##TITLE=1H_41-2021
 CDCl3, 8 sc, 
 11.06.2021
##JCAMPDX= 6.0         $$ Bruker NMR JCAMP-DX V2.0
##DATA TYPE= NMR FID
##DATA CLASS= NTUPLES
##ORIGIN= UXNMR, Bruker Analytische Messtechnik GmbH
##OWNER= root
$$ XWIN-NMR		Version 3.5
$$ Fri Jun 11 10:59:16 2021 Russian Standard Time (UT+4h)  she@DPX200
##.OBSERVE FREQUENCY= 200.131506
##.OBSERVE NUCLEUS= ^1H
##.DELAY= (6, 6)
##.ACQUISITION MODE= SIMULTANEOUS
##.ACQUISITION SCHEME= undefined
##.AVERAGES= 8
##.DIGITISER RES= 18
##SPECTROMETER/DATA SYSTEM= spect
##.PULSE SEQUENCE= zg30
##.SOLVENT NAME= CDCl3
##.SHIFT REFERENCE= (INTERNAL, CDCl3, 0, 15.7039)
##AUDIT TRAIL= $$ (NUMBER, WHEN, WHO, WHERE, WHAT)
$$ ##TITLE= Audit trail, XWIN-NMR		Version 3.5
$$ ##JCAMPDX= 5.01
$$ ##ORIGIN= Bruker BioSpin GmbH
$$ ##OWNER= she
$$ F:/spectra/data/she/nmr/H-F/1/audita.txt
$$ ##AUDIT TRAIL=  $$ (NUMBER, WHEN, WHO, WHERE, WHAT)
(   1,<2021-06-11 10:58:01.26 +0400>,<she>,<DPX200>,
      <created by zg, POWCHK disabled, PULCHK disabled
       configuration hash MD5:
       00 E9 B6 7A A2 85 ED C7 34 08 36 98 17 FE 4E 26
       data hash MD5: 16K
       60 03 AD 22 5E B8 2F BC 5F A0 3A 55 8D F6 68 95>)
$$ ##END=
$$ 
$$ hash MD5
$$ 33 AA DF 35 1D 2B CF 63 34 64 B9 27 78 A2 B6 61
##$RELAX= 
##$RELAX= 
##$RELAX= 
##$RELAX= 
##$RELAX= 
##$RELAX= 
$$ Bruker specific parameters
$$ --------------------------
##$DU= <F:/spectra>
##$EXPNO= 1
##$NAME= <H-F>
##$PROCNO= 1
##$TYPE= <nmr>
##$USER= <she>
##$AMP= (0..31)
100 100 100 100 100 100 100 100 100 100 100 100 100 100 100 100 100 100 
100 100 100 100 100 100 100 100 100 100 100 100 100 100 
##$AQSEQ= 0
##$AQ_mod= 1
##$AUNM= <au_zg>
##$AUTOPOS= <>
##$BF1= 200.13
##$BF2= 200.13
##$BF3= 200.13
##$BF4= 200.13
##$BF5= 200.13
##$BF6= 200.13
##$BF7= 200.13
##$BF8= 200.13
##$BYTORDA= 1
##$CFDGTYP= 0
##$CFRGTYP= 5
##$CHEMSTR= <none>
##$CNST= (0..31)
1 1 145 1 1 1 1 1 1 1 1 1 1 1 1 1 1 1 1 1 1 1 1 1 1 1 1 1 1 1 1 1 
##$CPDPRG= <>
##$CPDPRG1= <>
##$CPDPRG2= <>
##$CPDPRG3= <>
##$CPDPRG4= <mlev>
##$CPDPRG5= <mlev>
##$CPDPRG6= <mlev>
##$CPDPRG7= <mlev>
##$CPDPRG8= <mlev>
##$CPDPRGB= <>
##$CPDPRGT= <>
##$D= (0..31)
0 1.2 0 0 0 0 0 0 0 0.06 0 0.03 0 0 0 0 0.0002 0 0 0 0 0 0 0 0 0 0 0 0 
0 0 0 
##$DATE= 1623394680
##$DBL= (0..7)
120 120 120 120 120 120 120 120 
##$DBP= (0..7)
150 150 150 150 150 150 150 150 
##$DBP07= 0
##$DBPNAM0= <>
##$DBPNAM1= <>
##$DBPNAM2= <>
##$DBPNAM3= <>
##$DBPNAM4= <>
##$DBPNAM5= <>
##$DBPNAM6= <>
##$DBPNAM7= <>
##$DBPOAL= (0..7)
0.5 0.5 0.5 0.5 0.5 0.5 0.5 0.5 
##$DBPOFFS= (0..7)
0 0 0 0 0 0 0 0 
##$DE= 6
##$DECBNUC= <off>
##$DECIM= 32
##$DECNUC= <off>
##$DECSTAT= 4
##$DIGMOD= 1
##$DIGTYP= 9
##$DL= (0..7)
0 120 120 120 120 120 120 120 
##$DP= (0..7)
150 150 150 150 150 150 150 150 
##$DP07= 0
##$DPNAME0= <>
##$DPNAME1= <>
##$DPNAME2= <>
##$DPNAME3= <>
##$DPNAME4= <>
##$DPNAME5= <>
##$DPNAME6= <>
##$DPNAME7= <>
##$DPOAL= (0..7)
0.5 0.5 0.5 0.5 0.5 0.5 0.5 0.5 
##$DPOFFS= (0..7)
0 0 0 0 0 0 0 0 
##$DQDMODE= 0
##$DR= 18
##$DS= 0
##$DSLIST= <SSSSSSSSSSSSSSS>
$$ [...]
##$SUBNAM2= <"">
##$SUBNAM3= <"">
##$SUBNAM4= <"">
##$SUBNAM5= <"">
##$SUBNAM6= <"">
##$SUBNAM7= <"">
##$SUBNAM8= <"">
##$SUBNAM9= <"">
##$SW= 20.0188882624521
##$SWIBOX= (0..15)
0 0 2 0 0 0 0 0 0 0 0 0 0 0 0 0 
##$SW_h= 4006.41025641026
##$TD= 16384
##$TD0= 1
##$TE= 0
##$TE2= 300
##$TE3= 300
##$TEG= 300
##$TL= (0..7)
0 120 120 120 120 120 120 120 
##$TP= (0..7)
150 150 150 150 150 150 150 150 
##$TP07= 0
##$TPNAME0= <>
##$TPNAME1= <>
##$TPNAME2= <>
##$TPNAME3= <>
##$TPNAME4= <>
##$TPNAME5= <>
##$TPNAME6= <>
##$TPNAME7= <>
##$TPOAL= (0..7)
0.5 0.5 0.5 0.5 0.5 0.5 0.5 0.5 
##$TPOFFS= (0..7)
0 0 0 0 0 0 0 0 
##$TUNHIN= 0
##$TUNHOUT= 0
##$TUNXOUT= 0
##$USERA1= <user>
##$USERA2= <user>
##$USERA3= <user>
##$USERA4= <user>
##$USERA5= <user>
##$V9= 5
##$VALIST= <valist>
##$VCLIST= <CCCCCCCCCCCCCCC>
##$VD= 0
##$VDLIST= <DDDDDDDDDDDDDDD>
##$VPLIST= <PPPPPPPPPPPPPPP>
##$VTLIST= <TTTTTTTTTTTTTTT>
##$WBST= 1024
##$WBSW= 4
##$XGAIN= (0..3)
0 0 0 0 
##$XL= 0
##$YL= 0
##$YMAX_a= 500436
##$YMIN_a= -559791
##$ZGOPTNS= <>
##$ZL1= 120
##$ZL2= 120
##$ZL3= 120
##$ZL4= 120
##$ABSF1= 10
##$ABSF2= 0
##$ABSG= 5
##$ABSL= 3
##$ALPHA= 0
##$AQORDER= 0
##$ASSFAC= 0
##$ASSFACI= 0
##$ASSFACX= 0
##$ASSWID= 0
##$AUNMP= <proc_1d>
##$AZFE= 0.1
##$AZFW= 0.1
##$BCFW= 1
##$BC_mod= 2
##$BYTORDP= 1
##$COROFFS= 0
##$CY= 11.3945322036743
##$DATMOD= 1
##$DC= 2
##$DFILT= <>
##$DTYPP= 0
##$F1P= 15.9154993809931
##$F2P= -4.1035820241983
##$FCOR= 0.5
##$FTSIZE= 0
##$FT_mod= 4
##$GAMMA= 1
##$GB= 0.15
##$INTBC= 1
##$INTSCL= 1
##$ISEN= 128
##$LB= 0.24
##$LEV0= 0
##$LPBIN= 0
##$MAXI= 10000
##$MC2= 0
##$MEAN= 0
##$ME_mod= 0
##$MI= 1.114404
##$NCOEF= 0
##$NC_proc= 0
##$NLEV= 6
##$NOISF1= 3.799351
##$NOISF2= 2.8
##$NSP= 1
##$NTH_PI= 0
##$NZP= 0
##$OFFSET= 15.70392
##$PC= 1
##$PHC0= -11481.43
##$PHC1= 8.80101
##$PH_mod= 1
##$PKNL= yes
##$PPARMOD= 0
##$PSCAL= 0
##$PSIGN= 0
##$REVERSE= no
##$SF= 200.130013532006
##$SI= 16384
##$SIGF1= 3
##$SIGF2= 2
##$SINO= 400
##$SIOLD= 16384
##$SREGLST= <1H.CDCl3>
##$SSB= 0
##$STSI= 0
##$STSR= 0
##$SW_p= 3612.71676300578
##$SYMM= 0
##$S_DEV= 0
##$TDeff= 0
##$TDoff= 0
##$TI= <>
##$TILT= no
##$TM1= 0
##$TM2= 0
##$TOPLEV= 0
##$USERP1= <user>
##$USERP2= <user>
##$USERP3= <user>
##$USERP4= <user>
##$USERP5= <user>
##$WDW= 1
##$XDIM= 8192
##$YMAX_p= 0
##$YMIN_p= 0
$$ End of Bruker specific parameters
$$ ---------------------------------
##NTUPLES= NMR FID
##VAR_NAME=  TIME,          FID/REAL,        FID/IMAG
##SYMBOL=    X,             R,               I
##VAR_TYPE=  INDEPENDENT,   DEPENDENT,       DEPENDENT
##VAR_FORM=  AFFN,          ASDF,            ASDF
##VAR_DIM=   8192,          8192,            8192
##UNITS=     SECONDS,       ARBITRARY UNITS, ARBITRARY UNITS
##FACTOR=    0.0002496,     1,               1
##FIRST=     0,             0,               0
##LAST=      2.0444736,     0,               0
##MIN=       0,             -559791,         0
##MAX=       2.0444736,     500436,          0
$$ Real data points
##PAGE= N=1
##DATA TABLE= (X++(R..R)), XYDATA
$$ [...]
2433a37M05J583l111j080K887N11j749R25q63j677J769K162j413j505J107q84
$$ -137 268 1851 -1260 -2340 547 1058 -691 234 -629 -2306 -537 1625 212 -1293 -186 -1070
2449a070j35L146j029k223Q00L95q9J491N84k830k49J952j98j47J249j966j636
$$ -1070 -1205 1941 912 -1311 -511 -116 -205 1286 1870 -960 -1209 743 545 398 1647 -319 -1955
2466a955K179Q52j610P24j24j962Q35K431j044j355Q33n33n01K290K80k344O70
$$ -1955 224 1076 -534 190 66 -1896 -1061 1370 326 -1029 -196 -729 -1230 1060 1340 -1004 -334
2483c34M77p71J353O86j628p27J435L05o47J156q97j840J664O83j265P96j7j432
$$ -334 143 -628 725 1411 -217 -944 491 796 149 1305 408 -1432 232 915 -350 446 429 -1003
2501a003P42J145n77r11Q66q48j89J306r6j139Q06Q3j100J451M19j336j6R01m37
$$ -1003 -261 884 307 -604 262 -586 -775 531 435 -704 102 185 -915 536 955 -381 -397 504 67
2520F7K9R68o45p77R42J91j124R50k99r57R14K19j050M96K42r86O00M00p31N5
$$ 67 96 1064 419 -358 584 775 -349 601 302 -655 259 478 -572 -76 166 -820 -220 180 -551 -496
2540d96N24m00k28Q48l34m67Q48o20m32R95q1n58L16J96m94M01N23j031l7Q84
$$ -496 28 -372 -600 248 -86 -553 295 -325 -757 238 157 -401 -85 111 -383 18 541 -490 -527 357
2560C57o90p0R66q79l42J146m30r27J294k35j138R16O42j186K10J211j491L70
$$ 357 -333 -403 563 -316 -658 488 58 -869 425 190 -948 -32 610 -576 -366 845 -646 -276
2578b76J406j621M7J437j247k04J152m62r60J496k08j263J014M39j502P54J177
$$ -276 1130 -491 -444 993 -254 -458 694 232 -728 768 560 -703 311 750 -752 2 1179
2595A179j845M32J144j151m42J713j186n35J461k09j451J300M09j694J142Q72
$$ 1179 -666 -234 910 -241 -683 1030 -156 -691 770 561 -890 410 819 -875 267 1139
2611A139k237J015J385k008j33J978j496n56J914r45j032J712O6k013J377P33
$$ 1139 -1098 -83 1302 -706 -839 1139 -357 -913 1001 56 -976 736 802 -1211 166 899
2627H99j856M92J323j739M10J592j664j30J828j456r56K046o05j564J744K95k175
$$ 899 -957 -465 858 -881 -471 1121 -543 -673 1155 -301 -1257 789 184 -1380 364 659 -1516
2644a516J658Q02k179Q88J407j960R4J868j317j000K431j235j401K159m9j994
$$ -1516 142 944 -1235 -347 1060 -900 -806 1062 -255 -1255 1176 -59 -1460 699 650 -1344
2660a344J632Q54k453J020J625k359M98J776j722m16K425j573r72K075o16j876
$$ -1344 288 1142 -1311 -291 1334 -1025 -527 1249 -473 -889 1536 -37 -1009 1066 450 -1426
2676a426K053M33k285J685P82k458R77J775k333L21J679j327p39J953o45j660
$$ -1426 627 1060 -1225 460 1242 -1216 -239 1536 -797 -476 1203 -124 -863 1090 445 -1215
2692a215K389n54j796J656N60k039J041R88j909M83J760j732m86K041j360q65
$$ -1215 1174 620 -1176 480 1040 -999 42 1030 -879 -396 1364 -368 -854 1187 -173 -1038
2708a038J975m50j803J980L2j763J297N17j864Q74Q40j377M09J423j435m73J657
$$ -1038 937 487 -1316 664 696 -1067 230 747 -1117 -243 597 -780 -371 1052 -383 -856 801
2725H01q00q92J761o31j599J874K40j481J297r1j717R18J279j574K77J017j495
$$ 801 1 -891 870 239 -1360 514 754 -727 570 479 -1238 -320 959 -615 -338 679 -816
2742h16j95K019r90r05J646r44q26J736J62j893J273K49j576J190R92j805l4J914
$$ -816 -1011 1008 18 -887 759 -185 -1011 725 887 -1006 267 516 -1060 130 1122 -683 -717 1197
2760A197j613j97K052j597r12J725n80r78J515L2j940J316J031k019Q39J685k469
$$ 1197 -416 -613 1439 -158 -1070 655 75 -903 612 644 -1296 20 1051 -968 -129 1556 -913
2777i13lK397j996l37K063r38j262J966l03j727J637K99k224J049J796k376K55
$$ -913 -916 1481 -515 -852 1211 273 -989 977 674 -1053 584 883 -1341 -292 1504 -872 -617
2794f17K206k188p33K474q99j255J815m24k139K069P88j935M84J372k325O08K382
$$ -617 1589 -599 -1332 1142 243 -1012 803 379 -1760 309 1097 -838 -354 1018 -1307 -699 1683
2811A683j850r40K157j154q56K256m28j686P27Q62j899J157J459k202m43J670
$$ 1683 -167 -1107 1050 -104 -960 1296 868 -818 -91 771 -1128 29 1488 -714 -1157 513
2827E13j058k17J980j201j826J650L62q80J393k83k257Q06J685l73k19N68j397
$$ 513 -545 -762 1218 17 -1809 -159 203 -677 716 433 -1824 -1018 667 294 75 643 -754
2844g54k80J906R2j131M89l69p04J177J184j463m76M68q70P91J390j040j599P52
$$ -754 -1034 872 964 -167 322 -47 -751 426 1610 147 -329 139 -731 60 1450 410 -1189 -437
2862d37K33L6Q72k07j493J38J009L14Q3k46q04k08R08Q06n40k58p21K42O48O01
$$ -437 -204 -168 704 497 -996 -858 151 465 548 302 -502 -710 198 1004 464 206 -515 -273 375 976
2882I76m6j237j18N00l0O74j55q88l49M75L74Q6o4r55m14Q19J205p91m23r7l89
$$ 976 930 -307 -425 75 45 719 564 -324 -673 -198 176 262 198 -757 -1171 -352 853 62 -361 -458 -847
2903h47O41J029l69r70j35L98K02P59L16j593J5M55M35j9K87j116k46P25P78n83
$$ -847 -206 823 454 -516 -651 -253 -51 708 1024 -569 -554 -99 336 317 604 -512 -758 -33 745 162
2923A62j46r4o72L78J307m68j183M53k34q7J471l03j342K98N51j89N46M39j381
$$ 162 16 -78 -750 -372 935 467 -716 -263 -497 -584 887 584 -758 -460 91 -98 448 887 -494
2942d94m18J132K20m0M10p38p33P04Q68m27j69n20l80J41J507o94p72J95r5j32
$$ -494 -912 220 440 400 810 72 -661 43 911 484 315 -205 -585 -444 1063 369 -403 -208 -303 -435
2962d35J223m3j249l4K02K23O24L7j080n62J204k6m1N91p74o56P33Q96n55j07
$$ -435 788 745 -504 -538 -336 -113 511 548 -532 -1094 110 84 43 634 -140 -796 -63 833 278 171
2982A71M1o80l3J152l4r19K95k81l08J088k9r58Q0P0j10M65P35j023l33M17J62
$$ 171 212 -468 -501 651 617 -302 -7 -288 -596 492 463 -495 -415 -345 -455 10 745 -278 -611 -194 -32
3003c2j52N40k10p28M69L02j27K96j79o90L65K66j9l02Q2l4k15N29J28k92j15
$$ -32 -184 356 146 -582 -113 189 62 358 179 -511 -146 120 101 -201 -119 -153 -368 161 289 -3 -118
3024a18j48k01N24L84l95n0l06M4J86M19j77j40k60O8N6L30l04k35N59L8n9K44
$$ -118 -266 -467 57 441 46 -4 -310 -266 -80 339 162 22 -238 -170 -114 216 -88 -323 236 274 215 459
3046D59m97%j04J82J77L9M3o09L84K46k15J08j11m47l3N59l37K49k0k87j4N21
$$ 459 -38 -38 -142 40 217 256 299 -310 74 320 105 213 102 -345 -378 181 -156 93 73 -214 -228 293
3068B93j16k79L92l3o76O04K27r12L69M13n16K50N57p26j94O23k87k46L25K60
$$ 293 177 -102 290 257 -419 185 412 -500 -131 282 -234 16 573 -153 -347 276 -11 -257 68 328
3088C28r88Q12K26q09K96M67p60J85O74o66P2O80p83n25J132p0p98N32P3o44O09
$$ 328 -660 152 378 -431 -135 332 -428 -243 431 -235 -163 517 -266 -791 341 271 -527 5 78 -566 43
3109D3L53p77k8Q30q49n3J305j041O2N81j39n50N86n7j032R87K44j174P50O85
$$ 43 396 -381 -409 421 -428 -481 824 -217 -155 426 287 -263 323 266 -766 221 465 -709 41 726
3129G26j075K34P87r72m5J142o70o08Q67K11j159P93J55q72P91M14j440M70Q43
$$ 726 -349 -115 672 -300 -345 797 127 -481 386 597 -562 231 386 -486 305 719 -721 -251 592
3148E92j043J55J115r36o24J170k34o49P60J03j344J390M00j601P10O25j418N98
$$ 592 -451 -296 819 -117 -741 429 195 -454 306 409 -935 455 855 -746 -36 589 -829 -231
3166b31J033j255O4J110q23m77J101n34r35J441q5j249R16N07j323O68O07j164
$$ -231 802 -453 -389 721 -102 -579 522 -12 -947 494 409 -840 76 583 -740 -72 535 -629
3184f29K73Q12o23o16J501q01q46J531n42r95J700k49j444J038N37j563O45J274
$$ -629 -356 456 -167 -783 718 -83 -929 602 60 -935 765 516 -928 110 647 -916 -271 1003
3202A003j486J5J008n94o95J608q67r98J561k15j125J102L01j290O79R77j631
$$ 1003 -483 -468 540 -54 -749 859 -8 -1006 555 340 -785 317 618 -672 7 984 -647
3219f47N10J188j351j49J664r21q87J576q91j053J597k04j267J076M02j091K92
$$ -647 -137 1051 -300 -449 1215 294 -593 983 92 -961 636 432 -835 241 643 -448 -156
3236a56R95j062j77J405j423j95J564j208l51J376n05j067J118K32j076R07O59
$$ -156 839 -223 -400 1005 -418 -613 951 -257 -608 768 263 -804 314 546 -530 377 1036
3253A036j576N5J375j287L2J163j095m81J315m26p96J077n5j258J006Q48j545
$$ 1036 -540 -485 890 -397 -365 798 -297 -778 537 111 -685 392 337 -921 85 933 -612
3270f12M21Q54j287K63J320j224n77J336o33o98J479l75j233J062J99j072R27
$$ -612 -191 663 -624 -361 959 -265 -842 494 -139 -837 642 267 -966 96 295 -777 150
3287A50O81j308K91Q51q98l22J249r97l42J406q82o74J295l36p82Q82M86j503
$$ 150 831 -477 -186 665 -233 -555 694 -303 -645 761 -121 -795 500 164 -618 264 750 -753
3305g53P29O94j306L52R13n34n37J246r07o04J244j26p91O34K02j213P98Q51j254
$$ -753 -24 670 -636 -284 629 95 -442 804 -103 -707 537 411 -380 254 456 -757 41 892 -362
3324c62K39Q68j321L60J307j274k60P45n27j99P27L08j087O64K30q86Q32N14j585
$$ -362 -123 745 -576 -216 1091 -183 -443 302 -225 -424 303 611 -476 188 418 -468 364 878 -707
3343g07M76N98n36J4P85n38o46Q24j14n96R58m04j238J034N01j009L30N00q80
$$ -707 -231 367 -169 -155 630 92 -554 270 156 -440 518 114 -1124 -90 411 -598 -268 232 -648
3362f48J44Q57m30j74P05p23l93R51J26p71L51J13q70R88L46p46k34Q51p53P0
$$ -648 -504 353 -77 -251 454 -269 -662 289 415 -356 -5 108 -762 226 572 -174 -408 443 -310 -240
3382b40O76l30o84N34L13n41O62k1j225P33N18n29K18J75m24m5M01j78j45K06
$$ -240 436 106 -578 -44 269 -272 390 369 -856 -123 395 -134 84 259 -165 -210 191 13 -132 74
3402G4J69q04N43P86p82J81M36r37P12L37o30k89K79M2m94O70l8n71L75K57n56
$$ 74 243 -561 -18 768 -14 167 603 -334 378 715 85 -204 75 117 -377 293 255 -316 59 316 -240
3423b40L80N8m45K6R3K10J99k85o8k42J83L22l4k62M23o03J68N00k93J7k38N0
$$ -240 140 198 -247 -221 -128 82 281 -4 -72 -314 -131 191 157 -105 318 -285 -117 383 90 107 -131 -81
3445h1rK14k16J23l15L13k05J56Q0l37M3J30k56M60k24j10K19m09K36L57j42k48
$$ -81 -90 124 -92 31 -284 29 -176 -20 60 -277 -234 -104 -360 100 -124 -234 -15 -424 -188 169 27 -221
3467b21L86k99L59J20k90j78O5P3J17j42K04o91L03N05k61m8J00m73J34N17K96
$$ -221 165 -134 225 345 55 -123 -58 15 132 -10 194 -497 -194 311 50 2 102 -371 -237 280 576
3488E76p26J11J42l83K56P36q03j00N07o32J92P03n63n44N78L21l15j30N02j050
$$ 576 -150 -39 103 -280 -24 712 -91 -191 316 -316 -124 579 16 -528 50 371 56 -74 428 -622
3508f22K31Q62k38l28J30k27oP58Pp24l3K43o42O42Q27j022m32P32q0j91P08m91
$$ -622 -391 471 233 -95 35 -192 -198 560 567 -157 -190 53 -589 53 880 -142 -574 158 78 -113 595 104
3530A04p75Q9N60J31L47k03p95M8J077j11o24M72p79l46J224K23m39n56q4k76
$$ 104 -671 -582 -22 109 456 253 -542 -494 583 472 -152 320 -459 -805 419 642 203 -353 -437 -713
3550g13Q82O17p53o23L61l27N46O49n92p56K34M25m7P80n01j046pJ259k7j15L14
$$ -713 169 786 33 -590 -229 -556 -10 639 47 -709 -475 -50 -97 683 182 -864 -871 388 361 246 560
3571E60j345j88J241K50k97L5p09l15J072L85m06m20L70n07J42Q44m24n62K18
$$ 560 -785 -973 268 518 221 256 -453 -768 304 689 283 -137 233 -274 -132 712 288 -274 -56
3590e6j58q3Q42j79l36k36J19J61J89K74p48j71L15n4N21J09q01r4M34n2N38m16
$$ -56 -214 -297 545 366 30 -206 -87 74 263 537 -211 -382 -67 -121 400 509 -292 -386 48 -4 534 118
3612A18p14J78P74k73j8L36m46n92Q61jn56N25k00o11O96K79o57J27M25r12L34
$$ 118 -596 -418 356 83 65 401 -45 -637 224 223 -333 192 -8 -619 77 356 -301 -174 251 -661 -327
3633c27Q36p05j64N02k39m35Q40P2r52O19l3q50J143L94j105L45L47m79l4O16
$$ -327 509 -196 -360 142 -97 -532 308 380 -572 47 14 -836 307 701 -404 -59 288 -191 -225 391
3653C91m33o25P49P0p34Q69N78j787R71O46r96L45P12p34n26J251p83n10J027
$$ 391 -42 -667 82 152 -582 287 865 -922 49 695 -301 44 756 22 -504 747 -36 -546 481
3672D81l44p73J058N1j202J058L96j472O13N26r43J34J200p91m92J154l19j107
$$ 481 137 -636 422 473 -729 329 725 -747 -134 392 -551 -417 783 -8 -500 654 335 -772
3690g72J281j31j098R44j58p89P92O45j197j44J252q61l45J148o87o82J413k35
$$ -772 509 378 -720 224 66 -723 69 714 -483 -627 625 -236 -581 567 -120 -802 611 376
3708C76j343J545l08j060J001J43r97K22J083p81k14Q87p48m28J473p24r57J428
$$ 376 -967 578 270 -790 211 354 -643 -421 662 -119 -333 554 -194 -622 851 127 -830 598
3726E98k03j221J271K5j159P99N66j122j22J532j220l64J314p34p92J573o86r26
$$ 598 395 -826 445 470 -689 110 676 -446 -568 964 -256 -620 694 -40 -832 741 55 -871
3744h71J394j35r93Q39N87j499P98N36j032N6J020q06m56J387q89n45J175P2r83
$$ -871 523 388 -605 234 821 -678 120 656 -376 -320 700 -106 -562 825 -64 -609 566 638 -345
3763c45P91q2q14O02N18j130J16J235j486P1J363q28m35R90o33m48R19J81j011
$$ -345 446 364 -450 152 670 -460 -344 891 -595 -524 839 11 -424 566 -67 -515 404 585 -426
3782d26L53O93j326O75P78j285K24J158j537l3J516p66o87J220m32p36R26j63
$$ -426 -73 620 -706 -31 747 -538 -314 844 -693 -726 790 24 -663 557 125 -611 315 152
3800A52p48P99K84r89L60O84j270M62Q28q50j90J167q18m35Q80k27q93O78O62
$$ 152 -596 203 487 -502 -142 542 -728 -266 562 -288 -478 689 -129 -564 316 89 -804 -126 536
3819E36j149N26N38j118O36O37j047M3J130r03k87R49l52r92J051L68j224Q07
$$ 536 -613 -87 451 -667 -31 606 -441 -398 732 -171 -458 491 139 -853 198 566 -658 149
3837A49M87j102M65Q96j230o1J245q90n76J262l97r09J202j37j277R80P10j567
$$ 149 636 -466 -1 895 -335 -396 849 -41 -617 645 248 -661 541 404 -873 107 817 -750
3855g50P62O87j367K93J337j389N5J255r39m52R51k11r30P97M25j413Q33R16j300
$$ -750 12 699 -668 -375 962 -427 -372 883 -56 -508 443 232 -698 99 524 -889 -56 860 -440
3874d40J5J145r93m9R22m39q83R21K29j193R09O42j557N00J031r01J3O33q27j23
$$ -440 -425 720 -273 -322 600 161 -722 199 428 -765 144 786 -771 -271 760 -141 -128 505 -322 -445
3894d45J013m11p52Q36J39q00L78P47q45j73O55o85j45Q27k72n86O47r9k50J19
$$ -445 568 157 -595 241 380 -420 -42 705 -140 -313 342 -343 -488 339 67 -519 128 29 -221 -102
3914a02L12n98Q7M57k48j56M68l41n61J193n9n38j32J69J8o4L81r0o85N22j02
$$ -102 210 -388 -301 156 -92 -248 220 -121 -682 511 452 -86 -218 -49 -31 -95 286 196 -489 33 -69
3935f9J33K01J97o39M4J00L46n40M28K12j067N72N09l58m8%l68L4P95j07o90J18
$$ -69 64 265 462 -177 -133 -33 313 -227 201 413 -654 -82 427 69 21 21 -347 -313 482 375 -315 -197
3957a97K78n05N42M92j055oR84p18O5N53n20m50N12O93q86K60L58j086K18J322
$$ -197 81 -424 118 610 -445 -451 533 -185 -120 433 -87 -537 -25 668 -218 42 400 -686 -468 854
3977H54j047o47J218n77o14J236k1j045M35Q64j059K6J200j293r3J456q07p43
$$ 854 -193 -840 378 -199 -813 423 402 -643 -208 656 -403 -377 823 -470 -563 893 86 -657
3995f57J194n31j138J460N39j257r0O72q41N71J351j035j222J422n33l56J283
$$ -657 537 6 -1132 328 867 -390 -480 192 -649 -78 1273 238 -984 438 -95 -451 832
4012H32l60j696Q64Q70o55n4Q95j159p01K174m88j023J017p12q47J341J090j572
$$ 832 472 -1224 -360 510 -145 -199 696 -463 -1164 1010 522 -501 516 -196 -1043 298 1388 -184
4030a84k00P49j138Q05J212o53j934J411j13m67J481p9j982M26J289m57L8P16
$$ -184 -384 365 -773 32 1244 591 -1343 68 -45 -512 969 890 -1092 -666 623 166 204 920
4048I20j408j154K261L23j114O97m92j640J535J358j114q38R32r19J52J821o99
$$ 920 -488 -1642 619 942 -172 525 33 -1607 -72 1286 172 -666 266 -653 -501 1320 621
4065F21j523M35M69p05J481J84j726k56J298m15J75Q90r13j027R35J011j031O66
$$ 621 -902 -467 2 -703 778 962 -764 -1020 278 -137 38 928 15 -1012 -77 934 -97 569
4083E69k51j425O99J206j71o81J92n63l75J147M83j528K19N19l94K38J127r17
$$ 569 318 -1107 -408 798 627 -54 138 -425 -800 347 830 -698 -479 40 -354 -116 1011 94
4101I4p33N84J0O2L65J19j073n8J149l83j34O76j005m84J230J91q38L81O9q23
$$ 94 -639 -55 -45 17 382 501 -572 -630 519 136 2 678 -327 -811 419 610 -228 153 222 -601
4121f01N81R02r40n05P51l11l12R31J02j484Q52M84j064L53Q68n41q53J130j64
$$ -601 -20 882 -58 -563 188 -123 -435 496 598 -886 -34 450 -614 -261 607 66 -787 343 179
4140A79p45J314k50j232P40Q48j468O28J172j746j26J255m69o57J259p14p48J057
$$ 179 -566 748 498 -734 6 854 -614 14 1186 -560 -686 569 100 -557 702 -12 -760 297
4158B97M09j531J044M17j371K02J474r31p46J210l24r22J192J73j276P21M83j389
$$ 297 706 -825 219 636 -735 -533 941 10 -736 474 150 -772 420 593 -683 38 521 -868
4176h68P39R50j218r7R80p76m84J454m67r55J097j7j114R74P12j622M50J021j173
$$ -868 -129 821 -397 -494 486 -290 -774 680 213 -742 355 338 -776 198 910 -712 -262 759 -414
4195d14J06J091j068k25P77j0j178J276R4j296R35L90j078K91R72q44p0Q84p59
$$ -414 -308 783 -285 -510 267 257 -921 355 449 -847 88 478 -600 -309 663 -181 -251 633 -126
4214a26j96Q49o38m99J039k71n11O39K43q53L89L38r71L91K33j29l80P08j84l54
$$ -126 -322 527 -111 -610 429 158 -353 286 529 -324 65 403 -568 -177 56 -73 -453 255 71 -283
4234b83O45k56k96M18n0m15M75k61m13N83J45n24K31K64n70J36O05p72L1O20l13
$$ -283 362 106 -190 228 178 -237 238 -23 -436 147 292 -232 -1 263 -307 -171 434 -338 -307 313 0
4255@j13M64l93m88R09k30l96J68M33q97M52O47r59j96Q42m62j03Q94o37m12J087
$$ 0 -113 351 -42 -530 379 149 -247 -79 354 -543 -91 556 -403 -599 243 -219 -322 572 -65 -477 610
4276F10m43n19N31J39p84O10K14q34N01K04m31l79J170j073m7J337r11p42J387
$$ 610 167 -352 179 318 -466 144 358 -476 25 229 -202 -581 589 -484 -531 806 -105 -847 540
4295E40m50n09N21M55q26K94M80p94J26J101j211JQ28o03l69R12j18j200J097
$$ 540 90 -419 102 557 -269 25 505 -289 -163 938 -273 -272 556 -47 -416 496 378 -822 275
4314B75N8j040N87O63j118L25R67j081J25R07q55o42J252m68n56R84n9j022Q67
$$ 275 333 -707 -120 543 -575 -250 717 -364 -239 668 -187 -829 423 -45 -601 383 324 -698 169
4333A69J50q79O99N42j108J37J060r43l16R84m95o66R97l12o55N35M40j044P08
$$ 169 319 -560 139 681 -427 -290 770 -173 -489 495 0 -666 331 19 -636 -101 339 -705 3
4352CM19j029K79Q48p74j50J092j060q4R30m32p45P80J3n21J33P60r47L27O90
$$ 3 422 -607 -328 520 -254 -404 688 -372 -456 474 42 -703 77 90 -431 -298 462 -485 -158 532
4372E32p32l84J160r82nR30o51j85L97K47o83N24M64j056M13O21q83J46O88l02
$$ 532 -200 -584 576 -406 -411 519 -132 -317 80 327 -356 168 632 -424 -11 610 -273 -127 561 259
4392B59m23N32n37k20N22j32j25K69K03m84J64m7l45K64N09p08K50n8P5JJ07q2
$$ 259 -164 368 -169 -389 133 1 -124 145 348 -136 28 -19 -364 -100 409 -299 -49 -107 -32 -31 76 -6
4414fR0p8k7k6J62J51m07J12PO3J58j13k26J71m43M36QK86n43N3L59k83K28K01
$$ -6 84 6 -21 -47 115 266 -141 -29 -22 41 199 86 -140 31 -412 24 32 318 -225 -172 187 -96 132 333
4438C33o33j14Q47m89k19Q73q77k9O08j99m87J10N75p96K83O55r39K7R10l80m67
$$ 333 -300 -414 433 -56 -275 598 -279 -308 300 101 -386 -276 299 -497 -214 441 -498 -471 439 59 -408
4459d08R99l73q23O52K17p97P66N98j214K28P13p11k19J281j081o45J431j85j456
$$ -408 591 218 -605 47 264 -533 233 831 -383 -155 558 -153 -372 909 -172 -817 614 429 -1027
4478a027J174O91j401M41R55r69m63J348p50m31J167j55j226Q78K09q35L41O77
$$ -1027 147 838 -563 -122 833 -136 -599 749 -1 -432 735 580 -646 232 441 -394 -53 624
4496F24j006j33J582j162n12J337m14j158J498J13j855J038O46j426N98J083q65
$$ 624 -382 -515 1067 -95 -607 730 316 -842 656 769 -1086 -48 598 -828 -230 853 -12
4513a2n24J265p82q72J689k72j495J064L24j054O50R99j561l30J697n70p42J043
$$ -12 -536 729 -53 -925 764 492 -1003 61 385 -669 -19 980 -581 -911 786 216 -526 517
4531E17l42j559J724P07j833P90N26j317L88J144o62p76J047l03r09J228N74j912
$$ 517 175 -1384 340 1047 -786 4 530 -787 -399 745 83 -693 354 51 -858 370 944 -968
4549i68L58J331j414N42R89j132q45J450K83q12Q32Q7j846R37J288j405K2R75
$$ -968 -610 721 -693 -151 838 -294 -1139 311 594 -218 614 701 -1145 -208 1080 -325 -303 672
4567F72r83n08J503Or28K96O56j543R24Q28j248m99J528q79j55J063l34j214R07
$$ 672 -311 -819 684 690 -238 58 714 -829 95 923 -325 -824 704 -175 -330 733 399 -815 92
4586I2O31j225N79N27j293q0J504m89j015J456o33j165J349L11j193O37M91p52
$$ 92 723 -502 77 604 -689 -769 735 246 -769 687 54 -1111 238 549 -644 -7 484 -268
4604b68k25J315n22j164J400k70j174J336L48j755O26J068j111J00J469j230r53
$$ -268 -493 822 300 -864 536 266 -908 428 776 -979 -353 715 -396 -296 1173 -57 -1010
4621a010J778k02j415J341J08j602P43J118j103m33J348j007q28K348n13j741
$$ -1010 768 566 -849 492 600 -1002 -259 859 -244 -677 671 -336 -1164 1184 671 -1070
4637a070J189O35j787J166J225k184L55J487j134m59J343p44j179J497J36j422
$$ -1070 119 754 -1033 133 1358 -826 -471 1016 -118 -577 766 22 -1157 340 476 -946
4653i46J235P92k285O82K056j773m88J742j019r78J756%j483N48J062j898O13
$$ -946 289 1081 -1204 -522 1534 -239 -727 1015 -4 -982 774 774 -709 -161 901 -997 -384
4670c84J470j506l19J847j022r81J605l03j409J343L01j366O39J075j675m5J586
$$ -384 1086 -420 -739 1108 86 -895 710 407 -1002 341 642 -724 -85 990 -685 -730 856
4687H56j131R4J198r06j031J253J33r57P90J27j127J70J291r94k77J186p32o36
$$ 856 -275 -181 1017 111 -920 333 466 -491 299 426 -701 -531 760 -234 -511 675 -57 -693
4705f93J073j1r23M12J19q22P94O23p46j53P96n18m56R80j82p09M57j46k27L06
$$ -693 380 369 -554 -142 -23 -845 -51 572 -174 -327 469 -49 -505 475 293 -416 41 -105 -332 -26
4725b6M50m88l96N84k17M8L89q9p16M39J32N7r2O2k95l54N47M29m37K1J42o54
$$ -26 424 -64 -460 124 -93 -45 344 255 -461 -22 110 167 75 137 -158 -512 35 464 27 48 190 -464
4747d64K32N69o6l76L52j02j53M8L08l96j47N57o97NR41n70m06L33L80o72N82
$$ -464 -232 337 271 -105 247 145 -8 40 348 -48 -195 362 -335 -330 611 41 -365 -32 348 -324 258
4768B58k7o72J95R10q29m32Q39m06m19R66k12p61R88j39p30N08L15q04n5R20n88
$$ 258 231 -441 -246 664 -165 -597 242 -164 -583 383 171 -590 398 259 -471 37 352 -452 -507 413 -175
4789a75k28J115o34p87J201m29o35O40L74r06P0J113q20l68R64o09l93J049l72
$$ -175 -403 712 78 -709 492 63 -572 68 442 -464 -394 719 -101 -469 495 -114 -507 542 170
4808A70n73O32k4q92P94O74j129M30O23q79l27R91o10l45P12L4r61J040J34r71
$$ 170 -403 229 205 -687 107 781 -348 82 705 -174 -501 490 -120 -465 247 281 -680 360 494 -477
4828d77P55Q4p10O7R68o66j59Q93p47l29Q45n87m26O80O0o62M76J72o54K76O23
$$ -477 278 362 -348 -281 687 21 -138 755 8 -321 524 -63 -489 191 251 -411 65 237 -417 -141 482
4849D82q64K64O43p39k15O83j79k17M63l00k48N46L0l22j92M33m52p4M25n08J19
$$ 482 -382 -118 525 -214 -429 254 75 -142 321 21 -227 319 349 27 -165 268 -184 -258 167 -341 -222
4870b22P52m51N3J10o1n04N21k89j1O4Q8l17K37J99o36K03N97o73K42O9R6k52
$$ -222 530 79 132 242 181 -323 198 -91 -102 -38 50 -267 -30 169 -467 -264 333 -340 -98 -29 67 -185
4892a85J08p4r4M89l28j49J88L01l77m7J76J97k98M56m98P8Q3mk24L95n69N72
$$ -185 -77 -151 -245 244 -84 -233 -45 256 -121 -168 8 205 -93 363 -135 -57 26 22 -202 193 -376 196
4914A96M8l13RK52R4n00L87J81m71J68J59m39K12K58m92M6M74m78j40N95p7m75
$$ 196 244 -69 -60 192 286 -214 173 354 -117 51 210 -229 -17 241 -251 -205 269 -209 -349 246 169 -306
4936c06O27L41j071N00q9l91M60L74o20J83N30p40L90J83l85j23N35j38n64M69
$$ -306 321 662 -409 91 2 -389 71 445 -175 8 538 -202 188 371 -14 -137 398 260 -304 165
4956A65Q6p79N62K01m92j88Q62m79k10N47l30l72L33L81o33J95N50p60K91M78
$$ 165 251 -528 34 235 -257 -445 417 -62 -272 275 -55 -427 -94 287 -346 -151 399 -361 -70 408
4976D08q09K14O68l29q16R51k86l04N82M5q51M57O61q48k0P24o22k0M00k42k94
$$ 408 -401 -187 481 152 -664 287 1 -303 279 324 -527 -70 591 -257 -277 447 -175 -195 205 -37 -331
4997c31L05K84p36N93K89r44M66L65m13m04Q45l60m59P30R3r94O97O15j072N54
$$ -331 -26 258 -478 115 404 -540 -74 291 -122 -526 319 -41 -500 230 323 -671 26 641 -431 123
5017A23K22n29k68R44m29m31P10k87n58Q06J98p21J25O76p39l57J074m20q54J154
$$ 123 345 -184 -452 492 63 -368 342 55 -503 303 501 -220 -95 581 -158 -515 559 139 -715 439
5037D39l80o33N54O78q71K99O08q90k16Q95m65o46J075j79q77R05K52r27J36P99
$$ 439 59 -574 -20 658 -213 86 694 -196 -412 483 18 -628 447 268 -609 296 548 -379 -243 556
5057E56q85r2Q13o39n91J338l52n49P24J34q95K16O90p09J28M23j11j073J222
$$ 556 -329 -421 392 -247 -838 500 148 -401 323 457 -438 -222 468 -241 -113 310 199 -874 348
5076C48J76j040P65K68p80j09J119j020K2O00m24o34J151L7j216O47P68j153K24
$$ 348 524 -516 249 517 -263 -372 747 -273 -251 349 -75 -709 442 479 -737 -90 678 -475 -251
5095b51P47j095j38J166j27p24J101o36j273J255Q10j406k2J483j483R3J215q23
$$ -251 496 -599 -737 429 302 -422 679 43 -1230 25 835 -571 -593 890 -593 -500 715 -108
5113a08p46J134j7j084J159N83j616L04J180j308K19J326j190r29J305K31q96
$$ -108 -854 280 263 -821 338 921 -695 -391 789 -519 -300 1026 -164 -1093 212 443 -453
5130d53O58O22j778P83J450j413l95J519j279n91J676k50j339R62K21j421J011
$$ -453 205 827 -951 -168 1282 -131 -526 993 -286 -877 799 549 -790 172 393 -1028 -17
5147a7J166j629k63J731j132o57K042q23j444J279K90j252R28Q94j716l29J765
$$ -17 1149 -480 -743 988 -144 -801 1241 418 -1026 253 543 -709 219 1113 -603 -932 833
5164H33j117k92J653r51j337J555K19j366J205J16j476P37J319j113n84J444j331
$$ 833 -284 -576 1077 126 -1211 344 563 -803 402 518 -958 -221 1098 -15 -599 845 -486
5181d86o74J659J8j341R58L65j432Q96J096j244o18J345o45o76J557k94j500Q10
$$ -486 -1160 499 517 -824 134 499 -933 -37 1059 -185 -803 542 -103 -779 778 484 -1016 -206
5199b06M90j177J280L51j108j89J133n91n90R59J86j508Q21R79j044L60J93j083
$$ -206 284 -893 387 738 -370 -559 574 -17 -607 352 538 -970 -149 830 -214 146 339 -744
5217g44L07J069n22p81R48k43q38R73Q21j243oO97p53j8R67j96q93M28L10o80
$$ -744 -437 632 110 -671 277 34 -804 169 990 -253 -259 438 -315 -333 634 438 -455 -27 283 -397
5237c97P38L60j047N0P86n30l22J303j206n78R84L11o71J60O03j399J56J413n22
$$ -397 341 701 -346 -296 490 -40 -362 941 -265 -843 141 452 -219 -59 544 -855 -699 714 192
5256A92r01J038o01n21J113M46j221J16Q14j036K8J772j531p61J393j35q26J383
$$ 192 -709 329 -272 -793 320 766 -455 -339 475 -561 -533 1239 -292 -1053 340 205 -621 762
5274G62j59j565J015P61j333M10R39j316k29J516m65j159J434n28q80J148M13
$$ 762 603 -962 53 814 -519 -109 830 -486 -715 801 336 -823 611 83 -797 351 764
5291G64j288K83R52j099Q0J316r87q18J177j77r77J153K68j503R34N13j166M62
$$ 764 -524 -241 711 -388 -308 1008 21 -797 380 203 -774 379 647 -856 78 591 -575 -113
5309a13J070r48m56R37m72o14Q68J38j134R93K51r48K66N92p94L2Q39q56k56J078
$$ -113 957 9 -447 490 18 -596 272 410 -724 269 520 -428 -162 430 -364 -332 507 -349 -605 473
5329D73m61m87P55l8p78N84R7m22K09N66o61k0O95o18l4O58l70m43K85J44m82
$$ 473 12 -475 280 242 -536 48 145 -277 -68 498 -163 -183 512 -106 -140 518 148 -295 -10 134 -348
5350c48K95M65p44L46L93n82M4M16l12j88L39k32l9L05j36q7J68l8p5j20k4K14
$$ -348 -53 412 -332 14 407 -175 -131 285 -27 -215 124 -108 -147 158 22 -65 103 65 -10 -130 -154 60
5372F0m8P7nl05O50m00j93J42K18k27K16j65nK34k71k22L73q7pm6j6j0Q4j9j58
$$ 60 12 89 84 -221 429 29 -164 -22 196 -31 185 20 15 249 -22 -244 129 42 35 -11 -27 -37 47 28 -130
5397a30Q0R5o2j03J84l00L05O2m38L75J5l9j78K60j02k12K48K27m14q6O73m91
$$ -130 -50 45 -17 -120 64 -236 69 131 -307 68 83 44 -134 126 24 -188 60 287 -127 -213 460 -31
5419c1r9K70n38K91J32j64l9K90q3k44M51k36j53M2M63n90K80J23k38r6O13n16
$$ -31 -130 140 -398 -107 25 -139 -178 112 29 -215 236 0 -153 -111 352 -238 42 165 -73 -169 444 -72
5441g2j79M74k31k0J42J08o09K33L00m00J24M89m79j01N22k77k90K21K46n55L01
$$ -72 -251 223 -8 -28 114 222 -387 -154 146 -254 -130 359 -120 -221 301 24 -266 -45 201 -354 -53
5462e3L10n38K84K39m40M15j20j20qK79k77k54O15j50m76L52K25j53p3R1l21K91
$$ -53 257 -281 3 242 -198 217 97 -23 -31 248 -29 -283 332 182 -294 58 283 130 57 148 -173 118
5484A18K78n38j3J46J82k88L51j37m24O81r9j78Q9K23o41q9N87j29l05L02k61
$$ 118 396 -142 -155 -9 173 -115 236 99 -325 356 257 79 168 391 -250 -339 248 119 -186 116 -145
5505a45R5K71j63L9j20K8j14R4K22l77Q5L93n62Q8O76m21k37m3K59j49J63Mk73
$$ -145 -50 221 58 97 -23 5 -109 -15 207 -170 -85 308 -254 -166 510 89 -148 -191 68 -81 82 86 -187
5528a87J61J42k51k78M97P5l14K46j52l7n1L81j86l65M58j35j19J81J32k45k41
$$ -187 -26 116 -135 -413 84 159 -155 91 -61 -98 -149 232 46 -319 139 4 -115 66 198 -47 -288
5549b88L80k71J67K02m3m92M61L53o35n8M62k88K6M17k39l15K87L8l43J51N06
$$ -288 92 -179 -12 190 147 -345 116 469 -166 -224 238 -50 -24 393 154 -161 126 164 -179 -28 478
5570D78o34N8N11o77J10K29o2j62L79m3n71M51L11n73m4N52q81K17O69o62K9L23
$$ 478 -156 -98 413 -264 -154 75 13 -149 230 187 -384 67 378 -195 -239 313 -568 -351 318 -344 -315 8
5592HOl52M27L0m50L23M62q77O4J030q97k10O35K5m83O26M9j378R43O73q75K6
$$ 8 14 -338 89 119 -331 -8 454 -423 -359 671 -226 -436 199 224 -259 367 416 -962 -19 654 -221 -195
5614a95N24m21m60J064n38m68Q40j75o40N17L91p51J28K67m64o9J161n99n50N15
$$ -195 329 -92 -552 512 -26 -494 346 171 -469 48 439 -312 -184 83 -381 -450 711 112 -438 77
5634G7K37p58P30N82j619N84O70o16j15R47p24q47J080R3m48L36L30j205O31N77
$$ 77 314 -444 286 868 -751 -167 503 -113 -228 719 -5 -852 228 321 -127 209 539 -666 -35 542
5654E42p39j4P80r27k8R94j79j091P72K34r18N67N33q06j17J077r61k97J007r5
$$ 542 -197 -211 569 -358 -386 608 429 -662 110 344 -574 -7 526 -280 -397 680 -281 -578 429 334
5674C34r42O74K75r17N97Q76j227n3R81p41q2R28n35r42Q15K68p12O34L57j005
$$ 334 -608 66 341 -576 21 897 -330 -383 598 -143 -225 703 168 -774 41 309 -403 231 588 -417
5694d17J66Q94o53m51O24j3q00Q74J83q44N42M20r22J3R24p74k67P10k73l13R98
$$ -417 -251 643 -10 -461 163 150 -650 224 407 -437 105 525 -397 -384 540 -234 -501 209 -64 -377 621
5715F21k18q46m5O46l20J61O78q77n62J104p8o24P43k1j032L75Q62n91L8N25p67
$$ 621 403 -443 -488 158 -162 -1 677 -200 -762 342 264 -360 383 362 -670 -295 567 -24 14 539 -228
5736b28m55J113m3r05P75j23q91R98M33r28lR56q89k13R80m69r34R18L86r93O54
$$ -228 -683 430 387 -518 257 134 -757 241 674 -254 -257 699 -190 -403 577 108 -826 92 478 -515 139
5757A39O79j187j72J178q28m10J020m25n18R28N49j812R19M63j145O71Q52j268
$$ 139 818 -369 -541 637 -191 -601 419 -6 -524 404 953 -859 60 523 -622 49 901 -367
5775c67q6R64n02n57R80R1j442Q06N72j166N10J172j289k01J151q72k70J028j50
$$ -367 -453 511 9 -548 432 523 -919 -113 459 -707 -197 975 -314 -515 636 -236 -506 522 372
5794C72j229R30J76r32P73N93j361K05J188q34l52Q25l38m64P09j19q47P90L98
$$ 372 -857 73 249 -683 90 683 -678 -473 715 -119 -471 354 16 -448 261 142 -705 85 483
5813D83j089M19J032j153m8R73o67k86Q19q9j144P63L32n20L10N18o87k67Q79
$$ 483 -606 -187 845 -308 -356 617 -50 -336 483 394 -750 13 345 -175 135 653 -34 -301 578
5832E78n21n20R96o71l37M43L02n38J91L50l58Q5M30l95l91M44L23o47N62k15
$$ 578 57 -463 533 -138 -475 -32 270 -268 -77 273 -85 0 430 35 -356 88 411 -236 326 111
5852A11n43J63M77r3j69N71o09j31L29m7l99M01r3k31j9L40k91j5J75L25o01L31
$$ 111 -432 -269 208 115 -54 517 -92 -223 106 59 -340 61 -32 -263 -282 58 -233 -248 -73 252 -349 -18
5874a8M47l32L2k71J9J80J9Q6l85L40J91n08L02K02n72O1M40p0l67L58m77m7O00
$$ -18 429 97 129 -142 -123 57 76 162 -223 117 308 -200 102 304 -268 -207 233 163 -204 154 -323 -370 230
5897B30J78p15M50o2j80N3L12k06q6M56l99j94M03k92j91M85J20n28k4O19n28
$$ 230 408 -307 143 81 -99 -46 266 60 -26 430 31 -163 240 -52 -243 242 362 -166 -190 429 -99
5918i9j26M71r3p65O79M9l15K35J01o40M48L11l88K56J66l16j96M68j88l37L53
$$ -99 -225 246 153 -612 67 116 -199 36 137 -503 -55 256 -132 124 290 -26 -222 246 58 -279 74
5939G4R3n06L21J67m03J55L42l92n1L54k07j99N37l92k84N75j56m30K14L90O6
$$ 74 167 -339 -18 149 -254 -99 243 -149 -200 154 -53 -252 285 -107 -391 184 28 -402 -188 202 268
5960B68k50J76m0l79N01j86l61M33k53k91M53l48J19K87J4k50PK75j66o2o6n1
$$ 268 18 194 154 -225 276 90 -271 162 -91 -382 71 -277 -158 129 143 -107 -100 175 9 -53 -119 -170
5982a70m1M59k67k2p8J56m6r5L16l84K08N4q0j94L52j19J89j16qj68o6L7K47j34
$$ -170 -211 248 -19 -41 -119 37 -9 -104 212 -172 36 90 10 -184 168 49 238 122 114 -54 -120 -83 164 30
6006C0r9J99m4q9j97J17J80j44j9Q6j23L17l83K53M2n6j98K15k67L98j3k34Q7
$$ 30 -69 130 86 -3 -200 -83 97 -47 -66 20 -103 214 -169 84 126 70 -128 87 -180 218 205 -29 58
6029E8j00M6r4P1o4K21K9J06l24n8J11J09k54q0J91L04j79j87m8k2L03r5k37J92
$$ 58 -42 4 -90 -19 -83 138 167 273 -51 -109 2 111 -143 -223 -32 272 93 -94 -142 -164 139 44 -193 -1
6053aj6l09N05r8j83P5o2o3K09N5k38J39J40j33j61k5J27L1j04N1J24j77K61k00
$$ -1 -17 -326 179 81 -102 -27 -89 -152 57 112 -126 13 153 20 -141 -166 -39 -8 -112 -61 63 -114 147 -53
6077e3j45K08l3k25M85m35q2K68K19n49N50k51Lk54K95P4j89L50P2l95L3K75m07
$$ -53 -198 10 -23 -248 237 -198 -280 -12 207 -342 208 -43 -40 -294 1 75 -114 236 308 -87 -54 221 -186
6100a86J88K85n92M42J09m14Q6L35k57j16L16N5l15J61J52k92K02R9m68J23L16
$$ -186 2 287 -305 137 246 -168 -82 253 -4 -120 196 251 -64 97 249 -43 159 258 -210 -87 229
6121B29k42q8M86n23k37O91p3o02J44O16n08J13J57n14M02J45l42J01M7K40k96
$$ 229 -13 -101 385 -138 -375 316 243 -359 -215 401 -107 6 163 -351 51 196 -146 -45 2 242 -54
6142e4j82M36n43J64L93l10J5N22m74m8Q0j08k88K85M49k56o3J96k90r5L60k74
$$ -54 -236 200 -343 -179 214 -96 -81 441 -33 -81 -1 -109 -397 -112 337 81 18 214 -76 -171 189 -85
6164h5K22Q2k86L06j73Q9l84J51K45k76j33O75n38kO66k62o88M40K74n33K28J75
$$ -85 137 219 -67 239 66 155 -229 -78 167 -109 -242 433 -105 -107 559 297 -391 49 323 -210 18 193
6186A93l16N1K50j08m37M77L2n91O20o7k60L27L07m02l40Q52k61o53M93O0n31
$$ 193 -123 -72 178 70 -367 110 142 -449 171 104 -156 171 478 76 -264 588 327 -326 167 227 -304
6207c04O13jo15J84M67l92K6L35m22k16K80M39p41K65J39k63K6L16l45l2M85j46
$$ -304 309 308 -307 -123 344 -48 -22 313 -109 -325 -45 394 -347 -82 57 -206 -180 136 -209 -241 244 98
6229I8k91M82O4p67L95L60q64L72N10m76r2N59n01k74R01k46n90L34L79r34N60
$$ 98 -193 289 353 -414 -19 341 -523 -151 359 -117 -209 350 -151 -425 476 230 -360 -26 353 -581 -21
6250b1L11m15j90O17m19j23O87j50p03M87K40o92K09O09p64K71N92m68n81Q50
$$ -21 290 -125 -315 302 -117 -240 447 297 -406 81 321 -371 -162 447 -317 -46 546 78 -503 347
6270C47l54m06O24l8m42M85J42p79k5J009m71n93Q12m65l68Q95k09p68N31M95
$$ 347 -7 -413 211 173 -269 216 358 -421 -446 563 92 -501 311 -154 -522 373 164 -604 -73 422
6290D22o46RO35m97k21O67l30p2M11j45q08M74K75m78K83N03m93l93N85j23k93
$$ 422 -224 -215 420 -77 -298 369 39 -33 378 233 -575 -101 174 -304 -21 482 -11 -404 181 58 -235
6311b35M97l57n23N87K55k15K83j68n03J75N23k69m04N89l66j57N42M3m84j20
$$ -235 262 -95 -618 -31 224 9 292 124 -379 -204 319 50 -354 235 -131 -288 254 297 -187 -307
6331c07N33m29jP35o87j46K70L58n38N80j78k48r7L39k89K73j28k92kL08K48o12
$$ -307 226 -203 -204 531 -156 -302 -32 326 -212 368 190 -58 -155 184 -105 168 40 -252 -254 54 302 -310
6353c10K43J80o72O11L12r0l17M1l3j46M20K41p45Q8N01o03O59j46k49m43M65
$$ -310 -67 113 -559 52 364 274 -43 -2 -35 -181 239 480 -265 -177 324 -279 380 234 -15 -458 7
6374Gl5j68N16m25l26L89O12n79k27M00l39J33M80k97j25j15J1k79M14L87o67
$$ 7 -28 -196 320 -105 -431 -42 570 -9 -236 164 -175 -42 438 141 16 -99 -88 -367 47 434 -233
6395b33L05K37m95J30L33j80m28K74K39m56M59j4m22M7O98m24j10K59l62k39Q21
$$ -233 72 309 -186 -56 277 97 -331 -57 182 -274 185 171 -251 -204 494 70 -40 219 -143 -382 439
6416D39l33m30M47j0m88J72N93m34k28L61nk42Q5J80n30N10J08n09L03Jk61J99
$$ 439 106 -324 123 113 -375 -203 390 -44 -272 89 84 -158 -73 107 -423 87 195 -314 -11 -10 -271 -72
6438g2L47k55j17L96j21n46M80j32l11L80J63j23j45J30k02P5K28m2o8O7L4k95
$$ -72 275 20 -97 299 178 -368 112 -20 -331 49 212 89 -56 74 -128 -53 175 133 65 132 166 -129
6460a29K31J55m10L35n9l53L46qk47K54lj90K13mn1m13p5N84m28K50j03n5O2K63
$$ -129 102 257 -153 182 123 -230 116 108 -139 115 112 -78 135 131 80 -333 -408 176 -252 -2 -105 -160 -98 165
6484A65k01j23K40k12m9K21K97j50l43J19K04j93N1l56J49K36J02j48M1K60l59
$$ 165 -36 -159 81 -131 -180 41 338 188 -155 -36 168 -25 26 -330 -181 55 157 9 50 310 -49
6505d9J3q5J04Rj86K59l2J78j17n3k67K71ml6K18k35r1K02L1l62O4K70p3K53k65
$$ -49 -36 -121 -17 -8 -194 65 33 211 94 41 -226 45 41 5 223 -12 -103 99 130 -232 -168 102 29 282 17
6530A7n9R8j08K46l73K16j32j65L09J40k58N1M7J57Pn0R6l76J38q7j55Q7K03Q
$$ 17 -42 56 -52 194 -179 37 -95 -260 49 189 -69 -18 29 186 193 143 239 -137 1 -86 -241 -154 49 57
6554E7J66k77R1l23K85K7j77LL30k42J6J34q2J94j56k41M61k92l0m0O1J06k85
$$ 57 223 -54 37 -286 -1 26 -151 -148 182 -60 -44 90 8 202 46 -195 266 -26 -56 -96 -35 71 -214
6577b14K20J01j0n9j40K14K3l77L74k12k0O8p2O7m4L00l22J14l3ML70l78r7R4
$$ -214 6 107 97 38 -102 112 135 -242 132 -80 -100 -32 -104 -37 -81 219 -103 11 -22 -18 352 -26 -123 -29
6601b9R9K3M6k71l7J84m5j20P7J40nj73N12l07k40K66J89k37q6R6m27L13J40k90
$$ -29 70 93 139 -132 -169 15 -30 -150 -73 67 62 -111 401 94 -146 120 309 72 -14 82 -345 -32 108 -182
6625a82J92nP0j77k1P4n1M6J69j26J12l3L2k24K70k41P4K10l55l9K64Pj70o2K78
$$ -182 10 5 75 -102 -123 -49 -100 -54 115 -11 101 68 100 -124 146 -95 -21 189 -166 -205 59 66 -104 -166 112
6650A12k60J99j64qJ27J35j81q3j07M00p5K46n21Q2j06n4K71m8j2J09Q9n7j05
$$ 112 -148 51 -113 -121 6 141 -40 -123 -230 170 95 341 -180 -98 -204 -258 13 -35 -47 62 151 94 -11
6673a1k89N3J49K70j97K66j90l3qj4PK29j48l60K55p9K7j39K02M4j72J20k4P0
$$ -11 -300 -247 -98 172 -25 241 51 18 10 -4 3 232 84 -276 -21 -100 -73 -212 -10 34 -138 -18 -42 28
6697B8j93j1K81r2j8o5L76j00j72m9L14j92P0m76L99k06O6Q4p8k67N21k53j47
$$ 28 -165 -176 105 13 -5 -70 306 206 34 -15 299 107 177 -299 100 -106 -40 44 -34 -301 220 -33 -180
6720a80J95J59j04J55N8n94N37o4j32K5K61K09n87K26J1k17j7J66k56L6l1j26
$$ -180 15 174 70 225 283 -311 226 162 30 55 316 525 -62 164 175 -42 -59 107 -149 -113 -144 -270
6742b70J86K30r9k55L13l9k87L16k1m17J67K61j01R4M9j78L0r1J96m21L63J35
$$ -270 -84 146 47 -208 105 66 -221 95 74 -343 -176 85 -16 78 127 -51 -21 -112 84 -337 26 161
6764A61l48r8K63j92R4K72k21j09L05O7m78N36l63r5O5K37p7N9K23l58o4L45k86
$$ 161 -187 -285 -22 -214 -120 152 -69 -178 127 194 -284 252 -111 -206 -141 96 19 78 301 -57 -121 224 -62
6787f2j42K55K9j70O6K06k60N9j14M6k21L93r0p5N6N4k83N42J21l77k83J78J66
$$ -62 -204 51 80 -90 -24 182 -78 -19 -133 -87 -308 85 -5 -80 -24 30 -253 289 410 33 -250 -72 94
6810I4r6K67l68J1Kk19N65m82K49m3l69M41J36l34M94m23k10O69k13j69M6nm95
$$ 94 -2 265 -103 -92 -90 -309 256 -226 23 -20 -389 52 188 -146 348 -75 -285 384 171 2 48 43 -452
6833d52L68L54k23n7k45O9M2L08J41k95M2j38o1N9K31Q0n75K20J11rJ93j66k73
$$ -452 -84 270 47 -10 -255 -186 -144 164 305 10 52 -86 -147 -88 143 223 -352 -132 -21 -30 163 -3 -276
6856b76L43J16j94J29N0l65j64L52j10J70nN3k64M23j2n03J62J53j26j95M38Q
$$ -276 67 183 -11 118 168 -197 -361 -9 -119 51 46 99 -165 258 246 -257 -95 58 -68 -263 175 183
6878A83m44M25ok88K29O1k88R6J40J16l47N15j81n29M76K28o48J37L09l46J53
$$ 183 -261 164 158 -130 99 160 -128 -32 108 224 -123 392 211 -318 158 386 -262 -125 184 -162 -9
6899iJ99k71j41L14l47J31L27J4l02R8K05m64K95Ll68L00K87l54L40k0j42j48
$$ -9 190 -81 -222 92 -255 -124 203 217 -85 13 218 -246 49 52 -316 -16 271 -83 257 237 95 -53
6921e3R5J03j84O5L57n12J80K38r2l39K97j38L9J09Rj64r8J45J78j42J89k12k02
$$ -53 42 145 -39 26 383 -129 51 289 197 -142 155 17 56 165 174 10 -88 57 235 93 282 70 -132
6944a32K46j20K1R8n6k45NK06P5l0o9Q6k63N13k11m21K16K25j41j23K54j93q5
$$ -132 114 -6 15 113 57 -188 -183 23 98 68 -1 85 -178 335 124 -297 -81 144 3 -120 134 -59 -144
6967a44J97l27K77kJ22q6j11K03k19J23nj6m9L3m3k31L03j30j0K63r5j26j54K71
$$ -144 53 -274 3 1 123 37 -74 129 -90 33 28 12 -37 -4 -47 -278 25 -105 -115 148 53 -73 -227 44
6991D4j71L19j72P4J10m29Q2j17Q4L34n8J3r6l2M9k00J98K75k90m9J56P5m6l09
$$ 44 -127 192 20 94 204 -225 -143 -260 -176 158 100 113 17 -15 34 -166 32 307 17 -32 124 199 153 -156
7015a56m6J65J01j28K54j9k70J48k97J25J28K79k54m6J78k29J65j67M3M4q4J29
$$ -156 -202 -37 64 -64 190 171 -99 49 -248 -123 5 284 30 -16 162 -67 98 -69 -26 18 -66 63
7037F3kj90Kl4M5J08l1j8M7p0p7J95k4j40JJ61p1J35J03l08J1J02K04k58J41q
$$ 63 61 -129 -127 -161 -116 -8 -39 -57 -10 -80 -157 38 14 -126 -125 36 -35 100 203 -105 -94 8 212 -46 95 87
7063H7m9M7l5j60J71l4J18j65J1P9k9r6J35K8Q4k70o9L38l17J60P1l11K32j25
$$ 87 38 85 50 -110 61 27 145 -20 -9 70 41 -55 80 108 192 -78 -147 191 -126 34 105 -206 26 -99
7087i9K10k8k57J46p3R8j24M12k72j19NL2O3J98m97L79J49j5j89j89J25J07o6
$$ -99 111 83 -174 -28 -101 -3 -127 285 13 -106 -101 -69 -6 192 -305 74 223 208 19 -170 -45 62 -4
7110dk2m5N2j25K24p9j6o4l7P3Q2J2k06J05K26o7k02J72r2J56l08J28J3k47k8
$$ -4 -26 -71 -19 -144 80 1 -15 -79 -116 -43 39 51 -155 -50 176 109 -93 79 -13 143 -165 -37 -24 -271 -299
7135b99Q9L04j53O3L4l5m9l6O8K45q7O0m09J02M35j23k28L04j84k07M94j91l25
$$ -299 -210 94 -59 4 38 3 -46 -82 -14 231 144 204 -205 -103 332 209 -19 285 101 -106 388 197 -128
7158a28n5Q7J63o9O7j14J24J38m25P8O0J96O1k25j06J60N8k07K67j09K5J08k6
$$ -128 -183 -96 67 -2 65 -49 75 213 -212 -134 -74 122 183 -42 -148 12 70 -137 130 21 46 154 128
7181A28m9n4p4J10k26K88L8qk50L5J2j08J52j8j75L32l42K59j21K58r4j91N12
$$ 128 79 25 -49 61 -165 123 161 153 -97 -62 -50 -158 -6 -24 -199 133 -209 50 -71 187 93 -98 414
7204D14m63j09J95J40lj44l6M1K2k7r2O4n6K34l07L19L7n49K91J3j10N6J65j82
$$ 414 -49 -158 37 177 174 30 -6 35 57 30 -62 2 -54 180 -127 192 229 -320 -29 -16 -126 -70 95 -87
7228h7j28J21m2q1J57p3J96k9J67j50o6Q8r2k97J90N12o62J88J76m1j87p3M57
$$ -87 -215 -94 -136 -217 -60 -133 63 34 201 51 -15 73 -19 -316 -126 386 -276 -88 88 47 -140 -213 244
7251B44k25j97O3k6qK04m5j10q5J57J31l6l01P4J72j58j33K57Q9rn0k14R0J35
$$ 244 19 -178 -115 -141 -149 55 10 -100 -185 -28 103 67 -234 -160 12 -146 -279 -22 67 58 8 -206 -116 19
7275A9J47j7j66O8j2l59L43K7Lj36K69k17p1L15j13j08k5J79k73J00n0j77%M85
$$ 19 166 149 -17 51 39 -320 23 50 53 -83 186 -31 -102 213 100 -8 -33 146 -127 -27 -77 -254 -254 231
7299B31J4k71J84j55j99K89r0J47j50l3m0r6L12j13L9j50J22k39J46n4K75l60
$$ 231 245 -26 158 3 -196 93 3 150 0 -33 -73 -169 143 30 69 -81 41 -198 -52 -106 169 -191
7321a91P9j16K25k2Q2j68j21J35J47k21M16n6k54J09m7o3k2n9N7j47K16J73k96
$$ -191 -112 -228 -3 -25 57 -111 -232 -97 50 -171 245 189 -65 44 -3 -66 -88 -147 -90 -237 -21 152 -144
7344a44K12j16K60k00K0k21l2J78K31l69L27k85J37R9N1j22k51J92J7J16j3mj39
$$ -144 68 -48 212 12 32 -189 -221 -43 188 -181 146 -139 -2 97 148 26 -225 -33 -16 100 87 83 -56
7367e6J62k82J28k13M17o2k3n5j92K04j0l75N00k43J18J76j99k5J2l5J91k17L6
$$ -56 106 -176 -48 -261 156 94 71 16 -176 28 18 -357 143 -100 18 194 -5 -30 -18 -53 138 -79 -43
7390d3j01O1p0J60m9j23J91j78K49Jk5j43J06J57j40j42J59j19J37j35J14j29
$$ -43 -144 -83 -153 7 -42 -165 26 -152 97 98 73 -70 36 193 53 -89 70 -49 88 -47 67 -62
7412f2N5J5j83N4L01k49J31q4k30L27k49n3L01k42J49P4M6n8l5l3O1k34K23j92
$$ -62 -7 8 -175 -121 180 -69 62 -22 -252 75 -174 -227 74 -168 -19 55 101 43 8 -25 36 -198 25 -167
7436a67K61k49q3J55qK34n3j66N4k21m3K26J9K36k81QO4k14L08K2m1N3L0n2r6
$$ -167 94 -155 -238 -83 -91 143 90 -76 -22 -243 -286 -60 -41 195 -86 -78 -14 -228 80 102 61 114 144 92 -4
7461dJ72r0j73J86J85k16J32l0O7k03K05j53K80j28j40k6J03n30K35L44j79K4
$$ -4 168 78 -95 91 276 60 192 162 229 26 231 78 358 230 90 64 167 -363 -128 216 37 61
7483F1p8r7O4j9N2j52J52J75j33J16j69P6J48j70j4L8p0n1j41K66q0O0J10m9k54
$$ 61 -17 -114 -50 -69 -17 -169 -17 158 25 141 -28 48 196 26 12 50 -20 -71 -212 54 -26 34 144 95 -159
7508a59J56K03j69J62j06l4j81J33q2L06l12J14j98K8N2K55k12l34M08j22R6J20
$$ -159 -3 200 31 193 87 53 -128 5 -77 229 -83 31 -167 -139 -87 168 -44 -378 30 -92 4 124
7530A24O8k29n9J86k96Q6K97k53J54J00m22K90K77j60q7j03j1m9k5R3j21P7M3
$$ 124 192 -37 -96 90 -206 -120 177 -76 78 178 -244 46 323 163 76 -27 -38 -87 -112 -19 -140 -63 -20
7553b0K51j22J26j56Ql42L92j39j21K20J4j08j24O4o7R9J35q0M7k86J49k0K55
$$ -20 231 109 235 79 87 -255 137 -2 -123 97 111 3 -121 -57 -124 -25 110 30 77 -209 -60 -80 175
7576A75k21K8L2J7j06q0J83j33kJ21L55k99j12J60k21L22l90J86j74L74l52L29
$$ 175 -46 -18 14 31 -75 -155 28 -105 -107 14 369 70 -42 118 -103 219 -171 15 -159 215 -137 192
7598A92p1j95J99p6J04OK6j3j81R2k30J96J30j66%K85k18J03J49m36q2J57o3N1
$$ 192 121 -74 125 49 153 159 185 172 -9 83 -147 49 179 13 13 298 80 183 332 -104 -186 -29 -92 -41
7622d1m7J79K7r8k40K84j50Q9r7K51J35k07k3j38N1k21K98p5q5J85j20K84l53
$$ -41 -88 91 118 20 -220 64 -86 3 -94 157 292 85 62 -76 -25 -246 52 -23 -108 77 -43 241 -112
7645a12J06J00k9j5j97R0K7J02l48M53q1J36k52j39K62k61K02N2j11J10j4q6J50
$$ -112 -6 94 65 50 -147 -57 -30 72 -276 177 96 232 -20 -159 103 -158 44 96 -15 95 81 -5 145
7668A45q1j86O8J42k42L54n4Ol51K66L6q2P3k2j39K3L5Q7k55J55J68m92K34J78
$$ 145 64 -122 -54 88 -154 200 146 152 -199 67 103 21 94 72 -67 -44 -9 78 -177 -22 146 -346 -112 66
7692F6J90l90L02R0m24J3K39k04J17p9J19M9p8K39n1l4m8j85j24J29Q6j9j47K79
$$ 66 256 -134 168 258 -166 -153 86 -118 -1 -80 39 88 10 249 198 164 116 -69 -193 -64 22 3 -144 135
7716A35j17N6J02j31j75J53R1j30R8j52J01k6J19L5j56L5r4K13N7m48J54n3L2
$$ 135 18 74 176 45 -130 23 114 -16 82 -70 31 5 124 159 3 38 -56 157 214 -234 -80 -133 -101
7739a01k10K26j00K68j91K06j38J80q4j94J51l17L72J68j74m26M63q5r9J53k92
$$ -101 -311 -85 -185 83 -108 98 -40 140 56 -138 13 -304 68 236 62 -364 99 14 -85 68 -224
7760b24M0R9J55q6Nj81J62q8O0O5k6m0K2j62J2J26j58J17j08K20j80N7J23J9o
$$ -224 -184 -85 70 -16 -11 -192 -30 -118 -58 7 -19 -59 -37 -199 -187 -61 -219 -102 -210 10 -170 -113 10 29 23
7785B3K54k66j0k2O8l39K22kj91L19j11Q8j12K1k15M14j80J12k33J21lJ44q0J11
$$ 23 277 11 1 -21 47 -292 -70 -72 -263 56 -55 33 -79 -58 -273 141 -39 73 -160 -39 -42 102 22 133
7809A33k65J91k03K82m06K11K5j09L6p9M09q9j81j58L40k8j89J75j40L51l68k23
$$ 133 -132 59 -144 138 -268 -57 -32 -141 -105 -184 225 136 -45 -203 137 109 -80 95 -45 306 -62 -285
7831b85K63K79l99J55R7j15J17k03K24j54J98m65j19L81K38k21%m1O8J06J23k92
$$ -285 -22 257 -142 13 110 -5 112 -91 133 -21 177 -288 -407 -26 212 -9 -9 -50 18 124 247 -45
7853d5pJ34k27j24J52k3J32R3Q2k89j08L27j36j45L02j07k71K55J65k22J73m15
$$ -45 -52 82 -145 -269 -117 -140 -8 85 167 -122 -230 97 -39 -184 118 11 -260 -5 160 -62 111 -304
7875c04K24M8J18Np7J38l67L4q4M29l5j66J94J61m40J95o2k9L0l5J60J11l77M1
$$ -304 -80 -32 86 91 14 152 -215 -181 -265 164 129 -37 157 318 -122 73 11 -18 12 -23 137 248 -129 -88
7899h8K72k2j55L2N3o1j91J26j16L15m3l68J49N9J44j24J78jl05M4J35k68N2J76
$$ -88 184 162 7 39 92 31 -160 -34 -150 165 122 -246 -97 -38 106 -18 160 159 -146 -102 33 -235 -183 -7
7923gj41l0K24l0j59Q1K15k16M3k1Q4k6j65p1J27K22k21K34rj33Kj03M9J18j64
$$ -7 -148 -178 46 16 -143 -62 153 -63 -20 -41 43 17 -148 -219 -92 130 -91 143 134 1 3 -100 -51 67 -97
7948i7L41m53L80L6k40k0M4N3j33J17l9P3J10j6j62r0J7j4K06p4j32J10L3L7j90
$$ -97 244 -209 171 207 -33 -53 -9 44 -89 28 -11 62 172 156 -6 -96 -79 -93 113 39 -93 17 50 87 -103
7973a03L98r8j57p1K8K58m68N1J67j70K60j75lj69L53Q0k48J63k53K61p3j21q3
$$ -103 295 197 40 -31 -3 255 -213 -162 5 -165 95 -80 -83 -252 101 181 -67 96 -157 104 31 -90 -173
7996a73J97Q4n0n7O1k1o8J3m2J26k75M42l8j71Q2k37K33j1k66M02l35j97J86J63
$$ -173 24 108 58 1 62 41 -27 -14 -56 70 -205 237 199 28 110 -127 106 95 -171 231 -104 -301 -115 48
8020D8J11k77J84O9k41R9kJ3KK84k04j60R2j02J9J93n8k01j0L9k59L08J54k62
$$ 48 159 -118 66 135 -106 -7 -9 4 6 290 86 -74 18 -84 -65 128 70 -131 -141 -102 -361 -53 101 -161
8044a61L95j79j81r9L57ok10KJ69k32P9L94k91q8K31k45J00J41k55q6K88j43q8
$$ -161 234 55 -126 -225 132 126 -84 -82 87 -145 -66 328 37 -51 180 -65 35 176 -79 -165 123 -20 -108
8067a08oJ65n6j85K83k34J42k05L20k87N9Q7KKj17J58k19K74k91J01k17L41K1
$$ -108 -114 51 -5 -190 93 -141 1 -204 116 -171 -112 -25 -23 -21 -138 20 -199 75 -216 -115 -332 9 30
8090C0J3K24j07k67J76k57L72l58j1K40j8J82k17N4n3j30K36p0j54J48J44m0j70
$$ 30 43 267 160 -107 69 -188 184 -174 -185 55 37 219 2 56 3 -127 109 39 -115 33 177 137 -33
8113c3J09k03q8L92M4l51k39O04j70k33K94j23q9l3m0M9K92j63p8RJ76k18j7O2
$$ -33 76 -127 -215 177 221 -130 -369 235 65 -168 126 3 -86 -119 -159 -110 182 19 -59 -50 126 -92 -109 -47
8137d7J17j47R4R7j02L4J77k27M2P3j38j05L57j28L0n9kn7J44J7J03l77J04q2
$$ -47 70 -77 17 114 12 46 223 -4 38 111 -27 -132 225 97 127 68 66 9 153 170 273 -104 0 -82
8161h2J87R1l35L03j52k29N20n01J72J56R6j20r7K54l11j48M2Q0p5L54k56j14
$$ -82 105 196 -139 164 12 -217 303 -198 -26 130 226 106 9 263 -48 -196 -154 -74 -149 205 -51 -165
8183a65Q9K77j03j72L07l85J42j14
$$ -165 -76 201 98 -74 233 -152 -10 -124
8191a24
$$ Imaginary data points
##PAGE= N=2
##DATA TABLE= (X++(I..I)), XYDATA
0@%%%%%%%%%Pj5J6j6K4l2L9m7N6p2Q8j04J23j48J78k10K45k85L31l84M43n08N81
$$ 0 0 0 0 0 0 0 0 0 0 7 -8 8 -8 16 -16 23 -24 32 -40 48 -56 67 -81 97 -113 132 -153 178 -206 237 -271 310
32C10o62P50q50R61j080J212j357J517j694J884k092K320k569K842l140L464l818
$$ 310 -352 398 -452 509 -571 641 -716 801 -893 991 -1101 1219 -1350 1492 -1648 1816 -2002
49b002M208m637N110n630O204o846P567q379R305j0368J1606j3071J4832j7001
$$ -2002 2206 -2431 2679 -2951 3253 -3593 3974 -4405 4900 -5468 6138 -6933 7899 -9102
63i102J9745k3346K8312l5652M7748p2393K10697l71528J8834N23839m33789M0664
$$ -9102 10643 -12703 15609 -20043 27705 -44688 166009 -205519 -186685 337154 -96635 -55971
75e5971L74905l96401k69447M78246j08582k04616M10457j88378o00004M84557
$$ -55971 318934 -77467 -346914 131332 22750 -181866 228591 40213 -559791 -75234
85g5234M00776m99618J6529L34596m05895o7533M94219j15775k51698K38317j53451
$$ -75234 325542 -174076 -157547 177049 -228846 -296379 197840 82065 -169633 68684 -84767
96h4767k17335M83167R1449n40673J38301L03042l38108L3635L92597k58843k63191
$$ -84767 -302102 181065 272514 -268159 -129858 173184 -164924 -131289 261308 2465 -260726
107b60726K50653L037r8065K43995j00086l35136K49731K07585k97445P2353K52669
$$ -260726 -10073 -7036 -105101 138894 38808 -296328 -46597 160988 -136457 -64104 188565
118A88565k84603j23572L27801J2681j67099Q6985k7516j07753J85164O6016k09723
$$ 188565 -96038 -219610 108191 120872 -46227 40758 13242 -94511 90653 156669 -53054
129e3054O7014J33474k02021r551K52915q3921k00616R5867P7072p9365K1721
$$ -53054 13960 147434 -54587 -64138 188777 104856 -95760 107 77179 -2186 19535
140A9535L5133q6712P121O7458p7384j034J22020q4300j23927J29677Q4648j27923
$$ 19535 54668 -32044 -24923 42535 -34849 -35883 86137 1837 -122090 7587 92235 -35688
152c5688k2246J12462l2823p1798P8421J7992o0448N1392r56p6091Q4105N2888
$$ -35688 -57934 54528 21705 -50093 28328 46320 -14128 37264 36308 -39783 44322 97210
164I7210j33495N871J40001p7184j10123J25262L2823j36108M9141O6818j05106
$$ 97210 -36285 -30414 109587 32403 -77720 47542 80365 -55743 -6602 60216 -44890
175d4890K7169P1573j08514R785J18119j08074p6476J65416p924j62547R9732
$$ -44890 -17721 53852 -54662 -44877 73242 -34832 -111308 54108 46184 -116363 -16631
186a6631Q7099j48472L1446J17094j13381j0311J15439r6527l8340J53903o0083
$$ -16631 70468 -78004 -46558 70536 -42845 -53156 62283 -34244 -72584 81319 21236
197B1236j32910J39951M8123j65598O5470J14567j45400q786J30387r2761l6725
$$ 21236 -111674 28277 76400 -89198 -23728 90839 -54561 -63347 67040 -25721 -62446
208f2446J23670p5858q1344J39319m496j35521R4815P2165j43924K8317J24958
$$ -62446 61224 -14634 -95978 43341 38845 -96676 -1861 70304 -73620 -45303 79655
219G9655j03073l1276J14880o4349m9064J15488l2659q9823R6738K5518j13014
$$ 79655 -23418 -54694 60186 -4163 -53227 62261 29602 -60221 36517 62035 -50979
230e0979N3960Q1970j07293j0644J02330o5350m1070R0449l9598o1077Q0137l572
$$ -50979 2981 84951 -22342 -32986 69344 3994 -37076 53373 13775 -47302 32835 29263
242B9263p7623N5099L7651q5530J4107P5053o2543k6763P5114l3107m1069O4610
$$ 29263 -48360 6739 44390 -41140 -27033 48020 -14523 -41286 33828 721 -40348 24262
254B4262r546m8634M7004J3794n2152K4244M0933m7288r438N3692k6460k8962
$$ 24262 14716 -33918 13086 26880 -25272 -1028 39905 -7383 -16821 36871 10411 -18551
266a8551M7558r470l4346L3330L761l1306J8069J5120k8252j037K7642j7707j8845
$$ -18551 29007 19537 -14809 18521 22282 -9024 9045 24165 -4087 -5124 22518 4811 -14034
279a4034K9183o042k5548K2349K902k2455J1486O808j5096N11J1482p983j0628
$$ -14034 15149 9107 -16441 5908 8810 -13645 -2159 4649 -10447 -9936 1546 -6437 -17065
292a7065J3837l61j7067J2972M741j7209Q168O273j0491K226N673k857m042N715
$$ -17065 -3228 -3589 -20656 -7684 -2943 -20152 -11984 -5711 -16202 -13976 -8303 -11160 -15202 -9487
306i487M047q930N319Q121j0654N425P887p799L911N158k432J404K032L314k048
$$ -9487 -5440 -14370 -9051 -930 -11584 -6159 1728 -6071 -2160 2998 566 1970 4002 7316 5268
321E268N73O861n121N69P605o347J398M748m540J888Q2j239J461l422K336j271
$$ 5268 5841 12702 7581 8150 15755 9408 10806 15554 11014 12902 12984 11745 13206 9784 12120 10849
337A0849m510M149l806k985L609n702l58O20m378J342k966j603J474n646J916
$$ 10849 6339 10488 6682 3697 7306 1604 1246 1866 -2512 -1170 -4136 -5739 -4265 -9911 -7995
352g995L41n782M118j942l566M181l078k06K276k401J795j001K059J366m358O746
$$ -7995 -7654 -13436 -9318 -11260 -14826 -10645 -13723 -13929 -11653 -14054 -12259 -13260 -11201 -9835 -14193 -7447
368g447O39n704Q225K94n073Q357j5l022N716K489k712L78Q360j812o847J3384
$$ -7447 -6808 -12512 -4287 -3993 -9066 -709 -724 -3746 1970 4459 1747 2125 10485 8673 1826 15210
384A5210j99j1355J4038R10j1898J2259K245j2201P065P290j1909k707J5530r064
$$ 15210 15011 3656 17694 18604 6706 18965 21210 9009 16074 23364 11455 8748 24278 15214
398A5214j5364J8758j871k0894J6218J397k1700J2702O023k0785N691J4268j9750
$$ 15214 -150 18608 16737 -4157 12061 13458 -8242 4460 10483 -10302 -4611 9657 -10093
411a0093p953K4852q356k3102K3187K880k5815J8792Q840k4736J3727J1750k4337
$$ -10093 -18046 6806 -1550 -24652 -1465 1415 -24400 -5608 3232 -21504 -7777 3973 -20364
424b0364O755K4587k0512j5976L0408k011k8203K3251R700k9054J3250J2152k2374
$$ -20364 -13609 10978 -9534 -25510 4898 2887 -25316 -2065 7635 -21419 -8169 3983 -18391
437a8391J1973J3899k6636M17K8938j3611k1107K6251O565k9877J4332J8125j8773
$$ -18391 -6418 7481 -19155 -18738 10200 -3411 -24518 1733 8298 -21579 -7247 10878 -7895
450g895M313R160j3822R274J3589j6072m884K0765j132k1603J2328J8967j9447
$$ -7895 -3582 5578 -8244 1030 14619 -1453 -6337 14428 13296 -8307 4021 22988 3541
463C541q447J5671M07o668k442J205L143q12k522o640K652J5401j3934j5581K5459
$$ 3541 -4906 10765 11172 4504 2062 3267 6410 5598 3076 -3564 -912 14489 555 -15026 10433
478A0433N589k9809P190L0191j4229k2227K1229P232j5848J8212j586k6951K9367
$$ 10433 16022 -13787 -6597 23594 9365 -12862 8367 15599 -249 17963 16377 -10574 18793
491A8793R224m2940K6023L7555n7106k0213O3774r088m8432L4162L407m9322L7553
$$ 18793 28017 -14923 11100 48655 -8451 -28664 35110 26022 -22410 11752 15159 -34163 3390
504C390K0596n8041K8961K8932q0319J8039R1518o1709o1242P9007j649o4967
$$ 3390 23986 -34055 -5094 23838 -56481 -38442 53076 -8633 -69875 9132 7483 -57484
516e7484O7188K4541q5003L4788M3034p2360M6507P3474j13056k7609J25281l6488
$$ -57484 9704 34245 -50758 -15970 27064 -45296 1211 74685 -38371 -65980 59301 22813
528B2813p4534R3653l170j10115O6922O1830q6255L0841M2899j17374K8960J30727
$$ 22813 -51721 41932 38762 -71353 -4431 57399 -28856 1985 44884 -72490 -43530 87197
540H7197r3765o6794J16202l7178r7132J19684M4061j27988L0771N9072q5184
$$ 87197 -6568 -73362 42840 5662 -91470 28214 72275 -55713 -24942 34130 -51054
551e1054N5949R1743j32155k7591J35475o3412o5219J38837k0751j48662Q0669
$$ -51054 4895 96638 -35517 -63108 72367 8955 -56264 82573 61822 -86840 -6171
562f171Q0969r3238L0062N0537j23332J7675J24487q9004m3894J16205p1187j03646
$$ -6171 74798 -18440 11622 62159 -61173 -43498 80989 -8015 -51909 64296 -6891 -110537
574a10537J39117M7705j31531K5589N9148q3548L5766R1060r3024k6343R3523
$$ -110537 28580 76285 -55246 -29657 29491 -54057 -18291 72769 -20255 -46598 46925
585D6925o3348l6552J33526k3402j30434O5895P0667p4949J7210N7644p9848j7612
$$ 46925 -16423 -52975 80551 57149 -73285 -7390 63277 -11672 5538 63182 -16666 -34278
597c4278P7496l6608j9783O9665n7641p4737R3638M0345q9317P654N0727n6176
$$ -34278 43218 6610 -13173 56492 -1149 -75886 17752 58097 -31220 -23566 27161 -29015
609b9015j0833P0009j9128l9401K9970j9380j8069O8247L13p5356K1649N2382
$$ -29015 -39848 30161 11033 -28368 1602 -17778 -35847 32400 32713 -42643 -20994 31388
621C1388m0927j3345N9027j7789n8739L0800L0823k2636Q573o36l9423J7965M0564
$$ 31388 -9539 -22884 36143 18354 -40385 -9585 21238 -1398 7175 6539 -32884 -14919 25645
634B5645l3511k2180M5623j4507n6905M8582M8031o1679j6365M6551j9441j0084
$$ 25645 -7866 -30046 15577 1070 -55835 -7253 40778 -20901 -37266 9285 -10156 -20240
646b0240M3193j9401l4132M3598K713m6740N0754L5518q5801K271Q4537m0825
$$ -20240 22953 3552 -30580 13018 15731 -31009 19745 55263 -30538 -28267 56270 15445
658A5445l9017O3020j8167n3597N5198J3560n7888L7083K3327q2100K7644Q2978
$$ 15445 -23572 39448 21281 -32316 22882 36442 -21446 15637 38964 -43136 -15492 67486
670F7486p7341l8770Q8563l2261o1833P9472Q157p8955M2189L1654o9822L7661
$$ 67486 -9855 -48625 39938 7677 -54156 25316 33473 -45482 -3293 28361 -41461 -3800
682c800O0959r1369j1487J00928n3679n4247R6947j5669q8013O8258L5040p7127
$$ -3800 57159 -34210 -45697 55231 1552 -52695 44252 28583 -59430 8828 43868 -33259
694c3259L3863M4072q4167J3174Q6012p0838l6875R4434l8496p3304Q9869J6115
$$ -33259 604 44676 -39491 -26317 59695 -11143 -48018 46416 7920 -65384 24485 40600
706D0600q9569M1617M1328p2199K2477O3723p0201j7201Q1440m4409m6961Q7638
$$ 40600 -48969 -7352 33976 -38223 -15746 47977 -22224 -39425 42015 -2394 -49355 38283
718C8283j0001q1768N8805L4749p0047K4605M6932o2469k926O3909m1980k9829
$$ 38283 28282 -53486 5319 40068 -29979 -5374 41558 -20911 -23837 40072 -1908 -31737
730c1737O7374k3526n8402O3397J6776o7775K9464L6394n5211M650M9571l7365
$$ -31737 35637 12111 -46291 17106 33882 -33893 -4429 31965 -23246 -18596 30975 -6390
742f390j9711M9682k1333l6384N2568K649n4109L3315K7203m8497R749L9357l3773
$$ -6390 -26101 23581 2248 -34136 18432 21081 -33028 287 27490 -21007 -11258 28099 -5674
755e674j3521L8066j4505k4376L5522r51l7541K6769J8448l9104J0497L0005k9924
$$ -5674 -19195 18871 4366 -20010 15512 14561 -22980 3789 22237 -16867 -6370 23635 -6289
768f289r588L1369j0937k0020K3848J851k6527J5891J5781k7588N737K2960k3717
$$ -6289 -15877 15492 4555 -15465 8383 10234 -16293 -402 15379 -12209 -6472 16488 -7229
781g229o537K6292q952j7734J7791M555k0385R974J4992k0302k29J9966j5849
$$ -7229 -13766 12526 3574 -14160 3631 8186 -12199 -2225 12767 -7535 -7764 12202 -3647
794c647o619K2222q091j5526J6332M533j7045P426J3165j6698k274J8733j1311
$$ -3647 -10266 11956 3865 -11661 4671 9204 -7841 -415 12750 -3948 -6222 12511 1200
807A200r434J8789o359j4214J6076K128j5878O799R894j3898j683J5716r628r683
$$ 1200 -8234 10555 4196 -10018 6058 8186 -7692 -893 9001 -4897 -6580 9136 -492 -10175
821a0175J6403l898j2736J4097J172j3905P920P414j1179L79J0739p327o619J3309
$$ -10175 6228 2330 -10406 3691 4863 -9042 -1122 6292 -4887 -4508 6231 -1096 -7715 5594
835E594k457j1215J1108J288j1841P939M521r939J691O929n988l252P878j877
$$ 5594 3137 -8078 3030 4318 -7523 416 4937 -5002 -3311 3618 -2370 -5622 2256 379
849C79q231P583K368r285N874M009q646L263N360m531j080M638o41m264N348K319
$$ 379 -7852 -269 2099 -7186 -1312 2697 -5949 -2686 2674 -1857 -2937 1701 1060 -3204 2144 4463
865D463o337L398L867o205K950L765n052L26L236k096j512K008O19l633J272K773
$$ 4463 -1874 1524 5391 -814 2136 5901 849 1175 4411 2315 803 2811 3430 -203 1069 3842
881C842n020J780K546m584R19K686l024K03J511j270p99J114R21k052R75K180
$$ 3842 -1178 602 3148 -1436 -517 2169 -855 -652 859 -411 -1210 -96 825 -1227 -252 1928
897A928l605J226K690m156J999J707l167J352J059j858L02P74n62j221J133O46
$$ 1928 -1677 -451 2239 -1917 82 1789 -1378 -26 1033 -825 -523 251 -311 -1532 -399 247
913B47l452K547J511m595K647J141l632K444R81l247K039J659k245p05L210m77
$$ 247 -3205 -658 853 -3742 -1095 46 -3586 -1142 -161 -3408 -1369 290 -1955 -2660 550 73
929G3l863M148J296n238M414J000m582M110Q09m792L699K132m074m52M769j544
$$ 73 -3790 358 1654 -3584 830 1830 -2752 1358 2167 -2625 1074 3206 -868 -1320 3449 1905
945A905m399M645P65m789M553m48m346N492o80n900N464K088n861R44M152k679
$$ 1905 -2494 2151 2916 -1873 2680 2232 -2114 3378 2698 -3202 2262 4350 -1511 -567 3585 906
961I06k461L993j369k783N078l770l225Q746m517o155Q254J84o993L752K492m062
$$ 906 -1555 2438 1069 -1714 3364 -406 -3631 5115 598 -5557 2697 2881 -4112 -360 2132 -1930
977a930J424K646n297K251O987r366j426J3164q474p314J3254k421q902Q286k49
$$ -1930 -506 2140 -3157 -906 6081 -3285 -4711 8453 -21 -7335 5919 3498 -5404 2882 2633
992B633p749P833J984j3170P514J0405j8080l3K0054j4367j0312J9492n888j1571
$$ 2633 -5116 2717 4701 -8469 -955 9450 -8630 -8663 11391 -2976 -13288 6204 316 -11255
1006a1255J5133k623j3883J5538M088k1093J2131J7638k5975j048K8481j6259
$$ -11255 3878 1255 -12628 2910 6998 -14095 -1964 15674 -10301 -11349 17132 873
1018H73j3456K4785p947j5706K2269k922k1140K0775O417l0396J3663K5704l1762
$$ 873 -12583 12202 4255 -11451 10818 7896 -13244 7531 13948 -16448 -2785 22919 -8843
1031h843p221L3683j7541j7316K9142q399k1102K5486j163k5973K4889J2372l6603
$$ -8843 -16064 17619 78 -17238 11904 3505 -17597 7889 6726 -19247 5642 18014 -18589
1044a8589R373L4236k9188j1578L5895j5125k0889L0292m278k2395K5038J59l1416
$$ -18589 -9216 25020 -4168 -15746 20149 5024 -15865 14427 10149 -12246 12792 12951 -18465
1057a8465K3379K0501l8353R76L4706k5123j7271L4537r030k4575K3983k291k1144
$$ -18465 4914 25415 -12938 -11962 22744 -2379 -19650 14887 5857 -18718 5265 2974 -18170
1070a8170K4672M420l2960J5645K4653k9600m198L3598j6334k1944K7522K016
$$ -18170 6502 10922 -22038 -6393 18260 -11340 -15538 18060 1726 -20218 7304 9320
1082I320j8378J5883r83j8948J7680J0583k4355N035K0271k0559j1716K7534j322
$$ 9320 -9058 6825 5842 -13106 4574 15157 -9198 -4163 16108 -4451 -16167 11367 10045
1095A0045k2189Q166N649q835P906K851j2419L626P382r178j54J7056o076j9768
$$ 10045 -12144 -3978 1671 -7164 742 3593 -8826 -5200 2182 -6996 -7150 9906 3830 -15938
1109a5938J0654J6684r004n291P035k726n105O241O485m443j688j178r471R969
$$ -15938 -5284 11400 2396 -2895 4140 1414 -3691 2550 9035 4592 2904 1726 -7745 2224
1123B224J7170j7777j5228J8272O78j5814J3453J2070k4295o761J9855m078k094
$$ 2224 19394 1617 -13611 4661 5339 -10475 2978 15048 -9247 -16008 3847 -231 -2325
1136b325J4353k0876j3906L2610N36k5016K1242O902l6320J1433L8126k1102j7026
$$ -2325 12028 -8848 -22754 9856 10392 -14624 6618 13520 -22800 -11367 26759 5657 -11369
1149a1369K1586j5209j0088L9531q739l5708K7120M657l5379L0218K9847m9015
$$ -11369 10217 -4992 -15080 24451 15712 -19996 7124 11781 -23598 6620 36467 -12548
1161a2548j2364M0677j5267j3225L7126k0828l6675L9653P309l4209L2919J0385
$$ -12548 -24912 15765 498 -12727 24399 3571 -33104 6549 13858 -20351 12568 22953
1173B2953n7392J5658N1306l2767j6789L7246k5420k6309N1020Q46m1695K8881
$$ 22953 -34439 -18781 32525 -242 -17031 20215 -5205 -31514 19506 20352 -21343 7538
1185G538L471m5124L6712L7135n4770q218M3626k8383j4851N0761j6285m4569
$$ 7538 11009 -34115 2597 39732 -15038 -23256 20370 -8013 -22864 27897 11612 -32957
1197c2957L5036Q382l3828L4884J4414n7221J3212M4536l4319q088M2471k7694
$$ -32957 2079 10461 -23367 11517 25931 -31290 -18078 26458 -7861 -15949 26522 -1172
1209a172l2501M6160O559l5873K5553O308m2208K5461L2858l9935k627L4528k8938
$$ -1172 -33673 12487 19046 -16827 8726 15034 -27174 -1713 31145 -8790 -11417 23111 -5827
1222e827j5720M4255n956l6035K3553Q648k9947K1595J9614l6986K866K7916k4564
$$ -5827 -21547 22708 16752 -19283 4270 12918 -17029 4566 24180 -12806 -9940 17976 -6588
1235f588o342L3930j4486k8297K5703Q792k5426J4086J4038k8502L242K4097j9196
$$ -6588 -12930 21000 6514 -21783 3920 12712 -12714 1372 15410 -13092 -9850 14247 -4949
1248d949m471K3753j5159j7977K4844N036k3251J0973J2586k2025J724K2140j4101
$$ -4949 -9420 14333 -826 -18803 6041 11077 -12174 -1201 11385 -10640 -8916 13224 -877
1261h77q109J7745r302j2378K0091K592j9803Q245J1240j6718J95K0305j2168
$$ -877 -8986 8759 -543 -12921 7170 9762 -10041 -1796 9444 -7274 -7079 13226 1058
1274A058j2791J6889k314j2628J4939K572j8310O195J2922j3098j268J6632j1310
$$ 1058 -11733 5156 2842 -9786 5153 7725 -10585 -4390 8532 -4566 -5834 10798 -512
1287e12j2946J9671J223j6227J1905N267j7485P065J3917j3756l542J5155r258
$$ -512 -13458 6213 7436 -8791 3114 8381 -9104 -2039 11878 -1878 -5420 9735 477
1300D77j0170J8766m30j9716J2282P861j7973P434J2275j6262k823J6087q175
$$ 477 -9693 9073 8643 -11073 1209 9070 -8903 -1469 10806 -5456 -8279 7808 -367
1313c67r007J5909l049j6707J4617P746j8456P032J2261j6832Q90J6662j0024
$$ -367 -9374 6535 3486 -13221 1396 9142 -9314 -2282 9979 -6853 -5963 10699 675
1326F75q651J5014k959j2565J3616M268j7868P647J1050j5368J361J3581j2574
$$ 675 -7976 7038 4079 -8486 5130 9398 -8470 -823 10227 -5141 -3780 9801 -2773
1339b773n706J4726m441j0440J0484J853j3683P758R171j3794J050J1897j0694
$$ -2773 -8479 6247 1806 -8634 1850 3703 -9980 -2222 6949 -6845 -5795 6102 -4592
1352d592k496J3265n715q098J0095J131r103O983N892j1036J161J0598p975k598
$$ -4592 -7088 6177 462 -7636 2459 3590 -5513 1470 7362 -3674 -2513 8085 110 -2488
1366b488J0360o178o314R926k26q082M975L137q314J956P451p285k898Q241m601
$$ -2488 7872 1694 -4620 5306 5080 -3002 1973 5110 -3204 -1248 6203 -1082 -3980 4261 -340
1381c40m417Q434j686o701N477J745n653K208N194n700j549O883l016l971O582
$$ -340 -4757 3677 1991 -4710 767 2512 -3141 -933 4261 -1439 -2988 3895 879 -3092 3490
1396C490j703n218N046J190n002J910K304l930l59L871k224l317M217j204l583
$$ 3490 1787 -3431 1615 2805 -2197 -287 2017 -1913 -2272 1599 -625 -3942 275 -929 -4512
1411d512L651K92l504K120J273k410R54J665r93j224K567K92k213K653O33k282
$$ -4512 -861 -569 -4073 -1953 -680 -3090 -2136 -471 -1464 -2688 -121 171 -2042 611 1244 -1038
1427a038K054Q42j359J211J99m79K0J25P13j107J55N77j334L02N85p81l61k98
$$ -1038 1016 1858 499 1710 1909 1430 1450 1575 2288 1181 1336 1913 579 881 1466 685 324 26
1445B6K28J11j347J067R2j868J715K20j784J581L19j286L81J779j177j354K368
$$ 26 254 365 -982 85 177 -1691 24 244 -1540 41 360 -926 -545 1234 57 -1297 1071
1462A071n0k540K739p9l041K672L73l245K322R22k893O23K348j657j861L080l66
$$ 1071 1021 -1519 1220 1141 -1900 772 1145 -2100 222 1144 -1749 -1126 1222 -435 -2296 784 418
1479D18l079L413O0l480L712P52m358L581J789l886P20L681k687j580M028j634
$$ 418 -2661 752 812 -2668 1044 1796 -2562 1019 2808 -1078 -358 3323 636 -944 3084 1450
1495A450k599M319j372m028N365p38n726M668J876o030J993L617m399n99M184
$$ 1450 -1149 3170 1798 -2230 3135 2397 -3329 1339 3215 -2815 -822 2795 -1604 -2203 1981
1510A981l038k249N865l532m055P469j537o688O542J689o848L307L911n725M53
$$ 1981 -1057 -3306 2559 -973 -5028 2441 904 -5784 758 2447 -4401 -1094 2817 -2908 -2455
1525b455N195n223q52P286n093m729R597k115q168Q069J696p862M258M017o574
$$ -2455 2740 -2483 -3335 3951 -1142 -5871 3726 1611 -6557 1512 3208 -4654 -396 3621 -2953
1540b953K097M977o520m78R073o065n204J0537k201q629Q382J678p926M170L125
$$ -2953 -856 4121 -2399 -2877 6196 131 -5073 5464 3263 -5366 3016 4694 -3232 938 4063
1555D063o947K794N118p625p51R288o377n554J0425j945q116P121J424o774M854
$$ 4063 -2884 -90 5028 -2597 -3348 5940 -437 -5991 4434 2489 -5627 1494 2918 -3856 998
1570I98J859o096L498M091p377R02Q172n600n033Q121j197n165N299m93m025M063
$$ 998 2857 -3239 259 4350 -3027 -2125 6047 447 -4586 3535 2338 -2827 2472 1979 -2046 2017
1586B017r32l988M850J103o427R43N325l901j477L985k328j461K749k540J582
$$ 2017 1085 -2903 1947 3050 -3377 -2434 2891 -1010 -2487 1498 -830 -2291 458 -2082 -500
1601e00L717n474k024O304q65l438L576m26l605K661J410k700M099r37q333O288
$$ -500 3217 -2257 -4281 2023 1158 -2280 1296 870 -2735 -74 1336 -1364 2735 1798 -6535 -247
1617b47O261q759L95O003p468o53Q547l670l304M943m727m556J2763L54j4133
$$ -247 6014 -2745 -2350 3653 -3815 -4468 4079 409 -2895 2048 -2679 -7235 5528 5882 -8251
1632h251P597N778j2012O169J1163j3298k942J0228n794j018J3370r419j2554
$$ -8251 -654 5124 -6888 -719 10444 -2854 -5796 4432 -1362 -2380 10990 1571 -10983
1645a0983J5780K397j4107J2128O007k1493M960J6464j2218j249J1808j5285n289
$$ -10983 4797 7194 -6913 5215 11222 -10271 -5311 11153 -1065 -2314 9494 -5791 -11080
1658a1080K1399m734j5428J5040m64k0277J6184J4374k1403J0J3610j5076J803
$$ -11080 10319 5585 -9843 5197 4733 -15544 640 15014 -6389 -6379 7231 -7845 -6042
1671f042K0509j4004j2914J7944l851j3624K0508L768k6502Q525J6120j6463M039
$$ -6042 14467 463 -12451 5493 1642 -11982 8526 12294 -14208 -5683 10437 -6026 -1987
1684a987J5344j9564n890K1530p315j0259J8133n989k0864J8794J1994k0716M827
$$ -1987 13357 -6207 -12097 9433 2118 -8141 9992 4003 -16861 1933 13927 -6789 -1962
1697a962J1916j8859K023K0432j1897q898J4869q097j0965K0410J919k0583Q023
$$ -1962 9954 -8905 -6882 13550 1653 -7245 7624 -473 -11438 8972 10891 -9692 -1669
1710a669J0480j6386N212J5262j5111o289J4006n791n647J4321m545j4767J0718
$$ -1669 8811 -7575 -2363 12899 -2212 -8501 5505 -286 -5933 8388 3843 -10924 -206
1723b06P118j2695M514J0011j4199k932J3884m638n532Q369l855q447R663L806
$$ -206 6912 -5783 -1269 8742 -5457 -8389 5495 857 -4675 3694 -161 -8608 1055 4861
1737D861r481K784N890r198o69J1537m034o822O256n80m950N911L362p376L59
$$ 4861 -4620 -1836 4054 -5144 -5813 5724 1690 -5132 1124 544 -4406 1505 4867 -2509 -2150
1752b150N103m278p18Q146l121q052O443L200n943K654M259o501k334P548j720
$$ -2150 2953 -1325 -2043 6103 2982 -5070 1373 4573 -1370 1284 5543 -958 -3292 4256 2536
1767B536m567N493j135q272O624N398q719O88O568p232k307R710j957q108O341
$$ 2536 -2031 3462 2327 -5945 679 6077 -2642 -1954 4614 -2618 -4925 4785 2828 -5280 1061
1782A061J621q091O402O235j1811J080R614p867k149J0815m801r601J0104K079
$$ 1061 2682 -5409 993 7228 -4583 -3503 6111 -1756 -3905 6910 2109 -7492 2612 4691
1796D691j0093O452M962j2391K629J0761r616k725J1221p565p116J2809m76j1143
$$ 4691 -5402 1050 6012 -6379 -3750 7011 -2605 -5330 5891 -1674 -8790 4019 3543 -7600
1810g600P646M880j1913N063R848j1629j694J2170p963m505J2964m192j0359J0161
$$ -7600 46 4926 -6987 -1924 7924 -3705 -5399 6771 -1192 -5697 7267 3075 -7284 2877
1824B877L217j1346N599P440j2125P1J1529q345m375J1418n674q209J1301O72
$$ 2877 6094 -5252 347 7787 -4338 -4267 7262 -1083 -5458 5960 286 -7923 3378 4050
1838D050j0916O253N329j0517K476J0224r260l690J0851m808n901J0783j225r496
$$ 4050 -6866 -613 4716 -5801 -3325 6899 -2361 -6051 4800 -8 -5909 4874 3649 -5847
1852e847P181M249q748L103O678q123j902R453m559n174Q213j948p730O998K905
$$ -5847 1334 5583 -3165 -62 6616 -1507 -3409 6044 1485 -3689 4524 2576 -5154 1844 4749
1867D749q526K908M640o802k71P658m694m708P029j181n651O397J781p806L395
$$ 4749 -3777 -869 3771 -3031 -3302 4356 -338 -5046 1983 802 -4849 1548 3329 -4477 -1082
1882a082M423n775R70N647m601l313O442k11n169M844N58o616M193L702n397L6
$$ -1082 3341 -2434 -1464 4183 -418 -3731 2711 2500 -2669 2175 2733 -3883 310 4012 -1385 -1349
1898a349L984l872j503N144j257m887L606J271m694L238K907n259K53M327k514
$$ -1349 2635 -1237 -2740 2404 1147 -3740 -134 1137 -3557 -319 2588 -2671 -2418 1909 -605
1913f05r88L501j448l187L210K244l728J205K415m196Q03M256k720j570K547j177
$$ -605 -1593 1908 460 -2727 483 2727 -1001 204 2619 -1577 -774 3482 762 -808 1739 562
1929E62k183L109M36l413L27J989k123J43K940l125j228K578k44j469J737J51
$$ 562 -1621 1488 1924 -1489 -1162 827 -1296 -1153 1787 -1338 -2566 12 -232 -1701 36 187
1945A87k677J209K623j444r50K443j756j046L378l88k253J681K35j670J159J792
$$ 187 -2490 -1281 1342 -102 -1052 1391 -365 -1411 1967 1579 -674 1007 1242 -428 731 2523
1961B523k173j175K401r43j490K540r18k717K101P03j894Q64J058j858n22K567
$$ 2523 350 -825 1576 633 -857 1683 765 -1952 149 852 -1042 -178 880 -978 -1500 1067
1977A067j100j401K365n13k023K273R32k800J481J068j881M34K374j986j278K258
$$ 1067 -33 -1434 931 418 -1605 668 1600 -1200 281 1349 -532 -98 2276 290 -988 1270
1993A270o34k208K488j12k877J808O03k208J160J369k723M73J970j698q12K540
$$ 1270 636 -1572 916 804 -2073 -265 338 -1870 -710 659 -2064 -1591 379 -1319 -2131 409
2009D09q68j621K253L14k411K506J83k141J833J181k417N80K029j936n23K687
$$ 409 -459 -2080 173 487 -1924 582 765 -1376 457 1638 -779 -199 1830 -106 -629 2058
2025B058j621j525K659r87j917K741m14k611K640N28k751J228J806k739N55J885
$$ 2058 437 -1088 1571 584 -1333 1408 994 -1617 1023 1551 -1200 28 1834 -905 -350 1535
2041A535j530j436L407j645j963L570j048k861L103J98l024K321Q57k842J061
$$ 1535 5 -1431 1976 331 -1632 1938 890 -1971 1132 1330 -1694 627 1484 -1358 -297
2056b97J604k271j78L210k763j236L550j553k822L866m91l044K845O35l197K174
$$ -297 1307 -964 -1142 2068 -695 -1931 1619 66 -2756 1110 619 -2425 420 1055 -2142 32
2072C2J741l243N37L148l590o41M566k931j986M155j122k758L287m06k935K850
$$ 32 1773 -1470 -933 2215 -1375 -2016 2550 -381 -2367 1788 666 -2092 1195 789 -2146 704
2088G04P82l632J838K455l534k32L871k895j138L952k485j772L944j508k801L945
$$ 704 1486 -2146 -308 2147 -1387 -1619 2252 -643 -1781 2171 -314 -2086 1858 350 -2451 1494
2104A494Q2m197L082J929m487J405L361m096J74M286l845j210M762l125k315N502
$$ 1494 1576 -2621 461 2390 -2097 -692 2669 -1427 -1253 3033 -812 -2022 2740 -385 -2700 2802
2120B802j785m293M355J108m705K852K619n323J477M234n002K40N175m814j958
$$ 2802 1017 -3276 1079 2187 -2518 334 2953 -2370 -893 3341 -1661 -1421 3754 -1060 -3018
2135c018O506k400m249N021k74n099M447J955n773K440L696o127J074O378o025
$$ -3018 3488 1088 -3161 1860 1586 -3513 934 2889 -2884 -444 3252 -2875 -1801 4577 -1448
2150a448j975O855l611l743O603j007n803M547K102o272L824L999p618J117O676
$$ -1448 -3423 3432 -179 -3922 2681 1674 -4129 418 2520 -3752 72 4071 -3547 -2430 4246
2165D246n899j281O842m131l948O406m65n109N147O96o912M029M717p074Q38N798
$$ 4246 -1653 -2934 3908 -223 -4171 2235 1770 -3339 1808 2504 -4408 -379 4338 -2736 -1898 3900
2181C900n696j230P080l351m165N737j239m796N408J689o716K740M104n988J294
$$ 3900 -1796 -3026 4054 703 -3462 2275 1036 -3760 1648 3337 -3379 -639 3465 -2523 -1229
2196a229N407n598j667N759k564k482M780j028m778L855J834m680K551K729n187
$$ -1229 4178 -1420 -3087 2672 108 -2374 2406 1378 -3400 455 2289 -2391 160 2889 -2298
2211b298N27M741l162j327L403k262j900L605j05k458J616M40k422J576K088k603
$$ -2298 -1771 2970 -192 -1519 1884 -378 -2278 1327 1222 -1236 380 820 -1602 -26 2062 -541
2227e41n28J890j405J97J703j083o99N59l51N12K01k31p04k2N64J48P5m13k68
$$ -541 -1069 821 -584 -387 1316 233 -466 93 -258 254 455 224 -480 -502 62 210 285 -128 -396
2246c96O66p22M25J582j579j340J981m95p66J715m22k114J305R96j780R08J564
$$ -396 270 -452 -27 1555 -24 -1364 617 122 -644 1071 649 -1465 -160 836 -944 -36 1528
2263A528l080k34L715k270j513L465k013k772M102K58l598K692J284m237J570
$$ 1528 -1552 -1786 1929 -341 -1854 1611 -402 -3174 928 1186 -2412 280 1564 -2673 -1103
2278a103M115m149j013M877k846k256N634j644m550M342N86m998L629K978n747
$$ -1103 3012 -1137 -2150 2727 -119 -2375 3259 1615 -2935 1407 1993 -3005 624 3602 -2145
2293b145N89M851m508j350O035l180m226N962r10m797N023J449o062J979M621
$$ -2145 -1556 3295 -1213 -2563 3472 292 -3934 2028 1118 -3679 1344 2793 -3269 -1290 3331
2308C331m819j75N717m677l000O962j692m142N107o91n547M265L216n347O16M008
$$ 3331 -1488 -1663 4054 -623 -3623 3339 1647 -2495 2612 1921 -3626 639 3855 -1492 -876 3132
2324C132n097m70O322l400m209N158r40m535N277J321n809J878L226m108J169
$$ 3132 -1965 -2435 3887 487 -3722 1436 496 -4039 1238 2559 -3250 -1372 1854 -2254 -1085
2339a085M382m011l106N206l26l023M133l58n201L021L406l666L15K748l876j066
$$ -1085 3297 -714 -3820 1386 1060 -1963 2170 1812 -3389 -368 3038 -628 -313 2435 -1441 -2507
2355b507M745m86l876K740m52l305L900K021m412KK130j892N9L611j906l469K854
$$ -2507 2238 1752 -2124 616 164 -3141 759 2780 -1632 -1630 500 -1392 -1333 2278 372 -3097 -243
2372b43J183k160K294Q21m262J013L557j547o47J621k014j377L142R26k777M46
$$ -243 940 -1220 1074 1895 -2367 -1354 2203 656 9 1630 -384 -1761 1381 2307 -470 -24
2388b4O14k252J825K664l302j419K023n17o31K364q23k666P25K597j297J29J483
$$ -24 590 -1662 163 2827 -475 -1894 129 -388 -1019 1345 522 -2144 -1419 1178 -119 10 1493
2405A493k982l38L791o44j721P48o23j356K531J721k710p94J579q40j54K634j665
$$ 1493 -1489 -1827 1964 1320 -401 347 -276 -1632 899 2620 -90 -884 695 -145 -299 2335 670
2422F70k856J843J086j212J353k64k711L93K857n46j341J025j476j383L443O14
$$ 670 -2186 -343 743 -469 884 620 -2091 -1698 1159 613 -728 297 -1179 -2562 881 1495
2438A495k273P4K51r55J268K397j907j575J531k74k61K423r34k844J208J593j021
$$ 1495 -778 -704 -453 -1408 -140 2257 350 -1225 306 32 -229 2194 1260 -1584 -376 1217 196
2455A96P11l6k115p22K768L63j580O20r52j606K381J498k070k58N46r81R31J939
$$ 196 907 871 -1244 -1966 802 1165 -415 205 -747 -2353 28 1526 -544 -802 -256 -1237 -306 1633
2473A633q74j985R74N51p40J462P86k822N36J362n84K93O80j527r51K102p4q33
$$ 1633 759 -1226 -252 299 -441 1021 1807 -1015 -479 883 299 592 1272 -255 -1206 896 822 -11
2491a1O55l99j720J482J357j663m59Q74r92K98J563r76r23R83k22m67J044L46
$$ -11 644 245 -1475 7 1364 -299 -758 116 -876 -578 985 9 -914 69 -153 -620 424 770
2509G70j338M60Q88r97N06N79j126p3Q57j06p79O14q8r56R59P0o60J80L91q12
$$ 770 -568 -108 780 -217 289 868 -258 -331 526 420 -359 255 167 -789 170 240 -420 -240 151 -661
2529f61J5Q84o53M2L65n46r1Q03m24j31O65l39l89Q93j34p29M97O1l28O57j43
$$ -661 -646 238 -415 -373 -8 -554 -645 158 -266 -397 268 -71 -460 433 299 -430 67 128 -200 457 314
2550C14p90O03L24p48M36J07m16m22R19l21o84J273l96o57Q50O2q98P89K14r96
$$ 314 -476 127 451 -297 139 246 -170 -592 327 6 -678 595 199 -458 392 454 -444 345 559 -437
2570d37Q13K70j029K76R57j061l43J713j168n03J163n97p18J124K65j430Q59M23
$$ -437 376 646 -383 -107 850 -211 -554 1159 -9 -512 651 54 -664 460 725 -705 154 577
2588E77j084K28J050j335K5J538j312n99J713p32j107J530m31j065J225L51j396
$$ 577 -507 -279 771 -564 -539 999 -313 -912 801 69 -1038 492 61 -1004 221 572 -824
2605h24M85J444j808K98J590j794k38J857j253o60J800r29j026J507l7j616J221
$$ -824 -339 1105 -703 -405 1185 -609 -847 1010 -243 -903 897 -32 -1058 449 412 -1204 17
2622A7Q75j851P32J241j938J20J875j565n15K226j542o88K134o74j607J454L57
$$ 17 892 -959 -227 1014 -924 -804 1071 -494 -1009 1217 -325 -1013 1121 447 -1160 294 651
2639F51j830R87J221j869M54J525j877J99J620j590l35J985j016r72J645J68j918
$$ 651 -1179 -192 1029 -840 -386 1139 -738 -539 1081 -509 -844 1141 125 -847 798 966 -952
2656i52J418J038k408O64J839k610O54K010k189l55K565j569j368K290l51k115
$$ -952 466 1504 -904 -240 1599 -1011 -357 1653 -536 -891 1674 105 -1263 1027 676 -1439
2672a439J735N29k383J687J331k393O21J768k120O2J964j685o45J741n69j575
$$ -1439 296 825 -1558 129 1460 -933 -312 1456 -664 -602 1362 -323 -968 773 204 -1371
2688a371K005K79k257J490J004k348R69J592k258m2K145j645l71J871j108j047
$$ -1371 634 913 -1344 146 1150 -1198 -229 1363 -895 -937 1208 -437 -808 1063 -45 -1092
2704a092J512q6j646J609N78k195J562O82j994R55J010j549%J352j070l53J534
$$ -1092 420 334 -1312 297 875 -1320 242 924 -1070 -115 895 -654 -654 698 -372 -725 809
2721H09q51j096J869l04j230J384J30j931J454R65j989Q32P27j505L12J360r34
$$ 809 -42 -1138 731 427 -803 581 711 -1220 234 1199 -790 42 769 -736 -424 936 2
2738Bp06J347p08n43J944p86j489J607k51j508J912J30j871P54R41j322M34J337
$$ 2 -704 643 -65 -608 1336 550 -939 668 417 -1091 821 951 -920 -166 775 -547 -113 1224
2756A224j897l10J719n96j097J838k37j709J612J69j693J285O94k190Q76J461
$$ 1224 -673 -983 736 140 -957 881 644 -1065 547 716 -977 308 1002 -1188 -312 1149
2772A149j735j26K003j798p91K572q25j403J804j38k033J640Q40k508J292J041
$$ 1149 -586 -712 1291 -507 -1298 1274 449 -954 850 712 -1321 319 1159 -1349 -57 984
2788I84j892J73K138j822q38K339j168j582K595l44k013J740M57k187J153J756
$$ 984 -908 -735 1403 -419 -1257 1082 -86 -1668 927 583 -1430 310 767 -1420 -267 1489
2804A489k224k2J524j151o81K625j093j821J881Q3j773J762L92k150O15J128j199
$$ 1489 -735 -757 767 -384 -1065 1560 467 -1354 527 610 -1163 599 991 -1159 -544 584 -615
2821f15j8J865j663r52K073m29j149J826p38j775J647P43r64L13N75j603K72J980
$$ -615 -633 1232 -431 -1383 690 261 -888 938 200 -1575 72 815 -149 164 739 -864 -592 1388
2839A388q77q91J203p27q07J912J46j805J99K32n62Q68J046j468j073Q63M30j16
$$ 1388 511 -380 823 96 -711 1201 1347 -458 -259 -27 -589 279 1325 -143 -1216 -353 77 -39
2857c9Q56o57j591N51J234k28L24l61j015L99J065K83o85No32j60J285L23o83
$$ -39 817 160 -1431 -880 354 126 450 89 -926 -527 538 821 136 141 -491 -651 634 957 274
2876B74n84j60rQ21N18r22p77o8J032N9M34o29q10k76J017P02l81n42l93K4O13
$$ 274 -310 -470 -479 342 860 -62 -839 -907 125 184 618 -11 -821 -1097 -80 622 241 -301 -694 -670 -57
2897e7R11p00p01K70j34O59L61k89r21q5Q85J75L85j54q04p69J181L43n54n3l50
$$ -57 854 154 -547 -277 -411 248 609 320 -601 -686 199 374 759 605 -199 -968 213 556 2 -51 -401
2918d01l06Q17O33o81k90j53j98K45J173l90j111Q2O74J78M48K4j406J61Q39l
$$ -401 -707 110 743 62 -228 -381 -579 -334 839 449 -662 -580 94 272 720 744 -662 -501 338 335
2938C35K26l8j160m82J622N49j035J29l71o85J155O91p91o74l87K10P69P69o30
$$ 335 561 523 -637 -1119 503 1052 17 146 -225 -910 245 936 145 -529 -916 -706 63 832 202
2957B02j360O37K99j31P92j6j118L5O42K02L0M10j113m34J066P79p60Q7j95r56
$$ 202 -1158 -521 -222 -353 439 423 -695 -660 -18 184 214 624 -489 -923 143 922 162 249 54 -902
2977i02O87J156q11k41Q4j92j20R19l38j008M39p3j03P13K86j073l2O77l18K18
$$ -902 -215 941 130 -111 -27 -219 -339 580 242 -766 -327 -400 -503 210 496 -577 -609 68 -250 -32
2997c2O65r65j52O82Q7q0J22k69m25L95L99l96J17m7m44J90O10j41m75J26j99
$$ -32 633 -332 -484 198 285 205 327 58 -367 28 427 31 148 101 -343 -153 457 316 -159 -33 -232
3018b32N0L94J66m98l02N91k74K0M77m55j32J53K25K32k39j33j83J93M17r2m3
$$ -232 -182 212 378 -120 -422 169 -105 -85 392 -63 -195 -42 183 415 176 43 -140 53 470 378 335
3039C35j1p03M11K61m26L44l89l00J38L76j86J63j14j19j41N58j94k38J5N4L5
$$ 335 324 -379 32 293 -133 211 -178 -478 -340 36 -150 13 -101 -220 -361 197 3 -235 -220 -166 -131
3060a31N21k73l02K72l95R5M74j98j31N1q4j35m3N81m69j08L49j86j29Q64o21
$$ -131 390 117 -185 87 -308 -213 261 63 -68 -17 -101 -236 -279 302 -167 -275 74 -112 -241 623 2
3081Bo70O54j78l20M91L08q77M51P59j061K52Q25r97l0J052p26k59N68k96l54
$$ 2 -668 -14 -192 -512 -21 287 -590 -139 620 -441 -189 636 -361 -391 661 -65 -324 244 -52 -406
3101d06Q21j6q54L53L40l96L0P23o22n3O96p84k35O84j9p58P73Pq00N25O78j185
$$ -406 415 399 -455 -102 238 -158 -128 595 -27 -80 616 -168 -403 281 262 -496 277 284 -516 9 687 -498
3123d98L46O43q64K88O91p85k29J131o09m80M42K2m97N16J46o73L68O31j246N37
$$ -498 -152 491 -373 -85 606 -179 -408 723 114 -366 76 98 -399 117 263 -410 -42 589 -657 -120
3143a20Q85j020j52R96n67p75R47j13j002J210r8r07Q87J98r66M92P89j440O04
$$ -120 765 -255 -407 589 22 -753 194 81 -921 289 191 -716 171 369 -597 -105 684 -756 -152
3162a52Q77j100j11J112q39n77J385l05j081J104K93j403J034K84j268O30R93
$$ -152 725 -375 -486 626 -213 -790 595 290 -791 313 606 -797 237 521 -747 -117 876
3179H76j324J50J071q53n53J456q99o77J447j77j321J216Q8j249N73R93j307M07
$$ 876 -448 -298 773 -80 -633 823 -76 -753 694 517 -804 412 500 -749 -176 817 -490 -83
3197h3P44j087J13J277j013o73J452o97q28J366l9j344J513N8j515Q77R04j672
$$ -83 661 -426 -313 964 -49 -722 730 33 -795 571 532 -812 701 759 -756 121 1025 -647
3215f47K05J314j101m58J453n06q99J354k34j283J240L29j720J148M90j509N91
$$ -647 -442 872 -229 -687 766 260 -639 715 481 -802 438 767 -953 195 685 -824 -233
3232b33Q07j252R6J286j004l33J276m04q19J073k6j311J037L60j521J019O95j375
$$ -233 574 -678 -582 704 -300 -633 643 239 -580 493 467 -844 193 553 -968 51 746 -629
3250f29M33Q26q64l27J409p34q28J331o99j029J397Rj278J145L54j239P98Q61
$$ -629 -196 630 -234 -561 848 114 -714 617 -82 -1111 286 295 -983 162 516 -723 75 936
3268I36j332j8J186q16p60J672r17p57J458l74j074J096K87j314Q42N84j013J1
$$ 936 -396 -414 772 -44 -804 868 -49 -806 652 278 -796 300 587 -727 115 699 -314 -303
3286c03J036j039k16J428q56n54J449r26q96J428j5j325J087K06j129O78O42j211
$$ -303 733 -306 -522 906 50 -504 945 19 -877 551 536 -789 298 504 -625 53 695 -516
3304e16O36P06j140J30R75n43q39J130l50q98J265J34j062L75L61j055M82R64
$$ -516 120 826 -314 -184 791 248 -591 539 189 -709 556 690 -372 3 364 -691 -209 755
3322G55j033j31R26r28k69J658q73r20O94J61p20R43J06j098L64Q11j073K96R62
$$ 755 -278 -409 517 -411 -680 978 105 -815 -121 40 -680 263 369 -729 -365 446 -627 -331 631
3341F31j114j85J316q05l55R21o43n19Q26j2n87O13K01j012R0J170q00k8Q39p65
$$ 631 -483 -668 648 -157 -512 409 -234 -753 73 61 -526 87 288 -724 -634 536 -264 -292 547 -218
3361b18J9R34o16n83Q10l38n01J118J0j119K04N56l51N3Q90j008m53J008l81k90
$$ -218 -199 735 119 -464 346 8 -493 625 635 -484 -280 276 -75 -22 868 -140 -593 415 34 -256
3381b56P91l02q93P81K76m11JM58q24J77J023o92k91O98q40q0O74J57o56L57P9
$$ -256 535 233 -660 121 397 -14 -13 445 -379 -202 821 129 -162 536 -304 -384 290 447 -209 148 227
3402B27n24M49M29q77m1R55r81K25O84o85m39O44M7l82M74R7o17LM41j04l59L51
$$ 227 -297 152 581 -296 -337 618 -363 -138 546 -139 -578 66 113 -269 205 302 -315 -312 129 25 -334 17
3424A7k99N1R02m05m49l5N9O1N6M23k47k96j17J87K34J94m57M8j36j59L39P9j4
$$ 17 -282 -231 671 266 -183 -218 -159 -98 -42 381 134 -162 -279 -92 142 336 -121 -73 -209 -368 -29 50 36
3447C6j00l18J53L13k25K26l51o2L90m9K50l43K32k10L9L47K3k49j91K47J54q1
$$ 36 -64 -382 -229 84 -141 85 -266 -328 62 13 263 -80 152 -58 -19 328 351 102 -89 158 312 231
3469B31j74m3l09J35M89m15L53q2m32R7N77l25k55K37j61OK90L45m62l69K74k2
$$ 231 57 14 -295 -160 329 -86 267 185 -247 -150 427 102 -153 84 -77 -71 219 564 102 -267 7 -15
3491a5l60J170o86p98Q19K24j75l4q8n55N64K64p6l08J91p57K64N59J57q42O3
$$ -15 -375 795 109 -689 130 354 179 145 57 -498 66 330 254 -54 137 -620 -356 203 360 -482 -419
3512d19K1j71Q27L27p69l30M34k11M08L75m82p62O13M46l85N12l19j053N40Q76
$$ -419 -398 -569 258 585 -184 -514 -80 -291 117 492 10 -752 -139 307 -78 434 115 -938 -398 478
3532D78k27o5m2q39J11J343k50r36M82m99n5Q78L88j113q2J94m5L76O90o89r43
$$ 478 251 186 144 -695 -584 759 509 -427 55 -444 -499 379 767 -346 -428 -234 -279 97 787 98 -845
3553h45O86J50KQ20n01j505R06O48k17Q6J18j080K72Q45N16n71j20o37j84J144
$$ -845 -159 -9 -7 813 312 -1193 -287 361 144 230 348 -732 -460 385 901 330 210 -427 -611 533
3573E33K01p82j60q3R3L92P47p43m86l2jJ47R57o19q65J75O17L6M77m97n01j0
$$ 533 734 -48 -208 -291 -198 194 941 198 -288 -320 -321 -174 783 164 -701 -526 91 127 604 107 -394 -404
3595d04K71K40J04j54l71k48P06J27k79K56o79K10L56J9N4j38m11k53L77L96k02
$$ -404 -133 107 211 57 -314 -562 144 271 -8 248 -431 -221 135 154 208 70 -341 -594 -217 179 -23
3616b3n3k07j31N19M17o47J26J0n75O64N35r44P0N09n42k5P34k95m74M50j3l08
$$ -23 -76 -283 -414 105 522 -125 1 11 -564 100 635 -309 -239 270 -272 -297 437 142 -332 118 105 -203
3638b03K55O31j200L43P34j048L95N09o50j33P87j26p01Q26m35m79N15M87j245
$$ -203 52 683 -517 -174 560 -488 -93 416 -234 -367 420 294 -407 419 -16 -495 20 507 -738
3657g38P32Q15j466N76P63r23j96J002m64o36R88N1j016P50J64j101R54M92j311
$$ -738 -6 809 -657 -81 682 -241 -437 565 101 -535 453 504 -512 238 402 -699 255 747 -564
3676e64L37O61r36L40R69j049k47J106m35r11J224J21j604J327l5j026L78J026
$$ -564 -227 434 -502 -162 807 -242 -489 617 182 -729 495 616 -988 339 304 -722 -344 682
3694F82j532N51R27r97l05J182n19q79J145J60j090J032K24j384R34N40j330M16
$$ 682 -850 -299 628 -369 -674 508 -11 -890 255 415 -675 357 581 -803 131 671 -659 -243
3712b43J002j352J80J067q43l97J212m90q43J243K36j421Q54M67j588Q81Q35j014
$$ -243 759 -593 -413 654 -189 -586 626 136 -707 536 772 -649 205 672 -916 -35 800 -214
3730b14j77J279j302k06J263n55o58R98j23j036J046L67j564J304L49j238N68
$$ -214 -391 888 -414 -620 643 88 -570 428 305 -731 315 682 -882 422 771 -467 101
3747A01O93j256K70R50q13n95J338n64q45J255j3j365J016J36j174J067L37r28
$$ 101 794 -462 -192 758 -55 -650 688 124 -721 534 521 -844 172 308 -866 201 538 -390
3765c90L36O35q83l55J621j224l62J573o43j053J140k55r27J272o8r21K05O56
$$ -390 -54 581 -302 -657 964 -260 -622 951 308 -745 395 140 -787 485 417 -504 -299 357
3783C57q05j2R98q73l83J167n61p52J510o39p53J199k34j137J039M26j300Q20
$$ 357 -448 -460 538 -335 -718 449 -112 -864 646 7 -746 453 219 -918 121 547 -753 67
3801F7K24p54j0J142j002k80J565r48n59J199k36r20O82K16r54Q24M03j111J89
$$ 67 291 -463 -473 669 -333 -613 952 4 -555 644 408 -512 170 386 -568 256 659 -452 -263
3820b63R41j116K4J124j045m3J328p09o99Q45J28j245J023L78r85K0J168j330
$$ -263 678 -438 -414 710 -335 -378 950 241 -458 387 515 -730 293 671 -314 -294 874 -456
3838d56J68J266j107o73J613r47o22J116l9j367J190K82j108M91J169j344j13
$$ -456 -288 978 -129 -802 811 -136 -758 358 319 -1048 142 424 -684 -193 976 -368 -481
3855d81J362r45l98J346p28q06J428o32p15J014R3j290O94R28j352Q9J317j408
$$ -481 881 -64 -462 884 156 -650 778 146 -569 445 538 -752 -58 870 -482 -393 924 -484
3873d84k6J327r73o98J373j00r90P80N4q29L85P07j144L48J092j023j61Q32o19
$$ -484 -510 817 -156 -854 519 419 -571 209 263 -566 -181 526 -618 -270 822 -201 -362 470 -149
3892a49m00J039j54q15N87K84p39M40K73o42j91J300n93o46R95n51p15P48L84
$$ -149 -549 490 336 -479 108 392 -347 93 366 -276 -467 833 240 -406 589 38 -677 71 455
3911D55r02N76O0m98K16N49l9p02N11j89l19L04M34m13j56K90j61k55N77P9q42
$$ 455 -447 129 189 -309 -93 456 417 -285 226 37 -282 22 456 43 -113 177 16 -239 338 417 -425
3932d25M17K77l17j2K41k39m2J59J34k26M5J44m25K35M99n61m80O52l04RL95m6
$$ -425 -8 269 -48 -60 181 -58 -100 59 193 -33 12 156 -269 -34 465 -96 -576 76 -228 -219 176 130
3954A30m72P8N24p00L20M28o02k54J090o23l04Q30n42n21N23O00q99q7J032j110
$$ 130 -342 -264 260 -440 -120 308 -294 -548 542 -81 -385 445 -97 -618 -95 505 -394 -481 551 -559
3974e59q5J224n49p15J020k25q32R79M66j328M23Q39j079L49O38n54n88J264k67
$$ -559 -644 580 31 -684 336 111 -721 258 724 -604 -181 658 -421 -72 566 12 -576 688 421
3993D21j133Q58K03j172J003P62j388l53J560q84k33J256n74j550J620L26j154
$$ 421 -712 146 349 -823 180 942 -446 -799 761 -123 -356 900 326 -1224 396 722 -432
4010d32O02K82j514P45J396r81l71P95q65o41J674L87j963Q83K65j118J336Q96
$$ -432 170 452 -1062 -317 1079 98 -273 522 -343 -984 690 1077 -886 -3 262 -856 480 1376
4028A376j873o84J290P3m16J446o80k010J515R08r85M28L59k186N17J833m67n66
$$ 1376 -497 -1181 109 182 -234 1212 532 -1478 37 945 -40 388 747 -1439 -922 911 444 -122
4046a22L84o60j079K002N59j414j17O03j318J079J468j628p25Q54Q9m23J679n82
$$ -122 262 -398 -1477 525 1084 -330 -447 156 -1162 -83 1385 -243 -968 -114 -25 -448 1231 649
4064F49k029N00J405p71N10O16j513k24J072K47m42M20p02j173J264J052p36l78
$$ 649 -1380 -880 525 -246 264 880 -633 -857 215 462 20 440 -262 -1435 -171 881 145 -233
4082b33N75r50j30J793o20j084M83O4k88Q81K07r33n85O45K0n3R39o27q02O20
$$ -233 342 -608 -738 1055 435 -649 -166 -102 -390 491 698 -235 -820 -175 -155 -208 731 104 -698 -78
4102g8N86m07L20K3j054pJ185J1p00O78o34n83J098K95r39P4L94n38k44J513r80
$$ -78 508 101 421 444 -610 -617 568 579 -121 557 -77 -660 438 733 -206 -132 262 -276 -520 993 13
4123A3r31J028J92o37P41L13j502N23Q81o14j47R83j045n55J034K79j198J207
$$ 13 -918 110 302 -335 406 719 -783 -260 621 7 -140 843 -202 -757 277 556 -642 565
4141E65Qj474Q31P74r47m57J483o62q13J147k6j201R82L57j541R98J163j617N9
$$ 565 573 -901 -70 704 -243 -700 783 121 -692 455 429 -772 210 567 -974 24 1187 -430 -371
4160c71J213j280j22J168k10j166R48J62j083J158M61j844P85J036j536L71J166
$$ -371 842 -438 -560 608 398 -768 180 342 -741 417 878 -966 -181 855 -681 -310 856
4177H56j197m11J480m71j042J291r7j382R72P53j362M94Q50j308N3J161o21o29
$$ 856 -341 -752 728 257 -785 506 409 -973 -1 752 -610 -116 734 -574 -521 640 19 -610
4195f10J220n62o07P91J78p74M88M93j257M64P79j081L9J118j094J14R27k63r14
$$ -610 610 48 -559 232 410 -364 124 617 -640 -176 603 -478 -439 679 -415 -301 626 363 -551
4214e51P71k9p08P00M70j251P71M17r90N61K26q74L82N97l72m15N93j88n96N46
$$ -551 220 191 -517 183 653 -598 173 590 -400 161 387 -487 -105 492 120 -295 298 110 -486 60
4234F0j13n91Q10K16r80L87O08r97O26P7n35J97K54j52l48P31l76n0O98m27p26
$$ 60 -53 -644 166 382 -598 -211 397 -600 26 103 -432 -235 19 -133 -481 250 -126 -176 522 95 -631
4255f31Q49j44n74P30n4n52M54L18o57L1N54k80l21P95m76m57Q97O8r32O83K09
$$ -631 218 74 -500 230 176 -376 78 396 -261 -230 324 44 -277 518 42 -415 482 550 -382 301 510
4276E10p73L83K03o70L83P68r23m40J051n77l24J285j009m08J285m31r87J103
$$ 510 -263 120 323 -347 36 804 -119 -559 492 -85 -409 876 -133 -541 744 313 -674 429
4294D29j45p38P81J97q73M05R15j141k88R55m39m12Q84j64r84R80j10p65Q24J47
$$ 429 284 -454 327 524 -349 56 971 -170 -458 497 58 -354 530 366 -618 362 252 -513 311 458
4314D58r54L65M32q12M75P87r20p13J372m11p83J121j54o52N11M73r79K60N06
$$ 458 -496 -131 301 -511 -36 751 -169 -882 490 79 -704 417 263 -389 122 595 -384 -124 382
4333C82p91j02J003p49k20Q57o05o31J317m16p02R14Pq16N28L26q96K58Q59j092
$$ 382 -409 -511 492 -257 -477 380 -225 -856 461 45 -657 257 264 -552 -24 302 -594 -336 523 -569
4353e69L24P38n13n91J088l14p74J307k06q13L93N01r36L50O28q20R9O20m47l17
$$ -569 -245 493 -20 -611 477 163 -611 696 490 -323 70 571 -365 -15 613 -207 -108 512 65 -252
4373b52P97o33k46O71j19o52P18L19o35j25O61m92n8M50m11l59O25k06m67O13
$$ -252 545 -88 -334 337 218 -434 284 603 -32 -157 504 12 -46 404 -7 -366 259 53 -414 199
4393A99n8l33L05K91o80K67L54m80RM57n70p3N27k03k38K12r8l3m6L08j85j61
$$ 199 141 -192 113 404 -276 -9 345 -135 -126 331 -239 -312 215 12 -226 -14 -112 -145 -191 117 -68 -229
4415b29K95np2K8r8L9J0j90K77j44j15M64k76j29K44J09n69K10K31j24j82M59
$$ -229 66 61 -11 17 -81 -42 -32 -222 55 -89 -204 260 -16 -145 99 208 -361 -151 80 -44 -226 233
4437B33l65o6L95j49l59P80m43n71P09j05l08K20J62m19J87N64m87l26Q13j29
$$ 233 -132 -198 197 48 -311 469 26 -545 164 59 -249 -29 133 -286 -99 465 -22 -348 465 336
4457C36q20P33m3r63R56L71j033M19N61o33l64J132l08r01J196o00q84J241J83
$$ 336 -484 249 206 -757 199 570 -463 -44 517 -116 -480 652 344 -557 639 39 -845 396 579
4476E79j317P19O12j098O5J187p47n65R44J12j332J333L2j652J002Q43j166J57
$$ 579 -738 -19 593 -505 -440 747 0 -565 379 491 -841 492 524 -1128 -126 717 -449 -292
4494b92R28r13n30J666l58j118J075k81j087J072P66j526M05P85j034k35J442
$$ -292 636 -277 -807 859 501 -617 458 177 -910 162 928 -598 -193 592 -442 -677 765
4511G65p83p85J150O1j313J053M40j518P37J085j301L58R33j177p48J588L3j190
$$ 765 -18 -803 347 408 -905 148 588 -930 -193 892 -409 -51 882 -295 -1043 545 578 -612
4529f12O64N33j765J042J222j482l41J263q64k66J690o00j395J085K14r79P56
$$ -612 52 585 -1180 -138 1084 -398 -739 524 -340 -606 1084 484 -911 174 388 -591 165
4546A65P34j620K35J381j000k81J376j184q85J459L40j182N62M23j155J05J551
$$ 165 899 -721 -486 895 -105 -386 990 -194 -1079 380 720 -462 100 523 -632 -527 1024
4563A024q74o98J200n74p78J400Q2j535N72O68p50j5J319j228o61J329j71j226
$$ 1024 150 -548 652 78 -700 700 782 -753 -181 487 -263 -278 1041 -187 -848 481 310 -916
4581i16J622l77j190N95R19j112N6J201j056o99J506p4j426J066L97j685R10J251
$$ -916 706 329 -861 -266 653 -459 -403 798 -258 -957 549 475 -951 115 512 -1173 -263 988
4599I88j382k36J234q72k82J041K3j550J194N73j581R42R65j855K41J413r79n86
$$ 988 -394 -630 604 -268 -550 491 514 -1036 158 731 -850 92 1057 -798 -557 856 -123 -709
4617g09J552n55j206J466L11j724J012N16j496L78J701j379p78K070r88j367J865
$$ -709 843 288 -918 548 859 -865 147 663 -833 -455 1246 -133 -911 1159 171 -1196 669
4634F69K64k054Q76J036j376J49J783j937k68J800r73p86J801l74j773J220J155
$$ 669 933 -1121 -245 791 -585 -436 1347 -590 -858 942 -31 -817 984 610 -1163 57 1212
4651A212j854J96J650j820L8J625q34j097J830q16j004J300N71k067P45J048j356
$$ 1212 -642 -446 1204 -616 -578 1047 213 -884 946 130 -874 426 997 -1070 -325 723 -633
4668f33L47J256j036j250K103o08j004J457j89j521P95J184j303k30J505j440
$$ -633 -286 970 -66 -1316 787 179 -825 632 443 -1078 -283 901 -402 -632 873 -567
4684e67l35J846o31r76J108k74j245J239L79j181M70R51j323J35J092o50r92J375
$$ -567 -902 944 313 -663 445 171 -1074 165 544 -637 -167 784 -539 -404 688 38 -954 421
4702D21l03o76R48J24j047M22N67q21K27Q58m85q52O72J80p15J073m03o27O59
$$ 421 118 -558 390 514 -533 -111 456 -365 -138 720 235 -617 55 235 -480 593 190 -437 222
4721B22j87j41%N06o00J15L33J78l97J69j74n99N46N23m77R5q1n4j41J38M43n36
$$ 222 35 -106 -106 400 -200 -85 248 426 29 198 24 -575 -29 494 17 112 31 -23 -164 -26 417 -119
4743a19j17K82P2k21M29j49n62L59K78m79J57O42p87l80J111k54o91P29m14k78
$$ -119 -236 46 118 -103 326 177 -385 -26 252 -227 -70 572 -215 -595 516 262 -429 300 -114 -392
4763c92O35L27p01k6L42k47n14J197p32k27O31j24m09N63J64j188N07N96p75j13
$$ -392 243 570 -131 -157 185 -62 -576 621 -111 -338 293 169 -240 323 487 -701 -194 402 -373 -486
4783d86J014o18p61J686q36p08J217l81o16P19M89j122K33O56r96K32R42p68k95
$$ -486 528 -90 -851 835 -1 -709 508 127 -489 230 719 -403 -170 486 -510 -278 664 -104 -399
4802c99O45J61j061J172q8r40O20J35q47P65M14p89l20J016p12m08J029j78q75
$$ -399 246 407 -654 518 430 -510 110 245 -602 163 577 -212 -532 484 -228 -636 393 215 -660
4821f60R94p3p70N79K87j033Q53M10q01k68Q67m49m53R94o17k62M64J07n88O04
$$ -660 334 261 -509 70 357 -676 177 587 -214 -482 385 -64 -517 477 -140 -402 62 169 -419 185
$$ [...]
8191d7
##END NTUPLES=NMR FID
##END=
