##TITLE=1H_40-2021
 CDCl3, 8 sc, 
 10.06.2021
##JCAMPDX= 6.0         $$ Bruker NMR JCAMP-DX V2.0
##DATA TYPE= NMR FID
##DATA CLASS= NTUPLES
##ORIGIN= UXNMR, Bruker Analytische Messtechnik GmbH
##OWNER= root
$$ XWIN-NMR		Version 3.5
$$ Thu Jun 10 10:26:12 2021 Russian Standard Time (UT+4h)  she@DPX200
##.OBSERVE FREQUENCY= 200.131506
##.OBSERVE NUCLEUS= ^1H
##.DELAY= (6, 6)
##.ACQUISITION MODE= SIMULTANEOUS
##.ACQUISITION SCHEME= undefined
##.AVERAGES= 8
##.DIGITISER RES= 18
##SPECTROMETER/DATA SYSTEM= spect
##.PULSE SEQUENCE= zg30
##.SOLVENT NAME= D2O
##.SHIFT REFERENCE= (INTERNAL, D2O, 0, 15.7039)
##AUDIT TRAIL= $$ (NUMBER, WHEN, WHO, WHERE, WHAT)
$$ ##TITLE= Audit trail, XWIN-NMR		Version 3.5
$$ ##JCAMPDX= 5.01
$$ ##ORIGIN= Bruker BioSpin GmbH
$$ ##OWNER= she
$$ F:/spectra/data/she/nmr/H-F/1/audita.txt
$$ ##AUDIT TRAIL=  $$ (NUMBER, WHEN, WHO, WHERE, WHAT)
(   1,<2021-06-10 10:25:14.20 +0400>,<she>,<DPX200>,
      <created by zg, POWCHK disabled, PULCHK disabled
       configuration hash MD5:
       00 E9 B6 7A A2 85 ED C7 34 08 36 98 17 FE 4E 26
       data hash MD5: 16K
       F0 AA C4 1D 16 03 5C 1B AD 5C 46 2E B6 6E BE A3>)
$$ ##END=
$$ 
$$ hash MD5
$$ 34 C5 5D CF D6 E4 45 97 98 A7 76 22 A1 AE 37 0B
##$RELAX= 
##$RELAX= 
##$RELAX= 
##$RELAX= 
##$RELAX= 
##$RELAX= 
$$ Bruker specific parameters
$$ --------------------------
##$DU= <F:/spectra>
##$EXPNO= 1
##$NAME= <H-F>
##$PROCNO= 1
##$TYPE= <nmr>
##$USER= <she>
##$AMP= (0..31)
100 100 100 100 100 100 100 100 100 100 100 100 100 100 100 100 100 100 
100 100 100 100 100 100 100 100 100 100 100 100 100 100 
##$AQSEQ= 0
##$AQ_mod= 1
##$AUNM= <au_zg>
##$AUTOPOS= <>
##$BF1= 200.13
##$BF2= 200.13
##$BF3= 200.13
##$BF4= 200.13
##$BF5= 200.13
##$BF6= 200.13
##$BF7= 200.13
##$BF8= 200.13
##$BYTORDA= 1
##$CFDGTYP= 0
##$CFRGTYP= 5
##$CHEMSTR= <none>
##$CNST= (0..31)
1 1 145 1 1 1 1 1 1 1 1 1 1 1 1 1 1 1 1 1 1 1 1 1 1 1 1 1 1 1 1 1 
##$CPDPRG= <>
##$CPDPRG1= <>
##$CPDPRG2= <>
##$CPDPRG3= <>
##$CPDPRG4= <mlev>
##$CPDPRG5= <mlev>
##$CPDPRG6= <mlev>
##$CPDPRG7= <mlev>
##$CPDPRG8= <mlev>
##$CPDPRGB= <>
##$CPDPRGT= <>
##$D= (0..31)
0 1.2 0 0 0 0 0 0 0 0.06 0 0.03 0 0 0 0 0.0002 0 0 0 0 0 0 0 0 0 0 0 0 
0 0 0 
##$DATE= 1623306313
##$DBL= (0..7)
120 120 120 120 120 120 120 120 
##$DBP= (0..7)
150 150 150 150 150 150 150 150 
##$DBP07= 0
##$DBPNAM0= <>
##$DBPNAM1= <>
##$DBPNAM2= <>
##$DBPNAM3= <>
##$DBPNAM4= <>
##$DBPNAM5= <>
##$DBPNAM6= <>
##$DBPNAM7= <>
##$DBPOAL= (0..7)
0.5 0.5 0.5 0.5 0.5 0.5 0.5 0.5 
##$DBPOFFS= (0..7)
0 0 0 0 0 0 0 0 
##$DE= 6
##$DECBNUC= <off>
##$DECIM= 32
##$DECNUC= <off>
##$DECSTAT= 4
##$DIGMOD= 1
##$DIGTYP= 9
##$DL= (0..7)
0 120 120 120 120 120 120 120 
##$DP= (0..7)
150 150 150 150 150 150 150 150 
##$DP07= 0
##$DPNAME0= <>
##$DPNAME1= <>
##$DPNAME2= <>
##$DPNAME3= <>
##$DPNAME4= <>
##$DPNAME5= <>
##$DPNAME6= <>
##$DPNAME7= <>
##$DPOAL= (0..7)
0.5 0.5 0.5 0.5 0.5 0.5 0.5 0.5 
##$DPOFFS= (0..7)
0 0 0 0 0 0 0 0 
##$DQDMODE= 0
##$DR= 18
##$DS= 0
##$DSLIST= <SSSSSSSSSSSSSSS>
$$ [...]
##$SUBNAM2= <"">
##$SUBNAM3= <"">
##$SUBNAM4= <"">
##$SUBNAM5= <"">
##$SUBNAM6= <"">
##$SUBNAM7= <"">
##$SUBNAM8= <"">
##$SUBNAM9= <"">
##$SW= 20.0188882624521
##$SWIBOX= (0..15)
0 0 2 0 0 0 0 0 0 0 0 0 0 0 0 0 
##$SW_h= 4006.41025641026
##$TD= 16384
##$TD0= 1
##$TE= 0
##$TE2= 300
##$TE3= 300
##$TEG= 300
##$TL= (0..7)
0 120 120 120 120 120 120 120 
##$TP= (0..7)
150 150 150 150 150 150 150 150 
##$TP07= 0
##$TPNAME0= <>
##$TPNAME1= <>
##$TPNAME2= <>
##$TPNAME3= <>
##$TPNAME4= <>
##$TPNAME5= <>
##$TPNAME6= <>
##$TPNAME7= <>
##$TPOAL= (0..7)
0.5 0.5 0.5 0.5 0.5 0.5 0.5 0.5 
##$TPOFFS= (0..7)
0 0 0 0 0 0 0 0 
##$TUNHIN= 0
##$TUNHOUT= 0
##$TUNXOUT= 0
##$USERA1= <user>
##$USERA2= <user>
##$USERA3= <user>
##$USERA4= <user>
##$USERA5= <user>
##$V9= 5
##$VALIST= <valist>
##$VCLIST= <CCCCCCCCCCCCCCC>
##$VD= 0
##$VDLIST= <DDDDDDDDDDDDDDD>
##$VPLIST= <PPPPPPPPPPPPPPP>
##$VTLIST= <TTTTTTTTTTTTTTT>
##$WBST= 1024
##$WBSW= 4
##$XGAIN= (0..3)
0 0 0 0 
##$XL= 0
##$YL= 0
##$YMAX_a= 680167
##$YMIN_a= -755454
##$ZGOPTNS= <>
##$ZL1= 120
##$ZL2= 120
##$ZL3= 120
##$ZL4= 120
##$ABSF1= 10
##$ABSF2= 0
##$ABSG= 5
##$ABSL= 3
##$ALPHA= 0
##$AQORDER= 0
##$ASSFAC= 0
##$ASSFACI= 0
##$ASSFACX= 0
##$ASSWID= 0
##$AUNMP= <proc_1d>
##$AZFE= 0.1
##$AZFW= 0.1
##$BCFW= 1
##$BC_mod= 2
##$BYTORDP= 1
##$COROFFS= 0
##$CY= 11.3945322036743
##$DATMOD= 1
##$DC= 2
##$DFILT= <>
##$DTYPP= 0
##$F1P= 15.9154993809931
##$F2P= -4.1035820241983
##$FCOR= 0.5
##$FTSIZE= 0
##$FT_mod= 4
##$GAMMA= 1
##$GB= 0.15
##$INTBC= 1
##$INTSCL= 1
##$ISEN= 128
##$LB= 0.24
##$LEV0= 0
##$LPBIN= 0
##$MAXI= 10000
##$MC2= 0
##$MEAN= 0
##$ME_mod= 0
##$MI= 1.114404
##$NCOEF= 0
##$NC_proc= 0
##$NLEV= 6
##$NOISF1= 3.799351
##$NOISF2= 2.8
##$NSP= 1
##$NTH_PI= 0
##$NZP= 0
##$OFFSET= 15.70392
##$PC= 1
##$PHC0= -11482.12
##$PHC1= 8.601007
##$PH_mod= 1
##$PKNL= yes
##$PPARMOD= 0
##$PSCAL= 0
##$PSIGN= 0
##$REVERSE= no
##$SF= 200.130013532006
##$SI= 16384
##$SIGF1= 3
##$SIGF2= 2
##$SINO= 400
##$SIOLD= 16384
##$SREGLST= <1H.CDCl3>
##$SSB= 0
##$STSI= 0
##$STSR= 0
##$SW_p= 3612.71676300578
##$SYMM= 0
##$S_DEV= 0
##$TDeff= 0
##$TDoff= 0
##$TI= <>
##$TILT= no
##$TM1= 0
##$TM2= 0
##$TOPLEV= 0
##$USERP1= <user>
##$USERP2= <user>
##$USERP3= <user>
##$USERP4= <user>
##$USERP5= <user>
##$WDW= 1
##$XDIM= 8192
##$YMAX_p= 0
##$YMIN_p= 0
$$ End of Bruker specific parameters
$$ ---------------------------------
##NTUPLES= NMR FID
##VAR_NAME=  TIME,          FID/REAL,        FID/IMAG
##SYMBOL=    X,             R,               I
##VAR_TYPE=  INDEPENDENT,   DEPENDENT,       DEPENDENT
##VAR_FORM=  AFFN,          ASDF,            ASDF
##VAR_DIM=   8192,          8192,            8192
##UNITS=     SECONDS,       ARBITRARY UNITS, ARBITRARY UNITS
##FACTOR=    0.0002496,     1,               1
##FIRST=     0,             0,               0
##LAST=      2.0444736,     0,               0
##MIN=       0,             -755454,         0
##MAX=       2.0444736,     680167,          0
$$ Real data points
##PAGE= N=1
##DATA TABLE= (X++(R..R)), XYDATA
$$ [...]
$$ plain form
2691 503 -1986 1376 1188 -1873 556 1422 -1151 586 1811 -1129 -788 1999 -49 -826 1825 -39
2707 -39 -918 1298 700 -1564 693 905 -2057 435 1318 -950 -136 636 -259 -976 1769 -373 -851 1239
2725 1239 -682 -297 835 72 -2051 569 849 -1980 315 639 -1445 -228 1322 -547 -802 486
2741 486 -966 -922 1392 541 -503 1334 -411 -1676 1171 599 -1986 548 624 -1157 949 1204 -1021
2758 -1021 -811 943 -813 -435 1878 -567 -1860 1060 366 -1931 1116 -61 -1514 612 1790 -443
2774 -443 115 815 -1105 -1068 1858 -900 -655 2044 -639 -1921 1277 329 -1909 1323 656 -2015 462
2791 462 1219 -1034 -509 1373 -1646 -1479 1411 -1030 -929 1071 27 -2046 1445 1561 -1816 548
2807 548 1320 -1921 524 1520 -589 -580 1657 -734 -936 1855 609 -1087 1053 994 -1171 -65 1354
$$ packed form
2691E03k489L362j88l061K429Q66k573J737J225k940L41K787k048p77K651j864
2707c9q79K216n98k264K257K12k962K492Q83k268Q14P72q95p17K745k142m78K090
2725A239j921L85J132p63k123K620K80k829K295L24k084J217J550j869k55J288
2741D86j452M4K314q51j044J837j745j265K847n72k585K534P6j781K106K55k225
2758a021K10J754j756L78K313k445j293K920o94k297L047j177j453K126J178k233
2774d43N58P00j920L7K926k758K45K699k683j282L198r48k238L232o67k671K477
2791D62P57k253N25J882l019J67K890k441J01K000j044k073L491J16l377K364
2807E48P72l241K445R96k109RK237k391k02K791j246j696K140n9k165J106J419
$$ plain form
2824 1354 -1388 -503 1834 -1430 -634 2101 -601 -2043 675 1087 -863 970 861 -2134 -750 1173
2840 1173 -466 1070 2225 -1757 -1001 1978 327 -715 416 -1199 -1592 1027 1566 -701 -898 30
2856 30 -1002 37 1581 -249 -1643 -658 -1355 -674 1127 711 -1742 -535 525 968 1750 870 -611
2873 -611 -923 715 546 1176 506 -748 -786 182 2020 682 -1245 -50 -947 652 1601 953 -355 -673
2891 -673 213 520 233 578 -1219 -832 50 671 208 671 830 -1214 385 778 779 -748 -460 -959 82
2910 82 657 309 -434 -489 2 -167 313 841 -996 -1465 547 111 -188 244 -1302 -701 -822 1142 520
2929 520 -990 23 -1242 236 1684 0 -932 -174 170 232 1407 1521 -1050 -389 338 245 1319 946
2947 946 -474 -887 -82 977 429 533 -1392 -1086 -422 1241 -454 -701 -143 -1891 -481 515 382 -934
$$ packed form
2824A354k742Q85K337l264P96K735k702j442K718M12j950J833j09k995J384J923
2840A173j639J536J155l982P56K979j651j042J131j615l93K619N39k267j97R28
2856C0j032J039J544j830j394R85o97O81J801m16k453J207J060M43P82q80j481
2873f11l12J638j69O30o70j254l8R68J838j338j927J195q97J599R49o48j308l18
2891f73Q86L07k87L45j797L87Q82O21m63M63J59k044J599L93Jj527K88m99J041
2910H2N75l48p43n5M91j69M80N28j837m69K012m36k99M32j546O01j21J964o22
2929E20j510J013j265J478J448j684r32P58L44O2J175J14k571O61P27r3J074l73
2947I46j420m13Q05J059n48J04j925L06O64J663j695k47N58j748J410R96j33j316
$$ plain form
2965 -934 -142 -841 427 963 567 -132 -755 981 398 1267 439 -916 -395 -96 -34 -10 1462 -94 -929
2984 -929 -373 669 940 -481 -617 -834 -1526 862 283 -1246 215 339 -674 -170 988 -530 -192
3001 -192 -57 -516 756 381 471 -583 116 -319 633 1451 421 -1196 -128 391 293 701 -463 -651 -497
3020 -497 -330 278 207 -112 -1304 -190 224 -49 -265 350 -515 -229 -115 470 -424 -117 383 27 728 798
3040 798 328 -108 -319 -459 29 -63 -244 -195 729 -261 278 -246 -531 -905 134 -73 -567 -110 -490 -267
3060 -267 -636 465 18 281 -448 -930 -519 764 135 -724 627 -191 85 895 -131 -895 -27 183 -623
3079 -623 501 428 -623 429 459 -697 11 456 -236 -51 242 -215 -1093 175 286 -1017 50 514
3097 514 -808 353 1156 -838 -234 1120 -697 -468 372 -528 -279 884 174 -507 363 929 -665 594
$$ packed form
2965i34P92o99J268N36l96o99o23J736n83Q69q28j355N21K99O2K4J472j556q35
2984i29N56J042K71j421j36k17o92K388n79j529J461J24j013N04J158j518L38
3001a92J35m59J272l75R0j054O99m35R52Q18j030j617J068N19r8M08j164j88J54
3020d97J67O08p1l19j192J114M14k73k16O15q65K86J14N85q94L07N00l56P01P0
3040G98m70m36k11j40M88r2j81M9R24r90N39n24k85l74J039k07m94M57l80K23
3060b67l69J101m47K63p29m82M11J283o29q59J351q18K76Q10j026p64Q68K10q06
3079f23J124p3j051J052L0j156P08M45o92J85K93m57q78J268J11j303J067M64
3097E14j322J161Q03j994O04J354j817K29Q40r00K49J163p10o81Q70N66j594J259
$$ plain form
3115 594 226 -521 218 621 -265 -11 1061 -158 -497 771 12 -502 1099 791 -726 1086 1051 -1635
3133 -1635 -634 1070 -591 25 1200 -545 159 641 -338 -894 652 35 -896 234 429 -1125 -455
3150 -455 800 -1357 264 227 -562 -1067 953 -614 -743 720 -705 -660 1067 -231 -1084 409 1184
3167 1184 -995 616 1127 -1100 -131 956 -780 -402 989 -612 -99 1538 58 -759 769 -86
3183 -86 -1429 1590 904 -1584 -352 1235 -1045 -124 1545 -912 -531 812 -854 -1038 1053 -34
3199 -34 -605 844 490 -1004 445 496 -696 585 1439 -1112 -594 1045 -718 -534 1507 241 -887
3216 -887 1453 -45 -1287 912 529 -985 582 249 -1083 15 664 -687 -156 503 -451 -1139 868
3233 868 -234 -1250 909 62 -1186 98 616 -1620 91 742 -684 -283 1058 -1277 -838 1165
$$ packed form
3115E94l68p47P39M03q86K54J072j219l39J268p59n14J601l08j517J812l5k686
3133a635J001J704j661O16J175j745P04M82r79n56J546o17r31J130J95j554O70
3150d55J255k157J621l7p89n05K020j567j29J463j425M5J727j298q53J493P75
3167A184k179J611N11k227R69J087j736L78J391j601N13J637j480q17J528q55
3183h6j343L019o86k488J232J587k280R21J669k457L81J343j666j84K091j087
3199c4n71J449l54j494J449N1j192J281Q54k551N18J639j763J84K041j266j128
3216h87K340j498j242K199l83j514J567l33j332J098O49j351N31O59r54o88K007
3233H68j102j016K159q47j248J284N18k236J711O51j426M01J341k335M39K003
$$ plain form
3249 1165 -841 -1104 990 -415 -1914 1070 542 -1654 569 398 -1376 362 1261 -514 -373 1077
3265 1077 -579 -987 1164 -476 -910 1076 -666 -1384 1140 64 -873 313 6 -1226 75 827
3281 827 -320 -338 1097 -617 -501 1403 -144 -779 843 -249 -145 784 879 -840 -371 510 -1063 428
3299 428 1167 -115 58 867 7 -77 1165 340 -1150 139 -419 -1488 718 664 -893 205 1136 -757
3317 -757 244 1297 -517 -605 1236 -310 -977 714 8 -670 559 456 -640 -150 766 -1102 -233
3334 -233 1281 -237 -334 361 -92 -787 914 150 -331 36 65 -716 0 818 -497 -97 428 23 104 798
3354 798 -1165 111 525 -239 1 466 74 -689 818 193 -57 -72 227 -1129 623 1493 150 -639
3372 -639 373 151 309 1174 372 -945 757 132 -489 355 1010 -614 -15 693 -190 -8 610 -320 -897
$$ packed form
3249A165k006k63K094j405j499K984n28k196K223j71j774J738Q99j775J41J450
3265A077j656m08K151j640m34J986j742p18K524j076r37J186l07j232J301P52
3281H27j147j8J435j714J16J904j547o35J622j092J04R29R5j719M69Q81j573J491
3299D28P39j282J73Q09q60q4J242q25j490J289n58j069K206n4j557J098R31j893
3317g57J001J053j814q8J841j546o67J691p06o78J229j03j096M90R16j868Q69
3334b33J514j518r7O95m53o95J701p64m81L67K9p81P16Q18j315M00N25m05Q1O94
3354G98j963J276M14p64K40M65l92p63J507o25k50j5K99j356J752Q70j343p89
3372f39J012k22J58Q65q02j317J702o25o21Q44O55j624N99P08q83J82O18r30n77
$$ plain form
3391 -897 1208 -473 -595 575 -101 -1143 531 982 -241 264 450 -50 174 916 259 -80 -90 -1110
3409 -1110 262 752 694 -243 -175 -333 -648 500 63 -605 -252 250 -280 -561 266 4 -302 247 8 -238
3429 -238 -445 372 -652 436 556 306 -623 -94 -239 -509 -93 127 806 -692 -91 -446 930 -245
3447 -245 -240 -257 -469 394 24 262 98 639 734 1213 662 49 -167 -401 24 959 246 603 411 -6 -376
3468 -376 -321 426 -140 229 415 600 705 -313 546 -749 -702 -71 1218 -218 157 231 -274 194 286 755
3488 755 520 -500 -508 105 665 164 208 256 -176 -342 431 581 -1052 -39 120 725 -7 99 -139 -438
3508 -438 41 46 436 -12 -31 -931 562 879 -253 -1206 -235 -383 319 80 744 174 -16 -745 129 542
3528 542 319 -273 56 457 -82 -388 213 -762 -986 455 658 -455 -147 2 -321 -157 843 -832 -966
$$ packed form
3391h97K105j681j22J170o76j042J674M51j223N05J86n00K24P42o57l39j0j020
3409a110J372M90n8r37O8j58l15J148m37o68L53N02n30k81Q27k62l06N49k39k46
3429b38k07Q17j024J088J20k50r29N29j45k70M16K20O79j498O01l55J376j175
3447b45Nj7k12Q63l70K38j64N41R5M79n51o13k16k34M25R35p13L57j92m17l70
3468c76N5P47n66L69J86J85J05j018Q59j295M7O31J289j436L75P4n05M68R2M69
3488G55k35j020qO13N60n01M4M8m32j66P73J50j633J013J59O05p32J06k38k99
3508d38M79NL90m48j9r00J493L17j132r53R71j48P02k39O64n70j90p29Q74M13
3528E42k23n92L29M01n39l06O01r75k24J441K03j113L08J49l23J64J000j675j34
$$ plain form
3547 -966 649 -713 28 959 -320 -668 293 558 -530 742 -210 -1546 177 414 -255 739 525 -671
3565 -671 92 994 516 -813 1163 -450 -705 459 1160 213 365 -276 -142 235 1281 452 -755 -76
3583 -76 -471 -793 421 530 -198 -220 -997 -571 1317 -468 -234 -1136 77 -12 -8 40 -588 -957 110 154 695
3604 695 -47 362 -196 375 278 -684 500 249 -986 68 -328 -363 463 -99 -919 -35 748 482 -211 18
3624 18 28 215 86 17 132 -666 -265 314 682 -258 101 336 436 -470 1260 702 -1153 -363 88 -416
3644 -416 -307 1191 334 -179 1211 -795 -11 874 -434 -828 1108 1110 -630 210 93 -621 21 1261
3662 1261 -903 -716 636 -780 192 921 -309 -1959 448 417 261 967 -355 -714 110 975 -479
3679 -479 -489 781 -764 -1172 1072 -623 -224 996 -512 -872 1276 -352 -942 1068 327 -320 870
$$ packed form
3547i66J615j362P41R31j279l48R61K65j088J272r52j336J723K37o69R94k14j196
3565f71P63R02m78j329J976j613k55J164P01r47J52o41J34L77J046q29j207O79
3583g6l95l22J214J09p28k2p77M26J888j785K34r02J213q9MM8o28l69J067M4N41
3604F95p42M09n58N71r7r62J184k51j235J054l96l5Q26n62q20Q84P83k66o93K29
3624A8J0J87j29o9J15p98M01N79L68r40L59K35J00r06J730n58j855P90M51n04
3644d16J09J498q57n13J390k006P84Q85j308l94J936Kj740Q40j17p14O42J240
3662A261k164J87J352j416R72P29j230j650K407l1j56P06j322l59Q24Q65j454
3679d79j0J270j545m08K244j695L99J220j508l60K148j628n90K010p41o47J190
$$ plain form
3696 870 431 -656 413 906 -592 -531 1456 -696 -930 853 595 -1644 115 18 120 785 195 -886
3714 -886 611 769 -794 -303 1767 692 -805 1041 -40 -654 788 1325 -1539 -196 551 -722
3730 -722 -478 491 -1556 -220 495 -462 -825 973 -512 -596 692 216 -318 1386 -63 -977 320 896
3748 896 -213 -624 631 -1000 357 982 -879 258 452 -649 -19 -183 -401 -110 206 331 546 48
3766 48 489 -1150 274 820 -463 304 813 -946 -813 997 -1019 -1091 1494 -266 -806 539 384 -733
3784 -733 423 -34 -473 1118 575 -15 167 959 47 -405 803 -299 -1395 1229 31 -1366 1287
3801 1287 236 -252 24 1202 -1260 53 1375 -490 605 644 -331 -558 1121 58 -506 73 208
3818 208 -1627 1012 519 -1089 812 650 -738 530 548 -633 -253 954 -187 -848 926 -286 -1485
$$ packed form
3696H70m39j087J069M93j498O1J987k152k34J783k58k239J759r7J02O65n90j081
3714h86J497J58j563M91K070j075j497J846j081o14J442N37k864J343P47j273
3730g22K44R69k047J336P15r57l63J798j485q4J288m76n34J704j449r14J297N76
3748H96j109m11J255j631J357O25j861J137J94j101O30j64k18K91L16J25K15m98
3766D8M41j639J424N46j283P67N09j759J33J810k016p2K585j760n40J345j55j117
3784g33J156m57m39J591n43n90J82P92r12m52J208j102j096K624j198j397K653
3801A287j051m88K76J178k462J313J322j865J095L9r75k27J679j063n64N79J35
3818B08j835K639m93j608J901j62j388J268J8j181L80J207j141o61J774j212j199
$$ plain form
3835 -1485 -66 -498 -735 -285 51 -1537 704 922 -1374 -116 842 -819 -710 952 -167 -1240 726
3852 726 122 -583 875 175 -368 -518 442 -376 507 271 -337 -543 1188 -898 -685 418 519 -116 999
3871 999 -195 -731 -335 1047 -637 -91 1108 547 143 1653 29 -660 239 0 -664 1554 -11
3888 -11 -769 -659 49 142 626 780 501 -732 -495 -551 -488 886 493 -941 23 228 -492 -104 830 44
3908 44 -1073 142 -496 522 112 321 -238 -67 -52 586 -101 847 -937 -344 688 -433 -511 -398 262
3927 262 146 886 -205 349 120 -29 -784 548 264 176 -213 -407 -658 -129 -293 65 -486 -583 349 636
3947 636 -228 26 346 583 1123 860 -696 -55 504 -370 -221 1639 338 -1582 -260 -580 -510 56 423
3966 423 -627 -266 -197 244 34 744 -551 -1196 852 965 -313 170 678 -586 344 429 302 -416 971
$$ packed form
3835a485J419m32k37M50L36j588K241K18k296J258R58j661J09J662j119j073J966
3852G26o04p05J458p00n43j50R60q18Q83k36o08k06J731k086K13J103J01o35J115
3871I99j194n36L96J382j684N46J199n61m04J510j624o89Q99k39o64K218j565
3888a1p58J10P08R3M84J54k79j233K37n6O3J374l93j434R64K05p20L88R34p86
3908D4j117J215o38J018m10K09n59J71J5O38o87R48j784N93J032j121p8J13O60
3927B62j16P40j091N54k29j49p55J332k84q8l89j94k51N29j64L58n51r7R32K87
3947F36q64K54L20K37N40k63j556O41N59q74J49J860j301j920J322l20P0N66L67
3966D23j050L61O9M41k10P10j295o45K048J13j278M83N08j264R30Q5j27p18J387
$$ plain form
3985 971 108 -86 687 533 -1651 597 1435 -590 -499 820 -1622 718 1082 311 -271 28 712 -687
4003 -687 1758 620 -437 -392 1203 -1248 108 397 310 -967 1472 367 -972 1334 -498 -1497 -11
4020 -11 1585 -578 -309 837 -1097 -323 887 391 -1290 528 -131 -952 1209 206 -716 -564 747
4037 747 427 137 73 -494 -1445 843 1057 182 261 -355 -1254 171 1720 -267 -784 633 -1302 -386 2031
4056 2031 313 -245 -146 -519 -492 602 522 -1151 -1494 -55 583 586 1099 -385 -1595 -676 958 -251 151
4075 151 -348 -1821 -90 1890 658 85 184 -754 -448 1387 1246 -788 -669 14 -413 750 1563 -43
4093 -43 -419 -190 1093 -270 486 627 -1445 -927 1098 816 428 1545 -896 216 12 467 148 1052
4111 1052 -626 -803 308 396 -249 108 268 303 -172 447 195 -958 -342 -560 143 -588 457 -1210 -816
$$ packed form
3985I71q63j94P73j54k184K248Q38k025R1J319k442K340L64p71n82K99O84j399
4003f87K445j138j057M5J595k451J356K89q7j277K439j105j339K306j832r99J486
4020a1J596k163K69J146j934P74J210m96j681J818o59q21K161j003r22J52J311
4037G47l20k90o4n67r51K288K14q75P9o16q99J425J549j987n17J417j935R16K417
4056B031j718n58R9l73K7J094q0j673l43J439O38LN13j484j210R19J634j209M02
4075A51m99j473J731J980j232n73R9r38L06J835j41k034J19O83m27J163Q13j606
4093d3l76K29J283j363P56J41k072N18K025k82l88J117k441J112k04M55l19R04
4111A052j678j77J111Q8o45L57J60L5m75O19k52j153O16k18P03p31J045j667L94
$$ plain form
4130 -816 287 -26 94 1040 -86 -884 543 290 -671 -128 202 -2038 -686 821 -64 -175 961 -10
4148 -10 -999 1005 -330 -380 -167 591 -1275 599 1279 -788 -1041 1475 -218 -988 1262 598 -871 658
4166 658 932 -733 -239 552 -512 -1023 1467 -612 -64 78 -41 -144 573 545 -709 415 132 -651
4184 -651 244 843 56 -260 1776 -1165 -1016 1642 -85 -863 761 518 -740 980 374 -504 103 -478
4202 -478 -279 -417 890 315 30 793 56 -15 831 325 -504 175 -319 -1158 98 758 -611 136 295
4221 295 155 422 734 203 189 -103 433 138 895 -94 -338 -607 417 -1388 -104 621 478 -496 1087
4240 1087 -45 -576 213 375 -1073 800 -56 -1055 -138 338 -820 -103 -272 -88 215 755 -858 -189
4258 -189 424 -536 -167 536 -521 -14 0 -376 -408 780 -268 -869 159 469 -51 784 536 -659 -152
$$ packed form
4130h16J103l13J20R46j126p98J427k53r61N43L30k240J352J507q85j11J136r71
4148a0r89K004j335n0K13P58j866J874O80k067k53K516j693p70K250o64j469J529
4166F58K74j665M94P91j064n11K490k079N48J42j19j03P17k8j254J124k83p83
4184f51Q95N99p87l16K036k941J49K658j727p78J624k43j258J720o06q78O07n81
4202d78J99j38J307n75k85P63p37p1Q46n06q29O79m94q39J256O60j369P47J59
4221B95j40K67L12n31j4k92N36k95P57r89k44k69J024j805J284P25j43r74J583
4240A087j132n31P89J62j448J873q56r99R17M76j158P17j69J84L03N40j613O69
4258a89O13r60L69P03j057N07J4l76l2J188j048o01J028L10n20Q35k48j195N07
$$ plain form
4277 -152 -122 -1669 -123 866 -687 -434 91 61 -761 338 165 -21 396 -378 -1220 550 627 -801 -226
4296 -226 -94 -34 -254 21 278 -455 572 99 -142 490 19 -375 71 195 -579 -707 587 6 -273 794
4316 794 -361 -1322 905 -640 -31 1384 417 -543 678 454 -546 325 -300 -366 206 817 -93 -88 -32
4335 -32 196 -825 1405 584 136 443 103 89 538 825 -771 304 259 -256 326 630 -1086 41 387
4354 387 -403 165 329 120 420 333 305 4 -14 833 -270 -53 1199 287 -80 685 151 -765 738 168
4374 168 -586 554 -110 -1046 59 -532 -767 -185 184 -376 -1011 -534 663 -1069 564 350 1058 561
4392 561 -283 296 691 1 -347 379 45 -281 -22 194 -248 -457 879 23 -728 -188 -54 -351 -242 91
4412 91 134 177 -513 -179 -241 -721 1220 202 86 -25 204 437 228 551 -220 370 129 -43 -221 -188 734
$$ packed form
4277a52L0j547J546R89j553K53N25l0q22J099j73j86M17p74q42J770P7j428N75
4296b26J32O0k20K75K57p33J027m73k41O32m71l94M46J24p74j28J294n81k79J067
4316G94j155r61K227j545O09J415r67r60J221k24j000Q71o25o6N72O11r10NN6
4335c2K28j021K230q21m48L07l40j4M49K87j596J075m5n15N82L04j716J127L46
4354C87p90N68J64k09L00q7k8l01j8Q47j103K17J252r12l67P65n34r16J503n70
4374A68p54J140o64r36J105n91k35N82L69n60o35M77J197j732J633k14P08m97
4392E61q44N79L95o90l48P26l34l26K59K16m42k09J336q56p51N40J34k97J09L33
4412I1M3M3o90L34o2m80J941j018j16j11K29K33k09L23p71N90k41j72j78L3R22
$$ plain form
4433 734 -367 258 193 -78 -1012 988 -213 -530 393 335 -488 -428 -317 -664 494 -175 -292 115 417 -158
4453 -158 -293 -108 -337 -762 775 -379 -370 6 33 -882 -307 536 -875 -388 730 -655 -764 903 -100
4472 -100 130 194 800 -1450 419 130 -832 201 822 -623 -862 109 -802 -576 1311 126 -736 439
4490 439 302 -2056 611 1204 -809 319 1144 -654 101 1508 -289 -715 733 -231 -1053 354 767
4507 767 -901 -646 1739 -545 -135 772 24 -292 1234 619 -639 386 1005 -649 -16 1016 -515
4524 -515 -589 500 -201 -592 977 -242 -716 917 659 -1720 186 516 -1362 410 1323 -582 -745
4541 -745 1734 69 -672 927 -244 -705 502 1285 -209 735 321 -517 -419 937 111 -120 1066 -421
4559 -421 -1272 944 1127 -985 429 619 -918 161 1409 -897 -1646 471 145 -1552 1106 -100
$$ packed form
4433G34j101O25o5k71r34K000j201l17R23n8q23O0J11l47J158o69j17M07L02n75
4453a58j35J85k29m25J537j154RL76K7r15N75Q43j411M87J118j385j09J667j003
4472a00K30O4O06k250J869k89r62J033O21j445k39R71r11K26J887j185q62J175
4490D39j37k358K667N93k013J128Q25j798P55J407j797m26J448r64q22J407M13
4507G67j668K55K385k284M10R07p48l16J526o15j258J025O19j654O33J032j531
4524e15p4J089p01l91J569j219m74J633k58k379J906L30j878J772R13j905j63
4541g45K479j665p41J599j171m61J207P83j494R44m14q38R8J356q26k31J186j487
4559d21q51K216J83k112J414J90j537J079J248k306p49K117l26j697K658j206
$$ plain form
4575 -100 -1573 -122 1397 8 336 1171 -495 -1114 953 427 -200 479 694 -37 -27 265 -512 -150
4593 -150 803 -32 -519 1102 148 -1101 -162 -240 -1242 188 1113 -467 -650 1297 -668 -973 951 -557
4611 -557 -849 998 576 -362 354 400 -697 -340 1236 91 -1359 714 686 -517 412 900 -1098 170
4629 170 786 -1287 -456 668 232 -604 1206 -68 -802 629 342 -1157 206 413 -350 -53 847 -801
4647 -801 -1151 616 765 -1926 918 412 -720 767 1140 -757 -183 1126 -564 -376 1622 -545 -1121
4664 -1121 1229 -32 -914 1153 60 -1370 140 1019 -241 -917 720 204 -1079 812 314 -992
4680 -992 829 -157 -1407 1065 1150 -696 321 355 -968 -922 1007 -395 -1349 -69 558 -385 795 953
4698 953 155 310 1484 -514 114 1444 -370 -407 748 -83 -1014 599 537 -1503 907 -287 -468 -369
$$ packed form
4575a00j473J451J519j389L28Q35j666o19K067n26o27O79K15p31J0K92p77L62
4593a50R53q35m87J621r54j249R39p8j002J430R25j580j83J947j965l05J924j508
4611e57k92J847m22r38P16M6j097L57J576j145j450K073k8j203R29M88j998J268
4629A70O16k073Q31J124m36q36J810j274p34J431k87j499J363K07p63K97R00j648
4647h01l50J767J49k691K844n06j132J487L73j897N74J309j690J88J998k167n76
4664a121K350j261q82K067j093j430J510Q79j260o76J637n16j283J891m98j306
4680i92J821r86j250K472Q5j846J017L4j323M6J929j402r54J280O27r43J180J58
4698I53p98J55J174j998O28J330j814l7J155q31r31J613o2k040K410j194j81R9
$$ plain form
4716 -369 495 -7 -689 1015 11 50 823 444 102 80 643 -171 -609 627 -581 -1030 -237 644 183
4735 183 -1278 -501 -759 314 1640 -767 -300 1298 -376 -398 644 -373 -450 107 -721 -246 613 -137
4753 -137 361 -953 -145 721 -216 -513 -187 -89 527 236 -95 -204 335 482 -260 -73 515 -886 -228 -318
4773 -318 -60 -314 1308 -218 819 941 -1065 690 159 1153 -385 -170 489 -84 -195 -93 -333 -401
4791 -401 1427 186 -1311 666 407 -431 1189 702 -862 361 602 -463 111 255 -537 -1499 -71
4808 -71 -474 -19 179 -17 -623 1072 120 -550 70 870 -551 -642 526 59 105 1109 -688 -236 304
4827 304 -29 -1129 610 174 -444 227 505 -561 -534 527 272 -642 -406 -731 -1423 235 524 -1318
4845 -1318 459 251 -37 533 812 728 -895 805 -831 -277 1089 -303 -616 486 -13 -122 -822 -53
$$ packed form
4716c69Q64n02o82J704j004L9P73l79l42k2N63q14m38J236j208m49P93Q81m61
4735A83j461P77k58J073J326k407M67J598j674k2J042j017p7N57q28M75Q59p50
4753a37M98j314Q08Q66r37k97L26R8O16k91l31j09N39J47p42J87N88j401O58r0
4773c18K58k54J622j526J037J22k006J755n31R94j538K15O59n73j11J02k40o8
4791d01J828j241j497J977k59q38J620m87j564J223K41j065N74J44p92r62J428
4808g1m03M55J98j96o06J695r52o70O20Q00j421r1J168m67M6J004j797M52N40
4827C04l33j100J739m36o18O71K78j066K7J061k55r14K36l25o92J658K89j842
4845a318J777k08k88N70K79q4j623J700j636N54J366j392l13J102m99j09p00P69
$$ plain form
4863 -53 -950 457 776 -1188 238 28 123 -86 97 233 71 -236 791 -101 944 -42 661 528 135
4882 135 -443 968 -600 292 -444 543 -408 -716 329 -63 688 378 750 -153 -1237 -15 -543 -222
4900 -222 849 284 -475 -235 -225 236 193 -598 -182 461 400 -431 469 -302 -714 -1367 -297 -153 -777 -714 -689
4921 -689 565 506 -81 -325 516 -960 -583 -17 277 61 223 680 -1 501 1467 -165 966 -113 -445
4940 -445 240 29 -831 256 -182 -555 337 791 -894 -463 458 -218 -378 585 -1097 -807 1424 920 325
4959 325 453 476 -57 809 217 136 -288 213 -641 -264 -531 41 61 649 287 149 -24 843 -567 -431 1066
4980 1066 -550 -300 -587 -112 439 966 -1367 -739 1087 724 -1008 272 31 -1063 1067 93 254
4997 254 -101 -201 348 632 431 288 -566 -179 -337 -488 -608 719 -683 -235 820 -493 -484 1113 -377
$$ packed form
4863e3q97J407L19j964J426k10R5k09J83J36j62l07J027q92J045r86P03j33l93
4882A35n78J411j568Q92p36R87r51l08J045l92P51l10L72r03j084J222n28L21
4900b22J071n65p59K40J0M61m3p91M16O43o1q31R00p71m12o53J070J44o24O3K5
4921f89J254n9n87k44Q41j476L77N66K94k16J62M57o81N02R66j632J131j079l32
4940d45O85k11q60J087m38l73Q92M54j685M31R21o76j60R63j682K90K231n04n95
4959C25J28K3n33Q66n92q1m24N01q54L77k67N72K0N88l62j38j73Q67j410J36J497
4980A066j616K50k87M75N51N27k333O28J826l63j732J280k41j094K130r74J61
4997B54l55j00N49K84k01j43q54L87j58j51j20J327j402M48J055j313RJ597j490
$$ plain form
5016 -377 -706 236 -490 -1356 611 19 -334 582 -127 532 -430 1392 -55 -696 274 -430 -954 987 234
5035 234 -334 -695 149 -606 -242 672 638 -651 71 280 29 -775 74 -895 243 1332 -399 -1296 1202
5054 1202 -76 -1558 876 929 -332 -40 277 -631 594 431 -1414 -119 961 -1305 -624 503 -42
5071 -42 398 719 -337 -241 389 1175 199 187 426 -619 -547 1138 -310 -124 332 33 -1465 -404 1770
5090 1770 306 412 -67 -1086 -827 1074 145 -847 747 859 -665 -298 554 -702 -36 1060 448
5107 448 -125 563 294 -1145 459 69 -544 -545 1014 -1740 -4 1051 737 -94 1159 906 -134 1188
5125 1188 -195 -516 -871 355 -372 826 1337 -431 -194 449 -119 -990 964 -28 -663 -267 902 -218
5143 -218 1281 -145 -716 -1882 1176 778 -395 186 -56 -801 1249 1118 -653 658 552 -300 -311 1747
$$ packed form
5016c77l29R42p26q66J967n92l53R16p09O59r62J822j447o41R70p04n24J941p53
5035B34n68l61Q44p55L64R14l4j289P22K09k51q04Q49r69J138J089j731q97K498
5054A202j278j482K434N3j261K92L17r08J225j63j845J295J080k266O81J127n45
5071d2M40L21j056R6O30P86r76j2K39j045P2J685j448J86M56k99j498J061K174
5090A770j464J06m79j019K59J901r29r92J594J12j524L67Q52j256O66J096o12
5107D48n73O88k69j439J604l90o13jJ559k754J736J055l14q31J253k53j040J322
5125A188j383l21l55J226p27J198N11j768K37O43n68q71J954r92o35L96J169j120
5143b18J499j426n71j166L058l98j173N81k42p45K050j31j771J311j06q52j1K058
$$ plain form
5161 1747 543 -766 517 -857 -1561 1292 1016 -932 -611 972 -493 -755 852 -485 -902 -146
5177 -146 1008 -1395 1575 373 -1814 699 221 -700 -320 1119 -436 -1136 619 -182 -352 250 399
5194 399 -1085 749 164 -604 -715 930 -930 -215 1470 -535 -1445 719 -380 -335 1238 306 -896
5211 -896 636 657 -312 482 771 -437 -1105 40 901 -256 928 -291 -354 -121 1334 0 -385 273
5229 273 -1518 -154 330 115 -963 157 -187 -959 494 1412 -350 -550 101 424 -38 1106 539 -788
5247 -788 -394 -344 -416 1290 893 -248 -886 562 -479 1066 1221 759 -490 -535 307 -1122 854 590
5265 590 36 -861 1698 404 -1296 631 -624 -1143 445 564 -278 -795 549 -997 522 612 -525
5282 -525 -1077 -169 -61 -916 345 -46 -853 368 657 -733 -65 -344 143 -511 38 -252 -762 1199 -411
$$ packed form
5161A747j204j309J283j374p04K853k76j948L21J583j465k62J607j337m17P56
5177a46J154k403K970j202k187K513m78r21L80J439j555p00J755q01j70O02J49
5194C99j484J834n85p68j11J645j860P15J685k005r10K164j099M5J573r32j202
5211h96J532K1r69P94K89j208o68J145Q61j157J184j219o3K33J455j334l85O58
5229B73j791J364M84k15j078J120l44p72J453R18j762k00O51L23m62J144n67j327
5247g88L94N0p2J706l97j141o38J448j041J545J55m62j249m5Q42j429J976k64
5265E90n54q97K559j294j700J927j255n19J588J19q42n17J344j546J519R0j137
5282e25n52R08J08q55J261l91q07J221K89j390O68k79M87o54N49k90n10J961j610
$$ plain form
5301 -411 -161 375 84 -739 -311 -22 -1038 56 494 970 -303 201 1111 -175 1725 -674 -1176 -4
5319 -4 315 -889 -53 178 -55 -183 -36 43 -930 596 289 15 189 1560 -262 321 439 -383 -415 69
5339 69 -390 -578 196 -2 -603 683 492 187 390 -306 -761 -41 227 515 -367 -74 -286 140 -46 462
5359 462 -33 37 261 -85 443 -52 97 -384 -220 -184 135 -494 -305 683 -7 42 38 340 393 589 10 -363
5381 -363 -238 -408 -125 440 360 -46 -352 -567 179 -496 386 666 285 -368 -384 126 -161 -436 -93 654 447
5402 447 -321 -37 87 734 215 293 542 276 490 409 960 -238 729 -142 792 623 360 -730 -246 328
5422 328 -539 1007 32 -632 -805 72 -553 -490 449 146 -48 -100 173 -135 -107 419 83 390 -139 -246 -142
5443 -142 507 -439 20 108 -674 -335 -178 -124 321 -258 251 643 -277 12 -230 -142 228 408 242 920 -419
$$ packed form
5301d11K50N36k91q23M28K89j016J094M38M76j273N04R10j286J900k399n02J172
5319dL19j204Q36K31k33j28J47P9r73J526l07k74J74J371j822N83J18q22l2M84
5339F9m59j88P74j98o01J286j91l05K03o96m55P20K68K88q82K93k12M26j86N08
5359D62m95P0K24l46N28m95J49m81J64L6L19o29J89R88o90M9mL02N3J96n79l73
5381c63J25j70K83N65q0m06l06k15P46o75Q82K80l81o53j6N10k87k75L43P47k07
5402D47p68K84J24O47n19P8K49k66K14q1N51j198R67q71R34j69k63j090M84N74
5422C28q67J546r75o64j73Q77o25O3R39l03j94n2K73l08K8N26l36L07n29j07J04
5443a42O49r46M59Q8p82L39J57N4M45n79N09L92r20K89k42Q8L70J80j66O78j339
$$ plain form
5464 -419 -51 532 146 28 -186 625 584 299 193 -216 757 457 -321 66 461 -390 -8 157 -374 -355 387
5485 387 -105 -472 -43 19 -794 355 562 -124 547 297 -883 144 164 -971 -314 89 209 -721 366
5504 366 114 -517 185 -16 -124 889 -523 197 324 981 -495 271 243 433 92 278 827 69 55 -21
5524 -21 -968 501 477 -45 -74 562 -277 98 -442 138 -397 -387 85 -88 -581 661 285 -148 469 58 216
5545 216 825 843 -191 -206 473 529 154 -107 22 316 261 -38 -1338 482 537 162 -347 481 -98 -442 503
5566 503 -467 433 723 188 -436 352 381 -624 -602 136 -786 -399 -479 -235 -674 371 -132 -933 41 158
5586 158 147 258 -33 -264 -246 597 52 32 -116 208 -640 -646 -343 76 110 644 -390 150 946 12 -241 -25
5608 -25 289 -276 -286 -72 -616 375 501 -628 -412 232 -103 -605 -29 547 247 533 240 76 -43 296
$$ packed form
5464d19L68N83l86j18k14Q11m1k85j06m09R73l00p78L87L95q51L82J65n31J9P42
5485C87m92l67M29O2q13J149K07o86O71k50j180J027K0j135O57M03J20r30J087
5504C66k52o31P02k01j08J013j412P20J27O57j476P66k8J90l41J86N49p58j4p6
5524b1r47J469k4n22k9O36q39L75n40N80n35J0M72j73m93J242l76m33O17m11J58
5545B16O09J8j034j5O79N6l75k61J29K94n5k99j300J820N5l75n09Q28n79l44R45
5566E03r70R00K90n35o24P88K9j005K2P38r22L87q0K44m39J045n03q01R74J17
5586A58j1J11k91k31J8Q43n45k0j48L24q48oL03M19L4N34j034N40P96r34k53K16
5608b5L14n65j0K14n44R91J26j129K16O44l35n02N76N76l00K86k93j64j19L39
$$ plain form
5628 296 -1521 -199 1704 -15 -570 407 930 -449 797 173 -694 -328 183 -340 422 895 -681 183
5646 183 1020 5 -517 576 221 -470 196 194 -1220 101 1191 -1626 15 1355 -287 -210 341 -11
5664 -11 -482 123 413 -34 -60 1326 -435 412 1010 137 86 618 55 -784 901 476 -561 -904 608
5683 608 -734 166 1014 -820 364 10 14 -74 344 424 -1142 198 346 -326 580 635 156 -113 577 -90
5703 -90 391 404 -2 -41 -193 348 -470 379 366 -565 277 808 -227 258 -49 26 -142 83 390 -943 -41
5724 -41 572 -413 -235 1200 -314 144 937 686 -451 200 983 -812 338 892 -415 473 1020 140
5742 140 -276 505 350 -538 -170 146 -396 -670 325 -97 -187 -108 -118 -54 605 450 -696 471 613 -872
5762 -872 270 709 -163 -365 759 -81 50 415 -237 -1031 200 1322 -558 -4 -194 -169 217 763 314
$$ packed form
5628B96j817J322J903j719n55R77N23j379J246o24q67L66N11n23P62M73j576Q64
5646A83Q37j015n22J093l55o91O66kj414J321J090k817J641J340j642P7N51l52
5664a1m71O05K90m47k6J386j761Q47N98q73n1N32n63q39J685m25j037l43J512
5683F08j342R00Q48j834J184l54Mq8M18Q0j566J340J48o72R06N5m79k69O90o67
5703i0M81J3m06l9j52N41q18Q49j3r31Q42N31j035M85l07P5j68K25L07j333R02
5724d1O13r85J78J435j514M58P93k51j137O51P83j795J150N54j307Q88N47q80
5742A40m16P81j55q88L68L16n42k74R95m22r0P9j0O4O59j55j146J167J42j485
5762h72J142M39q72k02J124q40J31L65o52p94J231J122j880N54j90K5L86N46m49
$$ plain form
5781 314 24 1071 -224 -70 1156 928 -204 1281 1131 -163 708 395 -409 96 362 -748 -236 686
5799 686 -471 -145 344 219 -621 400 420 -950 414 438 649 -25 145 -155 -837 600 687 -966 -4
5818 -4 743 -944 431 598 850 -824 1553 709 -567 -392 178 -829 305 214 348 702 611 -723 122
5837 122 -269 -273 -333 394 500 -775 -143 652 -466 678 782 -431 383 4 492 -183 542 411 202 591
5857 591 76 -417 876 -35 -346 -502 109 -605 -813 448 1359 -97 172 1335 135 1113 33 256
5875 256 32 61 83 201 507 205 79 -60 442 -240 -108 446 375 -146 744 559 154 162 98 -173 70 297
5897 297 -398 -6 -374 -266 1042 -51 463 -349 -155 155 -320 -156 243 81 245 -694 0 -264 -30
5916 -30 28 242 575 552 -447 -341 -218 125 -630 242 265 -200 -679 324 33 158 224 75 -226 -293 -429 -280
$$ packed form
5781C14k90J047j295J54J226k28j132J485j50j294Q71l13q04N05K66j110N12R22
5799F86j157L26M89j25q40J021K0j370J364K4K11o74J70l00o82J437Q7j653R62
5818dP47j687J375J67K52j674K377q44j276J75N70j007J134r1J34L54r1j334Q45
5837A22l91mo0P27J06j275O32P95j118J144J04j213Q14l79M88o75P25j31k09L89
5857E91n15m93J293r11l11j56O11p14k08J261R11j456K69J163j200R78j080K23
5875B56k24K9K2J18L06l02j26j39N02o82J32N54p1n21Q90j85m05Qo4k71K43K27
5897B97o95L92l68J08J308j093N14q12J94L10m75J64L99j62J64r39O94k64K34
5916c0N8K14L33k3r99J06J23L43p55Q72K3m65m79J003k91J25O6j49l01o7j36J49
$$ plain form
5938 -280 -46 -208 153 -728 -672 452 434 -526 -344 -54 511 -9 -105 389 413 366 -69 -301 -1059 63 359
5959 359 -734 -781 446 161 239 593 185 365 469 224 -15 -79 -238 573 154 -406 -905 837 -268 463
5979 463 583 -295 -96 -166 212 868 71 255 142 179 118 272 291 -585 319 367 133 -200 21 -452 -302 14
6001 14 58 22 73 -341 206 182 -192 369 324 -129 171 690 -371 1054 541 -133 281 65 -183 -397 271
6022 271 -353 -428 172 -363 -722 -9 367 130 -278 474 -325 -404 -164 -123 -65 548 621 218 359 -580 230 202
6044 202 64 78 8 -62 -77 464 -73 -210 63 -40 -69 370 -273 -350 1093 7 212 401 -284 433 -60
6065 -60 -423 72 -22 386 1060 -29 693 -336 -43 53 -680 375 467 79 -288 -682 -56 -532 366 721
6085 721 -247 55 -812 1199 -39 110 -60 -367 624 -459 -309 -343 334 -882 186 -241 122 -35 177
$$ packed form
5938b80K34j62L61q81N6J124j8r60J82K90N65n20r6M94K4m7m35k32p58J122K96
5959C59j093m7J227k85P8L54m08J80J04k45k39o4j59Q11m19n60m99J742j105P31
5979D63J20q78J99p0L78O56p97J84j13L7o1J54J9q76R04M8k34l33K21m73J50L16
6001A4M4l6N1m14N47k4l74N61m5m53L00N19j061J425n13o74M14k16k48k14O68
6022B71o24p5O00n35l59P13L76k37m08P52p99p9K40M1N8O13P3m03J41r39Q10k8
6044B02j38J4p0p0j5N41n37j37K73j03k9M39o43p7J443j086K05J89o85P17m93
6065f0l63M95r4M08O74j089P22j029K93R6p33J055R2l88l67l94O26m76Q98L55
6085G21r68L02q67K011j238J49j70l07R91j083J50l4O77j216J068m27L63j57K12
$$ plain form
6104 177 135 -548 961 -749 -1328 -392 -946 91 186 95 586 -522 365 -73 408 -525 -486 435 -322 374
6124 374 -454 -487 -275 -293 -399 669 682 -406 -93 -180 438 246 -366 -780 405 -94 -344 434 -227 -186 -542
6145 -542 -513 -270 -326 388 410 -478 484 162 -820 -592 581 -109 130 170 597 -211 610 24 8 -244 -129
6166 -129 803 -644 -289 -532 510 -126 -653 -226 -736 266 519 33 -44 504 -253 42 714 503 339
6185 339 -739 -141 31 272 -121 609 112 122 643 468 258 -54 75 -63 13 210 216 -71 -233 96 -91
6206 -91 -177 540 -432 -325 946 53 -408 -494 141 -378 -168 -101 -247 -121 -522 -291 439 324 225 643 210
6227 210 -360 -628 542 329 -325 677 -200 -208 159 1012 416 -864 -274 368 -499 241 -208 76 50 -838
6247 -838 -190 258 -344 -722 -249 -150 350 -729 -413 -362 141 243 244 -61 -1139 -6 -946 224 823 -745
$$ packed form
6104A77m2o83J509j710n79R36n54J037R5r1M91j108Q87m38M81r33L9R21p57O96
6124C74q28l3K12j8j06J068J3j088L13q7O18j92o12m14J185m99k50P78o61M1l56
6145e42K9K43n6P14K2q88R62l22r82K28J173o90K39M0M27q08Q21n86j6k52J15
6166a29R32j447L55k43J042o36n27M27n10J002K53m86p7N48p57K95O72k11j64
6185C39j078N98J72K41l93P30m97J0N21j75k10l12J29j38P6J97Ok87j62L29j87
6206i1q6P17r72J07J271q93m61q6O35n19K10O7j46J26m01K31P30j15r9M18m33
6227B10n70k68J170k13o54J002q77qL67Q53n96j280N90O42q67P40m49K84k6q88
6247h38O48M48o02l78M73R9N00j079L16N1N03J02Jl05j078J133r40J170N99j568
$$ plain form
6267 -745 -355 -53 -79 -307 -252 568 -262 21 241 814 49 461 -919 -576 -484 -1034 -27 203 -36 -513
6287 -513 -22 424 426 13 129 -965 -1189 901 -326 247 -50 -454 -381 236 -656 -4 414 -79 160 84
6307 84 464 38 695 420 -1252 334 136 -479 -118 103 165 1148 802 372 212 552 -170 -674 -196 289
6327 289 439 129 22 503 52 225 -475 -108 596 -158 -264 -50 -583 -607 305 210 1335 -699 -332 -244
6347 -244 -681 754 -71 -210 400 -36 28 362 605 -70 -142 252 -467 -165 632 -73 688 -394 40 -26
6367 -26 -506 19 170 -162 -655 656 -356 -295 395 -155 -685 -397 -312 507 -114 3 591 -244 -209 -99 214
6388 214 128 -61 680 456 313 36 604 -200 -52 220 112 -761 -1164 14 251 260 553 437 295 301 86
6409 86 -252 359 -526 62 -13 563 -335 -224 92 -201 291 -603 439 -54 -436 226 353 -72 -112 -981 72
$$ packed form
6267g45L90L02k6k28N5Q20q30K83K20N73p65M12j380L43R2n50J007K30k39m77
6287e13M91M46Km13J16j094k24K090j227N73k97m04P3O17q92O52M18m93K39p6
6307H4L80m26O57k75j672J586j98o15L61K21O2R83l46m30j60L40p22n04M78M85
6327B89J50l10j07M81m51J73p00L67P04p54j06K14n33k4R12r5J125k034L67Q8
6347b44m37J435q25j39O10m36O4L34K43o75p2L94p19L02P97p05P61j082M34o6
6367b6m80N25J51l32m93J311j012O1O90n50n30K88Q5Q19o21J17N88q35L5J10L13
6388B14q6j89P41k24j43k77N68q04J48K72j08q73m03J178K37RK93j16j42Ok15
6409H6l38O11q85N88p5N76q98J11L16k93M92q94J042m93l82O62J27m25m0q69J053
$$ plain form
6430 72 36 -706 -661 -99 81 -260 255 46 -588 77 -654 -1079 468 243 112 66 -153 70 -837 515 195
6451 195 -476 34 399 54 189 271 -39 -422 -78 371 446 -203 201 109 -12 -307 101 749 336 -263 -43
6472 -43 -3 -403 463 402 472 633 -112 -604 151 207 -71 147 280 -427 -1188 -523 -509 -202 -81 102 268 41
6494 41 -353 -335 118 117 -47 191 329 -625 -189 -470 715 -309 347 303 -116 -575 -61 -60 -411 -401 -507 -469
6516 -469 -123 222 -788 -91 -420 -628 -413 63 359 -514 -282 58 428 -337 309 -230 -85 -75 96 104 -71
6537 -71 168 -891 552 167 -86 418 472 146 46 150 34 18 51 -198 -156 244 -732 -414 3 -418 -4
6558 -4 -672 361 -309 840 50 -232 -67 -536 140 -219 -423 -252 211 311 374 306 -143 649 -478 -165
6578 -165 -21 187 -607 180 -1 87 -286 190 205 -127 -341 -105 -927 51 423 201 71 425 -481 -295 2
$$ packed form
6430G2l6p42M5N62J80l41N15k09o34O65p31m25J547k25j31m6k19K23r07J352l20
6451A95o71N10L65l45J35Q2l10l83L44M49P5o49M04r2j21k95M08O48m13n99K20
6472d3M0m00Q66o1P0J61p45m92P55N6k78K18J33p07p61O65J4L07J21J83J66k27
6494D1l94J8M53jj64K38J38r54M36k81J185j024O56m4m19m59N14Jl51J0j06L8
6516d69L46L45j010O97l29k08K15M76K96q73K32L40L70p65O46n39J45J0J71Qj75
6537g1K39j059J443l85k53N04N4l26j00J04j16j6L3k49M2M00r76L18M17m21M14
6558do68J033o70J149p90k82J65m69O76l59k04J71M63J00O3o8m49P92j127L13
6578a65J44K08p94P87j81Q8l73M76J5l32k14K36q22R78L72k22j30L54r06J86K97
$$ plain form
6599 2 -288 213 -72 176 -212 -530 -588 -151 211 -31 -107 47 337 -654 -1079 1069 -375 60 -290 91 -481
6620 -481 484 285 -664 162 299 65 -489 976 363 -560 218 396 -126 27 -6 172 -128 -443 -169 -80
6640 -80 1474 -30 -679 52 -204 -488 -5 -386 -404 -62 540 -729 431 -656 -81 32 -732 816 195
6659 195 -46 -919 -1 340 97 -14 515 302 -98 -647 97 867 -380 -78 -541 -344 85 152 -95 78
6679 78 -324 -539 -298 632 -354 -423 259 -333 -108 -203 -407 598 341 637 -584 -91 0 234 854 -730
6699 -730 48 184 53 -41 -694 125 -73 -120 -52 -206 -193 128 -612 411 -216 393 213 317 548 -7 241
6720 241 -297 234 73 -353 514 605 -296 164 655 546 -159 194 -455 -115 231 96 102 317 -4 -365 815
6741 815 542 -208 27 116 -322 -246 -264 308 510 244 687 -321 505 195 71 -409 -134 41 -641 -174 738
$$ packed form
6599Bk90N01k85K48l88l18n8M37L62k42p6J54K90r91m25K148j444M35l50L81n72
6620d81R65j99r49Q26J37k34n54J465o13r23P78J78n22J53l3J78l00l15K74Q9
6640h0J554j504o49P31k56k84M83l81j8L42O02j269J160j087N75J13p64J548o21
6659A95k41q73R18L41k43j11N29k13m00n49P44P70j247L02m63J97M29O7k47J73
6679G8m02k15K41R30r86o9O82n92K25r5k04J005k57K96j221M93R1K34O20j584
6699g30P78J36j31r4o53Q19j98m7O8j54J3L21p40J023o27O09j80J04K31n55K48
6720B41n38N31j61m26Q67R1r01M60M91j09p05L53o49L40L46j35OK15l21l61J180
6741H15k73p50K35Q9m38P6j8N72K02k66M43j008Q26l10j24m80K75J75o82M67R12
$$ plain form
6762 738 381 380 -273 220 -177 60 -367 -77 -271 -20 -259 -776 -326 553 -164 -481 -192 668 -456 -749
6782 -749 -79 197 -344 -1201 382 -149 92 -703 187 -443 -256 516 440 180 -597 -1144 -341 -107 -1038 -484
6802 -484 42 -500 -287 -145 -137 1247 725 154 551 441 201 -781 -129 66 -420 92 620 534 -229 800
6822 800 -104 -43 -142 329 -734 40 -257 -558 -522 -41 -695 -148 -83 328 40 414 -199 -225 -419 537 483 -305
6844 -305 503 -353 44 -289 87 -280 -166 -843 22 704 14 -450 -331 790 64 115 145 493 -90 -191
6864 -191 -137 -1217 -347 220 -345 -184 -329 706 112 605 -25 -1081 -650 16 394 -282 479 696 -462
6883 -462 614 118 510 -516 500 -118 824 93 -302 -44 -134 -184 -117 46 433 -36 -310 -93 -753 472
6903 472 293 -356 407 -50 -187 -41 174 -91 -99 992 878 -857 563 -595 598 -45 -290 -631 -369
$$ packed form
6762G38l57jo53M93l97K37m27K90j94K51k39n17M50Q79p17l17K89Q60j124k93
6782g49O70K76n41q57J583n31K41p95Q90o30J87P72p6k60p77n47Q03K34r31N54
6802d84N26n42K13J42QJ384n22n71L97j10k40r82O52J95m86N12N28q6p63J029
6822H00r04O1r9M71j063P74k97l01L6M81o54N47O5M11k88L74o13k6j94R56n4p88
6844c05Q08q56L97l33L76l67J14o77Q65O82o90m64J19J121p26N1L0L48n83j01
6864a91N4j080Q70N67n65J61j45J035n94M93o30j056M31O66L78o76P61K17j158
6883d62J076m96L92j026J016o18R42p31l95K58r0n0O7J63L87m69k74K17o60J225
6903D72j79o49P63m57j37J46K15k65qJ091j14j735J420j158J193o43k45l41K62
$$ plain form
6922 -369 990 -642 39 241 1023 -692 -173 -48 -551 883 -423 -387 83 -239 194 173 896 -262 -601
6941 -601 -477 155 -100 -201 -152 -86 97 -352 -44 474 -362 -589 -358 24 -257 -456 98 434 -321 1 -1091
6962 -1091 -190 -428 -245 440 -328 -264 -96 507 700 362 -471 -861 1040 -322 -653 547 422 -114 -130
6981 -130 -53 -806 -822 110 -59 351 672 -120 233 -406 -776 422 -90 -912 332 409 591 1020 -753 -265
7001 -265 -192 -271 451 -173 684 342 -344 618 292 -1022 423 -780 331 -37 -124 852 -748 568 961
7020 961 539 -143 -120 -4 610 32 801 117 -470 1304 -50 -468 -556 -192 149 -704 531 -1226 264
7039 264 -276 -281 -228 392 -1073 -931 -221 -405 383 -784 303 153 246 363 -958 976 1706 407 150
7058 150 216 -592 520 -356 -783 473 99 -48 -1109 -979 -480 421 -171 -601 -438 731 352 371 442 1406
$$ packed form
6922c69J359j632O81K02P82j715N19J25n03J434j306L6M70l22M33k1P23j158l39
6941f01J24O32k55j01M9O6J83m49L08N18q36k27K31L82k81j99N54L36p55L22j092
6962a091R01k38J83O85p68O4J68O03J93l38q33l90J901j362l31J200j25n36j6
6981a30P7p53j6R32j69M10L21p92L53o39l70J198n12q22J244P7J82M29j773M88
7001b65P3p9P22o24Q57l42o86R62l26j314J445j203J111l68q7R76j600J316L93
7020I61m22o82K3J16O14n78P69o84n87J774j354m18q8L64L41q53J235j757J490
7039B64n40nN3O20j465J42P10j84P88j167J087j50R3J17j321J934P30j299k57
7058A50O6q08J112q76m27J256l74j47j061J30M99R01n92m30J63J169l79J9P1R64
$$ plain form
7078 1406 373 332 257 41 805 805 136 -292 231 -392 -451 793 -273 -885 -661 792 -493 -661 128 -683
7098 -683 462 -266 261 -1659 -228 608 -60 -440 564 -832 -355 213 160 339 -530 287 -1130 -109
7116 -109 -303 -13 248 1225 -650 -196 -127 590 -111 -511 534 -184 377 424 634 416 -60 518 -346 11
7136 11 -192 -76 -382 125 105 482 760 395 1012 717 -495 86 819 -792 -14 -257 306 243 49 -263
7156 -263 -17 1039 14 -100 -420 -153 -548 233 -54 212 -871 114 366 -274 -21 636 -358 -242 216
7175 216 -615 191 111 80 91 156 611 714 -225 750 -347 194 430 500 121 -459 342 329 714 183 -601 413
7197 413 189 -375 168 -423 -47 -995 -264 927 470 492 -142 -328 484 -571 -771 103 189 -351 543 -299
7217 -299 407 92 0 693 -114 -279 213 274 62 332 -428 -12 -275 -54 -179 250 -144 103 274 -357 586
$$ packed form
7078A406j033m1p5k16P64%o69m28N23o23n9J244j066o12K24J453j285j68P89q11
7098f83J145p28N27j920J431Q36o68l80J004j396M77N68n3J79q69Q17j417J021
7116a09j94K90K61R77j875M54O9P17p01m00J045p18N61M7K10k18m76N78q64L57
7136A1k03J16l06N07k0L77K78l65O17k95j212N81P33j611P78k43N63o3j94l12
7156b63K46J056j025j14l20K67l95P81k87K66j083R85K52o40K53O57r94J16M58
7175B16q31Q06q0l1J1O5M55J03r39R75j097N41K36P0l79n80Q01j3L85n31p84J014
7197D13k24n64N43n91L76r48P31J191m57K2o34j86Q12j055k00Q74Q6n40Q94q42
7217b99P06l15r2O93q07j65M92O1k12K70p60M16k63K21j25M29l94K47J71o31R43
$$ plain form
7238 586 952 60 778 -327 375 -69 -526 173 1047 -140 -61 -119 -610 -322 -283 -154 -400 -16 -43 307 -250
7259 -250 -110 -553 215 -62 51 391 271 41 -35 521 -38 330 -437 -91 609 848 -141 -550 -804 512
7279 512 -433 -176 368 -223 -1046 -16 -610 286 48 -142 143 465 -320 578 488 439 -206 -499 -318 -603
7299 -603 -309 260 583 22 -421 344 25 440 353 322 -333 42 -694 -223 -55 815 124 -471 -278 -123 -1052
7320 -1052 -398 -116 -264 1287 193 87 610 -787 -44 464 -676 219 -583 -681 -543 69 263 238 -80
7339 -80 -409 -168 154 627 308 79 144 203 -165 -450 316 -1071 -654 213 382 -215 223 857 -587 -377
7359 -377 666 -32 118 395 309 -53 -255 -335 -797 135 -339 -364 208 478 238 448 267 62 -527 635
7379 635 416 127 52 476 -366 -309 426 260 -905 513 -65 -510 223 681 3 708 415 -385 493 703
$$ packed form
7238E86L66q92P18j105P02m44m57O99Q74j187P9n8m91K88L9J29k46L84k7L50n57
7259b50J40m43P68k77J13L40j20k30p6N56n59L68p67L46P00K39r89m09k54J316
7279E12r45K57N44n91q23J030n94Q96k38j90K85L22p85Q98r0m9o45k93J81k85
7299f03K94N69L23n61m43P65l19M15q7l1o55L75p36M71J68Q70o91n95J93J55r29
7320a052O54K82j48J551j094j06N23j397P43N08j140Q95q02r8J38O12J94k5l18
7339h0l29K41L22M73l19k29O5N9l68k85P66j387M17Q67J69n97M38O34j444K10
7359c77J043o98J50K77q6l62k02q0m62R32m74k5N72K70k40K10j81k05n89J162
7379F35k19k89p5M24q42N7P35j66j165J418n78m45P33M58o78P05k93q00Q78K10
$$ plain form
7399 703 -257 269 639 -744 25 177 -241 -529 69 48 -140 578 -277 -319 448 -415 75 -63 -67 -157 682
7420 682 -57 29 -610 -356 -289 483 309 503 -82 175 43 -143 -785 13 -146 -315 450 211 107 -247 730
7441 730 -791 -408 710 215 -502 -286 -267 -197 -704 -728 206 -4 627 -663 -651 376 -268 -300 -26 564
7461 564 -190 -407 477 -253 3 901 -97 -501 374 91 -222 237 -235 -258 340 118 -389 705 301 242
7481 242 -385 114 129 -1000 528 -58 287 -271 -254 89 -170 69 38 42 -420 -27 36 34 -119 -259 655 -4
7503 -4 126 11 879 325 22 364 -1389 234 253 -63 -765 427 589 53 32 1 346 -145 155 -108 -390
7524 -390 258 -205 -219 -284 -330 -316 -34 223 426 215 -25 120 -151 132 -478 85 0 -105 613 79 -426 -182
7546 -182 466 732 380 226 -36 -769 -642 422 -193 -133 159 36 -305 21 -87 103 -14 -360 -9 212
$$ packed form
7399G03r60N26L70j383P69J52m18k88N98k1j88P18q55m2P67q63M90j38mr0Q39
7420F82p39Q6o39K54O7P72j74J94n85K57j32j86o42P98j59j69P65k39j04l54R77
7441G30j521L83J118m95p17K16J9P0n07k4R34k10O31j290J2J027o44l2K74N90
7461E64p54k17Q84p30K56Q98r98m04Q75k83l13M59m72k3N98k22n07J094m04n9
7481B42o27M99J5j129J528n86L45n58J7L43k59K39l1Mm62L93O3kj53j40R14o59
7503dJ30j15Q68n54l03L42j753J623J9l16p02J192J62n36k1l1L45m91L00k63k82
7524c90O48m63j4o5m6J4K82K57K03k11k40J45k71K83o10N63q5j05P18n34n05K44
7546a82O48K66l52j54k62p33J27J064o15O0K92j23l41L26j08J90j17l46L51K21
$$ plain form
7566 212 313 12 -601 465 -583 228 -303 -471 -184 184 568 -151 543 123 225 -51 364 -451 681
7585 681 211 167 -145 382 -338 68 -959 -615 -173 -198 77 574 223 42 -338 -449 -500 -466 -673 575 384
7606 384 -255 -12 530 -853 55 109 -323 -241 -308 -142 306 -98 137 126 -431 -176 -279 -594 485 79 97
7627 97 409 -143 -474 53 -130 311 125 -45 288 -388 -306 -405 -96 476 211 -626 -615 -380 -87 389 -133
7648 -133 268 215 -275 -484 -122 162 460 363 479 -235 3 -33 382 17 -325 -132 66 301 -593 222 -197
7669 -197 -47 109 -126 51 -644 196 291 -532 -301 569 -143 338 -183 -182 -70 169 -453 -449 137 -916 -21
7690 -21 -461 -645 532 67 146 177 -309 -666 -154 -313 514 -472 -374 -337 -876 288 -404 283 -231 -83 173
7711 173 -195 -186 -748 579 266 789 408 -131 118 293 589 213 197 -109 401 -16 80 633 285 566 -394
$$ packed form
7566B12J01l01o13J066j048Q11n31j68K87L68L84p19O94m20J02k76M15q15J132
7585F81m70m4l12N27p20M06j027L44M42k5K75M97l51j81l80j11n1L4k07J248j91
7606C84o39K43N42j383R08N4m32Q2o7J66M48m04K35j1n57K55j03l15J079m06J8
7627I7L12n52l31N27j83M41j86j70L33o76Q2r9L09N72k65q37J1K35K93M76n22
7648a33M01n3m90k09L62K84K98r7J16p14K38l6M15l65l42J93J98K35q94Q15m19
7669a97J50J56k35J77o95Q40R5q23K31Q70p12M81n21JJ12K39o22MN86j053Q95
7690b1m40j84J177m65P9L1m86l57N12j59Q27r86R8L7n39J164o92O87n14J48K56
7711A73l68Rn62J327l13N23l81n39K49J75K96l76j6l06N10m17R6N53l48K81r60
$$ plain form
7732 -394 -395 196 -160 462 578 -104 -310 -512 -54 -391 679 394 368 567 928 160 206 -715 257 777 47
7753 47 745 -123 -125 352 -28 378 494 232 -63 338 329 582 16 -278 -62 -401 -462 15 -92 -156 95 47 293
7776 293 215 -250 -452 -461 -336 -415 -449 -234 -828 -3 -233 -354 458 -411 187 570 -101 -490 -364 -17 -82 -613
7798 -613 2 -359 44 507 -18 117 20 94 352 -370 464 74 78 -140 159 188 135 -782 357 -401 -641 279
7820 279 442 -29 139 255 -379 499 137 -63 399 347 -58 6 74 -711 215 -591 -250 347 -293 330 31
7841 31 -7 -17 -298 543 -14 716 4 -483 -312 204 -109 -137 13 -229 730 -66 25 -8 334 -338 48 23
7863 23 405 724 130 -221 258 -389 84 88 67 2 -522 23 -58 -651 -90 219 218 279 66 -465 0 380 566
7886 566 489 -18 533 -170 315 367 -157 275 -145 -382 142 485 -159 156 425 54 -4 309 -385 -171 601
$$ packed form
7732c94jN91l56O22J16o82k06k02M58l37J070k85k6J99L61p68M6r21R72N20p30
7753D7O98q68kM77l80M06J16k62k95M01rK53n66k94K16l39o1M77j07o4K51m8K46
7776B93p8m65k02rJ25p9l4K15n94Q25k30j21Q12q69N98L83o71l89J26L47o5n31
7798f13O15l61M03M63n25J35r7P4K58p22Q34l90Mk18K99K9n3r17J139p58k40R20
7820B79J63m71J68J16o34Q78l62k00M62n2m05O4O8p85R26q06L41N97o40O23k99
7841C1l8j0k81Q41n57P30p12m87J71N16l13k8J50k42R59p96R1l3L42o72L86k5
7863B3L82L19n94l51M79o47M73Mk1o5n24N45q1n93N61L09jO1k13n31M65L80J86
7886E66p7n07N51p03M85N2n24M32m20k37N24L43o44L15K69l71n8L13o94K14P72
$$ plain form
7907 601 127 -41 42 -107 204 -240 279 538 -618 149 414 -400 363 34 -190 212 97 -685 173 445
7927 445 118 486 245 -407 144 132 247 -250 263 301 -488 757 133 -941 -226 -4 531 -259 30 432
7947 432 -102 781 690 179 -177 475 128 -48 -263 123 -336 -15 756 192 -387 29 -122 21 508 49
7967 49 554 343 81 147 206 -280 227 -221 -459 -110 63 166 -13 558 324 -278 -320 6 -87 35 292 351
7989 351 4 -232 -285 -594 276 -93 -453 -400 -356 451 418 -564 363 -21 158 -218 29 -65 735 16 -516 149
8011 149 -321 -118 2 366 -243 263 859 440 -464 13 422 162 312 -125 -464 -269 -484 -446 526 -281
8031 -281 78 94 -325 28 -145 63 311 -139 421 354 82 817 19 256 698 65 -39 -28 -308 243 9
8052 9 978 -153 -734 582 -54 -528 -430 -91 -491 -106 -316 136 -338 242 -51 -667 -61 1068 277 -712
$$ packed form
7907F01m74j68Q3j49L11m44N19K59j156P67K65q14P63l29k24M02j15p82Q58K72
7927D45l27L68k41o52N51j2J15m97N13L8p89J245o24j074P15K22N35p90K89M02
7947D32n34Q83r1n11l56O52l47j76k15L86m59L21P71n64n79M16j51J43M87m59
7967D9N05k11k62O6N9m86N07m48k38L49J73J03j79N71k34o02m2L26r3J22K57N9
7989C51l47k36n3l09Q70l69l60N3M4Q07l3r82R27l84J79l76K47r4Q00p19n32O65
8011A49m70K03J20L64o09N06N96m19r04M77M09k60J50m37l39J95k15L8R72q07
8031b81L59J6m19L53j73K08K48m50N60o7k72P35p98K37M42o33j04J1k80N51k34
8052IR69j131n81J316o36m74R8L39m00L85k10M52m74N80k93o16O06J129p91r89
$$ plain form
8072 -712 790 303 317 1 -86 -339 -65 246 189 -37 304 210 -10 761 -110 -255 321 244 -583 926 98
8093 98 -125 595 339 442 821 -42 600 215 315 -138 139 -878 -58 -285 138 -39 -490 353 -789 193
8113 193 30 84 63 -61 -204 -548 -248 172 -549 324 -163 -482 -103 -950 -119 -189 -169 -88 228 -331 -132 -407
8135 -407 130 832 3 562 -88 -254 -950 461 697 -54 -799 412 97 -164 -228 257 0 -177 -503 -178
8155 -178 -86 -229 45 121 290 2 -343 473 -263 -866 140 -26 200 137 885 349 -423 485 -116 957
8175 957 107 532 85 -54 -521 -337 -488 -15 387 602 23 674 -1206 -190 -164 -4
$$ packed form
8072g12J502m87J4l16q7k53K74L11n7k26L41r4k20P71q71j45N76p7q27J509q28
8093I8k23P20k56J03L79q63O42l85J00m53K77j017Q20k27M23j77m51Q43j142R82
8113A93j63N4k1j24j43l44L00M20p21Q73m87l19L79q47Q31p0K0Q1L16n59J99k75
8135d07N37P02q29N59o50j66o96J411K36p51p45J211l15k61o4M85k57j77l26L25
8155a78R2j43K74P6J69k88l45Q16p36o03J006j66K26o3P48n36p72R08o01J073
8175I57q50M25m47j39m67J84j51M73M02K15n79O51j880J016K6J60
8191d
$$ Imaginary data points
##PAGE= N=2
##DATA TABLE= (X++(I..I)), XYDATA
$$ plain form
0 0 0 0 0 0 0 0 0 0 -8 8 -8 8 -15 16 -23 25 -32 41 -52 64 -74 88 -106 126 -149 173 -200 234 -270 309 -356
31 -356 405 -459 523 -591 667 -749 842 -940 1051 -1170 1301 -1443 1601 -1770 1957 -2161
47 -2161 2383 -2626 2895 -3189 3513 -3870 4267 -4712 5214 -5779 6426 -7174 8049 -9093
61 -9093 10358 -11932 13950 -16647 20445 -26242 36251 -58387 214870 -276718 -248754 448707
73 448707 -135406 -85054 426782 -115481 -465287 192742 22350 -241438 308777 18327
83 18327 -755454 -77111 429069 -234859 -196604 233790 -321469 -391379 278709 94061 -225910
94 -225910 108381 -128415 -389407 272390 330935 -377433 -148848 226016 -227327 -148168
104 -148168 356159 -27192 -355410 4115 -17136 -131890 206754 20905 -399065 -20444
$$ packed form
0@%%%%%%%%qJ6j6J6k3L1l9M8n7P3r3J16j38J62j94K32k75L22l73M34n04N79o65
31c56P61q64R82j114J258j416J591j782J991k221K471k744L044l371L727m118
47b161M544n009N521o084O702p383Q137q979R926j0993J2205j3600J5223j7142
61i093J9451k2290K5882l0597L7092m6687O2493r4638K73257m91588K7964O97461
73D48707n84113N0352N11836n42263l49806O58029j70392k63788N50215k90450
83A8327p73781O78343N06180o63928L8255M30394n55259o9910O70088j84648l19971
94b25910L34291k36796k60992O61797N8545p08368K28585L74864m53343P9159
104a48168N04327l83351l28218L59525k1251j14754L38644j85849m19970L78621
$$ plain form
114 -20444 202904 -192749 -53008 250260 -149499 -269166 181687 157647 -65787 70158
124 70158 11100 -114479 159178 197545 -79511 48689 184258 -90047 -54977 266057 111772
135 111772 -142276 17013 99924 -16512 32911 59851 -61433 -21901 48541 -59827 -28811
146 -28811 112413 -26485 -160439 37507 120264 -69609 -59911 88077 9012 -58488 56487
157 56487 51644 -14080 55220 31651 -48227 76775 110059 -74718 -21676 150584 -2916
168 -2916 -105513 86060 68471 -96390 5760 56036 -78720 -12604 52578 -95736 -42421
179 -42421 93313 -87981 -130031 104592 18708 -162530 23635 73622 -119634 -23657 88082
190 88082 -76646 -42884 85856 -69970 -67259 129145 -16702 -141640 84563 65523 -137668
$$ packed form
114b0444K23348l95653J39741L03268l99759j19667M50853k4040k23434J35945
124G0158n9058j25579K73657L8367k77056J28200J35569k74305L5070L21034j54285
135A11772k54048J59289Q2911j16436M9423K6940j21284L9532P0442j08368L1016
146b8811J41224j38898j33954J97946Q2757j89873R698J47988p9065o7500J14975
157E6487m843o5724O9300k3569p9878J25002L3284j84777N3042J72260j53500
168b916j02597J91573j7589j64861J02150N0276j34756O6116O5182j48314N3315
179d2421J35734j81294m2050K34623q5884j81238J86165M9987j93256R5977J11739
190H8082j64728L3762J28740j55826K711J96404j45847j24938K26203j9040k03191
$$ plain form
201 -137668 15783 100691 -104483 -49143 88146 -61831 -59168 89201 -54032 -107838 94458
212 94458 16139 -129821 50039 71649 -115514 -6507 107257 -55581 -36098 93331 -25643
223 -25643 -41444 105331 13267 -71002 84957 55634 -78221 47046 95215 -60551 -10651
234 -10651 89632 -26698 -31808 73866 -13660 -56548 57834 8770 -71631 35400 35892 -76587
246 -76587 -3252 56569 -46229 -30332 50309 -21235 -39585 44681 2528 -40607 36725 22276
258 22276 -41167 24069 45600 -28367 927 50829 -5782 -11864 43686 10200 -16561 30378
270 30378 18491 -17868 20287 24110 -19106 3626 26902 -13615 -12121 21219 -5523 -20436
282 -20436 9072 1234 -22157 -1216 1845 -22541 -11230 1084 -20580 -19155 -2207 -16458 -23904
$$ packed form
201a37668J53451Q4908k05174N5340J37289j49977K663J48369j43233n3806K02296
212I4458p8319j45960J79860K1610j87163J09007J13764j62838J9483J29429j18974
223b5643j5801J46775r2064q4269J55959k9323j33855J25267M8169j55766M9900
234a0651J00283j16330n110J05674q7526m2888J14382m9064q0401J07031M92j12479
246g6587P3335N9821j02798J5897Q0641p1544j8350Q4266m2153m3135P7332j4449
258B2276o3443O5236K1531p3967K9294M9902n6611o082N5550l3486k6761M6939
270C0378j1887l6359L8155L823m3216K2732K3276m0517J494L3340k6742j4913
282b0436K9508p838k3391K0941L061k4386J1311J2314k1664J425J6948j4251p446
$$ plain form
295 -23904 -6504 -11659 -25861 -11993 -7795 -20824 -15215 -5289 -16114 -15334 -3280 -8940 -13002 -1321
309 -1321 -672 -8578 -354 4735 -1754 2810 9977 4077 5275 12663 10790 8363 15253 15872 11778 16360
325 16360 18457 13594 14774 18334 14576 13468 15946 12966 9949 11443 10101 6262 6512 5919 1576
340 1576 347 165 -2754 -4264 -4550 -7442 -10646 -10459 -10754 -14322 -14001 -13499 -15182 -15240 -13748 -15701 -15498
357 -15498 -14460 -14419 -14158 -11528 -10619 -11671 -9081 -6160 -9273 -5978 -127 -3746 -3134 4833 2653 489
373 489 9609 8866 5033 13675 14811 6814 15752 22139 10832 15291 27433 16079 13372 27465 18746
388 18746 11593 26180 20750 5560 20559 20017 -644 12359 20896 -5581 -3341 16659 -5070
401 -5070 -13618 6780 -7986 -23199 420 -7508 -29987 -6067 -2707 -36026 -16619 5376 -28337
$$ packed form
295b3904J7400n155j4202J3868M198j3029N609R926j0825P80J2054n660m062J1681
309a321O49p906Q224N089o489M564P167n900J198P388j873k427O890O19m094M582
325A6360K097m863J180L560l758j108K478k980l017J494j342l839K50n93m343
340A576j229j82k919j510k86k892l204J87k95l568L21N02j683n8J492j953K03
357a5498J038M1K61K630R09j052K590K921l113L295N851l619O12P967k180k164
373D89R120p43l833Q642J136p997Q938O387j1307M459J2142j1354k707J4093q719
388A8746p153J4587n430j5190J4999n42k0661J3003Q537k6477K240K0000k1729
401e070q548K0398j4766j5213K3619p928k2479K3920L360l3319J9407K1995l3713
$$ plain form
414 -28337 -27687 3166 -17958 -29162 2466 -8093 -28193 2035 -3525 -30899 1698 12405 -31082
427 -31082 -14223 17483 -16283 -22742 14352 -5638 -25757 5696 -284 -19487 9487 3924 -28101
440 -28101 3068 23084 -16841 -9812 27990 1075 -13803 21372 18948 -1716 14385 14193 1699
453 1699 23715 23336 -3886 11783 31954 4140 -3685 27340 20137 -7496 1530 17789 6795
466 6795 -2207 1717 2568 3363 4261 -4591 -6924 10758 9784 -14855 -3305 25007 1996 -20366 17411
481 17411 28888 -12147 -5070 23816 4084 3574 21057 -6145 -7467 29500 -5136 -28549 33213
494 33213 13995 -60986 -8025 40139 -32372 -36445 14436 -35004 -42587 21974 -20932 -50642
506 -50642 18628 -22728 -82060 30704 50011 -79617 -34396 52491 -35852 -28527 66415 -11034
$$ packed form
414b8337O50L0853k1124j1204L1628j0559k0100L0228n560k7374L2597J0707m3487
427c1082J6859L1706l3766o459L7094j9990k0119L1453n980j9203K8974n563l2025
440b8101L1169K0016l9925P029L7802k6915j4878L5175k424k0664J6101j92j2494
453A699K2016l79k7222J5669K0171k7814p825L1025p203k7633R026J6259j0994
466F795r002L924Q51P95Q98q852k333J7682r74k4639J1550K8312k3011k2362L7777
481A7411J1477m1035P077K8886j9732n10J7483k7202j322L6967l4636k3413O1762
494C3213j9218p4981N2961M8164p2511m073N0881m9440p583O4561m2906k9710
506e0642O9270m1356n9332J12764J9307j29628M5221Q6887q8343P325R4942p7449
$$ plain form
518 -11034 -54053 42851 3484 -37810 77554 30596 -104424 19469 92414 -51767 -16504
529 -16504 80653 -49123 -67649 75827 14921 -48766 49397 -19246 -97082 73851 78766 -95622
541 -95622 -6531 78805 -73367 -26448 130457 -813 -75090 54914 10457 -32892 110164
552 110164 42498 -108064 39980 90398 -68348 22898 120257 -75761 -89604 94298 19412
563 19412 -52594 53013 -28997 -111855 56058 52459 -97226 9585 49262 -125875 -39403
574 -39403 127789 -22041 -93287 40725 -8730 -53901 82668 38373 -79306 27379 45299
585 45299 -66024 46670 116114 -69592 -71889 85664 22086 -38686 55908 5143 -78406
596 -78406 19386 36188 -41799 21380 23221 -98582 -30584 87977 -13821 -70007 23982 -3038
$$ packed form
518a1034m3019R6904l9367m1294J15364m6958j35020J23893P2945j44181L5263
529a6504R7157j29776j8526J43476o0906o3687R8163o8643p7836J70933M915j74388
541i5622Q9091Q5336j52172M6919J56905j31270p4277J30004m4457m3349J43056
552A10164o7666j50562J48044N0418j58746R1246R7359j96018j3843J83902p4886
563A9412p2006J05607q2010q2858J67913l599j49685J06811L9677j75137Q6472
574c9403J67192j49830p1246J34012m9455m5171J36569m4295j17679J06685J7920
585D5299j11323J12694O9444j85706k297J57553o3578o0772R4594n0765q3549
596g8406R7792J6802p7987O3179J841j21803O7998J18561j01798n6186R3989k7020
$$ plain form
608 -3038 -59858 27825 45476 -33464 -12812 8340 -30554 24884 66626 -31320 -49780 43136
620 43136 19320 -36497 29151 37329 -48688 -33814 31665 6776 -11574 3110 -34373 -35440
632 -35440 29526 10168 -44210 4132 20506 -51660 -18218 63168 5992 -49370 13917 25567
644 25567 -11169 31710 35054 -25624 10149 46438 -16153 9603 74481 -13331 -55001 56393
656 56393 46194 -43620 13657 37201 -47956 -7769 49230 -28562 -22635 37198 -42474 -52866
668 -52866 65617 9908 -83743 18326 36142 -65382 1936 61820 -45318 -33704 49075
679 49075 -24121 -26275 70284 -13151 -74805 53329 38988 -70001 23980 58156 -69721 -24645
691 -24645 68583 -27240 -36312 51249 -30915 -58182 62887 12345 -77218 31395 36358 -78050
$$ packed form
608c038n6820Q7683J7651p8940K0652K1152l8894N5438M1742r7946j8460R2916
620D3136k3816n5817O5648Q178q6017J4874O5479k4889j8350J4684l7483j067
632c5440O4966j9358n4378M8342J6374p2166L3442Q1386n7176n5362O3287J1650
644B5567l6736M2879L344o0678L5773L6289o2591K5756O4878q7812m1670J11394
656E6393j0199q9814N7277K3544q5157M0187N6999p7792N927N9833p9672j0392
668e2866J18483n5709r3651J02069J7816j01524O7318N9884j07138J1614Q2779
679D9075p3196k154R6559q3435o1654J28134j4341j08989R3981L4176j27877M5076
691b4645R3228r5823r072Q7561q2164k7267J21069n0542q9563J08613M963j14408
$$ plain form
703 -78050 4938 74641 -46526 -36146 57299 -18349 -34524 65933 1198 -58479 46934
714 46934 30299 -57232 31801 58613 -57485 -14455 66717 -20793 -28673 52512 -10349 -46064
726 -46064 42993 14793 -49258 26009 27290 -59250 3338 52321 -36619 -27554 43847 -16271
738 -16271 -36735 38073 5362 -41880 21777 16507 -41019 13596 36460 -36843 -12473 40799
750 40799 -15328 -24696 36012 2025 -32667 19595 13664 -28088 12405 22263 -28637 -4124 29416
763 29416 -15985 -17730 27550 -3421 -28117 17194 12312 -22867 5212 15445 -20123 -4160
775 -4160 20027 -12491 -12067 18805 -3297 -18360 15511 11297 -18410 4599 14642 -11914 -2219
788 -2219 19311 -6067 -8869 15843 1601 -11160 14285 10026 -15198 3501 14952 -8578 -1904
$$ packed form
703g8050Q2988O9703j21167J0380R3445p5648j6175J00457o4735n9677J05413
714D6934j6635q7531Q9033K6812j16098M3030Q1172q7510p880Q1185o2861l5715
726d6064Q9057k8200o4051P5267J281q6540O2588M8983q8940R065P1401o0118
738a6271k0464P4808l2711m7242O3657n270n7526N4615K2864p3303K4370N3272
750D0799n6127r368O0708l3987l4692N2262n931m1752M0493R858n0900K4513L3540
763B9416m5401j745M5280l0971k4696M5311m882l5179K8079J0233l5568J5963
775d160K4187l2518M24L0872k2102j5063L3871m214k9707K3009J0043k6556R695
788b219K1530k5378k802K4712j4242j2761K5445m259k5224J8699J1451k3530O674
$$ plain form
801 -1904 15369 -6341 -9085 12477 1363 -12388 7603 3809 -14258 2196 9748 -12112 -5053
814 -5053 10456 -6965 -10444 10260 -1415 -12876 6490 4263 -11572 2597 8254 -10911 -2709
827 -2709 10865 -6325 -6332 8337 -2469 -9369 5356 1648 -11625 639 4332 -8508 -3252 5108
841 5108 -7451 -6946 4269 -2517 -7801 3785 502 -7891 3138 5702 -4680 2147 6889 -2087
855 -2087 -79 8964 3168 -736 7472 5031 -570 5612 7169 166 2907 6014 -726 928 5144
870 5144 -413 -1758 2757 639 -3346 1845 1048 -3661 -110 1615 -858 -1642 1976 -2654 -1446 1268
886 1268 -104 -2350 1944 254 -1667 566 23 -1292 -23 570 -3075 -643 242 -3030 -2427 -105
902 -105 -2985 -3049 -858 -3069 -3116 -801 -1785 -3921 -358 -1426 -4208 -196 750 -2848 -1172 1868 -901
$$ packed form
801a904J7273k1710k744K1562j1114j3751J9991l794j8067J6454P552k1860P059
814e053J5509j7421l479K0704j1675j1461J9366k227j5835J4169N657j9165Q202
827b709J3574j7190pJ4669j0806o900J4725l708j3273J2264L693j2840N256Q360
841E108j2559N05J1215o786n284J1586l283q393J1029K564j0382O827M742q976
855b087K008R043n796l904Q208k441n601O182J557p003K741L107o740J654M216
870E144n557j345M515k118l985N191p97m709L551J725k473p84L618m630J208K714
886A268j372k246M294j690j921K233n43j315J269N93l645K432Q85l272O03K322
902a05k880o4K191k211m7K315r84k136L563j068k782M012R46l598J676L040k769
$$ plain form
919 -901 -228 2695 -1506 -158 3648 -950 -451 4012 612 -2584 2196 2589 -1978 1043 2720 -1552
935 -1552 873 3139 -866 998 4958 -1965 -1706 5865 1216 -2700 4301 2363 -1673 1456 2220 -2995
951 -2995 2196 2634 -3039 1246 4217 -4489 -2931 3604 -2516 -3700 2636 -585 -2684 1818 -1706
966 -1706 -2438 5607 787 -5445 3087 4174 -4969 407 5276 -2822 -1045 3925 -3224 1163 5587
981 5587 -7079 -3683 7929 -4046 -10391 4877 375 -10677 1448 1141 -8697 1927 1887 -11356
995 -11356 2860 8846 -11786 -3994 15749 -5417 -9758 13977 3911 -9115 10068 5691 -9513
1008 -9513 11296 8998 -14564 6686 17552 -15808 -5552 21953 -6687 -14532 14585 -785
1020 -785 -16273 10677 1760 -19579 9668 7027 -23515 4730 21144 -21288 -12063 25082 -5495
$$ packed form
919i01O73K923m201J348L806m598M99M463l400l196M780L93m567L021J677m272
935a552K425K266m005J864L960o923K59P571m649l916P001j938m036L129P64n215
951b995N191M38n673M285K971q706J558O535o120j184O336l221k099M502l524
966a706p32Q045m820o232Q532J087r143N376M869q098J777M970p149M387M424
981E587j2666L396J1612j1975o345J5268m502j1052J2125l07r838J0624m0j3243
995a1356J4216N986k0632P792J9743k1166m341K3735j0066j3026J9183m377j5204
1008i513K0809k298k3562K1250J0866l3360J0256K7505k8640p845K9117j5370
1020g85j5488K6950q917k1339K9247k641l0542K8245J6414m2432R225L7145l0577
$$ plain form
1033 -5495 -16492 19685 2368 -16369 17661 8154 -18600 16802 16363 -26681 4860 31166 -17527
1046 -17527 -14109 26190 -5763 -20759 18720 1648 -22037 11831 2146 -27984 11541 16977
1058 16977 -32181 -7006 25656 -18186 -18509 24716 -2822 -21771 14984 4860 -15081 17475
1070 17475 8367 -24522 11799 24364 -19599 -4166 29478 -9128 -19007 21091 5226 -15997
1082 -15997 7465 918 -15864 10877 8418 -23197 847 15744 -18345 -10108 22258 -1372
1094 -1372 -19920 5519 8213 -4975 7405 5405 -7979 4683 11272 -5691 5107 18302 -5553
1107 -5553 -13558 12647 15814 -5968 -4941 5423 -3372 -5372 3854 1981 -5619 -5032 -7620 -7301 8727
1122 8727 6151 -18400 -13428 11017 -345 -11065 10013 4953 -19944 -3849 17401 1919 1041
$$ packed form
1033e495j0997L6177j7317j8737L4030r507k6754L5402m39m3044L1541K6306m8693
1046a7527L418M0299l1953j4996L9479j7072k3685L3868r685l0130L9525N436
1058A6977m9158K5175L2662m3842l23M3225k7538j8949L6755j0124j9941L2556
1070A7475r108l2889L6321J2565m3963J5433L3644l8606r879M0098j5865k1223
1082a5997K3462o547j6782K6741k459l1615K4044J4897l4089Q237L2366k3630
1094a372j8548K5439K694j3188J2380k000j3384J2662O589j6963J0798J3195k3855
1107e553q005K6205L167k1782J027J0364q795k000R226j873p600N87k588L19J6028
1122H727k576k4551M972K4445j1362j0720K1078n060k4897J6095K1250j5482q78
$$ plain form
1135 1041 6587 -15218 -2686 28029 4470 -14851 15044 3446 -25200 14898 30272 -17261
1147 -17261 -14824 11594 -8372 -1578 26424 -11521 -27649 15046 1596 -21623 23557 16079
1159 16079 -43841 -9147 32842 -7557 -6311 23279 -20326 -23671 31941 9559 -18387 22273
1171 22273 1008 -42146 18970 42691 -26483 -15070 22167 -21777 -13564 39135 -4116 -33806
1183 -33806 14047 -3567 -27368 29928 19742 -49681 -6822 31455 -20695 -5348 37500 -21585
1195 -21585 -32536 29957 7957 -17197 27629 2083 -41568 19247 36721 -23630 -757 29074
1207 29074 -26267 -16483 41859 4081 -23900 15999 -1586 -26058 26904 21099 -33405 -788
1219 -788 21425 -23529 -2957 36087 -14253 -27849 18721 3233 -17154 20410 6296 -31145
$$ packed form
1135A041N546k1805J2532L0715k3559j9321K9895j1598k8646M0098J5374m7533
1147a7261K437K6418j9966O794K8002l7945j6128M2695j3450k3219M5180p478
1159A6079n9920L4694M1989m0399J246K9590m3605l345N5612k2382k7946M0660
1171B2273k1265m3154O1116K3721o9174J1413L7237m3944Q213N2699m3251k9690
1183c3806M7853j7614k3801N7296j0186o9423M2859L8277n2150J5347M2848n9085
1195b1585j0951O2493k2000k5154M4826k5546m3651O0815J7474o0351K2873K9831
1207B9074n5341R784N8342l7778k7981L9899j7585k4472N2962n805n4504L2617
1219g88K2213m4954K0572L9044n0340j3596M6570j5488k0387L7564j4114l7441
$$ plain form
1231 -31145 5598 18616 -19187 1146 23979 -19377 -18361 25174 2520 -19087 12730 2779
1243 2779 -22650 7765 15706 -14701 -590 13274 -17084 -7603 22133 -2608 -17715 11699
1255 11699 3558 -16265 8406 12892 -14177 -3845 11050 -10156 -3178 16135 -5075 -14962 9736
1268 9736 5605 -13153 6678 11276 -13651 -4796 12845 -4658 -4902 11897 -3332 -11622 9446
1281 9446 6839 -10755 3822 8553 -13075 -3150 15527 -4521 -9576 8988 -2074 -10299 8709
1294 8709 6527 -13595 92 7586 -10936 -1286 12912 -7770 -11169 11056 438 -10863 9582
1307 9582 5432 -13164 3775 12476 -7415 1129 12843 -6980 -4781 15668 1175 -9509 9975
1320 9975 4934 -11049 6094 9922 -11368 -2374 10236 -8071 -5412 11037 -5410 -12024 8583
$$ packed form
1231c1145L6743J3018l7803K0333K2833m3356J016M3535k2654k1607L1817r951
1243B779k5429L0415P941l0407J4111J3864l0358R481K9736k4741j5107K9414
1255A1699q141j9823K4671M486k7069J0332J4895k1206O978J9313k1210r887K4698
1268I736m131j8758J9831M598k4927Q855J7641j7503k44J6799j5229q290K1068
1281I446k607j7594J4577M731k1628R925J8677k0048n055J8564j1062q225J9008
1294H709k182k0122J3687P494j8522R650J4198k0682l399K2225j0618j1301K0445
1307I582m150j8596J6939Q701j9891Q544J1714j9823K199K0449j4493j0684J9484
1320I975n041j5983J7143L828k1290Q994J2610j8307K659J6449j6447o614K0607
$$ plain form
1333 8583 1243 -11134 4230 5237 -11600 603 10170 -7523 -3321 9911 -2963 -5537 11320
1346 11320 2058 -8855 6223 6521 -6852 4245 8192 -6861 -1953 8802 -4578 -5742 6510
1359 6510 -2907 -8473 4295 2424 -8944 95 2655 -9604 -1586 5372 -4840 -4690 4561 -2413
1373 -2413 -5516 5477 1819 -6066 2670 3887 -3835 798 4152 -3426 -3110 5712 -775 -3907 3905
1388 3905 -517 -6264 201 1329 -5873 -1460 1181 -4504 -2735 3038 -1841 -4285 2936 341 -1390
1403 -1390 4189 2617 -1295 2884 4618 1576 2799 5859 2945 1544 6203 3217 1714 4937 3239
1418 3239 -77 2963 2588 -664 447 1226 -1258 -780 12 -416 -2418 46 -446 -1599 -1489 -865 -1015
1435 -1015 -1791 -374 -1997 -867 -1078 -1650 -1284 -920 -464 -1132 -1267 -1322 -743 -1906 -1770 -601 -2946 -2383
$$ packed form
1333H583p340j2377J5364J007j6837J2203R567j7693M202J3232j2874k574J6857
1346A1320r262j0913J5078K98j3373J1097L947j5053M908J0755j3380j164J2252
1359F510r417n566J2768j871j1368R039K560j2259Q018O958j0212J50R251o974
1373b413l103J0993l658p885Q736J217p722M633L354p578L16Q822o487l132P812
1388C905m422n747O465J128p202M413K641n685J769N773m879k444P221k595j731
1403a390N579j572l912M179J734l042J223L060k914j401M659k986j503L223j698
1418C239l316L040l75l252J111P79k484M78P92m28k002K464m92j153J10O24j50
1435a015p76J417j623J130k11n72L66L64M56o68j35n5N79j163J36J169k345N63
$$ plain form
1453 -2383 -686 -1971 -3984 -1627 -1743 -2866 -1283 -424 -2428 -1107 413 -1548 -1092 2478 -214 514
1469 514 2626 585 -1003 2810 1152 -1392 2066 3279 -431 1298 3371 -505 1000 3720 -395
1484 -395 -462 4176 -878 -2851 2857 1890 -3388 1610 2628 -2606 1603 1772 -3024 -32 3132 -3384
1500 -3384 -1358 4324 -2127 -3541 3425 -111 -3735 2986 526 -4057 1572 1880 -3865 1538 2996
1515 2996 -4571 73 6358 -3129 -2629 5644 -882 -3501 3648 62 -3661 4329 1882 -5110 3208
1530 3208 5184 -6242 -391 5976 -4558 -3620 6374 -2152 -4513 3908 -1513 -5006 4166 924 -6965
1545 -6965 2853 3442 -7527 -331 5890 -5192 -3785 5573 -1761 -3446 5108 -2147 -4860 5349
1559 5349 522 -6944 3022 4515 -6917 -58 6990 -3860 -1589 5217 -3581 -1740 5646 -1962
$$ packed form
1453b383J697j285k013K357j16j123J583Q59k004J321J520j961M56L570k692P28
1469E14K112k041j588L813j658k544L458J213l710J729K073l876J505K720m115
1484c95o7M638n054j973N708r67n278M998J018n234M209J69m796K992L164o516
1500c384K026N682o451j414O966l536l624O721k460m583N629L08n745N403J458
1515B996p567M644O285r487N00Q273o526k619P149l586l723P990k447o992Q318
1530C208J976j1426N851O367j0534R38R994q526k361Q421n421l493R172l242p889
1545f965R818N89j0969P196O221j1082J407R358p334j685Q554p255k713J0209
1559E349m827p466R966J493j1432O859P048j0850K271O806q798J841P386p608
$$ plain form
1573 -1962 -4233 6266 -294 -6115 5189 4170 -5896 729 4033 -3019 143 4111 -1535 908
1587 908 4095 -2604 -1250 7003 507 -3380 3019 1715 -1815 1771 1611 -895 2062 -563 -3762
1602 -3762 2426 2186 -4232 -1259 989 -2827 -354 2429 -867 -657 22 -3019 1386 6232 -3962
1617 -3962 -4811 4700 751 -2238 4979 2420 -5264 1383 2212 -3359 5726 4020 -9352 -849 8233
1632 8233 -4575 -1881 8135 -5969 -8749 6512 1961 -5794 3906 -2224 -12426 6334 8305
1645 8305 -10449 -1338 7602 -12151 -4630 14711 -2320 -8973 5986 -2553 -7624 13427 4369
1658 4369 -14340 3289 6808 -11497 4714 15995 -12262 -9448 12243 -1085 -4860 13481 -2900
1671 -2900 -15590 9650 7726 -10762 7164 7718 -17342 -1005 18421 -4505 -7190 10646 -6016
$$ packed form
1573a962k271J0499o560n821J1304j019j0066O625L304p052L162L968n646K443
1587I08L187o699J354Q253o496l887O399j304l530L586j60k506K957k625l199
1602c762O188k40o418K973K248l816K473K783l296K10O79l041M405M846j0194
1617c962q49R511l949k989P217k559p684O647Q29n571R085j706j3372Q503R082
1632H233j2808K694J0016j4104k780J5261m551p755R700o130j0202J8760J971
1645H305j8754R111Q940j9753P521J9341j7031o653J4959q539n071K1051r058
1658D369j8709J7629L519j8305J6211J1281k8257K814K1691j3328l775J8341j6381
1671b900j2690K5240j924j8488J7926N54k5060J6337J9426k2926k685J7836j6662
$$ plain form
1684 -6016 -8954 16688 5470 -12605 6975 3151 -14516 8359 15396 -13527 -6764 11750 -6814
1697 -6814 -4054 15704 -3781 -15781 7647 2020 -9492 9929 5367 -18209 -1411 12123 -7322
1710 -7322 -2863 9970 -9236 -11343 10700 1684 -8142 6127 -478 -13201 5431 9944 -8357
1723 -8357 -1966 7959 -7716 -4357 12349 961 -7504 4406 1462 -4851 6683 6767 -7796 -212
1737 -212 6969 -3713 -921 8894 -1498 -6938 4052 3825 -2266 3050 2940 -6603 -2038 6049 -1390
1752 -1390 -1709 4002 -2974 -5552 3882 4302 -4731 -1215 2637 -4149 -1666 5973 848 -4715 2201
1767 2201 703 -3775 3283 3689 -6216 -2624 5010 -3071 -2122 5961 -1967 -7443 2900 2268 -4996
1782 -4996 2597 2985 -8433 -1314 7102 -2633 -3812 5687 -2154 -6492 7642 4318 -7669 3073
$$ packed form
1684f016k938K5642j1218j8075J9580l824j7667K2875P037k8923O763J8514j8564
1697f814K760J9758j9485j2000K3428n627j1512J9421m562k3576J6798J3534j9445
1710g322M459J2833j9206k107K2043r016r826J4269o605j2723J8632M513j8301
1723h357O391R925j5675L359J6706j1388q465J1910k944o313J1534Q4j4563P584
1737b12P181j0682K792R815j0392n440J0990k27o091N316j10r543M565Q087p439
1752a390l19N711o976k578R434M20r033L516L852o786K483P639n125n563O916
1767B201j498m478P058M06r905L592P634q081R49Q083p928n476J0343o32p264
1782d996P593L88j1418P119Q416r735j179R499p841m338J4134l324j1987J0742
$$ plain form
1796 3073 5562 -6477 1665 10325 -4212 -3365 8196 -1664 -4913 8857 1169 -9115 3556 3850
1810 3850 -7869 2197 6884 -8370 -3419 7569 -3573 -5336 6621 -2265 -8514 6189 4121
1823 4121 -7810 2511 5261 -7602 61 8556 -4819 -4140 8249 -1078 -5039 8178 2776 -8631
1837 -8631 3649 5211 -7188 1228 6863 -5764 -3587 6734 -2166 -5367 5884 -1527 -8150 3144
1851 3144 2342 -6515 268 4527 -6766 -1356 6294 -3045 -3998 5269 126 -4962 5727 2499 -4681
1866 -4681 2123 4612 -3738 1478 6276 -3685 -2374 4204 -702 -3924 3445 -516 -5731 1681 3103
1881 3103 -5652 -620 3143 -4663 -2391 4058 -1291 -3714 2976 692 -3164 3602 3695 -3830 318
1896 318 4640 -1247 295 4437 -1449 -2171 3499 1533 -2655 1789 1537 -4308 397 1871 -2837 -1533
$$ packed form
1796C073K489j2039Q142Q660j4537Q47J1561r860l249J3770p688j0284J2671K94
1810C850j1719J0066M687j5254M951J0988j1142j763J1957q886o249J4703k068
1823D121j1931J0321K750j2863P663Q495j3375O79J2389r327l961J3217n402j1407
1837h631J2280J562j2399Q416N635j2627K177J0321q900l201J1251p411o623J1294
1851C144q02q857O783M259j1293N410P650r339r53R267n143n088J0689l228p180
1866d681O804K489q350N216M798r961J311O578m906l222P369l961n215P412J422
1881C103q755N032L763p806K272O449n349k423O690k284l856O766R3p525M148
1896C18M322n887J542M142n886p22N670j966m188M444k52n845M705J474m708J304
$$ plain form
1912 -1533 1292 -2871 -3070 1977 -663 -4016 -696 1263 -2911 336 2209 -3072 -1190 2967 284
1927 284 47 2206 721 -863 2856 2537 -593 1902 2509 -1538 -317 1996 535 -2004 613 -584
1943 -584 -2345 682 80 -1640 -504 929 -559 -217 2132 -843 -1858 1388 444 -406 1687 1084
1959 1084 -1120 783 2849 -184 -475 1372 -1118 -1382 1256 281 -2069 -327 -605 -2547 23 369
1975 369 -2884 -2031 -186 -1162 -1878 437 -522 -1574 661 788 -1606 199 1355 -1269 101 2628
1991 2628 -418 -189 1479 537 -791 2180 1643 -1199 2609 1518 -1868 1906 1919 -1136 226 1234
2007 1234 -987 -895 1227 -1176 -1329 604 -293 -1934 189 -54 -1467 754 1488 -1698 1252 1739 -2007
2024 -2007 101 1859 401 -1081 2081 -566 -1253 1625 -721 -2054 1618 -268 -2230 123 282
$$ packed form
1912a533K825m163j99N047k640l353L320J959m174L247J873n281J882M157k683
1927B84k37K159j485j584L719l19l130K495O07m047J221K313j461k539K617j197
1943e84j761L027o02j720J136J433j488L42K349k975j015L246r44q50K093o03
1959A084k204J903K066l033k91J847k490k64K638r75k350J742k78j942K570L46
1975C69l253Q53J845r76p16K315r59j052K235J27k394J805J156k624J370K527
1991B628l046K29J668r42j328K971n37k842L808j091l386L774J3l055J362J008
2007A234k221R2K122k403j53J933q97j641K123k43j413K221P34l186K950M87l746
2024b007K108J758j458j482L162k647o87K878k346j333L672j886j962K353J59
$$ plain form
2039 282 -2193 -234 1917 -1840 -657 1578 -1197 -1661 2140 -991 -2329 1989 1122 -2820 1160 1659
2055 1659 -1974 687 1530 -1623 698 1993 -1238 -225 3151 -1031 -1468 1778 -297 -2039 1732
2070 1732 1 -2151 1743 1306 -2078 1236 2164 -2028 -580 1262 -1516 -946 1908 -1040 -1058 1619
2086 1619 -1047 -2553 1792 365 -2343 1862 1253 -2402 439 2193 -1134 116 2226 -2122 -14
2101 -14 1954 -1270 -1514 2981 -68 -2455 2644 671 -2338 1085 2112 -3020 664 2547 -2756 385
2117 385 2166 -2704 -1838 4227 -1364 -2096 3019 402 -2368 2405 816 -3859 1738 1714 -3321 1179
2133 1179 3787 -3378 -1619 3446 -1266 -2112 3686 -2096 -2797 2709 585 -3070 3259 1094 -5011
2148 -5011 2020 2430 -4144 228 3796 -3859 -1543 5496 -1167 -3118 4125 -603 -4157 4082 2072
$$ packed form
2039B82k475J959K151l757J183K235k775m64L801l131j338M318q67l942L980M99
2055A659l633K661Q43l153K321J295l231J013L376m182m37L246k075j742L771
2070A732j731k152L894m37l384L314R28m192J448J842k778N70K854k948j8K677
2086A619k666j506M345j427k708M205o09l655K841J754l327J250K110m348K108
2101a4J968l224k44M495l049k387N099j973l009L423J027n132L684J883n303L141
2117C85J781m870Q66O065n591p32N115k617k770M773j589m675N597k4n035M500
2133A179K608p165J759N065m712q46N798n782p01N506k124l655O329k165o105
2148e011P031M10o574M372L568p655K316P039o663j951P243m728l554Q239k010
$$ plain form
2163 2072 -4664 1872 2400 -4388 1180 3912 -3497 -2634 4963 -2864 -3369 5209 -1023 -4180 3459 581
2179 581 -4691 2436 3405 -5150 609 4139 -3036 -743 4408 -2880 -2796 4484 914 -3744 4028 1377
2195 1377 -4500 2521 2939 -3676 534 3209 -3580 -711 3243 -1824 -2844 3112 -638 -2260 2784
2210 2784 474 -2899 1504 1622 -2630 978 3505 -2413 -944 3258 -8 -603 1694 -907 -2294
2225 -2294 1245 597 -1785 -152 41 -1447 627 1703 -273 -85 435 -1185 708 918 -255 -862
2241 -862 -329 -279 730 -560 -19 691 -1035 -635 567 812 167 578 -344 -1489 178 1216 -907 -312
2259 -312 485 -395 -1339 1742 -99 -1917 -126 192 -2712 896 2674 -2182 -978 2320 -1279 217
2275 217 2700 -778 -2465 3333 739 -2859 2155 1879 -2863 659 3786 -2399 -509 3692 -1355
$$ packed form
2163B072o736O536N28o788N568K732p409Q63P597p827n05Q578o232l157P639k878
2179E81n272P127R69q555N759L530p175K293N151p288Q4P280l570m658P772k651
2195A377n877P021M18o615M210K675o789K869L954n067j020N956l750j622N044
2210B784k310l373M403J18m252L608K527n918J469M202l266n95K297k601j387
2225b294L539o48k382J633J93j488K074J076j976J88N20j620J893K10j173o07
2241h62N33N0J009j290N41P10j726M00J202K45o45M11r22j145J667J038k123N95
2259c12P97q80r44L081j841j818J791L18k904L608J778m856J204L298l599J496
2275B17K483l478j687N798k594l598N014k76m742L522L127o185J890M201n047
$$ plain form
2290 -1355 -1447 4012 471 -3350 3258 1201 -4065 2123 2596 -3181 -191 3570 -3895 -1214 4191 -2168
2306 -2168 -2752 2653 -512 -3550 3210 1905 -4673 896 3320 -2633 -421 4538 -2455 -1947 3968
2321 3968 -541 -2915 3290 750 -4590 1373 2977 -3744 -179 2752 -4380 -1808 4184 -1827 -3370
2336 -3370 2310 -2146 -4120 3323 2116 -2945 554 1981 -3801 908 4312 -2973 -2265 3225 54
2351 54 -1519 3954 650 -3570 415 1921 -1853 719 2116 -3522 -2316 2179 364 -1191 1260
2366 1260 -1336 -3348 1123 1930 -1986 201 1171 -2194 146 3196 -425 -2067 1288 540 -769 2547
2382 2547 1640 -2744 -609 2785 239 -127 1720 -1209 -1824 1144 420 -2189 656 -511 -3178 1325
2398 1325 2449 -1120 -1449 520 -589 -193 1751 -465 -2808 -150 936 -765 1197 1040 -1254 -190
$$ packed form
2290a355r2N459l541l821O608k057n266O188M73n777K990L761p465K681N405o359
2306b168n84N405l165l038O760j305o578N569K424n953K212M959o993N08N915
2321C968m509k374O205k540n340N963J604o721L565K931p132K572N992o011j543
2336c370N680m456j974P443j207n061L499J427n782M709L404p285P08N490l171
2351E4j573N473l304m220L985J506l774K572J397n638J206M495j815j555K451
2366A260k596k012M471Q07l916K187R70l365K340L050l621j642L355p48j309L316
2382B547r07m384K135L394k546l66J847k929o15K968p24k609K845j167k667M503
2398A325J124l569l29J969j109L96J944k216k343K658J086j701J962j57k294J064
$$ plain form
2414 -190 2763 1030 -356 1852 -732 -1325 1489 1729 -1359 481 -48 -1554 240 2325 -816 -2967
2430 -2967 -340 -228 -617 1449 468 -2951 -669 1232 77 -255 226 -2213 -995 2007 1596 -706
2446 -706 595 -269 -1245 1992 2474 -209 -549 817 -626 460 1652 18 -2274 -178 203 -370 948
2463 948 914 -2907 -981 1267 -174 4 934 -734 -1576 1667 1345 -1306 223 566 -862 685 1882
2480 1882 -447 -550 818 -1149 374 1447 -202 -1726 -677 1061 -376 435 -129 -3157 -1176 1248
2496 1248 -424 -166 686 -615 -1717 908 740 -688 370 -590 -1401 820 1694 -559 -368 1070 -475
2513 -475 -775 2253 -359 -1194 -86 -434 -1286 34 708 -1158 301 307 -529 -405 1333 -1505 -379 666
2531 666 -64 -689 15 67 -396 762 862 -417 655 669 -1005 518 920 -400 -121 1286 119 -57
$$ packed form
2414a90K953j733j386K208k584n93K814K40l088J840n29j506J794K085l141k151
2430b967K627J12l89K066r81l419K282J901j155l32M81k439J218L002m11k302
2446g06J301q64r76L237M82k683l40J366j443J086J192j634k292K096L81n73J318
2463I48l4l821J926K248j441J78R30j668q42L243l22k651J529L43j428J547J197
2480A882k329j03J368j967J523J073j649j524J049J738j437Q11n64l028J981K424
2496A248j672K58Q52j301j102K625j68j428J058r60q11K221Q74k253J91J438j545
2513d75l00L028k612q35J108l48q52J320O74j866J459Oq36J24J738k838J126J045
2531F66p30o25P04N2m63J158J00j279J072J4j674J523M02j320K79J407j167j76
$$ plain form
2549 -57 481 42 -900 899 -273 -355 467 -785 -956 739 -103 -1038 398 297 -471 712 305 -1118
2567 -1118 956 675 245 213 658 -890 -480 1697 -220 -1912 771 3 -1036 638 -75 -1112 775
2584 775 860 -1550 -18 900 -620 -83 644 -1249 -1968 1759 -787 -1491 1492 -377 -1386 426 219
2601 219 -1427 139 1328 -1658 69 802 -901 -268 1380 -1253 -973 1771 78 -1336 944 702
2617 702 -1196 707 629 -1517 527 824 -1584 -868 1407 -1115 -139 1492 -917 -1725 1150 -434 -1759
2634 -1759 1198 1221 -1624 223 1113 -1534 -533 834 -781 -152 2448 -697 -838 1133 -805 -1240
2650 -1240 1804 412 -1041 835 756 -1461 857 1611 -2294 -367 1991 -1151 -1008 1963 -696 -812
2666 -812 1417 202 -1999 1792 519 -1084 938 715 -1821 -707 2084 -1445 -523 1774 -1002 -992
$$ packed form
2549e7N38m39r42J799j172q2Q22j252j71J695q42r35J436j01p68J183m07j423
2567a118K074k81m30l2M45j548M10K177j917j692K683p68j039J674p13j037J887
2584G75Q5k410J532R18j520N37P27j893p19L727k546p04K983j869j009J812k07
2601B19j646J566J189k986J727P33j703O33J648k633K80K744j693j414K280k42
2617G02j898J903p8k146K044K97k408P16K275k522R76J631k409q08K875j584j325
2634a759K957K3k845J847Q90k647J001J367j615O29K600l145j41J971j938m35
2650a240L044j392j453J876p9k217K318P54l905J927K358l142J43K971k659j16
2666h12K229j215k201L791j273j603K022k23k536J114K791l529R22K297k776J0
$$ plain form
2682 -992 1334 -382 -1263 1964 518 -1449 899 686 -2059 585 1230 -1911 -426 1523 -896 -1146
2698 -1146 1356 -842 -804 1014 322 -1862 814 154 -1686 665 888 -1928 816 436 -1609 -201
2714 -201 1950 -1240 -390 1074 -515 -982 1006 -344 -1395 625 797 -1697 620 461 -1168 743
2730 743 275 -264 197 2304 -1268 -25 2394 -558 -720 1063 -296 -1411 708 417 -1579 1101
2746 1101 939 -1752 198 1018 -1001 585 595 -1502 -7 1119 -683 -1331 949 -405 -1441 1891
2762 1891 142 -857 717 388 -1875 880 1048 -1293 393 1282 -440 -648 904 -705 -1033 1703
2778 1703 -29 -1610 1175 81 -1677 459 610 -1507 -847 1119 -1790 199 2165 -1100 -945 2360
2794 2360 358 -1721 1492 1143 -1994 1035 469 -1715 808 2372 -899 -436 1475 -934 -1103 2445
$$ packed form
2682i92K326j716q81L227j446j967K348k13k745K644O45l141J485J949k419k50
2698a146K502k198L8J818o92k184K676o60j840K351K23k816K744l80k045J408
2714b01K151l190Q50J464j589m67J988j350j051K020J72k494K317j59j629J911
2730G43m68n39M61K107l572J243K419k952j62J783j359j115K119k91j996K680
2746A101j62k691J950Q20k019J586J0k097J495J126j802o48K280j354j036L332
2762A891j749r99J574l29k263K755J68k341J686Q89j722k08J552j609l28K736
2778A703j732j581K785j094j758K136J51k117O60J966k909J989J966l265J55L305
2794B360k002k079L213l49l137L029n66k184K523J564l271M63J911k409j69L548
$$ plain form
2810 2445 -440 -716 610 935 -1130 877 1941 -1569 -231 1044 -2156 92 1444 -858 -985 1441
2826 1441 -389 -497 1386 412 -1612 576 1260 -1042 903 626 -1621 648 1630 -132 442 1247 -973
2843 -973 -2154 2151 556 -1196 131 36 -1697 39 1470 -864 -1720 373 -645 -59 1502 646
2859 646 -1544 -1122 389 468 794 1168 -1434 -979 552 372 928 154 -112 -1311 1258 812 137 -805
2877 -805 -723 -1818 179 809 897 -1147 -308 -304 340 1213 606 -1266 -1285 151 483 733 732 -950 -1207 1260
2897 1260 1273 561 -157 -139 -422 76 868 675 -660 -1013 -173 466 924 760 -767 -369 80 -343 429 304
2917 304 -1324 -1766 76 502 -751 -1 -1287 -691 403 1786 729 -772 735 348 463 1260 -124
2934 -124 -1101 -803 642 105 638 651 -1023 -997 874 70 -525 -299 -1525 -1730 581 1114 -354 244 -1111
$$ packed form
2810B445k885k76J326L25k065K007J064l510J338J275l200K248J352k302j27K426
2826A441j830j08J883r74k024K188O84k302J945k77k247K269R82j762N74Q05k220
2843i73j181M305j595j752J327r5j733J736J431k334q56K093j018N86J561q56
2859F46k190M22J511P9L26L74k602M55J531j80N56p74k66j199K569m46o75r42
2877h05Q2j095J997O30Q8k044Q39MO44Q73o07j872j9J436L32K50jj682k57K467
2897A260J3p12p18J8k83M98P92j93j335l53Q40O39M58j64j527L98M49m23P72j25
2917C04j628m42J842M26j253P50j286N96J094J383j057j501J507l87J15P97j384
2934a24r77K98J445n37N33J3j674K6J871q04n95K26j226k05K311N33j468N98j355
$$ plain form
2953 -1111 -1156 157 623 133 -1051 166 -446 267 1441 56 -686 -873 454 32 1375 1100 -1787
2970 -1787 -1552 533 55 -35 712 -140 -1117 258 2006 19 327 -10 -808 1083 1155 561 -803 -51
2988 -51 -876 760 2426 486 -549 -643 980 -1217 476 424 346 -1071 984 722 -288 575 211 -810
3006 -810 -725 380 520 -92 -84 -472 -21 -78 246 -257 -655 -831 40 92 -7 -190 -152 -622 -315 356 938 111
3028 111 -1287 -321 -237 609 189 -168 -859 -221 -546 -235 305 -377 -15 -281 -109 -22 69 -499 -275 73 -98
3049 -98 292 52 324 -1035 -138 306 167 -166 -15 -760 -892 351 -331 207 -150 -458 -382 581 135 -1192
3069 -1192 -133 -481 -744 518 260 -737 -263 309 -112 279 780 -755 -100 122 261 -442 432 -65 -638
3088 -638 723 554 -512 -249 828 -965 -331 762 -683 -787 566 -324 -424 660 -428 -813 443
$$ packed form
2953a111m5J313M66m90j184J217o12P13J174j385p42j87J327m22J343k75k887
2970a787K35K085m78r0P47q52r77J375J748j987L08l37p98J891P2n94j364P52
2988e1q25J636J666j940j035r4J623k197J693n2p8j417K055k62j010Q63l64j021
3006h10Q5J105J40o12Ql88M51n7L24n03l98j76Q71N2r9j83L8m70L07O71N82q27
3028A11j398R66Q4Q46m20l57o91O38l25L11N40o82L62k66J72Q7R1n68K24L48j71
3049i8L90k40K72j359Q97M44j39l33J51p45j32J243o82N38l57l08P6R63m46j327
3069a192J059l48k63J262k58r97M74N72m21L91N01j535O55K22J39p03Q74m97n73
3088f38J361j69j066K63J077j793O34J093j445j04J353q90j00J084j088l85J256
$$ plain form
3105 443 9 -829 904 571 -514 -48 147 -285 -791 219 -943 -622 1371 -781 -1108 480 -30 -839
3123 -839 638 527 -605 -26 356 -1143 -410 1155 151 72 1518 -577 -928 943 -136 -1543 1155
3140 1155 -165 -1309 859 541 -1144 430 1211 -1004 -10 540 -329 -1104 1651 137 -1254 622
3156 622 854 -1291 851 312 -1826 603 1419 -1712 29 1430 -757 -143 1204 -582 -540 1238 -13
3173 -13 -293 873 -226 -756 948 974 -989 170 545 -1375 -412 607 -1286 -708 763 -1064 -75
3190 -75 944 -386 -927 956 551 -1000 329 -101 -325 66 814 -363 425 905 -1394 -326 1084
3207 1084 -1277 -573 654 -362 -1393 1305 195 -1157 654 580 -1311 -379 814 -720 643 1008
3223 1008 -732 -620 1130 -1202 -1412 677 72 -1186 417 475 -1573 859 332 -967 -242 487 -1108
$$ packed form
3105D43m34q38J733l33j085M66J95m32n06J010j162L21J993k152l27J588n10q09
3123h39J477j11j132N79L82j499P33J565j004p9J446k095l51J871j079j407K698
3140A155j320j144K168l18j685J574P81k215R94N50q69p75K755j514j391J876
3156F22K32k145K142n39k138K429Q16l131J741J401k187O14J347j786M2J778j251
3173a3k80J166j099n30J704K6j963J159L75j920R63J019j893N78J471j827R89
3190g5J019j330n41J883m05j551J329m30k24L91P48j177P88M80k299J068J410
3207A084k361P04J227j016j031K698j110j352J811p4j891R32J193j534J363L65
3223A008j740J12J750k332k10K089o05j258J603N8k048K432n27j299P25P29j595
$$ plain form
3240 -1108 -701 373 54 -593 988 165 -1156 1556 239 -1462 385 -383 -685 1166 1443 -894 -277
3257 -277 868 -592 -343 589 186 -379 1017 -275 -548 1577 240 -1099 333 602 -746 96 1207
3274 1207 -1000 592 1336 -346 -523 968 -463 -504 234 456 -359 1718 52 -782 856 254 -1705
3291 -1705 602 1413 -41 -55 1463 -626 -962 1158 -250 -752 998 -464 -1005 703 445 -1291 243
3308 243 1105 -542 -597 514 -741 -801 733 -294 -830 658 -314 -1090 870 -147 -1146 688 -16 -1608
3326 -1608 948 669 -1014 -154 1230 -573 317 893 -751 -268 547 -915 -292 368 -140 -796 -514 654
3344 654 -1359 192 699 -1430 50 1672 -617 0 861 -254 -348 623 -282 -591 591 -169 -592 885
3362 885 1157 -680 22 372 -479 618 830 157 100 325 -649 309 945 108 -1080 24 -31 -492 838
$$ packed form
3240a108M07J074l19o47J581q23j321K712j317j701J847p68l02J851K77k337O17
3257b77J145j460K49R32m03n65J396j292k73K125j337j339J432K69j348Q42J111
3274A207k207J592P44j682j77J491j431m1P38K22q15K077j666q34J638o02j959
3291a705K307Q11j454j4J518k089l36K120j408n02J750j462n41J708k58j736J534
3308B43Q62j647n5J111j255o0J534j027n36J488r72p76J960j017r99J834p04j592
3326a608K556k79j683Q60J384j803Q90N76j644M83Q15j462O23O60n08o56K82J168
3344F54k013J551N07k129J480J622k289O17Q61j115r4R71r05l09J182p60m23J477
3362H85K72j837P02L50q51J097K12o73n7K25r74R58O36q37j188J104n5m61J330
$$ plain form
3381 838 787 -91 354 -489 -380 552 98 488 -1476 87 354 -755 -478 -153 -1212 330 556 -32 -134
3400 -134 287 -585 -412 305 12 -451 629 66 -341 644 -267 -701 -678 214 -635 -11 637 -835 -834 493
3420 493 26 96 -158 244 -834 298 192 479 -604 -120 -358 198 217 -15 259 92 -1200 68 -409
3439 -409 -135 427 -1030 254 -243 429 -158 690 -5 -163 202 147 -145 433 679 24 146 -807 701
3458 701 -822 -20 -98 -163 455 139 190 124 -352 -9 -173 121 -1224 199 -303 10 -487 -438 288 428 634
3479 634 -157 -50 -81 -134 -965 160 451 -846 -696 100 -478 206 -239 102 -504 462 -278 -88 65 73 -688
3500 -688 295 217 -427 472 392 -618 -129 31 -185 36 446 -179 -620 136 247 173 -23 631 -51 -442 903
3521 903 350 -1039 -23 467 -170 462 664 -771 -1048 216 336 -176 757 -804 -222 844 309 -155
$$ packed form
3381H38n1q78M45q43J09R32m54L90j964J563K67j109K77L25j059J542K26n88j02
3400a34M21q72J73P17k93m63J080n63m07R85r11m34K3Q92q49O24O48j472JJ327
3420D93m67P0k54M02j078J132j06K87j083M84k38N56J9k32K74j67j292J268m77
3439d09K74N62j457J284m97O72n87Q48o95j58L65n5k92N78K46o55J22r53J508
3458G01j523Q02p8o5O18l16N1o6m76L43j64K94j345J423n02L13m97M9P26J40K06
3479F34p91J07l1n3q31J125K91j297J50P96n78O84m45L41o06R66p40J90J53Qp61
3500f88R83p8o44Q99q0j010M89J60k16K21M10o25m41P56J11p4j96O54o82l91J345
3521I03n53j389J016M90o37O32K02j435k77J264J20n12R33j561N82J066n35m64
$$ plain form
3539 -155 -559 -596 -217 318 757 -552 -1263 248 663 1098 833 -354 -1037 806 975 -41 -107 -1257 -749
3558 -749 -692 232 288 328 448 -634 -859 966 534 -357 152 -488 -985 1153 433 -385 169 -548 70 727
3578 727 -9 -752 83 -1052 480 -90 942 522 -490 -425 265 235 1003 -132 -805 426 -1057 132
3596 132 -423 -257 -419 -126 915 1329 611 -314 -49 -387 620 1231 -114 411 -576 -116 -53 606 671 -819
3616 -819 -968 432 911 1131 -42 198 796 -483 250 807 -274 201 218 167 -804 786 891 -1026 -11
3635 -11 -124 -622 303 621 -487 823 551 505 -919 262 37 -541 846 14 -164 124 55 -509 707
3654 707 1260 -436 103 941 -432 125 533 -282 -242 985 343 -934 169 267 -420 279 57 -1298 944
3673 944 843 -139 40 54 -1557 -112 1566 -386 -89 1476 -165 -1198 -162 346 -134 83 451 -872
$$ packed form
3539a55m04l7L79N35M39j309p11J511M15M35k65j187o83J843J69j016o6j150N08
3558g49N7R24N6M0J20j082k25J825m32q91N09o40m97K138p20q18N54p17O18O57
3578G27p36p43Q35j135J532n70J032m20j012O5O90l0P68j135o73J231j483J189
3596A32n55J66j62K93J041M14p18r25K65l38J007O11j345N25r87M60O3O59O5j490
3616h19j49J400M79K20j173K40N98j279P33N57j081M75J7n1r71J590J05j917J015
3635a1j13m98R25L18j108J310k72m6j424J181k25n78J387q32j78K88o9n64J216
3654G07N53j696N39Q38j373N57M08q15M0J227o42j277J103R8o87O99k22j355K242
3673I44j01r82J79J4j611J445J678j952K97J565j641j033J036N08m80K17L68j323
$$ plain form
3691 -872 694 581 -1094 -148 229 -146 -351 1187 44 -377 860 697 -1087 682 -115 -643 241 364
3709 364 -575 112 619 -660 -542 -94 -871 -317 992 -965 -1607 655 907 -742 -94 180 -819 155
3727 155 580 -957 403 795 -883 -269 863 -403 57 39 -627 -1176 777 494 -1320 580 239 -640
3745 -640 -516 -308 -1542 -149 974 -914 -751 324 -452 -852 722 1084 198 512 250 182 191 305 -1265
3764 -1265 315 149 -735 177 512 -1101 -930 1165 569 -731 -230 115 235 1094 626 -1105 514 799
3782 799 -690 50 476 -652 272 849 -393 138 446 -986 -620 644 9 -1163 869 727 -1377
3799 -1377 -381 738 -1157 -1312 98 -414 721 578 -1256 -288 522 104 -215 498 86 -396 919 412
3817 412 -634 626 -279 -92 -420 918 -576 -332 1034 173 470 1015 -639 -665 537 -192 -611 1442
$$ packed form
3691h72J566j13j675R46L77l75k05J538j143m21J237j63j784J769p97n28Q84J23
3709C64r39O87N07j279J18M48p77N54J309j957o42K262K52j649O48K74r99R74
3727A55M25j537J360L92j678O14J132j266M60j8o66n49J953k83j814J900l41q79
3745f40J24K08j234J393J123j888J63J075p76m00J574L62q86L14k62o8RJ14j570
3764a265J580j66q84R12L35j613J71K095n96j300N01L45J20Q59m68j731J619K85
3782G99j489P40M26j128R24N77j242N31L08j432L66J264o35j172K032j42k104
3799a377R96J119j895j55J410n12J135j43j834R68Q10m18l19P13m12m82J315n07
3817D12j046J260r05J87l28J338j494K44J366q61K97N45j654k6J202p29m19K053
$$ plain form
3835 1442 783 -1458 -725 759 -1217 301 991 -1783 -371 1418 -516 -1026 1018 -361 -24 334
3851 334 1305 -1239 -501 1039 -1254 -576 726 -60 -80 471 -715 -466 765 396 -622 796 66 -79
3869 -79 -153 1158 -1000 -543 1207 -995 19 -99 -697 -788 751 276 -282 1304 -475 -937 426 927
3887 927 -1055 -111 501 -416 -246 644 212 -679 20 -73 -1200 611 378 -1800 -290 -661 -798 261
3905 261 991 32 -526 1068 395 -171 482 363 -157 627 738 125 602 312 -502 353 172 -248 -150 -366
3925 -366 -224 139 -130 803 -237 -95 598 422 -13 646 -71 -949 -881 319 244 -738 311 -575 -466 -1373
3945 -1373 900 151 -236 -20 -1054 443 1481 -155 -818 -58 738 -461 -169 -307 -1365 -141 903
3962 903 724 899 449 -600 -553 977 264 -1317 552 -780 335 242 1007 -19 -836 -376 -512 -91
$$ packed form
3835A442o59k241P33J484j976J518O90k774J412J789j934n10K044j379L37L58
3851C34R71k544P38J540k293O78J302p86k0N51j186K49J231l69j018J418p30j45
3869g9p4J311k158M57J750k202J014j18n98r1J539m75n58J586j779m62J363N01
3887I27j982R44O12r17J70Q90m32q91O99r3j127J811k33k178J510l71j37J059
3905B61P30r59n58J594o73n66O53j19n20P84J11o13M77k90q14Q55j81m20R8k16
3925c66J42L63k69R33j040J42O93j76m35O59p17q78O8J200p5r82J049q86J09r07
3945a373K273p49l87K16j034J497J038j636o63P60P96j199K92j38j058J224J044
3962I03j79J75m50j049M7J530p13j581J869j332J115r3P65j026q17M60j36M21
$$ plain form
3980 -91 1238 -18 -964 -31 933 -68 912 369 -934 567 1509 -634 -337 1409 -623 -561 1163 277
3998 277 -1645 341 103 -300 -168 886 -1001 -469 952 -113 253 314 664 -1515 765 603 -461
4015 -461 -626 -399 -995 -253 1536 -1060 -591 223 -76 -755 881 284 -1538 931 -258 -431 -44 1114
4033 1114 -1475 -252 801 -238 -320 1447 -693 -1346 -57 856 -1071 -497 486 -1502 -968 1216 -591
4050 -591 -1332 644 -389 -188 229 399 -1012 -215 552 -3 786 1111 -1035 -251 490 354 -281 727
4068 727 64 -1424 261 1368 -489 306 544 -1670 -453 675 317 -735 -329 -442 -751 1664 -303
4085 -303 -922 -815 -307 -166 181 348 -606 -1604 35 374 -1134 498 433 -1111 -829 391 -234 -713 -185
4104 -185 56 -447 903 1056 -297 151 -97 -1329 526 460 -94 -681 -343 72 -313 251 568 -496 -641
$$ packed form
3980i1J329j256r46R33R64j001R80n43j303J501R42k143K97J746k032O2J724q86
3998B77j922J986k38m03J32J054j887N32J421j065L66O1L50k179K280j62j064
4015d61j65K27n96P42J789k596M69Q14k99o79J636n97j822K469j189j73L87J158
4033A114k589J223J053j039q2J767k140o53J289R13j927N74R83j988N34K184j807
4050e91p41J976j033K01M17J70j411P97P67n55P89L25k146P84P41j36o35J008
4068G27o63j488J685J107j857P95K38k214J217J128l58j052M06j13l09K415j967
4085c03o19J07N08J41L47J67r54r98J639L39j508J632o5j544K82J220o25m79N28
4104a85K41n03J350J53j353M48k48j232J855o6n54n87L38M15l85N64L17j064j45
$$ plain form
4123 -641 622 -201 -214 1028 -697 -890 568 256 -192 396 -817 -1494 819 -46 -347 -225 -90 -940
4141 -940 -69 1275 610 -517 141 -393 -324 1013 518 -639 -570 981 -678 -337 497 -79 -827 110 -23
4160 -23 -380 1031 899 -853 207 896 397 218 1155 -1093 -334 836 56 -611 865 -276 -1690 734
4178 734 769 -319 244 409 -930 -252 1124 -581 -384 139 16 -313 1160 484 -539 299 578 -785
4196 -785 95 837 -1056 100 582 -316 -774 235 -344 -801 1054 -220 -1004 21 153 -540 454 969
4214 969 36 -252 567 -288 -909 508 -629 -433 591 93 -284 21 -220 -731 -320 -152 -593 779 163
4233 163 -366 -650 404 13 -574 884 -687 -795 775 -297 -836 -140 -265 -261 507 -362 -105 100 767
4252 767 -99 717 285 -186 74 228 -670 -1100 615 -370 -332 395 18 -584 497 -31 -925 -350 459 -1437
$$ packed form
4123f41J263q23j3J242j725j93J458l12m48N88j213o77K313q65l01J22J35q50
4141i40Q71J344o65j127O58n34O9J337m95j157O9J551j659L41Q34n76p48R37j33
4160b3l57J411j32j752J060O89m99j79R37k248P59J170p80o67J476j141j414K424
4178G34L5j088N63J65j339O78J376j705J97N23j23l29J473o76j023Q38K79j363
4196g85Q80P42j893J156M82q98m58J009n79m57J855j274p84J025J32o93R94N15
4214I69r33k88Q19q55o21J417j137J96J024m98l77L05k41n11M11J68m41J372o16
4233A63n29k84J054l91n87J458j571j08J570j072n39O96j25MP68q69K57K05O67
4252G67q66Q16m32m71K60J54q98m30J715r85L8P27l77o02J081n28q94N75Q09j896
$$ plain form
4272 -1437 -232 1064 174 713 835 -1398 -593 691 -456 -656 229 -621 -959 -641 368 221 600 398
4290 398 -1110 -479 585 -766 -1205 591 -592 364 161 -115 -47 421 -230 -1105 493 -202 239 -379
4308 -379 -111 -186 -204 237 49 -266 281 44 -1355 749 132 -351 628 -548 -796 254 991 -712 -409
4327 -409 756 -378 210 740 -853 -60 222 70 128 709 117 -739 806 628 -367 275 692 -107 -328
4346 -328 553 184 -303 246 163 -381 24 -610 35 266 -49 -875 410 725 -674 -981 1132 168 709
4365 709 393 -406 -713 372 231 -658 -317 59 -238 -349 520 -992 25 431 -247 -441 210 -227 -949
4384 -949 201 1233 86 -677 98 -436 -46 248 -532 -722 807 150 -461 1661 237 -417 409 -42
4402 -42 -143 -74 563 -234 -589 240 37 -456 -275 -1019 -59 -149 379 -208 412 165 507 -530 -1 397 57
$$ packed form
4272a437J205J296q90N39J22k233Q05J284j147k00Q85q50l38L18J009j47L79k02
4290C98j508O31J064j351m39J796j183R56k03k76O8M68o51q75J598o95M41o18
4308c79K68p5j8M41j88l15N47k37j399K104o17m83R79j176k48J050P37j703L03
4327d09J165j134N88N30j593P93K82j52N8N81n92q56J545j78r95O42M17p99k21
4346c28Q81l69m87N49q3n44M05o34O45K31l15q26J285L15j399l07K113r64N41
4365G09l16p99l07J085j41q89L41L76k97j11Q69j512J017M06o78j94O51m37p22
4384i49J150J032j147p63P75n34L90K94p80j90J529o57o11K122j424o54Q26m51
4402d2j01O9O37p97l55Q29k03m93J81p44R60r0N28n87O20k47L42j037N29L98l40
$$ plain form
4423 57 333 -420 -248 -74 -359 291 -74 -443 -200 425 -306 468 317 231 827 -695 65 281 237 -243 770
4444 770 66 -1345 771 -583 -348 -37 1499 -513 -443 -668 60 -640 -79 923 -410 339 -8 -649
4462 -649 307 890 -966 -308 281 -293 -187 1051 69 -376 1121 532 -1121 137 117 -1095 -398 739
4480 739 576 -96 321 -377 -816 990 843 -1325 488 38 -710 -816 822 43 -882 844 347 -444
4498 -444 531 267 -1073 -22 680 -1339 -473 1084 -512 221 824 216 -682 1046 -157 -1322 378
4515 378 86 -847 -209 297 -296 -1195 1016 -1039 -886 960 -538 -1267 226 98 -1339 1042 887 -659
4533 -659 -277 1242 -714 -867 1742 259 -1102 442 385 -1259 1633 -134 -1493 350 841 -853
4549 -853 -121 399 -256 -580 1282 171 -762 -79 46 -1495 235 1329 -1198 -283 67 -102 -164 1230
$$ packed form
4423E7K76p53J72J74k85O50l65l69K43O25p31P74j51q6N96j522P60K16m4m80J013
4444G70p04j411K116j354K35L11J536k012P0k25P28p00N61J002j333P49l47o41
4462f49R56N83j856O58N89n74J06J238r82m45J497n89j653J258k0j212O97J137
4480G39j63o72M17o98m39J806j47k168J813m50p48j06J638p79r25J726m97p91
4498d44R75k64j340J051P02k019Q66J557j596P33O03o08q98J728j203j165J700
4515C78k92r33O38N06n93q99K211k055J53J846j498p29J493j28j437K381j55j546
4533f59L82J519j956j53K609j483j361J544n7j644K892j767j359J843M91j694
4549h53P32N20o55l24J862j111r33O83J25j541J730J094k527R15L50j69o2J394
$$ plain form
4567 1230 -329 -1479 2 750 -270 645 1070 -593 -37 1028 -197 -1058 710 -535 -741 741
4583 741 403 -1405 126 469 -259 -359 808 78 -987 630 -711 -523 1137 -76 -51 -360 1357
4600 1357 -309 -634 563 -781 -737 663 -22 -1069 37 404 -970 858 1590 -1067 -395 242 -452
$$ packed form
4567A230j559j150J481P48j020R15M25j663N56J065j225q61J768j245k06J482
4583G41l38j808J531L43p28j00J167p30j065J617j341J88J660j213K5l09J717
4600A357j666l25J197j344M4J400o85j047J106L67j374J828P32k657O72O37o94
$$ [...]
8191f6
##END NTUPLES=NMR FID
##END=
