##TITLE=1H_4-2021
 CDCl3, 8 sc, 
 1.02.2021
##JCAMPDX= 6.0         $$ Bruker NMR JCAMP-DX V2.0
##DATA TYPE= NMR FID
##DATA CLASS= NTUPLES
##ORIGIN= UXNMR, Bruker Analytische Messtechnik GmbH
##OWNER= root
$$ XWIN-NMR		Version 3.5
$$ Mon Feb  1 10:48:40 2021 Russian Standard Time (UT+4h)  she@DPX200
##.OBSERVE FREQUENCY= 200.1315066352
##.OBSERVE NUCLEUS= ^1H
##.DELAY= (6, 6)
##.ACQUISITION MODE= SIMULTANEOUS
##.ACQUISITION SCHEME= undefined
##.AVERAGES= 8
##.DIGITISER RES= 18
##SPECTROMETER/DATA SYSTEM= spect
##.PULSE SEQUENCE= zg30
##.SOLVENT NAME= CDCl3
##.SHIFT REFERENCE= (INTERNAL, CDCl3, 0, 15.7039)
##AUDIT TRAIL= $$ (NUMBER, WHEN, WHO, WHERE, WHAT)
$$ ##TITLE= Audit trail, XWIN-NMR		Version 3.5
$$ ##JCAMPDX= 5.01
$$ ##ORIGIN= Bruker BioSpin GmbH
$$ ##OWNER= she
$$ F:/spectra/data/she/nmr/H-F/1/audita.txt
$$ ##AUDIT TRAIL=  $$ (NUMBER, WHEN, WHO, WHERE, WHAT)
(   1,<2021-02-01 10:47:27.21 +0400>,<she>,<DPX200>,
      <created by zg, POWCHK disabled, PULCHK disabled
       configuration hash MD5:
       00 E9 B6 7A A2 85 ED C7 34 08 36 98 17 FE 4E 26
       data hash MD5: 16K
       08 C8 45 07 95 10 94 44 98 97 A4 6D E1 C5 E8 89>)
$$ ##END=
$$ 
$$ hash MD5
$$ A6 40 FA 4D 78 69 34 46 A2 1E 0A 1B 78 48 5D FF
##$RELAX= 
##$RELAX= 
##$RELAX= 
##$RELAX= 
##$RELAX= 
##$RELAX= 
$$ Bruker specific parameters
$$ --------------------------
##$DU= <F:/spectra>
##$EXPNO= 1
##$NAME= <H-F>
##$PROCNO= 1
##$TYPE= <nmr>
##$USER= <she>
##$AMP= (0..31)
100 100 100 100 100 100 100 100 100 100 100 100 100 100 100 100 100 100 
100 100 100 100 100 100 100 100 100 100 100 100 100 100 
##$AQSEQ= 0
##$AQ_mod= 1
##$AUNM= <au_zg>
##$AUTOPOS= <>
##$BF1= 200.13
##$BF2= 200.13
##$BF3= 200.13
##$BF4= 200.13
##$BF5= 200.13
##$BF6= 200.13
##$BF7= 200.13
##$BF8= 200.13
##$BYTORDA= 1
##$CFDGTYP= 0
##$CFRGTYP= 5
##$CHEMSTR= <none>
##$CNST= (0..31)
1 1 145 1 1 1 1 1 1 1 1 1 1 1 1 1 1 1 1 1 1 1 1 1 1 1 1 1 1 1 1 1 
##$CPDPRG= <>
##$CPDPRG1= <>
##$CPDPRG2= <>
##$CPDPRG3= <>
##$CPDPRG4= <mlev>
##$CPDPRG5= <mlev>
##$CPDPRG6= <mlev>
##$CPDPRG7= <mlev>
##$CPDPRG8= <mlev>
##$CPDPRGB= <>
##$CPDPRGT= <>
##$D= (0..31)
0 1.2 0 0 0 0 0 0 0 0.06 0 0.03 0 0 0 0 0.0002 0 0 0 0 0 0 0 0 0 0 0 0 
0 0 0 
##$DATE= 1612162046
##$DBL= (0..7)
120 120 120 120 120 120 120 120 
##$DBP= (0..7)
150 150 150 150 150 150 150 150 
##$DBP07= 0
##$DBPNAM0= <>
##$DBPNAM1= <>
##$DBPNAM2= <>
##$DBPNAM3= <>
##$DBPNAM4= <>
##$DBPNAM5= <>
##$DBPNAM6= <>
##$DBPNAM7= <>
##$DBPOAL= (0..7)
0.5 0.5 0.5 0.5 0.5 0.5 0.5 0.5 
##$DBPOFFS= (0..7)
0 0 0 0 0 0 0 0 
##$DE= 6
##$DECBNUC= <off>
##$DECIM= 32
##$DECNUC= <off>
##$DECSTAT= 4
##$DIGMOD= 1
##$DIGTYP= 9
##$DL= (0..7)
0 120 120 120 120 120 120 120 
##$DP= (0..7)
150 150 150 150 150 150 150 150 
##$DP07= 0
##$DPNAME0= <>
##$DPNAME1= <>
##$DPNAME2= <>
##$DPNAME3= <>
##$DPNAME4= <>
##$DPNAME5= <>
##$DPNAME6= <>
##$DPNAME7= <>
##$DPOAL= (0..7)
0.5 0.5 0.5 0.5 0.5 0.5 0.5 0.5 
##$DPOFFS= (0..7)
0 0 0 0 0 0 0 0 
##$DQDMODE= 0
##$DR= 18
##$DS= 0
##$DSLIST= <SSSSSSSSSSSSSSS>
$$ [...]
##$SUBNAM2= <"">
##$SUBNAM3= <"">
##$SUBNAM4= <"">
##$SUBNAM5= <"">
##$SUBNAM6= <"">
##$SUBNAM7= <"">
##$SUBNAM8= <"">
##$SUBNAM9= <"">
##$SW= 16.9725356469052
##$SWIBOX= (0..15)
0 0 2 0 0 0 0 0 0 0 0 0 0 0 0 0 
##$SW_h= 3396.73913043478
##$TD= 16384
##$TD0= 1
##$TE= 0
##$TE2= 300
##$TE3= 300
##$TEG= 300
##$TL= (0..7)
0 120 120 120 120 120 120 120 
##$TP= (0..7)
150 150 150 150 150 150 150 150 
##$TP07= 0
##$TPNAME0= <>
##$TPNAME1= <>
##$TPNAME2= <>
##$TPNAME3= <>
##$TPNAME4= <>
##$TPNAME5= <>
##$TPNAME6= <>
##$TPNAME7= <>
##$TPOAL= (0..7)
0.5 0.5 0.5 0.5 0.5 0.5 0.5 0.5 
##$TPOFFS= (0..7)
0 0 0 0 0 0 0 0 
##$TUNHIN= 0
##$TUNHOUT= 0
##$TUNXOUT= 0
##$USERA1= <user>
##$USERA2= <user>
##$USERA3= <user>
##$USERA4= <user>
##$USERA5= <user>
##$V9= 5
##$VALIST= <valist>
##$VCLIST= <CCCCCCCCCCCCCCC>
##$VD= 0
##$VDLIST= <DDDDDDDDDDDDDDD>
##$VPLIST= <PPPPPPPPPPPPPPP>
##$VTLIST= <TTTTTTTTTTTTTTT>
##$WBST= 1024
##$WBSW= 4
##$XGAIN= (0..3)
0 0 0 0 
##$XL= 0
##$YL= 0
##$YMAX_a= 407393
##$YMIN_a= -329558
##$ZGOPTNS= <>
##$ZL1= 120
##$ZL2= 120
##$ZL3= 120
##$ZL4= 120
##$ABSF1= 10
##$ABSF2= 0
##$ABSG= 5
##$ABSL= 3
##$ALPHA= 0
##$AQORDER= 0
##$ASSFAC= 0
##$ASSFACI= 0
##$ASSFACX= 0
##$ASSWID= 0
##$AUNMP= <proc_1d>
##$AZFE= 0.1
##$AZFW= 0.1
##$BCFW= 1
##$BC_mod= 2
##$BYTORDP= 1
##$COROFFS= 0
##$CY= 11.3945322036743
##$DATMOD= 1
##$DC= 2
##$DFILT= <>
##$DTYPP= 0
##$F1P= 15.9154993809931
##$F2P= -4.1035820241983
##$FCOR= 0.5
##$FTSIZE= 0
##$FT_mod= 4
##$GAMMA= 1
##$GB= 0.15
##$INTBC= 1
##$INTSCL= 1
##$ISEN= 128
##$LB= 0.24
##$LEV0= 0
##$LPBIN= 0
##$MAXI= 10000
##$MC2= 0
##$MEAN= 0
##$ME_mod= 0
##$MI= 1.114404
##$NCOEF= 0
##$NC_proc= 0
##$NLEV= 6
##$NOISF1= 3.799351
##$NOISF2= 2.8
##$NSP= 1
##$NTH_PI= 0
##$NZP= 0
##$OFFSET= 15.70392
##$PC= 1
##$PHC0= -10757.35
##$PHC1= 8.80095
##$PH_mod= 1
##$PKNL= yes
##$PPARMOD= 0
##$PSCAL= 0
##$PSIGN= 0
##$REVERSE= no
##$SF= 200.130013532006
##$SI= 16384
##$SIGF1= 3
##$SIGF2= 2
##$SINO= 400
##$SIOLD= 16384
##$SREGLST= <1H.CDCl3>
##$SSB= 0
##$STSI= 0
##$STSR= 0
##$SW_p= 3612.71676300578
##$SYMM= 0
##$S_DEV= 0
##$TDeff= 0
##$TDoff= 0
##$TI= <>
##$TILT= no
##$TM1= 0
##$TM2= 0
##$TOPLEV= 0
##$USERP1= <user>
##$USERP2= <user>
##$USERP3= <user>
##$USERP4= <user>
##$USERP5= <user>
##$WDW= 1
##$XDIM= 8192
##$YMAX_p= 0
##$YMIN_p= 0
$$ End of Bruker specific parameters
$$ ---------------------------------
##NTUPLES= NMR FID
##VAR_NAME=  TIME,          FID/REAL,        FID/IMAG
##SYMBOL=    X,             R,               I
##VAR_TYPE=  INDEPENDENT,   DEPENDENT,       DEPENDENT
##VAR_FORM=  AFFN,          ASDF,            ASDF
##VAR_DIM=   8192,          8192,            8192
##UNITS=     SECONDS,       ARBITRARY UNITS, ARBITRARY UNITS
##FACTOR=    0.0002944,     1,               1
##FIRST=     0,             0,               0
##LAST=      2.4114304,     0,               0
##MIN=       0,             -329558,         0
##MAX=       2.4114304,     407393,          0
$$ Real data points
##PAGE= N=1
##DATA TABLE= (X++(R..R)), XYDATA
0@%%%%%%%%qJ6j6J6k4L2m0N1n9P2q8J04j27J57j88K21k54K94l42L96m58N23n96
31c18O79p69Q70r81J102j237J385j547J723j913K123k352K601k875L175l501L857
48B022m248M676n147N669o250O897p619Q434r365J0436j1683J3156j4925J7096
62I149j9828K3380k8195L5092m5781O4505j05920L34215o8774n27401P36951n29194
74a21801J51600L07325o12043M45376N5515m65481M92554k74307m8080L23436
84B54094m50414K63468P5198k72651K35062j16744l8390J75346j52528j9620J83961
95A36782k06209J09012M6254j84649K40204j15054j16268K24501j53326K052J63417
106A46716k97194K18082N2314l19997L58129k05008k9725K25854l38198K26519
$$ plain form
0 0 0 0 0 0 0 0 0 0 -8 8 -8 8 -16 16 -24 27 -32 40 -48 56 -71 86 -102 119 -135 159 -183 213 -245 278 -318
31 -318 361 -408 462 -519 583 -654 731 -816 907 -1006 1117 -1235 1366 -1509 1666 -1835 2022
48 2022 -2226 2450 -2697 2972 -3278 3619 -4000 4434 -4931 5505 -6178 6978 -7947 9149
62 9149 -10679 12701 -15494 19598 -26183 38322 -67598 266617 197843 -329558 407393 -121801
74 -121801 29799 337124 -274919 170457 225972 -239509 253045 -21262 -69342 254094
84 254094 -196320 67148 142346 -130305 104757 -11987 -50377 124969 -27559 -47179 136782
95 136782 -69427 39585 85839 -98810 141394 26340 -89928 134573 -18753 -16701 146716
106 146716 -150478 67604 119918 -200079 158050 -46958 -76683 149171 -189027 37492
116C7492N8767k60326K21097p5669o8953J98770k35773J15184Q4998j88979J55486
127D2094q1838L8263L3039r1456N9311K186Q557l1742J7194L354J538Q35j7728
140a6393K0023K9165o2451K9371K8017p0257J26203j34964L8996R6192j71027
151h7125J61717q2212m3273J52675j66325M5076J05210j61526J15610k1601j14334
162i6108K08100j61065J2506J10500j41779J01330k7685m9194Q8393l3737o2411
173e1150Q8176l6954j7690O4659r4872O4492J3418p0780N5827Q218o1639O9899
185C1604m3349l3222J27286j50610P7007K7775j14798J49743j00135q378J05777
196F8700j24252N2332N3878j24149J32336n7033p2221J60026j48213O9698L1650
$$ plain form
116 37492 96259 -164067 57030 -18639 -87592 111178 -124595 -9411 75587 -113392 42094
127 42094 -39744 -1481 31558 -59898 -587 1599 10156 -21586 -4392 -1038 500 1335 -16393
140 -16393 3630 32795 -29656 -285 27732 -42525 83678 -51286 -12290 83902 -87125
151 -87125 74592 -7620 -50893 101782 -64543 -19467 85743 -75783 39827 18226 -96108
162 -96108 111992 -49073 -36567 73933 -67846 33484 5799 -43395 44998 11261 -51150
173 -51150 37026 72 -17618 47041 -47831 16661 30079 -40701 15126 23344 -38295 31604
185 31604 -11745 -44967 82319 -68291 8716 36491 -78307 71436 -28699 -37077 68700
196 68700 -55552 -3220 50658 -73491 58845 1812 -70409 89617 -58596 11102 42752
207D2752j07562J14341n1413l1173P5552n0762r792N8795p9222N8036J1600o9035
219c7883P4064m1323R95K6719k1278o276L5112m0527J257N3655p8750O5172k4401
232F536l5807P0398n5578P427L8263n3761K0350L4645p7873Q2763l6238l8141
244c7016Q7340r0118N3772Q239n3314N2250j7030k8091N1849l0382j8515N9417
256C8401p3092M7122M728m6895N6067l5768l747K6812j6111j5095M2846n1613
268b6345K1207K9149o5066O8014l5833j3766M3644l9833Q487L3678n0244K2418
280d490K6523o8283Q2090m8207j4422O5580p9355N0484L132m1358M4986j4858
292A822l3576O4867m6768n06N0380p9723O9473k1533k9156N5938m5391Q637K4730
$$ plain form
207 42752 -64810 49531 -1882 -33055 42497 -8265 -18057 40738 -38484 19552 31152 -37883
219 -37883 36181 -5142 -4147 22572 1294 -4982 30130 -10397 -9140 44515 -34235 30937 6536
232 6536 -29271 41127 -14451 -7024 31239 -22522 -2172 32473 -45400 37363 1125 -37016
244 -37016 50324 -39794 13978 22217 -31097 21153 4123 -23968 27881 -2501 -21016 38401
256 38401 -34691 12431 17159 -29736 26331 -9437 -13184 13628 -2483 -17578 25268 -26345
268 -26345 -5138 24011 -41055 26959 -8874 -22640 21004 -18829 -10342 23336 -26908 -4490
280 -4490 22033 -46250 35840 -12367 -26789 38791 -40564 9920 13052 -28306 16680 1822
292 1822 -31754 33113 -13655 -14161 36219 -43504 25969 4436 -24720 31218 -14173 -5536 19194
305A9194l1896J2464K6670n6754M9541j4264k7435N6132n5813K5389Q843k9099
317a7028K0457P430k9656K7231n488l0932N8544n3694K1384J6165m1985M1510
329A3938j6550j0320K3681j2746j6561M1211m0669J9315J7100m9011N4332l3973
341a0253M200K1186k6405J0340P598j6701R295J3515l5555L8885k5611k58K4366
354A4602l1425K2697q718l367K910J2449k1003J9188l698j7901L7542l6359K1988
367H905K489j6610J6547k186p563J4379k966k0509L9221l7388J9470P035l0191
380i367L6816k7545L669J1660j0776m996J2907k0803J1838R093l3575L5640k5312
393a0751N347J0795j8382J2955J75q803L36J8631k6140K7822j6971n811L1385
$$ plain form
305 19194 -12702 -238 26432 -30322 19219 4955 -22480 33652 -22161 3228 12071 -17028
317 -17028 3429 10859 -18797 8434 2946 -27986 30558 -23136 -1752 14413 -27572 13938
329 13938 -2612 -12932 10749 -1997 -18558 22653 -18016 1299 18399 -30612 23720 -10253
341 -10253 -6053 15133 -11272 -932 6666 -10035 -740 12775 -22780 16105 -9506 -9764 14602
354 14602 -16823 5874 -2844 -6211 -3301 9148 -11855 7333 3635 -14266 23276 -13083 8905
367 8905 11394 -5216 11331 9145 1582 15961 12995 -7514 31707 -5681 13789 20824 -9367
380 -9367 27449 -96 3573 15233 4457 -539 12368 -8435 3403 12496 -21079 14561 -10751
393 -10751 -5404 5391 -12991 -36 139 -8664 -8328 10303 -15837 11985 -4986 -10797 20588
406B0588l5565K2084l077q390R501l677j3750K4374j4288j4904K9865l7795L2370
419G336j4877j5608K9524k4110P214K334l815K705R839k5266K4694J047j6113
432a5096K5154k4883K1824k145q084O828P150o910j859J1165j9170L0587k6051
445a490O09J8058j9747J3133p781l186Q388P76k1918K7871j4497k186J5757l3818
459b0031L8689j7963o334J3932j0752P585r72q487N745J4101k8555K1628r071
472d85R99J3105k6097J9085k056j510o929J1133q765O529p5j9404L3980k4676
486e166M083M548j0446J3117n076j2669J2855M641k3625K7420k4406J5408P733
499H417l2639L4365j5753M107M716j0903R695Q345j7436R637R805j8383K3767
$$ plain form
406 20588 -14977 7107 4030 -4360 5141 1464 -12286 12088 -2200 -17104 12761 -25034 7336
419 7336 -7541 -23149 6375 -17735 -10521 -8187 -12002 -9297 542 -24724 -30 1017 -15096
432 -15096 10058 -14825 6999 4854 -3230 3598 10748 3838 1979 13144 -6026 24561 -1490
445 -1490 -881 17177 -2570 10563 2782 -404 7984 8760 -13158 14713 216 -1970 13787 -20031
459 -20031 18658 695 -5639 8293 -2459 5126 4154 -4333 1412 15513 -13042 8586 -485
472 -485 514 13619 -12478 6607 4551 3041 -3888 7245 -1520 5009 4934 -14470 19510 -5166
486 -5166 -1083 3465 -6981 6136 1060 -11609 1246 5887 -17738 9682 -14724 684 8417
499 8417 -24222 10143 -5610 -1503 3213 -7690 2005 10350 -7086 2551 12356 -6027 17740
512A7740k6332J5933Q952k0994J2920p038O319l979J365j1692J8752j1023r712
525h789J9033j8049J6306j1029l929J0222J806j2504R459J005j0071K2551l1199
538a5188K4045k26j7471J9033j6469J1653O69r665O21J2967j6740R907k094q895
552g853K2234k7400J5478q77l340M497q028N563o99N047j5100J6951r724R88L856
567A593j0897J4189q001j139k835J0973j2632R679n458n482K0527k5837J8581
580C261m666k759Q181q986L832N864l062p148J5399j7402J5926p804o705J7587
594A1518j9418J1959o508K014L39J65n731M160M221j2145J6402j5816J1217j519
608H58n897R100m083K493l276P386j0493J5465j2142J985R471j7003J7769j2412
$$ plain form
512 17740 -8592 7341 16293 -4701 8219 1181 7500 3521 4886 -6806 11946 923 -8789
525 -8789 10244 -7805 8501 -2528 -6457 3765 5571 -6933 2526 3531 -6540 16011 -15188
538 -15188 8857 8631 -8840 10193 -6276 5377 6046 -3619 -2998 9969 -6771 3136 1042 -7853
552 -7853 14381 -13019 2459 1582 -1758 2739 -5289 274 -425 4622 -10478 6473 -3251 -2263 1593
567 1593 -9304 4885 -3116 -4255 -7090 3883 -8749 930 -4528 -10010 10517 -15320 3261
580 3261 -1405 -4164 4017 -4969 -1137 4727 1665 -5483 9916 -7486 8440 636 -6069 11518
594 11518 -7900 4059 -2449 -435 -96 69 -5662 -1502 2719 -9426 6976 -8840 2377 858
608 858 -5039 4061 -22 2471 -805 6581 -3912 11553 -589 1396 10867 -6136 11633 -779
622g79L598J824l462j372N162n242j233R558j8920K0270j3553K473Q574j4690
636g792J3076o739K199q83M106q446R828n492l059J2896j7474J5324j0015K480
650IL353m253J463k047M555q571J1775j2966R870k111o929J0508r215Q207o223
665b575L565m141P500o718R69O674j2317J5593j4541Q315J346n748L527k474K922
680A897k574N017j1489J4701j0063P58O668j1090J4209j2510M702n69K969m318
694a692J784M45l572R927j5743J3959o649M28K022n355P199m731K977p915J2090
709E174r706M633q00o047J3580j4623Q147k548K183j741J25k144L598L564j3391
724i996J6466j3150Q687j536p785J3313r294L165k529M425m020O311q825M580
$$ plain form
622 -779 2819 4643 1181 -191 4971 -271 -1504 8054 -10866 9404 -4149 -1676 6898 -7792
636 -7792 5284 -1455 744 -139 3967 -4479 5349 -143 -3202 9694 -7780 7544 -2471 9
650 9 3362 -891 572 -1475 3080 -5491 6284 -6682 3188 1077 -5852 4656 -4559 3648 -2575
665 -2575 990 -3151 4349 -2369 -1400 5274 -7043 8550 -5991 2324 3670 -2078 1449 -1025 1897
680 1897 -677 4340 -7149 7552 -2511 -1753 4915 -6175 8034 -4476 226 -343 2626 -1692
694 -1692 92 537 -3035 6892 -8851 5108 -1541 -1113 909 -4446 2753 -1978 999 -6916 5174
709 5174 -4532 101 -699 -6746 6834 -7789 358 -2190 -7 -1748 -1623 -3767 -169 3395 -9996
724 -9996 6470 -6680 2007 471 -7314 5999 -3295 -130 -2659 1766 -2254 4057 -4768 -188
738a88N976j2292J3404j1955R710l095l487M258r07K793o628P779q738J0914q407
753h63N87O062p681P006p604O737l799L700p127N317J682p383R937j3556J3197
768F212o787j209M064l493L473m404L199m419R336j1518O979r85l672Q646j2598
783g176J0945o008K305k324J549J294k801L717q098J1092r004M724k308m08L992
798A491o040N870n935Q291r584O602k113j210O305j0286J0375o871M370k582J940
813F23o77N55R54n258J0726j1724R793o360J332N135p907P279n964N200n297M890
829C300m433L221k50n383Q858r801Q824o995L679o54j381K880m931P441r105Q840
845D110o368L402Q61m646O366n921N185n099N731o088M556k182k398P699j1098
$$ plain form
738 -188 5788 -6504 6900 -5055 4655 1560 -1927 2331 1424 4217 -2411 5368 -3370 7544 -863
753 -863 -276 5786 -1895 5111 -2493 4244 445 4145 -2982 2335 4017 -3366 6571 -6985 6212
768 6212 -575 -1784 2280 -1213 2260 -2144 1055 -3364 5972 -5546 1433 448 -3224 5422 -7176
783 -7176 3769 -2239 66 -2258 -709 585 -2216 1501 -6597 4495 -4509 215 -2093 -2501 1491
798 1491 -4549 1321 -4614 3677 -5907 695 -1418 -2628 3677 -6609 3766 -3105 1265 -1317 623
813 623 -54 501 1455 -3803 6923 -4801 4992 -1368 -36 5099 -2808 4471 -1493 3707 -1590 3300
829 3300 -1133 2088 1838 -3545 5313 -4488 4336 -2659 1020 366 -1015 1865 -3066 4375 -4730 4110
845 4110 -2258 1144 2005 -2641 3725 -2196 2989 -2110 3621 -2467 2089 -93 -2491 5208 -5890
860e890J0773q748M424j73l094L816l279L318n074O532p454P483n200L99M722
875B555p976R364r032P465m266J891p15r35M574p122P361o892O525l823R84Q59
891H17j609L648o554Q193q003P587n984J301M543q001Q877q138N847l139O49j600
907a566K215j27l051N291q191J0504r103M201M15l122O962q552P568m791M711
922C364m552K167J085j918L069o351P792o608M933n559L309K17m288N872q926
937f394J0789r241M019R5k298N186o275M604k028L594n297N865m131L316R07o860
953d149J1375j0645P993n300J11M622n766M150m342M658m715L445m492M274j133
968H6k734M739o160R041r051O435k832Q77L061p118R181p181N540l866Q41J655
$$ plain form
860 -5890 4883 -3865 559 386 -2708 1108 -2171 1147 -3927 2605 -4849 2634 -2566 -2167 2555
875 2555 -5421 3943 -5089 2376 -1890 1 -714 -1649 2925 -4197 3164 -3728 2797 -1026 -42 817
891 817 -792 2856 -3698 4495 -3508 4079 -1905 -604 3939 -4062 4815 -3323 2524 -615 34 -1566
907 -1566 649 522 -2529 2762 -5429 5075 -4028 173 588 -2534 4428 -4124 3444 -1347 3364
922 3364 -1188 979 2064 146 3215 -3136 4656 -1952 2981 -2578 731 948 -3340 2532 -6394
937 -6394 4395 -4846 -827 -732 -3030 2156 -4119 485 -1543 2051 -3246 2619 -1512 1804 2711 -4149
953 -4149 7226 -3419 4574 -726 -615 4007 -1759 2391 -1951 2707 -2008 1437 -3055 1219 86
968 86 -2648 2091 -4069 4972 -4079 2356 -476 401 3462 -3656 5525 -1656 3884 18 859 2514
984B514j085n94j183L961o312P471r711Q200k746m215Q055j0047J0261p772K811
999c92N35j152J470j908J946k391M608o910P385n744L113J45m692Q358r353Q383
1015C401p061L777N83m190N422n573M889l602K181k467M253m122K094J031m472
1030c856R108j1821J0404n884R36L996p507Q011n946L366k021K039j974K528k479
1045a100M78L299o451Q514q892P271l631n69M907p800Q711p782N071k378K3J505
1061A176j655J246j711K490m539O482p828O905l564k012P115j0145J0573p977
1075c444L262O57k982L715l008J904j611K798n000O093n830M074l05m642Q156
1090C837r514Q915o942K873J644m431N478n604M777l068J860j842K851k199J159
$$ plain form
984 2514 1429 835 -348 3613 -2699 4772 -4939 3261 515 -3700 4355 -5692 4569 -3203 -392
999 -392 143 -1009 461 -1447 499 -1892 2716 -4194 3191 -2553 560 705 -3987 4371 -4982 3401
1015 3401 -3660 117 700 -3490 1932 -3641 1248 -2354 -173 -2640 1613 -2509 -415 616 -3856
1030 -3856 5252 -6569 3835 -2049 -1113 2883 -4624 3387 -2559 807 -1214 825 -1149 1379 -1100
1045 -1100 -622 2677 -3774 4740 -4152 3119 -512 -1081 3826 -3974 4737 -3045 2026 -352 -329 1176
1061 1176 -479 767 -944 1546 -2993 3489 -4339 2566 -998 -3010 4105 -6040 4533 -3444
1075 -3444 -182 475 -2507 1208 -1800 104 -1507 1291 -3709 2384 -3446 628 323 -4319 3837
1090 3837 -5677 3238 -3704 -831 813 -3618 1860 -3744 1033 -2035 -175 -2017 834 -1365 -206
1105b06M34l144P607r912R415o159J905K992p052Q597o773M354k054J69M80R39
1121A592j606L73K503n010P201q666P710l504j622M934o825Q173p403M316j664
1136E02K8J308k405K152k029K913m917N481n083M574l019j532O067q614R031q131
1152c674M893k23l475M406m112L659k963J554k869M874m507K591k09k933O871
1167C883r621Q522n240K118J024m413O083m937L987m034L262k021J883j734M21
1182h17K446m388N624o926P397m868Q45K470m670P302p565N159k030P36J1p54
1198b8J149p10J652m427O584o462N676l492o17N076p388P167o380M543j439q86
1214A8J117j116J855l042L492m149M974m879K938n68k007M747p347P564n819L456
$$ plain form
1105 -206 228 -2916 4691 -5221 4194 -1965 -60 2932 -4120 4477 -2296 2058 4 173 653 1592
1121 1592 -14 359 2862 -2148 5053 -3613 4097 593 -1029 3905 -2920 5253 -2150 2166 502
1136 502 530 1838 -567 1585 -444 2469 -2448 3033 -2050 2524 -495 -2027 4040 -4574 4457 -3674
1152 -3674 1219 996 -2479 1927 -2185 1474 -1489 65 -2804 2070 -2437 154 -55 -2988 3883
1167 3883 -5738 2784 -2456 -338 686 -3727 2356 -2581 1406 -2628 634 -1387 496 -1238 -817
1182 -817 1629 -2759 2865 -4061 3336 -1532 -687 1783 -2887 4415 -3150 2009 -21 715 726 -28
1198 -28 1121 411 2063 -2364 4220 -2242 3434 -58 -675 4401 -2987 4180 -2200 2343 904 18
1214 18 1135 19 1874 -1168 2324 -1825 3149 -1730 1208 640 -1367 3380 -3967 3597 -2222 1234
1230A234j068j829L784m015L547l211L088k849K539k634J806P06l860O254p127
1245c635P127n185J725J331l306M711m926L946k708K400k138J670n91q54K543
1260B110m575O108o089N250l224M3K664m131N452n600M571k913J290J01r86J434
1276A505j981L089m617N383n314M228j941j353M248o206O424n546L541j179q96
1291f15J416k178K678k938L173m251M590l973J859M37l190N703o795N814m315
1306b585K654m12j813L136l419L790l968L550k631K554j867N4K044l465M985o344
1322c737O075l902J357J043l407N137n241L989l034K578j761P49K21p26L049n346
1338b956O106n080M227k397l72L289m372M776m678M199k465O14j55n55K123k882
$$ plain form
1230 1234 166 -1663 2121 -1894 1653 -1558 1530 -1319 1220 -1414 392 1098 -2762 3492 -3635
1245 -3635 3492 -1693 32 1363 -1943 2768 -2158 1788 -920 1480 -658 1012 421 -433 2110
1260 2110 -2465 3643 -2446 2804 -420 -377 2287 -1844 3608 -1992 2579 -334 956 1057 71 1505
1276 1505 -476 2613 -2004 3379 -1935 2293 352 -1001 3247 -2959 3465 -2081 1460 281 -615
1291 -615 801 -1377 1301 -1637 1536 -2715 1875 -2098 -239 198 -2992 2711 -4084 1730 -2585
1306 -2585 69 -343 -2156 980 -2439 1351 -2617 933 -1698 856 -1011 -957 1087 -2378 2607 -3737
1322 -3737 2338 -1564 -207 836 -2571 2566 -2675 1314 -1720 858 -903 -154 67 -659 2390 -2956
1338 -2956 3150 -1930 2297 -100 -472 2817 -1555 3221 -1457 2742 277 891 736 181 2304 -578
1354e78K881l949M536m174K254o08j247L664o023N849m363K961j422r67K578k318
1370i26K015k975L719l600L305l184K019J221l370M367n665O102m172J479J00
1385D35j344K961l974L583k707K861l148J776q20L52J138l730M905m598M380m148
1401b078J579J900l575M205l651L927k771J101r15Q66N42j459J625k650N013n859
1417b200M158j534p07K999m889N078l913K787k102N07O21j183J050k166L452l650
1433a692L282l548K819l25k086L245m581N426m610K770o06m43J414k779K880k538
1449a372K849l248K773j946J204r1k973N176n730N276m258K036Q92k942L306l174
1465b222L366k843J787j882J995q66q21K118k875M402m906M196k244M32J762l689
$$ plain form
1354 -578 2303 -1646 2890 -1284 970 362 -885 2779 -3244 2605 -1758 1203 -219 -1186 1392 -926
1370 -926 1089 -1886 1833 -1767 1538 -1646 373 1594 -1776 2591 -3074 3028 -1144 335 435
1385 435 -909 2052 -1922 1661 -1046 1815 -1333 443 -377 -25 1113 -2617 2288 -2310 2070 -2078
1401 -2078 -499 1401 -2174 2031 -1620 2307 -464 637 -278 588 1130 -329 1296 -1354 3659 -2200
1417 -2200 1958 424 -283 2716 -2173 2905 -1008 1779 -323 184 805 -378 672 -1494 1958 -1692
1433 -1692 1590 -1958 861 536 -1550 1695 -2886 2540 -2070 700 94 -349 1065 -1714 1166 -1372
1449 -1372 1477 -1771 1002 -944 260 169 -2804 2372 -3358 1918 -2340 -304 588 -2354 952 -2222
1465 -2222 1144 -1699 88 -1794 201 -665 -1486 632 -2243 2159 -2747 1449 -795 -363 1399 -2290
1481b290M848m309L414k296J345Lp69O82j304K824l252L760m544L904j837r5K811
1498B895m697M672m218K990n35j352J217r15J237j234K505l494L633l397K330
1513A637J24k042L430m733M624l979L421j434j824L089l196K325k816K406j804
1528g72J791j618N15O94k376M293n329M759l772J727P57k846M018l778K976k175
1544a136J291j052J040m91k60J427l054M614n060M276k540M57K128l547M125l947
1560a729L306k189J226m70k64R61j742K745l169L630m009L096r77j130K823m434
1576b326M986m067K692j328m91J639k062K101k064K248k700L022k742J457J92
1591E57k252M123n297M930l553J814J1j542K234k533K481k278K155k348K001j167
$$ plain form
1481 -2290 2558 -1751 1663 -633 712 715 -54 628 -676 2148 -1104 2656 -1888 2016 179 84 2895
1498 2895 -1802 2870 -1348 1642 1107 -245 972 57 1294 60 2565 -929 2704 -693 1637
1513 1637 1761 -281 3149 -1584 3040 -939 2482 1048 -776 2313 -883 1442 -1374 1032 -772
1528 -772 1019 -599 -84 610 -1766 2527 -2802 1957 -1815 -88 669 -2177 1841 -1937 1039 -1136
1544 -1136 155 -897 143 -348 -608 819 -2235 2379 -2681 1595 -945 -488 1640 -1907 2218 -1729
1560 -1729 1577 -612 614 144 -120 841 -901 1844 -1325 2305 -1704 1392 415 -715 2108 -2326
1576 -2326 2660 -1407 1285 -43 -534 1105 -957 1144 -920 1328 -1372 1650 -1092 365 557
1591 557 -1695 2428 -2869 2061 -1492 322 333 -1209 1025 -1508 973 -1305 850 -1498 503 -664
1607f64j60J431k947M153m786M297k813J174R42k878L560l572L427k444J671q92
1623e01P78n04k35J748l080M097m265L910j830n41K563l780M068l545K660j384
1639A59M32kk31P52j522K723l666L455l112J954l27j468K974l790L982l559K475
1656A229p50p03J297j618K250k428K414k596K840k245Q62O68k585L888m533L999
1672A989l072J073M95j637K379k794K457k602J954j665J493j137k5J488k781L987
1688A602m128L464k034K86J395k475L108k909K851k200J500q46N54M3j215K364
1704A360l083L603l688K924j622o49K533l846M180l763K688j347N39M8o86J321
1720E12j595K470l162L449k777J899k04j861L402m035M264l254J686l29o92J188
$$ plain form
1607 -664 -824 607 -2340 1813 -2973 1324 -1489 -315 627 -2251 1309 -2263 1164 -1280 391 -501
1623 -501 277 -227 -462 1286 -1794 2303 -1962 1948 118 -423 2140 -1640 2428 -1117 1543 159
1639 159 591 589 358 1110 -412 2311 -1355 2100 -1012 942 615 -853 2121 -1669 2313 -1246 1229
1656 1229 479 -224 1073 -545 1705 -723 1691 -905 1935 -310 552 1220 -1365 2523 -2010 1989
1672 1989 -1083 -10 485 -1152 1227 -1567 890 -1712 242 -1423 70 -1067 -1092 396 -2385 1602
1688 1602 -2526 938 -1096 -810 585 -1890 1218 -1691 1160 -1040 460 -386 168 211 -1004 1360
1704 1360 -1723 1880 -1808 1116 -506 -1155 1378 -2468 1712 -2051 637 -710 -171 -123 -809 512
1720 512 -1083 1387 -1775 1674 -1103 796 592 -1269 2133 -1902 2362 -892 794 465 -227 961
1736I61j628J907k324K770k910K568j745K22Q54k338L691m311L459k446J423j33
1752B0j436K375k631K744k178J924j732J450m42o54K053l124L764l825L191j570
1768g1k18J304k407K932k861K189j830J712j372J64M31j139K545l639L633l000
1784a627K142o47j089K673l072L404l158K415q84q4L67q37J829k183K447l432
1800a736L805k567R09Q7j439L372m351L672k855J928n61p50J553j884J691j945
1816a071K433k228J972j575R1J951l203L608l945L525k195N12N94j593K516k707
1832a315K094k047K206k087R91Rq84K204l448L591l209K607j493J37J543k669
1848a770K724k840K754j885J118r69L66R57k059K540l005L632k933J475j49j068
$$ plain form
1736 961 -667 1240 -1084 1686 -1224 1344 -401 -179 675 -1663 2028 -2283 1176 -1270 153 20
1752 20 -1416 959 -1672 1072 -1106 818 -914 536 94 -560 1493 -1631 2133 -1692 1499 -71
1768 -71 -289 1015 -1392 1540 -1321 868 -962 750 -622 -458 -27 -1166 1379 -2260 1373 -1627
1784 -1627 515 -132 -1221 1452 -1620 1784 -1374 1041 157 73 440 -397 1432 -751 1696 -1736
1800 -1736 2069 -498 411 498 -941 2431 -1920 1752 -1103 825 264 -486 1067 -817 874 -1071
1816 -1071 1362 -866 1106 -469 -378 1573 -1630 1978 -1967 1558 -637 -125 469 -1124 1392 -1315
1832 -1315 779 -1268 938 -1149 -158 -149 -1033 1171 -2277 1314 -1895 712 -781 -644 899 -1770
1848 -1770 954 -1886 868 -1017 101 -868 -502 455 -1604 936 -2069 1563 -1370 105 -44 -1112
1864a112K568l177L319k466K036j344N22J10n06J546k605K990k898K548k209Q25
1880A47R45k248L164l622L309k390J380j89q00J667k043K020k388K635k478J750
1896H59n64j82J457k999L640l891K980k093N92Q27k096K278k265K261k237J673
1912B40j690J405m09r27K261k966L521l483K625r66m22J609k303L024l012K481
1928I88k110J224k67k26Q37j596K571l078L148k600J690k65j436K631l141L176
1944A546k383J516p88M6O40j136J962k494K750k966K668j887M06R93k257L296
1960A912l797L386k255J122J15j337J742k002K113k251K226k257J967j125l70
1975h11J408k639L387l758K946j711J80J168k053K554k746K210j394J262j020
$$ plain form
1864 -1112 1456 -1721 1598 -868 1168 -176 346 456 -50 1496 -1109 1881 -1017 1531 -678 147
1880 147 1092 -1156 2008 -1614 1695 -695 685 496 -304 1363 -680 1340 -1048 1587 -891 859
1896 859 295 113 1570 -1429 2211 -1680 1300 -793 -201 626 -1470 808 -1457 804 -1433 240
1912 240 -1450 -45 -454 -1381 880 -2086 1435 -2048 577 -389 -811 798 -1505 1519 -1493 988
1928 988 -1122 102 -165 -391 446 -1150 1421 -1657 1491 -1109 581 316 -1120 1511 -1630 1546
1944 1546 -837 679 -109 -63 577 -559 1403 -1091 1659 -1307 1361 -526 -120 873 -1384 1912
1960 1912 -1885 1501 -754 368 483 -854 888 -1114 999 -1252 974 -1283 684 -441 -811
1975 -811 597 -2042 1345 -2413 533 -1178 -998 170 -1883 671 -2075 135 -1259 3 -1017
1990a017N26L41j098K236l176L457l079K354r00l40J876k861K921k572K141j504
2006f95Q85p6k48N72j442K409k730K783k511J340J65j155K407l407L622k781J509
2023F47n28nQ67j776K007k063K343k472K222j606N53P64k385L415l321L186k659
2040h11R08N19j396K052k440J912j916K005j781J033m42m71J379k549L514l571
2056b055K662j420J15J333k554K765k406K112j746J275p77L25L76r08K251l066
2072a718L316k980K131q53m50J932l127L265k741J831j100O56j06p05J276j881
2088a254K136k227K432k054J218J07j543K719l047K990k417K092q01m37J061j610
2104f35K173k215K326k258J889j294K23R91k152K968l419L031k343O71M33j477
$$ plain form
1990 -1017 -491 -150 -1248 988 -2188 1269 -1810 544 -356 -696 1180 -1681 1240 -1332 809 -695
2006 -695 190 114 -134 438 -1004 1405 -1325 1458 -1053 287 452 -703 1704 -1703 1919 -862 647
2023 647 119 114 981 -795 1212 -851 1492 -980 1242 -364 189 953 -1432 1983 -1338 1848 -811
2040 -811 97 616 -780 1272 -1168 744 -1172 833 -948 85 -357 -828 551 -1998 1516 -2055
2056 -2055 607 -813 -698 635 -1919 846 -1560 552 -1194 81 -696 -371 5 -903 1348 -1718
2072 -1718 1598 -1382 749 -104 -554 1378 -1749 1516 -1225 606 -494 162 56 -649 627 -1254
2088 -1254 882 -1345 1087 -967 251 358 -1185 1534 -1513 1477 -940 1152 351 -86 975 -635
2104 -635 1538 -677 1649 -609 1280 -14 209 1200 -952 2016 -1403 1628 -715 -44 389 -1088
2120a088J994k344K334k062J478j457R80l91l54J582k460K892k985K493j269J74
2136d83R70k034K703k557K275j645J141p92oQ52j340K006k882K804k440J556n20
2153c92o08J784k853L320k813J855j010L13K87q21J610j916K212k086K266j598
2169d50Q11M97j710K656k983L006k078J005j71o30J518j818K062k098J782j995
2185e96J181n19l17J165j925K736l507K882j998O97N25j318J948k243J962j789
2201a116J540j228R83j69q88J799k072K522k818K162r20j19J021k296K422k416
2217a593J845j282R65o85R9P98j797K079k170K215j978J211n3r82K072k515K958
2234A187k431J812o75RN95r57J503j752J856k188K229j282O43J07j192K287k710
$$ plain form
2120 -1088 906 -1438 896 -1166 312 -1145 -165 -556 -910 672 -1788 1104 -1881 612 -657 -483
2136 -483 487 -1547 1156 -1401 874 -771 370 -422 -428 424 -916 1090 -1792 1012 -1428 128 -392
2153 -392 -1000 784 -2069 1251 -1562 293 -717 -404 -117 -938 672 -1244 968 -1118 1148 -450
2169 -450 361 858 -852 1804 -1179 1827 -251 754 583 -47 1471 -347 1715 -383 1399 -596
2185 -596 585 66 -251 914 -1011 1725 -1782 1100 -898 -201 324 -994 954 -1289 673 -1116
2201 -1116 424 -804 179 10 -878 921 -1151 1371 -1447 715 -205 -324 697 -1599 823 -1593
2217 -1593 252 -1030 -65 -750 -651 147 -1650 429 -1741 474 -1504 -293 -346 -1328 744 -1771 1187
2234 1187 -1244 568 -107 -98 497 -460 1043 -709 1147 -1041 1188 -94 549 656 -536 1751 -959
2251i59K380j804R11r6o77J245j724J790j886J816j407R12o59J6J244k148K152
2268A106k513K557j525M55K95j124J901k310J883j404J086j076N70L71j023J651
2284I00k528K714k410J706p86j80J390k117K165k240J710j220R20m91m0R99j513
2301a021J952k212K251j451P93j64o11J753k380K657j975J523j242M67N49j347
2317d58J513j606J647j999J742j130K95O48j353K069k414K315j736J067j85n21
2333a06J137j290J598k007J789j510J012n29k52Q02j659K052k354J801r92M39
2349f9M21j550J775k537K376j123J107j121j1Q95p86J818k261J658j719J388m94
2366b33J64N80j881K264k367K600k077J183m33l08J222j543J787j846K154k060
$$ plain form
2251 -959 1421 -383 528 432 -245 1000 -724 1066 -820 996 -411 501 -158 -142 1102 -1046 1106
2268 1106 -1407 1150 -375 80 375 -749 1152 -1158 725 -679 407 -669 -99 272 -751 900
2284 900 -1628 1086 -1324 382 -404 -584 806 -1311 854 -1386 324 -896 24 -467 -507 492 -1021
2301 -1021 931 -1281 970 -481 312 148 -463 1290 -1090 1567 -408 1115 -127 340 889 -458
2317 -458 1055 -551 1096 -903 839 -291 4 652 -701 1368 -1046 1269 -467 600 415 -106
2333 -106 1031 -259 1339 -668 1121 -389 623 94 -158 644 -1015 1037 -1317 484 -508 -69
2349 -69 352 -1198 577 -1960 416 -707 400 -721 -732 163 -623 1195 -1066 592 -1127 261 -233
2366 -233 -69 511 -1370 894 -1473 1127 -950 233 -200 -508 714 -829 958 -888 1266 -794
2382g94R09L67r57J217j305J689j859J041p88L5J230j124P67j349K169k107J576
2399G17r18j91J325j765J630k045K133n65L26n01n52J574k002J397j179J202r04
2416c18L67K22q19J250j987K194k031J654r71O8O10j532J678j831J909j646J301
2433A18o84o5Q77j278J862k061K179j710J083m16m95J338j926K079j817J249j063
2450g30R02k70o74J338j538J798j732J537j345N74K70q08J600j810J904j568J218
2467F66p12J8Q51j370J719j843J711j397J076m72n20J216j556J917k035J421j056
2484c66M57k29n19J174j295J715j960J650j269N63K62j091J425j419J789j824
2500i37J018J5n40O39j213J392j422J387j517J121m22n4N17j576K020j972J978
$$ plain form
2382 -794 115 482 -475 742 -563 1126 -733 308 -480 -445 785 -339 428 -921 1248 -859 717
2399 717 -201 -392 933 -832 798 -1247 886 321 647 146 -406 1168 -834 563 -616 586 -318
2416 -318 49 271 -548 702 -1285 909 -1122 532 -439 -371 239 -1293 385 -1446 463 -1183 118
2433 118 -566 -631 246 -1032 830 -1231 948 -762 321 -95 -590 748 -1178 901 -916 333 -730
2450 -730 172 -98 -772 566 -972 826 -906 631 -714 -140 130 -678 922 -888 1016 -552 666
2467 666 -46 -28 823 -547 1172 -671 1040 -357 719 247 -273 943 -613 1304 -731 690 -366
2484 -366 91 -138 -657 517 -778 937 -1023 627 -642 -79 183 -908 517 -902 887 -937
2500 -937 81 96 -444 195 -1018 374 -1048 339 -1178 -57 -479 -533 -16 -1592 428 -1544 434
2517D34j854J410k17p21J328j621J629j522J570r27N31K50r73J510j591J699j660
2534g25J528q23L13L67j412J878j995J947j609Q70k26j90O23j258J741j577J531
2551I83j167J026l68j33Q92j524J904k247J868j222M42j79k69P80j512J502j263
2568d87J153j271P89j79j061J679k020J999j340K98M06j14K80j522K111j557J187
2585C51r90J483j640N38L93j318J462j311J874j586P95K40r45J239j455J552j308
2602f26R04o94L45M48p34Q96j401J769j564J225o19K59N86j269J607j615J479
2619I96j241J005m44k6O61j215J501j917J703j430R07r1p71J130j394J757j713
2636e82J319j008M74m3n81J248j215J039j447J403j143M95J61r51J604j659J524
$$ plain form
2517 434 -1420 -10 -227 -948 380 -1241 388 -1134 436 -491 40 290 -683 827 -764 935 -725
2534 -725 803 -20 293 660 -752 1126 -869 1078 -531 339 113 -77 546 -712 1029 -548 983
2551 983 -184 842 474 341 1233 -291 1613 -634 1234 12 454 275 6 786 -726 776 -487
2568 -487 666 -605 184 5 -1056 623 -1397 602 -738 -440 -34 -148 132 -1390 721 -836 351
2585 351 -639 844 -796 -258 135 -1183 279 -1032 842 -744 51 291 -654 585 -870 682 -626
2602 -626 278 -416 -71 377 -357 539 -862 907 -657 568 -51 208 794 -475 1132 -483 996
2619 996 -245 760 316 290 951 -264 1237 -680 1023 -407 500 409 -362 768 -626 1131 -582
2636 -582 737 -271 203 160 -421 827 -388 651 -796 607 -536 -41 120 -831 773 -886 638
2653F38j365P80q5l70O29j032J438j219R38q46N57l18l2N20j220J591j707J798
2671F95j057O3K09m98R00j109J390j381J357m28M1m7m78J349j416J473j371J644
2689A336j370k34R97j060J724j839J333j087R27o72J52Q10j533J511j731J458
2705G22p31L03L73j172J836j983J324j357J196j197Q03J20j002J311o56O59j820
2722a271J684j818J604L47j540J969k508J319j237J808r16j35M07n14J180j183
2738h04R35q34R29j030O29k6n56J819k211J805q78j18j36l03J781j708J412n70
2756A36N77j122K74Q0k02Q95j688K031j554J114o26m89O56j050J892j638J287
2773E73o12J31ml0M93j315J511j319J165o78N61m19m39J331j661J804j642J054
$$ plain form
2653 638 -727 53 -32 -402 227 -805 633 -586 352 -494 63 -255 -287 233 -987 604 -1103 695
2671 695 -362 -299 -90 -588 312 -797 593 -788 569 141 182 135 -343 1006 -410 1063 -308 1336
2689 1336 -34 -268 729 -331 1393 -446 887 -200 727 55 207 1017 -516 995 -736 722
2705 722 -9 294 667 -505 1331 -652 672 -685 511 -686 117 237 -765 546 -110 549 -1271
2722 -1271 413 -1405 199 546 -994 975 -1533 -214 -1451 357 -559 -694 -287 -801 379 -804
2738 -804 131 -703 226 -804 -175 -201 -757 1062 -1149 656 -222 -340 -476 -779 1002 -706 706 136
2756 136 713 -409 -135 -55 -257 638 -1050 981 -573 541 -85 -574 82 -968 924 -714 573
2773 573 -39 92 88 58 551 -764 747 -572 593 -85 476 57 -382 949 -712 1092 -550 504
2791E04l41o84O68r97J347j095J063j144J154q66M84L47j131J572j640J454j109
2808d14M88%o50J108j280J182j191J216j238J029m45K47K50q84J736k046J565
2825F73r97L08M66r21J132j188J059r05O95l01J59J3n36Q11j189J608j671J240
2843D56n15J39L99j129J594j108R08r38L94n2l23Q96r46P95j151J537j364M67
2861E9kn78J319j674J549j319Q61j49l50M99j003J345j332J204j271J105q47M79
2879a05K81r35J546j836J523j253P35P9o86J207j426J489j555J392q76N12o3l55
2897c26Q80j400J735j688J125r09L46O21r78J251j241J154q58M37q2J96J2m52
2915a77R03j257J488j329J153l31l99R81j508J350r71R46j063K79L35o99P98o20
$$ plain form
2791 504 163 -521 147 -850 497 -598 465 -679 475 -391 93 440 -691 881 -759 695 -414
2808 -414 74 74 -576 532 -748 434 -757 459 -779 250 -195 52 302 -582 1154 -892 673
2825 673 -324 -16 450 -471 661 -527 532 -373 322 21 180 193 -343 468 -721 887 -784 456
2843 456 -59 80 479 -650 944 -164 744 -194 200 148 -175 721 -225 570 -581 956 -408 59
2861 59 57 -521 798 -876 673 -646 215 66 -284 215 -788 557 -775 429 -842 263 -584 -105
2879 -105 176 -759 787 -1049 474 -779 -44 35 -651 556 -870 619 -936 456 -420 92 29 -326
2897 -326 554 -846 889 -799 326 -583 -237 384 -594 657 -584 570 -288 149 67 263 275 -177
2915 -177 726 -531 957 -372 781 450 51 1032 -476 874 -97 849 -214 65 400 -299 499 -121
2933a21P45j133J296j329P06k16l60J120j409J499j636R96l40RM55r56J205j195
2951f64J182j107P91l64Q5L07r34J225j530J740j374N94J04p07Q18j388J661j093
2969f54P39n06J95k3k1N62r35J594j781R52l89L32M05j057J234j175J067q70O31
2988C00k61j8M60p26R26j184J438j115N43l25k3N12j260J808j695J192q68L83
3006H7K15p69J058j088J009j076J151r24M30O2p48J166j542J701r80N68m21k89
3024c90O56q29P60q73P79q70Q43l24J70J59j005J490j603J581j122N90K63q69
3042e94J206j377J193p36N78l65J64q3k62P04j017J355j392J100o98L8O92j057
3060e51J330j432J233r35M36l1j58M08n94P38r12R52r88Q83j1l19P42j415J675
$$ plain form
2933 -121 624 -509 787 -542 164 -52 -412 708 -701 798 -838 158 -182 -173 282 -674 531 -664
2951 -664 518 -589 202 -162 -77 230 -704 521 -1009 731 -643 -49 55 -652 166 -1222 439 -654
2969 -654 85 -421 -226 -249 -270 292 -643 951 -830 122 -267 65 470 -587 647 -528 539 -331 300
2988 300 39 21 481 -245 681 -503 935 -180 363 38 15 527 -733 1075 -620 572 -296 87
3006 87 302 -467 591 -497 512 -564 587 -337 93 155 -593 573 -969 732 -248 320 -101 -390
3024 -390 266 -563 197 -676 103 -767 76 -248 -78 81 -924 566 -1037 544 -578 12 275 -594
3042 -594 612 -765 428 -308 270 -95 69 -14 -276 428 -589 766 -626 474 -224 -186 506 -551
3060 -551 779 -653 580 -355 81 50 -108 300 -294 444 -468 484 -504 379 368 49 791 -624 1051
3079A051j560R58o61K71j23l47K16l45O75j086J376j056L91nn51J430j958J762
3097D38p22J30k34PQ96p26M64p77J041j109J160q06J87M78q37J315j618J148q80
3116d45N97K69j070J184j272J141r02Q55o86K84q4N9J54n80J231j331R85l17j12
3135d0N93j146J199j051J221q78L18l36N4M52o76R43r68J160j114P25j92l63Q67
3154G68j373J564j400P81l98J73J76p37R30r28R91r66P38n68J76K01n33J015j463
3173h53J446j055O33k90k82O96r52J085j024J018q19L44r5k14O23j039J189j035
3191f24J268j148N85n6o65J147j240J334j063P12n54k21Q28p71P01q99J325j451
3209g92J447o79J44O08j136J367j422J045o74J56K07k51O49q92P55o99O98n34
$$ plain form
3079 1051 -509 449 -212 59 -64 -411 -195 -540 135 -951 425 -631 -240 -245 -796 634 -1324 438
3097 438 -284 -154 -388 -381 515 -211 253 -524 517 -592 568 -238 -51 427 -410 905 -713 435 -445
3116 -445 152 421 -649 535 -737 404 -498 357 -329 -45 -129 -70 84 -496 735 -596 389 72 -40
3135 -40 553 -593 606 -445 776 -102 216 -120 -66 386 -290 653 -315 845 -269 456 264 -99 768
3154 768 -605 959 -441 340 -58 115 291 -446 484 -444 547 -419 319 -249 -73 128 -405 610 -853
3173 -853 593 -462 171 -119 -401 295 -657 428 -596 422 -397 -53 -148 -362 261 -778 411 -624
3191 -624 644 -504 81 25 -640 507 -733 601 -462 250 -304 -525 303 -468 233 -666 659 -792
3209 -792 655 -24 120 728 -408 959 -463 582 -92 64 271 20 669 -223 532 -167 531 -3
3227cN91k58n04P55j088J260j040Q02m50R1K40n48O54q01R65q66N26n87J72L38
3247B49p80J212j469J091o78L98J8n73R91j203J277r53N14m54L20l0l30O31q43
3266f12J231j313R66o49K33N27r89J174j276R18o96M63j8j75L88o22Q00r07J128
3285E71r93N03k31qN22p58J002j157J157r78K00L16l05N99q92P88p44O40l67L75
3305B40k37j59O78r58J167j235Q26l73j58O33r28J014q63O76p25N47k22k70O53
3324C06n27Q03j099R39q64N31n8m30P21j031J010q23P58n16M13o0k22N84j027
3343e92R58p96P67o41M79J67o73Q14j325J302q23M87k44J3O16q02Q21r22Q14q15
3363c95N26j57k65O38r86J268j190J385q03J69R3p21J032j173J289r93Q17n69
$$ plain form
3227 -3 588 330 -174 581 -507 753 -287 515 65 156 396 -152 502 -299 666 -200 326 -261 -89 249
3247 249 -531 681 -788 303 -375 23 41 -532 459 -744 533 -420 94 -360 -40 -70 -400 231 -612
3266 -612 619 -694 272 -377 -144 383 -606 568 -708 210 -486 -23 -41 -216 172 -450 350 -557 571
3285 571 -422 81 -150 -158 364 -394 608 -549 608 -370 -170 146 -159 440 -452 336 -408 232 -135 240
3305 240 3 -156 522 -436 731 -504 322 -51 -209 424 -504 510 -353 323 -402 145 -77 -347 306
3324 306 -221 582 -517 422 -442 89 31 -399 322 -709 301 -522 236 -280 133 73 -149 435 -592
3343 -592 366 -430 337 -304 175 342 -331 483 -842 460 -363 124 -120 -107 509 -293 528 -394 420 -395
3363 -395 131 -26 -291 347 -639 629 -561 824 21 190 283 -438 594 -579 710 -283 534 -35
3381c5R0K67n59P69j068J224j167N16k73J03K93o43R25j000P00n03L57k92J01
3400a95M32p14Q48q85R64j073N60k2k97P24p35R21r82P83n48K49J38n83P55n88
3420b48O19r12R31n56j76O57o67O55p93P43n26L70l4jJ49l29O21p45P72p78N97
3441C49j10l10M78p20Q71r02P97m67M6J51m11P97p68N44m75L57k87M3J47m91Q86
3462E25r23Q39p71M24P6l43j5k1P96j237R74o87M67k27KK96o04P23j101J122m71
3483a56k0L03o29P08p14Q10p24M99m05M49N6o76R86r08Q47p87O35k21k17L41k65
3504h8O72q41Q08q21N73k2m11M73n61P01n71L32l51L74k1n19Q03n46M51o68P68
3525E35l60n4L15p91P95r12R65q27N32n20K89J96l83N33q14P30n54M61m04k52
$$ plain form
3381 -35 55 322 -237 532 -536 688 -479 37 -236 -133 160 -483 442 -558 142 -361 -4 -296 -195
3400 -195 237 -477 371 -514 450 -623 -63 -85 -382 342 -393 528 -454 329 -219 30 168 -415 340 -248
3420 -248 371 -541 390 -166 -342 315 -352 303 -490 253 -273 97 63 62 211 -118 503 -242 530 -248 349
3441 349 239 -71 407 -313 558 -344 453 -14 32 183 -228 569 -199 345 -130 227 -60 -17 130 -361 525
3462 525 -398 441 -330 94 170 -173 -188 -209 587 -650 324 -363 104 -123 -121 175 -429 294 -807 315 -156
3483 -156 -176 127 -502 206 -508 302 -422 77 -328 121 177 -499 487 -421 426 -361 274 53 -164 177 -88
3504 -88 584 -257 551 -270 303 281 -130 343 -218 483 -88 244 -107 267 246 -273 530 -16 435 -233 535
3525 535 175 121 436 -355 440 -472 493 -334 198 -322 -33 163 -220 313 -501 229 -325 136 -268 -520
3545e20P69j031J150j077Q53l92J25J15j93P48q97P74o21P81r29K74K27o38R39
3564D57l44J20n63K46LJ00J51o89Q65q60J016p71J77K1lJ95l51L69m99N46k20
3585c4L06N2m00K70m92K48j04P64m40K54n16N9N00q00J128q41M72n1k92L67j198
3606g48J312q90M26k53M84k56j70M54o02L44m20N89m05L43l47O7M68q15P78r68
3626f09J004q70N78j6m67Q60q29M78l67N91m47K60j49k96M14l12L97m81M15k20
3646f6lM96q30P59o92O82q03O71k22p4J75n74P35o46N36j07pj23k13P05o21N07
3668B85m85M45m16O1K50k35N72p51P77p58N81l31j61L60n83Q92q37O03m44L53
3688A78r5j87K95o55J031r26O17m50K84o6o3J56o74P22o13N70q4K34k00k25L46
$$ plain form
3545 -520 249 -782 368 -709 144 -248 -123 -8 -201 547 -350 424 -197 584 -345 -71 156 -482 457
3564 457 113 233 -330 -84 -81 19 170 -519 346 -514 502 -269 -92 -71 -74 121 -230 139 -360 186 -34
3585 -34 272 324 -76 194 -298 -50 -154 610 170 424 -92 -33 467 -333 795 -46 426 375 83 450 -748
3606 -748 564 -326 100 -153 331 75 -95 359 -243 101 -319 270 -135 208 -139 -72 396 -419 359 -609
3626 -609 395 -475 103 87 -380 480 -349 129 -238 353 -94 166 17 -279 135 -177 220 -261 154 -66
3646 -66 -69 427 -403 356 -336 346 -457 214 -8 -82 93 -481 254 -392 144 37 30 -93 -306 399 -222 285
3668 285 -200 245 -171 -110 140 -95 477 -274 503 -255 326 -5 -166 194 -389 503 -334 269 -175 178
3688 178 83 -104 191 -464 567 -359 258 -192 92 26 -37 119 -555 167 -446 124 40 274 74 -151 195
3709A95o49N87n92Q11l57l20M02k50O32q57N04j94M89n47j7M32m99N70q67P29
3729B02n06M31k31q9M63m52J052j107L79J1j68R7j44M86p13P19q46Q94l15j73
3749a0K96o08O44m95P19p31M71l68O3N23q97R61o90N96o71N65m70j53N10q15P53
3770A93l93M50l03K11k02r5K61l61O25p61N97l42R2J18k91O03q49P34o47M23j1
3791E2l66O75o44O98o13M81o15O41m85N8M55k73L64p20O84o03K77K05l59L04n68
3812c52Q35p42M52j95NJ54l63M04m03N50o60N23m23J27L94m91K63n25O61m48K43
3833Ioj66L35n12N38m91L74k06J29p0j54M54o57O57o19K64j99K1N39n73N98m74
3855b09L65p33P28l81J79j2k63O80o56O26n48N84l25j91J98n27Q87o89L17l54
$$ plain form
3709 195 -454 133 -459 352 -5 -325 77 -173 459 -398 106 -88 401 -146 -163 269 -230 340 -527 202
3729 202 -304 127 -104 -193 270 -182 870 -237 142 153 -15 82 -62 424 -289 430 -416 478 163 -10
3749 -10 286 -322 322 -173 546 -185 286 -82 -19 504 -393 568 -122 474 -197 368 -102 -255 255 -560 193
3770 193 -200 250 -53 158 -44 -139 122 -239 386 -375 222 -120 -28 90 -201 402 -447 287 -360 63 52
3791 52 -314 361 -283 415 -198 283 -332 309 -176 -118 337 64 428 -292 392 -211 66 271 -88 216 -352
3812 -352 483 -259 193 -2 3 157 -206 198 -205 345 -315 208 -215 -88 306 -185 78 -447 214 -234 9
3833 9 3 -163 172 -340 198 -293 81 -125 4 -66 -220 234 -423 234 -385 -121 -320 -299 240 -333 265 -209
3855 -209 156 -577 151 -230 -51 -63 -326 354 -302 324 -224 360 35 -156 42 -485 402 -287 30 -324
3875c24M79j96k12N75n12N52n81O03l60Q8n3l35O90o32P45p77P58n01j79N53p03
3896c22Q29o31M45l45L93m14J31K80p36Q68q42L90m1J11K18o31N77o60R47j298
3916g31P27n11N64J00j99L45n83P05j173J440l81j09R1n14K40k03M01n15m1L79
3936C2n2P73j338J047r77P23o76N49m07q8M86l50M68m63M90j30o6N9Q6Jn70P79
3958C76o40M14k7J44j25k46M56o18P28n85M58l78j01K68m82Q01o68Q48o78L03
3978B48l81Q2L25m37N08n01L44k93J53j28j05L19j0M15r52P35m88J28L5j42L57
3999B12n16O40q19M84k8q7Q4j50M58n59N73n46L65k03l1K72n46M34l77O43o51
4020c48N77Mo22O99n80N42n48N40k71j55M15j73k26j59O31l82M72k53J8n7k90
$$ plain form
3875 -324 155 -41 -253 322 -190 362 -219 384 24 112 59 -276 414 -218 527 -250 508 7 -172 381 -322
3896 -322 507 -124 321 -24 369 -45 86 366 -370 498 -344 46 5 116 334 -297 280 -380 567 -731
3916 -731 -4 -515 49 149 -50 295 -288 417 -756 684 303 194 285 -229 11 -192 209 -306 -347 32
3936 32 -20 753 -585 462 -515 208 -468 81 -326 -414 72 -278 190 -273 217 87 21 80 166 167 -403 376
3958 376 -264 150 123 267 142 -104 352 -266 462 -123 335 -43 -144 124 -358 443 -225 623 -55 248
3978 248 -133 -51 274 -163 345 -156 188 -105 48 -80 -185 134 124 539 -413 322 -166 -38 -3 -145 212
3999 212 -304 336 -483 1 -27 -114 -30 -180 278 -281 292 -254 111 -92 -123 149 -397 37 -340 303 -348
4020 -348 229 233 -389 310 -270 272 -276 264 -7 -162 253 80 -146 -305 326 -56 416 163 181 124 -166
4041a66L34n16P79m74M18l58q2L03k92K78m88O84o52O46k87o7N6l31N26p63O43
4062A91l24NK82m74M30m7J56m18L72n62M12K6k16L84n92O89m42M31m24r2L22p6
4084C3K49o32L79l11L65m51J80J80k88M73n45P93n74j34M50k72N48o45M15m50
4104b37L59l81J27M40m98L72m66L99l88N25k30O5J96o75O04n48O59n13K50L9k94
4125a95L47l88O18o26O51o95M50j59k67L45m04P04p24M02k19o8N25n77M92n24
4145c12N51m63K34m8j03L89m55N67o21N54m58N80l67n81P01n51P05o99N38j43
4165A8N5m9Q7O8n35M46n27O34l89K03J21k76N55o74K95l85M19j78Q8L26l09L48
4187C41o99N59n21M29k38k24M12j84K56n02M94k66K98P1n04L76m00M96k49J68
$$ plain form
4041 -166 168 -348 431 -43 375 17 -65 238 -54 224 -264 420 -232 414 127 60 116 -215 311 -452 191
4062 191 -133 -128 154 -320 110 63 219 -199 173 -389 23 49 -167 217 -375 314 -128 303 -121 -213 109 33
4084 33 282 -350 29 -282 83 -368 -188 -8 -296 177 -368 425 -149 -283 167 -105 443 -202 213 -237
4104 -237 122 -259 -132 308 -190 182 -284 115 -273 252 22 87 283 -392 212 -336 323 -190 60 99 -195
4125 -195 152 -236 382 -244 407 -288 162 3 -264 81 -323 381 -343 59 -160 -228 297 -280 212 -312
4145 -312 239 -224 10 -38 -141 248 -207 360 -261 293 -165 415 48 -533 168 -383 322 -377 161 18
4165 18 73 24 111 179 -356 90 -437 197 -192 11 132 -144 411 -263 32 -353 66 -112 -24 302 -7 341
4187 341 -358 201 -320 109 -129 -353 59 -125 131 -371 123 -143 155 226 -278 98 -302 194 -55 113
4207A13k44K04m4k71M04q52R00m59K72k01K76K1l03L58l43M17m33J56L6q3L6k90
4229c30L06m81O10l53K24k4j48K38k30M23m85M96m81K50m54J93L52l38L30l18
4249b20M30k81Rk6j42N99n80P68r24N43k51P8J65l15L15k38M48n58K72j20J9K92
4271B83l23N61n91K48o69Q32j5m90K80j71M13n19Q44r39M02r5l64P27p07L51l18
4292b60N19k49R3r8m44M63p3L49n43K46j39K25l5l00L75m86P76p50O54m61R2K15
4314A69m85M79n55O71m88P4J30j48L12l62N52p84P71l26K1J79m01L99o89P44l18
4335e5J56l13K72pk97N19m33M52m95N98l82n4L28n01O85o53M68m2MJ26m42J11
4357D5l41P01o06M76l75L21j08j62K47n00O05l67K51k12k9n2k62Q19p50M28k65
$$ plain form
4207 113 -131 73 29 -242 162 -690 210 -249 23 -178 98 119 -184 174 -169 248 -185 -29 7 -76 -40 -330
4229 -330 -24 -505 105 -248 -24 -48 -196 42 -188 235 -250 246 -235 15 -439 -246 106 -232 98 -220
4249 -220 210 -71 -62 -88 -230 369 -211 557 -367 176 -75 3 168 -147 168 -70 378 -180 92 -28 -9 283
4271 283 -40 521 -70 178 -491 341 326 -164 116 -55 358 -161 683 -256 146 51 -313 414 -293 58 -260
4292 -260 259 10 103 5 -439 24 -49 300 -243 3 -136 89 54 -246 129 -357 419 -331 323 -138 -46 169
4314 169 -316 163 -392 279 -209 -135 -5 -153 159 -203 349 -435 336 10 31 210 -191 208 -481 263 -55
4335 -55 101 -212 60 53 -244 275 -158 294 -201 397 15 -39 289 -212 473 -180 288 246 250 376 -66 45
4357 45 -296 405 -201 275 -100 221 113 -49 198 -302 303 -64 187 -25 -54 -106 -368 451 -299 129 -136
4378a36J12k08K98o6k31M44q44Q47m75L33n2k32K75k68K02k55L31k81K07L9j18
4399g8L00n54O05l45J12k93K52N04m51L94n83M01m48K71M26k54J93n31J08n6L23
4420B96k75K32k30j41K02k96M28m69L08Nl3L26p18P45o30N42l06J51j9j19qJ39
4442A30P0j46J08n38O16j96j30J61o23P91m92K10j96J21J58k59K85k96L38k85
4462a73L12l66K57j61j22O13n92L69m08J91j8K61J0m31M40l01K66J8j1m15K26
4483c5R4j59L99n69N29k42J0K96l08K16l64M10l11J28j16j75K89j24K89n32P13
4504D38o35L49%m0k0p6J11m52O18q58P04l32K77J39l58M41k89J38k64J07J74k57
4526h5k4k46P17l07k05n21J066j0p28J01OK40j73M55n10L41k8k23K51m92N91m27
$$ plain form
4378 -136 -24 -232 66 0 -231 213 -631 216 -259 74 22 -210 65 -203 -1 -256 75 -206 1 40 -78
4399 -78 222 -332 273 -72 40 -253 -1 503 52 446 -137 264 -184 87 513 259 452 -79 29 -27 296
4420 296 21 253 23 -118 84 -212 216 -253 55 60 27 353 -365 380 -250 292 -14 137 118 -1 -9 130
4442 130 200 54 162 -376 240 44 -86 75 -548 243 -249 -39 -235 -114 44 -215 70 -226 112 -173
4462 -173 139 -227 30 -131 -253 360 -232 137 -271 -80 -98 163 173 -258 182 -119 147 165 154 -261 -35
4483 -35 59 -100 299 -270 259 17 27 323 15 231 -133 277 -34 94 -22 -197 92 -32 257 -275 438
4504 438 -197 152 152 112 92 16 127 -325 293 -565 139 -193 84 223 -135 306 17 155 -109 -2 172 -85
4526 -85 -109 -355 362 55 -150 -671 395 385 -343 -242 -236 4 -169 286 -224 117 89 -134 117 -375 216 -211
4548b11L97j82RMk99M31l47M41n43M55k02K25J6l68M86n86L82o6M5m4k83N43l59
4571e6M18l67J68k40o6L1M9L23n08P44p89M50k65K58J53l52K80n97N13j30oN6
4593F7j30O5j93K26m45L81j10L35k11J0N4l25K21k58L84j39m5P3j69K86q4J0p0
4616f7K51n81K97L15k36M9k32M48k85J96j76m8L49o93O73m29L10j97N6k0Q8j46
4638g8J0M48m34L28l12k3J26k2J8j84L33l13k05K23k33L43L7M70p52N06n22J99
4660c7q7J89J81l98K06k45O38n65J07p4J28L3l08M06k88K30j74J27r9j4J60l70
4682b54M09k39J39q4j50K39r7L67m27J38l3j7o2l9L08k55K60l86L64j7j22J02
4704A44m3J90m17K79l60N23m56L35q6l8J48m16N74n77M01j05k10K96k48K01l56
$$ plain form
4548 -211 186 4 13 17 -282 149 -198 243 -300 155 -47 178 194 -174 312 -274 108 42 87 43 -240 303 -56
4571 -56 362 -5 163 -77 -143 -112 -63 260 -248 496 -293 157 -108 150 303 -49 231 -366 147 17 11 67
4593 67 -63 2 -191 35 -410 -29 -139 196 -15 -5 49 -276 -55 -313 71 -68 -113 -40 -209 77 -7 3 -67
4616 -67 184 -397 -100 215 -21 28 -204 244 -41 155 -21 -69 280 -413 260 -169 141 -56 0 -20 68 -78
4638 -78 -68 380 -54 274 -38 -61 65 43 61 -123 210 -103 -308 -85 -318 25 62 532 -220 286 -236 -37
4660 -37 -124 65 246 -152 54 -191 447 -118 -11 -85 43 76 -232 174 -114 116 -58 69 -30 -44 116 -254
4682 -254 155 -84 55 -29 -179 60 -37 330 -97 41 8 -9 -71 -110 198 -57 203 -183 181 164 42 144
4704 144 101 291 -126 153 -207 316 -140 195 109 71 219 -197 377 -200 201 96 -114 182 -66 135 -221
4725b21M20j72p0J17K4j06l15O34o33N59m05R9M6k24L17j84K45l35M27l23K33
4746A33km61M81n34L05k21M38k97K06p1r4K79m83M41k04J44q7l8Rm4L98n77M60
4769A81m26J79l0pQ1j37N40l80j78K11j21R1k9K8m5J73j76J91r7J63L0l20K12
4792A34k93L44m0J10j13k41k3N9L05l12J95j77K70m46m8L60J7j00n0K57k32K4
4814@O2m5J33l56J85j12M06l30Q1R7l41L16k80L17k59P3r6q8M00k96K98k59L74
4837B80n61L66k20K41J20l48J08j21K15k56M13k64O9J14j76N5j20L85m97J12j52
4858b37K64p7k24N42l55K72q5k05J07n3L77o05L81j08K77j10k35K7k4K90k28J02
4880I3j36j0j03K23P6j90L11n26L54j78j35L04k05M13l31L28n16M11j18j79P8
$$ plain form
4725 -221 199 27 -43 74 98 -8 -323 311 -322 237 -168 -69 -23 -247 70 -114 131 -204 223 -100 133
4746 133 131 -330 151 -383 -78 -299 139 -158 48 -23 -117 162 -321 120 -84 60 -27 -65 -56 -100 298 -279 181
4769 181 -245 -66 -96 -103 -22 -159 381 1 -177 34 -87 4 -25 3 -42 131 -45 146 49 212 242 -78 134
4792 134 -159 185 145 255 142 -99 -122 -63 242 -70 125 -52 218 -228 -276 84 101 1 -49 208 -24 0
4814 0 62 17 150 -206 -21 -133 273 -57 24 121 -220 96 -184 133 -126 -53 -149 -237 163 -133 165 -94 280
4837 280 -281 85 -135 106 226 -122 -14 -135 80 -176 237 -27 42 156 -20 35 -85 300 -197 -85 -237
4858 -237 27 -50 -274 268 -87 185 100 -105 2 -51 326 -279 102 -6 271 161 -74 -47 -71 219 -9 93
4880 93 -43 -53 -156 67 143 -47 264 -262 92 -86 -221 83 -122 291 -40 288 -228 183 65 -114 -36
4901c6J17L7k15J58L2m03J50L34j38l4K45o10N91p15M70k78O87m86J02k12Q7K0
4923i7N63l68J60l07l34J278j248lM76k13j35L11k77L22l63J59K66k5l52L41j15
4944C9k30N40n68K25LJ38m6j60J59J45r7l73M79m33J87j20O9l4j27L12l71M93
4966B30O1j63k06j29M63n08O45m83l1j63J42L26n24M42l11J21o4K39M2M7k35n9
4988a18J96l01L70l51J96j11J27l3M2J54j70Rj73Q6j12k71O04k75L68l83K96l36
5010a86J26M70m08P4l54L09j89K9J23L11j35j58M2k61L61l53L37m3j41L49l00
5031CJ50k53K04J33j89j11j11L81k79J77l79L50n44M77J29j70J59l17J71r8P8
5052c9L65k47K08p4l70K59J00m24K05N9k03K49l84N95n10M14l44o0J99J99n1p5
$$ plain form
4901 -36 81 118 -97 61 93 -310 -160 174 36 2 247 -363 228 -487 -17 -295 392 -94 8 -204 -117 -97
4923 -97 466 98 258 -49 -383 895 -353 -356 120 -93 -228 83 -194 128 -235 -76 190 165 -187 154 39
4944 39 -191 349 -219 6 9 147 101 -59 100 245 148 -225 254 -179 8 -112 -43 -77 -204 108 -263 230
4966 230 291 128 -78 -207 256 -252 393 -90 -121 -284 -142 184 -340 102 -209 -88 -152 87 129 176 -59 -118
4988 -118 78 -223 147 -204 -8 -119 8 -25 17 171 1 10 -163 -77 -189 -460 144 -131 237 -146 150 -186
5010 -186 -60 410 2 76 -278 31 -158 -129 -6 305 170 12 54 -207 154 -199 138 95 -46 303 3
5031 3 153 -100 104 237 48 -63 -174 207 -72 105 -274 76 -468 9 138 -32 127 -190 -19 -117 -39
5052 -39 326 79 287 213 -157 102 202 -222 -17 42 -161 88 -296 299 -211 203 -141 -201 -2 197 146 71
5074G1N7L0j6j71Q4K11j55k37J88J27l04K69k46j1K45j0o3m8j5O8K32m62K95%
5098A39lk94K04L60n48R5l14L74L4l05K12j13L13j90J86j84K83o0k57M01l69K25
5120A89p2r1PL07l30j42K90l53L69m6l52J09j28M04k94J31j02J86j61m8M56n42
5142b13K11l22L31J5J74k13j08K58k66J66j78L98l00J93j30j38K78l40J05k63
5162c42N78k31oK3J18j46j14K39j36J62k75J69J42l03M83p53N57j43jJ73j21P4
5184A47j67K15k19Q5j24j29J92lJ75n39M15l66L69k59K17j3j5Q0k93J31J54k7
5206B6j7J82Q5k78J92m09K28O5j30r0Q9J47Jm8l33k2K52J15l89K56K13m07K47
5229b5N8J14J3k80K47k05L05j75P9j42R9M9Q0l59k3M4J05J45k20N2j86M46j98
$$ plain form
5074 71 128 158 142 -29 55 266 111 -126 62 189 -115 154 -92 -103 142 132 69 21 6 74 306 -156 139 139
5098 139 136 -158 46 406 -142 -47 -361 13 47 -258 -46 -159 154 -36 150 -34 249 189 -68 333 -36 189
5120 189 117 26 33 340 10 -132 158 -195 174 128 -224 -115 -243 161 -133 -2 -104 82 -79 -127 329 -213
5142 -213 -2 -324 7 22 196 -17 -125 133 -133 33 -145 253 -47 146 16 -122 156 -184 -79 -342
5162 -342 236 5 -1 22 140 -6 -120 119 -17 145 -130 39 181 -122 361 -392 165 22 21 194 73 147
5184 147 -20 195 -24 61 -63 -192 0 -3 172 -367 48 -318 51 -208 9 -4 -19 61 -232 -101 53 26
5206 26 9 191 276 -2 190 -219 9 74 -56 -146 -57 90 91 43 -290 -312 -60 55 -334 -78 135 -272 -25
5229 -25 33 147 160 -120 127 -78 227 52 131 -11 88 137 217 -142 -165 -121 -16 129 -91 -39 -225 221 23
5252B3Qlm8mq2K47l03P9K14l38L94j71Q4l35K24P1l00K61r9L49m00K97j18j61
5276a11L89m24L07k3r1O1k53P6J5J36n9o7p2o1R9J02N7N2j57l9K05o3p6k96K15
5301g8J53k48J93k27J70j14J17N8Mj23j5L13k87L45o20N82m35K12J10j4M8m38
5323b94M94j37q0M8R0m1j38J55j35J03k33K34N6j09L01m05J41k72L47j11K2j93
5345a57k26N31k22J00P3mj86J37k7l12J16K53j12k30J77K0R0K83l16Oj7J66j58
5368a5J99J37j90K8l64M16k59L8j35K01Qj25L7j09P4P8N5m06J83J87J95j52pP6
5392A50k53J3K68j71J55k34jq1J17j47M8M30k94N4P0K98n04N7K4j12K61k42O2
5415c2k31M16l35K25N7%r2Q6j62Q7J94j85M2j44M2J59p3kk40K92j92K4q9K21J22
$$ plain form
5252 23 31 28 -20 -24 -106 141 -162 -83 131 -207 187 16 100 -235 -11 60 -240 21 -78 271 -129 168 50 -111
5276 -111 278 -146 161 138 47 108 -145 -69 -54 82 23 -44 -116 -177 -78 24 81 133 -24 -63 142 79 3 -293 -78
5301 -78 75 -173 20 -207 -37 -151 -34 24 28 -95 -110 203 -84 261 -359 223 -212 0 110 96 144 -294
5323 -294 200 63 -17 31 121 80 -58 97 -38 65 -168 66 122 13 314 -91 50 -222 125 14 36 -157
5345 -157 -383 148 -74 26 99 95 -91 46 19 -293 -177 76 -36 -266 -89 -69 21 304 -12 -6 -23 143 -15
5368 -15 184 321 131 159 -205 211 -48 -10 -145 56 64 -61 -24 -133 -59 19 74 -332 -149 38 233 81 74 150
5392 150 -103 -90 178 7 162 -72 -73 -154 -37 -184 -136 294 0 54 124 422 -82 -25 -1 -113 148 -94 -32
5415 -32 -263 153 -182 43 100 100 8 94 -68 19 213 28 70 -74 -32 127 54 52 -188 104 -88 -64 -153 68 190
5440A90m01L70n06L88j21J70j15J02p4l88J93N8Q1j31L24k16L5K12j97J28k64
5461a62K15j15l8J94k07K00o1j83J24L0J84k43J21J31j66j85K99k23P8j05P8J32
5483I8j28J79p1R3k57m8K97j46k42Q3M13m32J54M5j87M40m18M70m43J19q6J10
5505D3J54l83K48J13j15j73j3J23p8Q8LPJ08k6m2l0j6K21j60j93K73k30m2J03
5529a7K7p5J06J75l17L29m44L48k22J46p6J07J4l9p2K0J91l42K46l9o6K05l58
5552a53K15r0J71k45K23O6j99l7M1M4j41J76L5j19J21k40Q1k02K84M7K0r6j79
5575a77K30l27L65m33M35j11pJ25M8o0l96K44j76K21K98l40J19j66K35l31L35
5596A31k04J8j11K36k52J46p3K2J18j72J18K48k16J37j24J27k72M6p0K2k43J20
$$ plain form
5440 190 -211 159 -347 41 -80 90 -25 77 3 -385 -192 -134 -53 -184 140 -76 -41 171 -26 102 -162
5461 -162 53 -62 -100 94 -113 87 26 -157 -33 -3 181 -62 59 190 24 -161 138 -85 -7 -112 -34 98
5483 98 -30 149 78 171 -86 -134 163 17 -225 -142 271 -161 -7 38 -149 291 -127 343 -100 19 -67 43
5505 43 197 -186 62 175 60 -113 -126 -3 -81 7 10 17 125 99 57 27 11 232 72 -121 152 -78 -120 -17
5529 -17 10 -65 41 216 -101 228 -216 132 -90 56 -20 87 101 62 -10 10 201 -141 105 66 0 205 -153
5552 -153 62 -28 143 -102 121 187 -12 -49 -8 36 -105 71 106 -13 108 -132 -51 -253 31 78 98 2 -177
5575 -177 53 -274 91 -342 93 -18 -25 100 148 88 -308 -64 -240 -19 279 -61 58 -108 127 -204 131
5596 131 -73 -55 -166 70 -182 -36 -109 -87 31 -141 -23 225 9 146 22 149 -123 -77 -147 -125 -368 -248
5618b48K14j17P3J62j14Q3j27K14j43Jj25L52j85J13k69K6pq7K67l09J29r1K56
5641F8l0j91J69k10M26l43k15L01k36J97j51L12p3N8K5NL1l2j20k65M08k45L04
5664A93l21J49k06K66R1l10J83Q0k88K19j43R5J15l37L04j08J20l2k35J43l8k55
5686c15L09RJ10j50J73o3l03K35k58L04O2qj46J85j54M9l5lK67m03J19M6L8R0
5710A58j0l55o2K72j8O9j48Q5J79j56L2j0K4k02K37j59r9L55j06j29J5MM2k1j68
5735a71J65j0j7j8N8J03K2K0m74K14K91l93K88j53K06N1M2j93J0J70p0J43m45
5758a61K79k7k98K10j44M48l64Q4l36K44LJ14j4k16K00J09J02n6l50j8Q0J88k48
5781a71K70n4J76l73J82j1k4j61K06j08p3L70j97k8j44j08K98j68J21J30j56O7
$$ plain form
5618 -248 -34 -151 -78 84 -30 53 -74 140 -3 -2 -127 225 40 153 -116 -90 -97 -184 83 -226 -97 -188 68
5641 68 38 -153 16 -194 232 -111 -326 -25 -261 -64 -215 97 24 82 107 112 143 111 -9 -274 134 -111 193
5664 193 -128 21 -185 81 172 -138 45 125 -163 56 -87 8 123 -214 90 -18 102 70 -165 -22 -60 -315
5686 -315 -6 3 113 -37 136 73 -230 5 -253 51 113 105 -41 144 -10 39 4 1 268 -135 -16 30 68 158
5710 158 148 -207 -269 3 -15 54 -94 -9 170 14 46 36 60 -142 95 -64 -163 192 86 -43 -28 -24 18 -3 -171
5735 -171 -6 -16 -33 -51 7 110 132 152 -322 -108 183 -210 78 -75 131 182 224 31 41 211 141 284 -161
5758 -161 118 91 -207 3 -141 307 -57 27 -309 -65 -62 52 38 -178 22 131 233 177 -173 -191 -111 77 -171
5781 -171 99 45 221 -152 30 19 -5 -166 40 -68 -141 229 32 4 -140 -248 50 -118 3 133 -23 44
5803D4K47k97J5K33l73L82m03O6R5k16K50p4K53j35J5k39J14J22j78N8l5j4QR1
5827B9j56L36k27r4Q5J21J3J38k73j1K05k57J76Q5k35J78j19K37k06J17j18j9
5849EP2j16J9r2K38Om2j64j79L59l61K56J0j44R2J08o2L7j35j71J84n9J71K8J01
5874A61j24p0l5l2j79L78N6k28K4j3P3j55K87p8j55J41j54j26K97r0M04k76j22
5897a6rj66J00M7Q3q1J75m50N93k96k25M30k55K31j28k5l15K25J22k93K81J07
5919A35J4j73J75k53p0L98l47K18j05K1J25oPk67K60m60M63j56P1q4q6lr1K66
5943E2l3R0k61J8j63K61J31j71J60n3r1J96q2k91j2L24N7j33QJ54k27J88k7J1
5967A06j2q8K31k29J79k71Kr8J80k63J94P5J8j91K30l65M98l50K15l06K38j51
$$ plain form
5803 44 291 -6 9 242 -131 251 -152 -86 9 -207 43 -31 222 87 102 -137 -23 99 -79 -21 -56 -70 -62 29
5827 29 -127 209 -18 -112 -27 94 107 245 -28 -39 166 -91 85 170 -65 113 -6 231 25 142 24 5
5849 5 77 -39 -20 -112 126 132 90 -74 -253 106 -255 1 11 -133 -41 67 5 42 -93 -264 -80 -139 32 60 161
5874 161 37 -33 -68 -100 -279 99 155 -73 -49 -62 11 -144 143 65 -90 51 -103 -229 68 -22 382 106 -16
5897 -16 -25 -191 -91 -44 39 -42 133 -317 276 -20 -245 185 -70 161 33 8 -307 -82 40 -253 28 135
5919 135 149 -24 151 -102 -172 226 -121 97 -8 13 138 132 139 -128 132 -328 135 -21 50 -34 -120 -123 -214 52
5943 52 19 109 -152 -134 -297 -36 95 -76 84 31 -60 136 54 -237 -249 75 132 -1 7 161 -66 122 95 106
5967 106 94 6 237 8 187 -84 -82 -180 0 -263 -69 6 24 -167 63 -302 196 -154 61 -245 -7 -158
5989a58L95m1r8K6k17M0j38L67k00m9P3J12J26k88J65p1j15l4j84L59k34N10l7
6012C09k29l5J25l64L43J1k39J93j96M55l98n9L4K9K75k25Q3M8q4p1k61M00k27
6035h3L03m00L01k80L02j92K7r2P0K62l36N2N7j07j1m3K60j29K05k74L97m47J12
6058d6j7L2k87M40R7k35j10j45O55n53P01p58k9P01n74N90Pr93P38m14O8O21k60
6081B29k77K0j5o9J25j1L8n0r2j63M82l76J38P0oL3j53J51j54m4P3O7j83J63J17
6106A13m40K23J02q9l1J44o4j46L54j11l3m6J43l58L09j23j30N37l75P6j54J17
6128A8P8k47J37j6J04o9L9Qq2n7j13M34k09k14RO5L0Q8k9NL4j18J50j3r4J88p8
6155D8J63l75J39j10L60k89L8M6j13K49j64K05l60J29l1K13m4j85J28m9o0qr4
$$ plain form
5989 -158 237 196 98 124 -93 -53 -191 176 -24 -73 0 112 238 -50 115 44 -71 -105 -289 70 -164 346 309
6012 309 80 45 170 -194 149 160 -79 114 -82 373 -25 -84 -50 -21 254 29 112 160 76 5 -256 144 -83
6035 -83 220 -180 121 -159 143 -49 -22 -114 -44 218 -118 -66 -9 -116 -127 -170 90 -39 166 -108 289 -158 -46
6058 -46 -63 -31 -318 122 219 -16 -126 -271 384 -169 532 -226 -255 446 -128 462 469 -524 214 -200 -132 489 229
6081 229 -48 -28 -43 -112 13 2 40 -10 -102 -265 217 -159 -21 49 43 76 -77 74 -80 -124 -51 16 -167 -4 113
6106 113 -327 -104 -2 -91 -122 22 -42 -188 166 55 22 -24 119 -239 70 -53 -183 354 -21 55 -99 18
6128 18 96 -151 -14 -30 74 5 44 52 -30 -87 -200 234 25 -189 -180 -115 -85 3 -26 -21 13 -105 45 32 -62 126 48
6155 48 211 -164 -25 -135 225 -64 -26 20 -93 156 -8 197 -163 -34 -65 148 104 -81 47 -2 -62 -70 -164
6178a64J97j92J94m2J52k07l0J06l22N02l24J60j67K02j35j18K37J08k56J18L6
6199E5j09r0J30K13k04p7K6R3J61r6r3j50J00np1L0N1M53n66J13K0o7J28j60j05
6224b20K70N9j38O9j04J77o1J76k01L2j4k63M74O7l19R5j87J70j21M5J74l73M31
6247B38k75J66n33N05j86K68k6o4j43P4M8j45N2k02K34l2J57j93R4N2l25M63k45
6270a8k25P4L35j65k8K15l50L9L47k02j80k01M64q3l6R7J16k66P3N5M5M4J0l4
6294A26q2j14K09q0J6o2q4J80j72j6J30j56M41l75k5J38p1j71M7R9n5m7M29l81
6318g6n0K36j43K3P8k40K55lj45J73k14J13l40K59J76j00K12k15K09j30j78K1
6340g9M6o6L0J21j79J28M0j46J8K2J80k36R7R9p1p0J42q9k27M53k51j5K85n23
$$ plain form
6178 -164 33 -159 35 -7 145 -62 -92 14 -308 194 -130 30 -137 65 -70 -188 49 157 -99 19 55
6199 55 -54 -144 -14 199 -5 -82 -56 37 198 102 9 -141 -41 -46 -117 -87 -36 417 -149 -36 -16 -83 45 -115 -220
6224 -220 50 109 -29 40 -64 113 52 228 27 59 45 -218 256 323 4 99 -88 82 -39 6 180 -193 238
6247 238 -37 129 -404 101 -85 183 157 93 -50 24 72 -73 -21 -223 11 -21 136 -57 37 89 -236 227 -18
6270 -18 -243 -169 166 1 -27 188 -162 -123 224 22 -158 -359 105 22 -14 83 199 -67 6 61 106 150 160 126
6294 126 44 -70 139 59 75 13 -71 109 -63 -79 51 -105 336 -39 -64 74 3 -168 -121 -22 -77 -124 305 -76
6318 -76 -126 110 -33 -10 68 -172 83 80 -65 108 -106 7 -333 -74 102 2 214 -1 208 78 -100 -79
6340 -79 -33 -99 -69 52 -127 1 41 -105 -87 -65 115 -121 -24 75 4 -66 76 -13 -240 213 -38 -53 232 -291
6364b91M17j44J70K17m84p6K12j4K84l42L27j70j04M6P4j43j65K14r3m3j6O3j0
6387g1Q4M6m7n0j79J84M2k02K87k08o4N2K32j46oK38k15j78L03K7l42J25K32j64
6411b0r1J04j73l1K34qP0n9k4k9k10K81k84K79r6J3P2q7J35k05J48jj60K01j18
6436e9J40j65K9J6L5K20j93j23mK58k21l6k9K02j02QK02j14N1k1k01J86M0l13
6460a94K24k56J13J93r7Q1l37M48J00k60k1J21l42K59q1Q4j2l1j10J01J86r7q
6483F4J40j89k44J67k36J76O3k23K34Q6k05K83j20P7m9r7jP5qJ64j40N7K3j5j3
6508F9J1k85J23o0J43J32Jl04J06m4K72P9lk96m5o6K60j29J77p8o8j10J22J0O0
6533G7N4k97J69N7k15K62J19k61j20K35j75R3JK8J11r4j59R1P3n3l8Q4M4m3O2
$$ plain form
6364 -291 126 -18 152 369 -115 -191 21 7 291 -51 276 106 2 48 122 -21 -186 28 -65 -108 -124 -61 -71
6387 -71 13 59 12 -38 -217 -33 9 -193 94 -114 -178 -126 106 -40 -46 192 -23 -201 102 129 -213 -88 144 -20
6411 -20 -111 -7 -180 -211 23 15 85 26 2 -27 -237 44 -240 39 -57 -44 28 -59 76 -129 19 18 -142 59 -59
6436 -59 81 -84 -55 -39 -4 216 23 -100 -104 154 -67 -103 -132 70 -32 -24 178 64 115 94 -107 79 119 -194
6460 -194 30 -226 -113 80 -17 64 -273 175 275 15 -6 115 -227 32 -49 35 23 -8 -118 -17 169 72 64
6483 64 204 15 -229 -62 -298 -122 -59 -282 -48 38 -167 116 -4 73 24 -73 -74 1 -7 157 17 74 97 82 69
6508 69 80 -205 -82 -142 1 133 134 -170 -64 -108 164 243 240 -56 -101 -167 93 -36 141 63 -5 -115 7 17 77
6533 77 131 -166 3 60 -155 107 226 -35 -155 80 -95 -2 -1 27 138 44 -115 -24 49 -4 -42 42 86 43 105
6558A05o0r5J18J88j61m7l63L79m6k5L7L3j13j19M01k52j26J08J13l8k37K13J2
6581B5j09J24J72k21m2NM1J4Mq0J22M8q6MJ14l27K67m2j51K1J77p0P5r1k41L42
6607I5k23J72J90j81J42j33K9N3k34oL35k54l4J60k66J64r6J72l74J63K03l4j28
6630h5J31%p3J34rj69k6K64j60J47j97k9p4J00j38J05N0Q4j46L8J19M3J7o4Ll26
6656b61J39J32J97l96K56j33J69l82J82J98l0L9j23n5Q3J04k50l6K07r6n4K60
6678A50l68J14J79O6k4K3k80J54jP9K7j74N1j18pJ84j33LL34k37j21j9P0N1k1
6703a8j13J17J74j62m8J85k14j84K26K84j67j98R3J30J8l44M3L16J0o9k95K45
6725B9j36r4J84J43q0j34J26j09J99j72J63j51o5J45l10J81m9p7K34J37j96K31
$$ plain form
6558 105 45 -50 68 256 95 48 -315 64 18 -7 30 63 -50 -169 232 -20 -146 -38 75 37 -200 13 25
6581 25 -84 40 212 -9 -51 -46 -5 9 13 -67 55 103 17 21 135 -192 75 33 -118 -97 80 10 85 -6 -247 95
6607 95 -128 44 234 53 195 62 91 144 -90 -96 239 -15 -49 111 -155 9 -87 85 -289 -126 77 43 -85
6630 -85 46 46 -27 107 98 -71 -97 167 7 154 -43 -72 -146 -46 -184 -79 -29 55 -91 -53 66 109 126 62 65 -261
6656 -261 -122 10 207 -189 67 -66 103 -279 -97 101 71 110 -13 -68 15 119 -131 -167 40 -56 -110 150
6678 150 -218 -104 75 141 117 140 -140 14 13 92 119 -55 -4 -122 -129 55 -78 -75 259 22 -99 -118 -48 3 -18
6703 -18 -131 -14 160 -2 -50 135 -79 -263 -37 247 80 -118 -25 105 123 -221 -178 138 148 79 -216 29
6725 29 -107 -201 -17 126 46 -88 38 -71 128 -44 119 -32 -97 48 -262 -81 -130 -207 27 164 -32 199
6747A99j39L5r9j17K63l72L39l08K37J79k62M1J27N7m64L88m4k2K0p2PJ29k53
6770a31K01J0j30J88k25O2O1j35Q3j67L52j79n5K39l33L22l88K92n4n8P8k39K82
6793G6j04J60p4k26K79m5j45j63K73p1q2J8Qj70M57k12o4r7J48J89l42l7m4J40
6817a28O4J9k0K84l30K9K38k67q5R9j10R9L5K08pj54K39j79j70K31k23J42n4m7
6841h7K32k56N6p0J95k84K29k10M6K29q1j06R7J76l31K1Jp4J36J09j16J15r4P1
6865DJ04m8p8o3L19l01O2k47M59j51j74K18j1l46J25J19k39M36j06k52L28nk11
6888e8J69n2J99j12l7o2K4l37J0K58J84O2l69k9J90n6R0O3r3o8K81j75l2J91l46
6913a05K55p5l9n6J6J18k01K8K42l05J9J73j8L5n8J44k11M2k4j08K56p5j1l8j38
$$ plain form
6747 199 60 95 -4 -121 142 -230 109 -199 38 217 -45 -4 123 180 -284 104 60 38 58 -14 -7 122 -131
6770 -131 70 80 -50 138 -87 -25 36 -99 -16 -183 169 -10 -65 174 -159 163 -225 67 13 -45 33 -206 76
6793 76 -28 132 58 -168 111 66 -79 -242 31 -40 -122 -104 -96 -266 191 -21 -85 -182 -34 155 -187 -224 -268 -128
6817 -128 -64 -45 -65 219 -111 -82 156 -111 -196 -97 -207 -108 -73 135 128 -26 213 34 -136 95 -128 14 -40 -87
6841 -87 145 -111 -55 -125 70 -214 15 -195 -149 80 -1 -107 -10 166 -165 -144 -143 -217 -81 28 -88 27 -67 4
6865 4 108 60 -18 -81 238 -63 -1 -248 211 60 -114 104 93 -253 -128 -9 -248 188 82 -170 158 153 -58
6888 -58 111 59 258 146 109 47 71 -266 -256 2 186 248 -121 -150 40 -16 74 137 44 -24 257 82 50 241 -105
6913 -105 150 75 36 -20 -4 114 -87 -59 183 -122 -103 70 52 87 29 173 -38 4 -20 -128 128 53 42 4 -134
6938a34J19Q2R5j84L1k20K76j07m9j44L44n3k24K06n4J73m02K66k2J56k43M8O
6961c4Q0j64J22J04Lj28J2N7n7Q4j37J3K1j8P9k77P2K03l3P7q2j95L15k00P3l8
6987d8j35J38M11j97j13k51L94j25L31k20l86M65k91j63N1K37l05pK9L69k56K32
7009A60k58l64K05K16M0J33k1n19O55K47k90m1p35L32M22l50L35K32o23M06l26
7030a44n2K5O08o69Q03p94Q9J82J62j4k72l22L43l08l54J031l94lj52L25k63m96
7052f69R05L13p15M93p47K92P21m29N52K83n54o60K90m99j1Q47L66k21l47o08
7072c98L17O26j151R40j55K2m9P09p57m82Q44K50k05m27J10m98N2m78J624p10
7092A84J3K48m68l79N18j78l88P8K68M9n28J19J201m79m27k10M83n63P46N4k82
$$ plain form
6938 -134 -15 67 162 -22 9 -211 65 -42 -91 -235 109 56 -168 38 -16 157 -245 21 -1 155 -88 -40 -34
6961 -34 46 -118 4 108 111 -17 -5 52 -5 79 -58 -45 -24 -42 37 -240 -168 35 2 79 -3 -198 117 -83 -10 -48
6987 -48 -183 -45 366 169 56 -195 199 74 405 185 -201 264 -27 -190 -139 98 -207 -214 -185 184 -72 160
7009 160 -98 -462 -257 -41 -1 132 111 -408 247 494 204 163 -572 -240 182 -168 167 399 -224 182 -144
7030 -144 -196 -171 437 -232 571 -223 -134 48 210 196 -76 -398 -55 -363 -717 314 -80 -83 -235 90 -173 -669
7052 -669 236 549 -166 327 -420 -128 593 164 716 999 445 -215 75 -424 -435 412 778 557 210 -398
7072 -398 -81 545 -606 334 179 201 152 861 104 -378 466 716 511 84 194 -304 -252 -730 894 184
7092 184 197 445 -23 -402 116 -62 -450 -372 -104 -55 -583 -464 737 258 -169 -379 104 -459 287 341 59
7113E9L9l72O7j99N88J6j85n4l1P7j72j7K73k61O14j88j7k3k23L3j49L82l15R3
7137C5K48k43J69k80J29K67K15p24L99J78k04j74N9j60L49P6k87J02r2J75l16
7158g9J8M71j63K13p73L00p3j0K06k54K55Q8k09M81k71Q9k46J64j72k12K09p4
7180d2L05m80K18o7Nk87L20K62j23k09J18K4J03q7Q9j49j23J85n3k40M84l47J17
7203B3k00O3J37o4n7J42J51l23J78j07K82k97J16j19K10J09k69L05k90k26L52
7224A16j2k18R9j19J38o6r4J09P8j89R8K4r1J4J38K5L6l2j29K34j29P8k21L54
7248B41k3j59MJ6L3k85PJ70K20k75J37k11K15j33rj07K67k73L46l69J71J02R1
7271A76o8k53J98m5J06k20K24k33J23P4q4O1r0n0L3O4K13j42o5K1j5k37K53n4
$$ plain form
7113 59 98 -274 -207 -406 182 198 13 -41 -72 5 -167 -184 89 -172 442 254 237 214 -9 24 -125 257 -58 35
7137 35 283 40 209 -71 58 325 540 -184 215 393 189 15 74 -86 263 339 52 154 62 237 -79
7158 -79 -61 410 247 460 -313 -13 -86 -96 110 -144 111 199 -10 471 200 289 43 207 35 -177 32 -42
7180 -42 263 -217 1 -66 -61 -348 -28 234 111 -98 20 44 147 60 149 0 -123 62 9 -231 253 -94 23
7203 23 -177 -114 23 -41 -98 44 195 -128 50 -57 225 -72 44 -75 135 244 -25 280 -10 -236 116
7224 116 104 -114 -15 -134 4 -62 -156 -47 31 -158 -60 -36 -127 -113 25 50 86 54 -75 159 30 108 -113 241
7248 241 218 59 63 79 112 -173 -166 4 224 -51 86 -125 90 -43 -52 -159 108 -165 181 -188 -17 85 176
7271 176 108 -145 53 8 114 -106 118 -115 8 82 -2 59 -31 -81 -48 16 229 87 22 43 28 -209 44 -10
7295a0n7j09K06J8k12M89l32J38m05K99j0N0P0q3n7k11J53j09N4J08R3k88L90
7318A85k09k8J18k82L60j8m13M29K9l1O5m30kL33k0K0j13M3J11j52N9j49J4M74
7342C93n27J86q4P0j68P4k86L32m9K17n12K51J03j1oMO8r7R7q9J28O2j30R0m0
7367G6n4L8j25J23j42K59k05nq0L50k57Q8j03j69K33n9P4J48J2l38K37k3p8J27
7391A27j27J14j28J40P5k87J04K1p8KM6P5o0J07k26K96k60j21J93o0O0k09J95
7414aP8k19J71j17Q9J39j01k91K94R1j96J84k15J44j23J96k35J69N1j80R0j15
7436i7K9j70J80%K43k13J86j09m7j95J44n8J3O8J6n9j46L78q5m9N0j93O9M7N6
7461E8j21pJ42q7L14l40L13m84N30m07j3j3Q6k35J27L24j90k59J00K58L7k86L54
$$ plain form
7295 -10 -67 -176 30 48 -164 325 -7 131 -274 25 15 65 135 52 -5 -216 -63 -172 -118 -10 83 -205 185
7318 185 -24 -52 66 -216 144 126 -287 142 171 140 205 -225 -227 106 86 106 -7 36 147 -5 54 -95 -81 393
7342 393 -134 52 -32 38 -130 -56 -342 -10 -59 158 -354 -103 0 -11 -17 -13 55 -42 55 -34 94 156 26 116 76
7367 76 22 60 -65 58 -84 175 -30 -35 -115 235 -22 66 -37 -206 27 -32 42 190 202 -136 101 78 0 127
7391 127 0 114 -14 126 201 -86 18 39 -39 -37 9 84 24 131 -95 201 -59 -180 13 -47 13 -196 -1
7414 -1 77 -142 29 -88 1 140 39 -252 42 133 -63 121 -94 50 -73 123 -112 57 108 -72 18 -97
7436 -97 -68 -238 -58 -58 185 -28 158 49 2 -193 -49 -107 -94 -26 -10 -69 -215 163 78 29 79 -114 -45 2 58
7461 58 -63 -70 72 -15 299 -41 272 -212 318 -89 -102 -115 -29 -264 -137 187 -3 -262 -162 96 133 -153 201
7484B01m08L01J1L0P0k47K44k56Q6j40J30j93K76J20n45K96J85m5l15R3R1l1l
7507d9P3K46m47L98k11L8pk95p0K89J46r0P5j5R2j26m0R4o5j16J6K32j80K2J21
7532A31j81J65j68K50j43j61l5J07K3k11K09j36K16l16M93n46K78r9J48J12k79
7553a43K16k55L12k99M23k56j28J21j25P0J26M2k69M0R4KJ32k93J44n4m7J22o8
7576i3P5Lj4J16k74J28o4J89Mj40K96kl51M8n5N3K18k41J58j25Q2o1R5J29k92
7601a18K02k28O6K5l7J65k19L53n16O44k54j15L8N0J90l28K51N1r6j3j66J41r9
7624a3nM5k03J89j31J78l86L43o7P9p4J20k47N7K55j35r1j29K68r2J2l3m7J67
7648F0k07J51L1K10j67k9j16Q7J42P5j29r1N2j42J32M9k47J16J66j47k2J5J27
$$ plain form
7484 201 -207 94 105 135 205 -42 202 -54 32 -108 22 -171 105 225 -320 -24 161 116 -199 -106 -15 -46 -49
7507 -49 24 270 -177 221 10 48 41 -254 -324 -35 111 21 96 81 173 47 7 101 36 -80 -64 168 -12 10 131
7532 131 -50 115 -53 197 54 -107 -142 -35 -12 -223 -14 -150 66 -250 243 -303 -25 -124 24 136 -143
7553 -143 73 -182 130 -169 254 -2 -130 -9 -134 -64 62 104 -165 -125 -31 -29 103 -190 -46 -100 -147 -25 -93
7576 -93 -18 -15 -29 87 -187 -59 -123 66 70 -70 226 224 -127 -79 -134 -81 137 -104 54 -71 11 -50 45 174 -118
7601 -118 84 -144 -78 -53 -90 75 -144 209 -307 337 83 -32 6 56 246 -82 169 220 124 111 -55 86 -13
7624 -13 -18 27 -176 13 -118 60 -326 17 -50 29 -45 75 -172 -115 140 5 -86 -215 53 -39 -27 -60 -107 60
7648 60 -147 4 35 245 78 49 -67 20 162 237 108 17 69 -73 59 108 -139 -23 143 -4 -26 -11 116
7671A16q5J79k57J52o3k49j08L70n8P9k41P1J32n3K6j24M8pJ56l77L32j35K5Q9
7695A8n0m1J69q9p2o5Q1j44K93l5j03L5M8MM1N4j33j6p6L10p5k01J4J48k29J54
7721D0J29j90K8J22o2r6j01J44k39K61k1K25k75n6lP6R3j21K83l98J71k4K60j63
7745H3k42k2L61m8j01J3j23N6JJ93j55n0J22m7N4L4k03J00n9L40l20J40j91k57
7769c21L96j95J26o6J71k64P2J96o3j45J7Q7K6j12K4J2M09l28K49k58m6j4K8M9
7793E0k20O3J39j09J64j31Qp3J58j71m8R9K48k71M16m00j14K54j2j14j13K05K1
7816D9j60j12L33j07j05K94j79Q5r0p7J48j37j38K83j5K6j15K09k72K15l28J05
7838h8Mk1K38j98Q1L6Nj19j8N1R5j27J22k20K7L61j55k1j20R2n5N0o7P1K4J51
$$ plain form
7671 116 31 210 -47 105 42 -207 -315 55 -3 76 -165 -94 38 -15 11 -113 -65 -72 84 -293 39 -96 -71 18
7695 18 -32 -73 96 7 -65 -130 -49 -193 100 65 -38 -3 45 49 90 144 11 -5 -81 229 154 -47 -33 115 -114 40
7721 40 169 -21 7 129 67 -29 -130 14 -225 36 15 240 -35 -91 -94 -18 75 -46 237 -161 10 -14 246 83
7745 83 -159 -181 180 132 31 44 -79 -23 -22 171 16 -34 88 41 95 129 -74 26 -33 307 -13 127 -64 -321
7769 -321 75 -120 6 -60 111 -153 -81 115 52 -93 -76 11 37 -75 -51 -39 370 42 291 33 -13 -27 1 50
7793 50 -170 -107 32 -77 87 -44 -36 -109 49 -122 -170 -71 177 -94 322 -78 -192 62 50 -64 -177 28 49
7816 49 -111 -223 110 3 -102 192 13 98 8 -69 79 -58 -196 87 72 98 -17 192 -80 135 -193 -88
7838 -88 -84 -105 133 -65 16 52 57 -62 -80 -29 66 -61 61 -159 -132 229 74 53 -67 25 -30 20 -47 24 48 199
7864A99k83l3J38j23Q2j89J60O2J46N7l67J60p4R9l7K82k68L7K9P3q7Kl7j11R1
7889HQ9j12lM3j77k1NJ48J85m37J80J0j39L30k99L21p3l0J88k40N5m2K26j54q3
7914b2N9p1q9J03j52KL44j85J63j47J21R7l85J75k28J84K81m23PK31m2j36J08
7937eL4k24J80K7j56P6O6n6O0k22L50J5k16j1M1j95J68J19kJ90m08O5L00k80L2
7962e2J44p0M2o1R5m12L13r0J69j03O5R7j62J92l85L82j76J29j12K49r5k56k6
7985a23J19r5J01J62Rj91M4R8N9l35P3k07M17j10o8N2j07K89l57J15n7L35k32
8008ij45M6o2M28j42j1r3J48l61J30L16j59Rj91n1j96L34j91K76K55l53j64M87
8031C01l06K3J08r8O8R3l16K53k0k13J03L7k2K43k05k39J77L47m19J88j00r6p8
$$ plain form
7864 199 -84 -117 21 -102 -20 -209 -49 13 159 216 -151 9 -65 34 -3 279 11 48 77 150 63 65 28 -83 8
7889 8 97 -15 -18 25 -152 -173 -168 -20 165 -272 -92 -82 -221 109 -190 131 58 28 216 -24 31 -11 215 61 -22
7914 -22 37 -34 -123 -20 -172 -170 174 -11 152 5 126 223 -162 13 -215 -31 250 -173 -166 65 23 -113 -5
7937 -5 29 -195 -15 12 -144 -68 -2 -58 2 -220 130 145 -71 -82 -41 -236 -68 51 49 239 -169 -104 196 -84 -52
7962 -52 92 22 64 3 98 -314 -1 -91 78 -25 40 137 -25 167 -218 164 -12 117 5 254 159 -97 -123
7985 -123 -4 -99 2 164 173 -18 26 124 183 -152 -79 -286 131 21 -47 5 -102 187 -170 -55 -112 223 -9
8008 -9 -154 -108 -170 258 116 105 12 160 -201 -71 245 86 95 -96 -147 -343 -9 -200 76 331 -22 -186 301
8031 301 -5 18 126 28 96 189 -127 126 106 -107 -4 33 11 254 49 -190 -13 334 -85 103 3 -93 -171
8054a71J04j1l7J8J30j10kJ25o9j6j6K7M0j24J40k61P2K72k96K76l07J43J78n6
8078D9j65R5L1j34J06j84J89k2k59L62K6l8j65qQ2j42Q1K29r4J32j5j43l8J07
8102H2N5k53M04l54l3J12L3K0nM6o4k76K11qQ8L0j22J24j0k98K53r7m1J59Oj42
8128h0J23m9l3R3j28j17K83j34o2J12r8q8J10J11J34j98m2J52j31M8j27J70Kk88
8152b37J52N1K01k65J58no8O4J31k00o1ko7o4L50M2l14M2Q9j20M05l83K98l49
8176a52R2k18O7L01o1J82k72j33J72J32j08N7r2m7R4
$$ plain form
8054 -171 -67 -78 -115 -97 33 -77 -79 46 -23 -39 -55 -28 12 -112 28 -233 -161 111 -185 91 -216 -73 105 49
8078 49 -116 -21 10 -124 -18 -202 -13 -35 -294 68 94 56 -109 -117 -35 -177 -96 133 39 171 156 13 -25 82
8102 82 137 -116 288 -66 -99 13 46 66 61 107 43 -233 -22 -30 58 88 -34 90 80 -218 35 -62 -103 56 62 -80
8128 -80 43 -6 -39 54 -74 -191 92 -42 -104 8 -90 -178 -68 43 177 -21 -63 89 -42 6 -121 49 51 -237
8152 -237 -85 -34 167 -98 60 55 -13 51 182 -18 -79 -81 -148 -212 138 180 -134 -92 -3 -123 282 -101 197 -152
8176 -152 -60 -278 -211 90 29 211 -61 -194 -22 110 2 59 -33 -80 14
8191A4
$$ Imaginary data points
##PAGE= N=2
##DATA TABLE= (X++(I..I)), XYDATA
0@%%%%%%%%%Qj6J6j6K4l2M0n6P2q8J04j22J46j76K11k52K98l47M03m68N41o24
31c34P16q17R29j052J189j342J509j692J894k116K355k617K905l218L561l937
47b067M349m796N284n819O407p056P775q573R462j0462J1591j2877J4361j6096
61h517J8156k0644K3721k7646L2848m0138N1250p1263J71524m24795M89873j4403
73A79966m46307O33680n56819J27147L84805n89274K88773J24670l89507M52096
83B09230l20110k5218L30425l59112J60941O6454j78047J82570p3031j05227K11528
94A00403j07116p1363J82262k14940J43579N2235k25541K05483l6046j46025K18811
105A01742j73810l593K49818l75763K11562Q2826k76353L25818k40092L314K54283
$$ plain form
0 0 0 0 0 0 0 0 0 0 0 8 -8 8 -8 16 -16 24 -32 40 -48 56 -66 80 -96 115 -137 161 -186 217 -251 290 -334
31 -334 382 -435 494 -558 631 -711 798 -894 1000 -1116 1239 -1378 1527 -1691 1870 -2067
47 -2067 2282 -2514 2770 -3049 3358 -3698 4077 -4496 4966 -5496 6095 -6782 7579 -8517
61 -8517 9639 -11005 12716 -14930 17918 -22220 29030 -42233 129291 -295504 194369 179966
73 179966 -266341 367339 -189480 -62333 322472 -266802 21971 146641 -242866 209230
83 209230 -110880 -136098 194327 -164785 -3844 62610 -115437 67133 -5898 -111125 100403
94 100403 -6713 -78076 104186 -110754 32825 85060 -140481 65002 28956 -117069 101742
105 101742 -72068 -75661 174157 -201606 9956 92782 -183571 142247 -97845 -94531 159752
116A59752l08161J31581J02675k05901J93191j05345n9345K33629k26641P9126
126e439M3305q2672J13382j03935M4098K7477k6417q712O913L0964k0839J950
138B0075j8528J4479K8742l2188k2264O5095q2582O4541j5399q6176J72323j67541
150e9423N0374O5857j47249J69754r1170p0591J67163j28473J1255J08049j70823
161i5277J50558k6390j31245K02233j26082J6632O0375j00479Q3380O452p8347
172c8190O0508J6713p9090Q2076n2783q33O6322r4819L1648M1964n9814K8319
184B021K3609q9215J15810o5517m1290J37422j52625R2594N318j01263J44894
195G1758p9257l4182J11407j13705M8051O5107j50445J51907o2736o0172J36354
$$ plain form
116 159752 -148409 -16828 85847 -120054 73137 -32208 -91553 142076 -84565 -5439
126 -5439 37866 -44806 68576 -35359 8739 36216 9799 1087 8000 38964 18125 20075
138 20075 1547 16026 44768 12580 -9684 55411 -27171 37370 21971 -64205 108118 -59423
150 -59423 -9049 56808 -90441 79313 -11857 -82448 84715 -43758 -32503 75546 -95277
161 -95277 55281 28891 -102354 99879 -26203 -9571 50804 -49675 33705 40157 -38190
172 -38190 22318 39031 -40059 42017 -10766 -11599 54723 -40096 -8448 33516 -26298 2021
184 2021 25630 -63585 52225 -13292 -54582 82840 -69785 22809 28127 -73136 71758
195 71758 -7499 -41681 69726 -43979 4072 69179 -81266 70641 7905 -52267 84087
206H4087j33361P2730J7374r0083Q2210j4305m8541O9144m6923j2759O8475q9974
218d1926N6711O346m8941M3923k2438o122K5456p383l8526O4197n4302R175M7963
231C4133p8277O8159k5251l0783N8871l3161j5374N5108o3766K4073M3878r1082
243e3472R3630m9206k0610O9493p4475L9647J2682m6849L3839N584m6542O3363
255B7084l8156j4914N7922p1662M9190k209l2470L3727j0032j9669L3250j1044
267A017k8965O1007o4649L1203K1929n4640N7487k8445j5769M0969k6255j3655
279a8766N4054o5250L3225K4152p1933Q8582n5805m772N0782n9866L3655J4224
291B2282m7367M0904n83m8953P6444o0407J1781M1012p4424O4075j9982k1808
$$ plain form
206 84087 -49274 23456 40830 -49253 32957 18652 -29889 39255 -7668 -20427 48048 -41926
218 -41926 14785 21131 -27810 16113 -6325 -12447 13009 5626 -32900 31297 -23005 -13830 34133
231 34133 -44144 24015 -1236 -32019 26852 -6309 -21683 33425 -30341 -6268 37610 -53472
243 -53472 40158 -9048 -29658 39835 -34640 5007 17689 -29160 4679 10263 -36279 27084
255 27084 -11072 -25986 31936 -39726 9464 7255 -25215 8512 -1520 -21189 12061 1017
267 1017 -27948 33059 -31590 -387 21542 -33098 24389 -4056 -19825 21144 -5111 -18766
279 -18766 35288 -29962 3263 27415 -44518 44064 -11741 -16513 34269 -25597 8058 22282
291 22282 -25085 15819 15236 -33717 42727 -17680 -5899 35113 -39311 24764 4782 -17026
303a7026L6546k5418r598L9488l8978Q322L3471o3168N7201k4235j4314M2917
315B5208m1689J2002J5439k0727O320K3658m6873M3219j2805k6950N5899n2564
327a9863K4465O890k8416K5855L67k4889K8083j0328k3181N0688n2452K9821N488
340A2528l6944M3700k6634L881J3628j3052n102K4506k8038J6564J1052l5438
352a9349M1719k8912R943J0516j5447O695M417o986k454K1491l3830L1448j6451
365B800r824K9945l0561J4917n12j0153N029R870k5590K5166r751k0427L8271
378A9180m0758K7621n615k0097K3735j2057l164R005m441j2144K7271l2629K1879
391b214N415k5561K9846k3688J0776O638p828n219J7512j6045L336J5036l1161
$$ plain form
303 -17026 19520 -5898 -15496 23992 -14986 -6664 26807 -36361 20840 -3395 -17709 25208
315 25208 -16481 -4479 10960 -9767 -3447 20211 -26662 16557 3752 -23198 32701 -19863
327 -19863 4602 11492 -16924 8931 9298 -15591 12492 2164 -21017 29671 -22781 7040 12528
340 12528 -24416 19284 -7350 -3469 10159 -2893 -7995 16511 -11527 5037 16089 -19349
352 -19349 22370 -6542 3401 13917 -1530 5165 9582 2596 142 21633 -12197 19251 2800
365 2800 -7024 22921 -7640 7277 6765 -3388 1641 11511 -14079 11087 1336 -19091 19180
378 19180 -21578 6043 428 -19669 4066 -7991 -11155 -2150 -6591 -18735 8536 -24093 -2214
391 -2214 3201 -22360 7486 -16202 -5426 1212 -6616 -11835 5677 -10368 -7032 8004 -23157
404b3157L8323k7084j810K0661k0345J1956k361j0999J0580Q778k9919L4694j9753
417a0436m08K1984l7030L9226j3425p880J3419n975K591R479j2713J569K2007
430B2408l2543K5053j0420j710J5153k4276J1812J961j34j2481J5224j6681J1996
443E362J252k3826L3868k2704L569M407p395Q938K938j7606J1280J0938k6095
456a5074K9712k8059J4900R488l1352K7985j1229J558N89o987L16J6476j9971
469a1648K438J4896k1650K4115k1929R033J0900j2835N46L488N771r233J4034
482G926k4284K4098l433j8739K3389j6847R349j213j0045O123J4337k5315J4032
495f22K012j4545L1193l7763K2743N288j8979J8757j3082P434O930j1739l864
$$ plain form
404 -23157 15166 -11918 -13728 6933 -13412 -1456 -3817 -14816 -4236 4542 -25377 9317 -10436
417 -10436 -10844 11140 -25890 13336 -89 -7969 5450 -525 2066 11545 -1168 401 22408
430 22408 -10135 14918 4498 2788 17941 -6335 5477 7438 7304 -5177 10047 -6634 5362
443 5362 6614 -17212 16656 -6048 -2479 1928 -5467 3471 6409 -11197 83 11021 -15074
456 -15074 14638 -13421 1479 10967 -20385 7600 -3629 -2071 -1482 -8469 -8153 8323 -11648
469 -11648 -9210 5686 -15964 8151 -13778 -4745 6155 -6680 -6134 -2646 3125 -6108 7926
482 7926 -16358 7740 4307 -14432 8957 -7890 1459 246 -9799 -3676 10661 -14654 -622
495 -622 1390 -13155 18038 -19725 3018 8306 -10673 8084 -4998 2436 9366 -2373 -6237
508f237K1782k1210J2948m900j1136K8049k9428J1675J385k528J66l218j528N001
522H21O679k4648K3875j1613J786O360j5268J4877j812p749l20J4163j8177J7189
536F163j4032k900K6157l2211K0302o764k203J0489j1826K129J0700p642o063
549g701J5016j8320K2051j4377m422J7937j7476J1680r042N070j235K027r492
562h284O188O360j4926J3989j4107J0740o30n409K138N152k613m185J2600j6113
576i100K2615j6112J7J5576j6841J4733r236J307M151n23r699J2606p204l623
590a333J1301k1615K2795j3774n47O418q934Q261m713J914l524J0740j4113J1394
604D270j981m432J2995j5974J2326m050J987k635M210n301K392M173j4317J9923
$$ plain form
508 -6237 15545 -5665 7283 2383 -8753 19296 -10132 1543 2928 400 566 -2652 -4180 821
522 821 7500 -17148 6727 -4886 -3100 3260 -12008 2869 1057 -6692 -7012 7151 -11026 6163
536 6163 -7869 -10769 15388 -16823 3479 -3285 -5488 5001 -6825 -4696 6004 -1638 -7701
549 -7701 7315 -11005 11046 -3331 -7753 10184 -7292 4388 -4654 416 -819 1208 -8284
562 -8284 -2096 4264 -10662 3327 -10780 -40 -670 -6079 -3941 1211 -1402 -5587 7013 -9100
576 -9100 13515 -2597 -2580 12996 -3845 10888 1652 2959 7110 6587 -3112 9494 2290 -1333
590 -1333 9968 -11647 11148 -2626 -3173 3245 -5689 2572 -2141 -227 -3751 6989 -7124 4270
604 4270 2289 -2143 10852 -5122 7204 3154 5141 2506 6716 1415 3807 7980 -6337 13586
618A3586j8633Q277O83r688J1846q561J279P9K438q839J3736j3434O145N519j6380
633a1947K0991j6445Q447P93n550M079K42j204n64O758j4556J7076j2495L872
647e03M871j0980J2423r863N023l161N516p472N335j663l791J2062j6267J2950
661D480o414J333J583l028L244k015L049r453J4638j2820Q161k142o544J3422
675G494j3154P298k988K581l146L713n709M387M538j4025J5772j3236R407k396
689E36n915Q130m639K240m910P740q356R485r830K975P460j1736J0380r359P738
704A939l416R56k774L775J522q593J1784j2447J3652q343k167P830o124M518m171
719b059L808l650Q164j2797J0007M33p595J2167j5933J4256m633k747L188p42
$$ plain form
618 13586 -5047 3230 3913 -5775 6071 -2490 -1211 -1132 1306 -7533 6203 -7231 -1086 4433 -11947
633 -11947 9044 -7401 1046 1839 -3711 368 610 -594 -1158 5600 -8956 8120 -4375 -503
647 -503 4368 -6612 5811 -4052 971 -2190 3326 -4146 1189 -474 -4265 7797 -8470 4480
661 4480 -1934 -601 982 -2046 1198 -817 2232 -7221 7417 -5403 2758 616 -5928 7494
675 7494 -5660 1638 -1350 1231 -1915 1798 -3911 476 5014 -9011 6761 -6475 2932 536
689 536 -5379 2751 -1888 352 -4558 3182 -5174 4311 -5519 -2544 4916 -6820 3560 -5799 1939
704 1939 -1477 -521 -3295 480 2002 -6591 5193 -7254 6398 -1945 -4112 3718 -2406 2112 -2059
719 -2059 1749 -1901 6263 -6534 3473 3906 -3689 8478 -7455 6801 2168 -579 2609 1867
733A867M71q97J456n930J3379j4995Q232j432l335Q707j2589Q950l847L575o243
748b631N226k270l09L435j0509J4256j0511M582k930K2L536l414J511m351J0061
763E704j2539J0007o212J793N827j2700J1516o311M113l518J943k087L776k592
777a280m352J0979j2450J1000r020L377M125o832N450n300O900o462N893n972
791c944N349k27n241Q068p723Q693p918N022k200K723p76l861P990r945J0533
806F543r481N294J129m717M341m337N021n051N455p762Q466n099j032O387j0470
821e313J1841j0223N322j115k42N78k113L180m668P239r553Q910n280O94K783
836B040n594P560p759O528o117N871l851L48L416p113Q820r187P202l897J354
$$ plain form
733 1867 2338 1441 2897 -3033 10346 -4649 3583 2151 -1184 7523 -5066 3884 37 3612 -2631
748 -2631 2595 325 16 3451 -7058 7198 -3313 1269 -1661 -1639 1897 -1517 -6 -4357 5704
763 5704 -6835 3172 -3040 -1247 4580 -8120 3396 -2915 1198 -2320 -377 -2464 1312 -1280
777 -1280 -5632 5347 -7103 3897 -5123 -1746 2379 -4453 997 -4303 2597 -3865 2028 -3944
791 -3944 1405 1178 -4063 4005 -3718 4975 -2943 2079 -121 2602 1826 -2035 5955 -3990 6543
806 6543 -2938 2356 3485 -1232 3109 -1228 3793 -1258 4197 -3565 4901 -198 -1230 5157 -5313
821 -5313 6528 -3695 1627 512 270 848 -1265 1915 -2753 4486 -5067 3843 -1437 -743 2040
836 2040 -3554 4006 -3753 2775 -3342 2529 -1322 -974 2442 -4671 4149 -5038 2164 -1733 -379
851c79o96l09J653l594O214r258J0582q694L718K583o459Q660q799O715l785L354
867A506l129K740j424j142M998q655J1005r864N927k423j050M770o681O516o448
882c354O992o483M137r15j337L865o486P057n531N707o304M528j483j047L957
897C303q669J1539j0347N696j791j286M216n325L288k846M321m980N176n436M637
912A496n18n441R841r559Q668o821K405J896k900K633m654O426o324N199n868
927c521M616j256k115K610m582P643q713P457o111M403R24o209R312q112P377
942C723n326J942J177j97j124k56L092n440P955j0873R344l949k428N673q646
957e333R883p932L378j427J520l27j453J943k176N401p821P709n195M380j977
$$ plain form
851 -379 -1075 -1384 269 -3325 2889 -6369 4213 -4481 -763 1820 -4639 4021 -4778 1937 -1848 1506
867 1506 -1623 1117 -307 -1449 3549 -5106 5899 -3965 1962 -461 -1511 3259 -3422 3094 -3354
882 -3354 3638 -2845 1292 377 -960 2905 -3581 3476 -2055 3652 -2652 1876 393 -654 3303
897 3303 -5366 6173 -4174 1522 -269 -1555 2661 -2664 624 -2222 2099 -2881 2295 -3141 1496
912 1496 978 -4463 5378 -4181 4487 -2334 71 1967 -933 1700 -2954 3472 -2852 2347 -3521
927 -3521 1095 -161 -2276 334 -4248 3395 -5318 2139 -3972 431 1355 -4854 4458 -3654 3723
942 3723 -1603 339 1516 1319 195 -61 3031 -2409 5546 -5327 4017 68 -2360 3313 -5333
957 -5333 4550 -3382 -4 -1431 89 -238 -1691 252 -1924 3477 -4344 3365 -1830 2550 573
972E73k399O302p586Q263r405O871k132k262L875n700N696m402J899k842M445
987A196m993L441j441k107Q263j2035J1170p231L289J576o226P799n397L813l529
1002b412L113k117K688l390R23L048n832P486q994Q572n590J136K323n370Q642
1017D226r046O551l605J807L32j326J372m45J669l919O412q053Q110n690K24N848
1033D467r694J0734r266N191m41k136K704k176J684j928K560m402O702o979M867
1048A887j771k149N970r008R628q303N441j465k769M929n928N241l975K795k367
1063a844K623l199L021j367j929O406r611J0356q576M393J412o068Q246p382N184
1078A665k863R67k93J232k221J529R01m228P552r210Q698n437J159K947o119Q508
$$ plain form
972 573 -1826 4476 -3110 5153 -4252 2619 487 -1775 2100 -3600 2096 -2306 -407 -3249 1196
987 1196 -3797 -356 -1797 -3904 4359 -7676 3494 -3737 -448 1128 -5098 2701 -2696 1117 -2412
1002 -2412 701 -1416 1272 -2118 -1195 1853 -3979 3507 -5487 3085 -2505 -1369 954 -4416 4226
1017 4226 -4820 1731 -1874 -67 265 -1061 311 -134 1535 -2384 4028 -4025 4085 -1605 -1381 4467
1033 4467 -5227 5507 -3759 1432 991 -1145 1559 -617 1067 -861 1699 -2703 3999 -2980 1887
1048 1887 116 -2033 3937 -5071 4557 -3746 1695 230 -2539 2390 -3538 1703 -2272 523 -1844
1063 -1844 779 -2420 601 -766 -2695 3711 -5900 4456 -4120 273 1685 -4383 3863 -3519 1665
1078 1665 -1198 -231 -524 708 -1513 16 917 -3311 4241 -4969 3729 -1708 -549 2398 -3721 4787
1094D787q182N868k941J304P75k128K020j140J819l392N003o076O773n239M82
1109b67M302p630R875r727O364j587k098L727m300L490k410J538k714M968n644
1124b113L979k026j217N702r109Q876p256M382p61l332N407n531M815m458L080
1139D38j610J784k588J266N74k132M375p510R424p475L608K62m115P520q389O114
1155A546l292J792k56q41J90J089L50l710O391p299P612o063J787L691o750P564
1171C801p290N970k602K39J38p27K205k574K896l980N597n361L750k410L83L588
1187C623o929P818o887N619l013r50M156m774L932l786L078k239K711l883L198
1202A674j227j841M504p436Q731p302L447k60k726N016n681M256l302L136k755
$$ plain form
1094 4787 -3395 2473 -468 836 1611 -517 1503 363 2182 -1210 3793 -2283 4490 -749 -267
1109 -267 4035 -3595 6280 -3447 2917 1330 -768 2959 -1341 2149 -261 1277 -1437 3531 -2113
1124 -2113 1866 -160 -1377 4325 -4784 4092 -3164 1218 457 -2875 2532 -2999 1816 -2642 438
1139 438 -1172 612 -1976 -710 -136 -2268 2107 -5403 4021 -3454 154 416 -3699 3821 -4568 1546
1155 1546 -1746 46 -210 -1051 -861 228 578 -3132 3259 -4040 3572 -2491 -704 2987 -3763 3801
1171 3801 -3489 2481 -121 118 256 -471 1734 -840 2056 -1924 3673 -1688 2062 -348 35 3623
1187 3623 -3306 4512 -2375 3244 231 -719 3437 -1337 2595 -1191 1887 -352 2359 -1524 1674
1202 1674 447 -1394 3110 -4326 4405 -2897 550 290 -2436 2580 -3101 1155 -2147 989 -1766
1217a766K124j405P71R23l654N896o463O462n575K863Q78l658N550o471N901m117
1233a741J647m04LQ23j615K070l210N101o023N760l788M90K979n759P139o598
1249c126M963k687N82J301j869J916k271L397m194M562m538L798j502j544L854
1264B642n855O738o161M365k062p46K518l946M107m140L310k898K578k782J949
1279c83k60j916M211o064O709n647L150j89k598M393m827M326l496K856k044J574
1295b05q52j04J877l897N518n894N573m075J305J945l820M889n535M756l071J957
1311C67r85k28J390j990K752l777N010m383L507k256K95K754n279O332n762M793
1327B540k582rJ776j907K296l140L470l296L868m491K785k71j999L593n905O555
$$ plain form
1217 -1766 358 -1047 -276 647 -3007 2889 -3574 2888 -2687 176 1054 -2604 2946 -3525 2376 -1741
1233 -1741 -94 -498 -495 328 -1287 783 -2427 2674 -3349 2411 -1377 -887 2092 -3667 3472 -3126
1249 -3126 1837 -850 -268 1033 -836 1080 -1191 2206 -1988 2574 -1964 1834 332 -1212 2642
1264 2642 -3213 3525 -2636 1729 -333 -1079 1439 -2507 1600 -2540 770 -2128 450 -2332 -383
1279 -383 -643 -2559 1652 -4412 2297 -3350 -200 -389 -2987 1406 -3421 905 -2591 265 -1779 -205
1295 -205 -1057 -1161 716 -3181 2337 -3557 2016 -2059 -754 1191 -2629 2260 -3275 1481 -1590 367
1311 367 -618 -846 544 -1446 1306 -2471 2539 -1844 1663 -593 -298 2456 -2823 3509 -2253 2540
1327 2540 -42 -51 1725 -182 2114 -1026 2444 -852 3016 -1475 1310 1039 -960 2633 -3272 3283
1343C283n137K681j308o67K799l730L218k679L178l525K311j557J384O00l334
1358b483M822n103N560n200K578P46k706L850m866M628l145J646j566J529l49
1373e9r12J519l222N381n688M346k687J031J859m524N433m686M142l297J428N58
1389F22o34Q71j882L201l298L763m569L572j073p64K259m285N650n511L840k293
1405e31O09J218k855K681j925K713m168L522k769K557r01k097M390n167N319m958
1421b362K777J42j752K544l027L553l069K086k664K770j591J06J110k755M584
1436B452n682M864l477K126J02l078M378m161M020l901K443n27J34j8r33K526
1452A268l108L535m425M745k782L26J806l342N193n264L703j975Q44K26j209J882
$$ plain form
1343 3283 -1854 827 -481 -1148 1651 -2079 1139 -1540 1638 -1887 424 -1133 251 851 -2483
1358 -2483 2339 -2764 2796 -2404 174 920 -1786 2064 -2802 1826 -1319 327 -1239 290 -59
1373 -59 -971 548 -2674 2707 -2981 1365 -1322 -291 1568 -2956 2477 -2209 1933 -1364 64 622
1389 622 -12 859 -1023 2178 -1120 2643 -1926 1646 573 -191 2068 -2217 3433 -2078 1762 -531
1405 -531 78 1296 -1559 1122 -803 1910 -2258 1264 -1505 1052 151 -1946 2444 -2723 2596 -2362
1421 -2362 415 557 -1195 1349 -1678 1875 -1194 892 -1772 998 -593 -487 623 -2132 2452
1436 2452 -3230 1634 -1843 283 385 -2693 1685 -2476 1544 -2357 86 -441 -307 -325 -1258 1268
1452 1268 -1840 1695 -2730 2015 -767 -441 1365 -1977 3216 -2048 1655 -320 524 750 -459 1423
1468A423j788K486l498L625l179K999j907r24L373m302M627m490L451r76q18J614
1484A716k442L072k536J709j806K297k233J545l64r38L327o084O393m764K731
1499A623l50k345L756m053K555k086K098k086J819j854M80J444k703L545m862
1514c019M793l411J443N72k465L758l792L301l239K416m66n14P77j540K165k921
1530b142L191l742L705k707J026J197l492M851m810M078k399M58J084j322J500
1545D76j664K263k979L154k979K776j053j002L080m891N211m429L104j218n52
1560g03J684k315K959k820K339k440K598k043R32J36j806L623m703M515l970K441
1576D27k30j952L220l618L450k766J614r98R53q68J4J008k156L556m699M227k853
$$ plain form
1468 1423 -365 2121 -1377 2248 -931 2068 161 -763 2610 -1692 2935 -1555 1896 920 102 1716
1484 1716 -726 2346 -190 1519 -287 2010 -223 1322 958 20 3347 -2737 3656 -1108 1623
1499 1623 1273 -1072 2684 -1369 1186 -900 1198 -888 931 -923 -443 1001 -1702 1843 -3019
1514 -3019 1774 -1637 -194 378 -2087 1671 -2121 1180 -2059 357 -109 -623 154 -1386 779 -2142
1530 -2142 1049 -2693 1012 -1695 -669 528 -2964 1887 -2923 1155 -1244 -786 298 -1024 476
1545 476 -1188 1075 -1904 1250 -1729 1047 -6 -1008 2072 -2819 2392 -2037 1067 -151 -703
1560 -703 981 -1334 1625 -1195 1144 -1296 1302 -741 191 327 -1479 2144 -2559 1956 -2014 427
1576 427 197 -1755 1465 -2153 1297 -1469 145 -853 100 -768 -754 254 -1902 1654 -3045 1182 -1671
1593a671P79J710l340M159m181L204k221J793o58l78R53j132K375l335L868l631
1609a706L210j861n14K562l729M422m437L701j970M17Q80j411J818k049K072k444
1625a039K911k647K108q17j008L168m653M711l772K254n42j379K218k238K449
1640A724k267J909j782J957k027O94Q48k541L455m195M246l223J345K33k133L143
1656A386l362K993k737J900j362R66l32o66J760k600L635m128L779k400M34J581
1672H47l324M351l969L152j957Q12j65j07L51r16J863k962L787l686K896j329
1688c56o79K355l525M298l749K869j403O5Q38j344J823k014K372k395K458k270
1704f57J596j82j702L361m310M422l377J720j40j237J942k757K917k408J880j811
$$ plain form
1593 -1671 -892 818 -2522 1637 -2544 660 -1561 232 -426 -804 149 -983 1392 -1943 1925 -1706
1609 -1706 1504 -357 -871 1691 -2038 2384 -2053 1648 -322 95 975 -436 1382 -667 1405 -1039
1625 -1039 1872 -775 1333 516 -492 2676 -1977 2734 -1038 1216 674 -705 1513 -725 1724
1640 1724 -543 1366 -416 1541 -486 208 1056 -1485 1970 -2225 2021 -1202 143 376 -1757 1386
1656 1386 -1976 1017 -1720 180 -1182 -216 -548 -1214 546 -2054 1581 -2547 1232 -1168 -734 847
1672 847 -2477 1874 -2095 1057 -900 -88 -253 -360 -9 -925 938 -2024 1763 -1923 973 -356
1688 -356 -1035 1320 -2205 2093 -1656 1213 -190 -125 713 -631 1192 -822 1550 -845 1613 -657
1704 -657 939 757 -945 2416 -1894 2528 -849 871 731 -506 1436 -1321 1596 -812 1068 -743
1720g43J631j259N51Q23k493L770m450L935k698R77Q83j994K950k914K369k274
1736i36J976j224Q30k77o48K028l268L360l664L265j735n22J950k932L266l460
1752a991K837j748R58l04m81J305j785K005k676L446k810K013n50r61K505l585
1768a822L773l277K400r36m79J244j179J653k474K441k486K530k210R50O77j984
1784a179K946m085M101k942J415k42o50J859k659K309k096K379k080J231o74L47
1800b0J276k773L403l417L349k510O59Q95j984K536l054K849k017J340j309N41
1816b36M86j436J848l093L953l753K108q68l18K045l351L741l011K365j496P01
1832c15L37m28J193k188K772k605K846k827J804k80j205K413l591M187l181J812
$$ plain form
1720 -743 888 -371 180 1003 -1490 2280 -2170 1765 -933 44 927 -1067 1883 -1031 1338 -936
1736 -936 1040 -184 646 369 -279 1749 -1519 1841 -1823 1442 -293 -815 1135 -1797 1469 -1991
1752 -1991 846 -902 56 -248 -729 576 -1209 796 -1880 1566 -1244 769 219 -742 1763 -1822
1768 -1822 1951 -1326 1074 138 -341 903 -276 1377 -1097 1344 -1142 1388 -822 128 805 -1179
1784 -1179 1767 -2318 1783 -1159 256 14 -636 1223 -1436 873 -1223 1156 -924 307 -367 -20
1800 -20 1256 -1517 1886 -1531 1818 -692 -33 862 -1122 1414 -1640 1209 -808 532 -777 -236
1816 -236 250 -1186 662 -2431 1522 -2231 -123 -991 -1309 736 -2615 1126 -1885 480 -1016 -315
1832 -315 22 -406 787 -1401 1371 -1234 1612 -1215 589 309 -896 1517 -2074 2113 -1068 744
1848G44j181j21J209j884K044j806K318k917K606j484P93N37k374L458l498L529
1864A973k427J206L07j210J514j969K674k419J787j816J470p16o53J397k654L561
1880B025l621K937k230O85J032k539L036k856K521k132J212n78RN53j156K259
1896A157l050L176l187K428r91o96K313l185L694l229K053j044L81N00j148J538
1912G10k063K821l041K934k220J325j95j498L020l541L536l067K083m76n59J236
1928A005j867K194k307K507k434K053j341L98Q38k089L308m116L549k087J020
1943F31K37j816K556k804K211k009J785j428R87l97p59J959k771L031l392K999
1959A020j770j61J839k817L308l152K409j835J133k79l62N84j311K139k554K926
$$ plain form
1848 744 -437 -558 651 -1233 811 -995 1323 -1594 1012 -472 321 858 -1516 1942 -1556 1973
1864 1973 -454 752 1059 -151 1363 -606 2068 -351 1436 -380 1090 374 -279 1118 -1536 2025
1880 2025 -1596 1341 -889 -204 828 -1711 1325 -1531 990 -1142 70 -508 -499 54 -1102 1157
1896 1157 -1893 1283 -1904 524 -467 -1163 1150 -2035 1659 -1570 483 -561 -180 320 -828 710
1912 710 -1353 1468 -1573 1361 -859 466 271 -1227 1793 -1748 1788 -1279 804 328 -231 1005
1928 1005 -862 1332 -975 1532 -902 1151 -190 208 1046 -1043 2265 -1851 1698 -389 631
1943 631 868 -948 1608 -1196 1015 -994 791 -637 350 -47 -806 1153 -1618 1413 -1979 1020
1959 1020 -750 -911 928 -1889 1419 -1733 676 -1159 -26 -305 -667 -83 -1394 745 -1809 1117
1975A117l019K287q19p94K147l015L713l218K304j140K95M49q23J365j721K329
1991A457k444K545k141J349O6j532K499l296L388k688J492l66n96J464k064K114
2007A247k004J862j941K057j385J5J010j837L041l660L108k328Q78M96j601K703
2023A661k898K431k093J567j169Q84m41r75K081k682K869l196K521j290J04R57
2039C31k412K941k652J936j637J293k74k22M95j219K033k469K962k842K105o06
2055b37q48K279l087L584k958J868r45LP57j240J767k029K081k232K092j597N93
2072a49L66j239K309l226L364k568J573m77p50J702k053K310j857J863j473J366
2088A061j105J72R22j810K785l463L198k380J054M24j859K250k749K635k079J008
$$ plain form
1975 1117 -1902 385 -434 -1228 919 -2096 1617 -1601 703 -437 -142 307 -516 849 -872 1457
1991 1457 -987 1558 -583 766 832 -700 1799 -1497 1891 -797 695 329 -267 1197 -867 1247
2007 1247 -757 1105 -836 1221 -164 -149 861 -976 2065 -1595 1513 -815 63 559 -1042 1661
2023 1661 -1237 1194 -899 668 -501 383 -58 -1033 1048 -1634 1235 -1961 560 -730 -626 331
2039 331 -2081 860 -1792 144 -1493 -200 -474 -696 -201 -1420 613 -1856 1106 -1736 369 -237
2055 -237 -1085 1194 -1893 1691 -1267 601 -344 -341 416 -824 943 -1086 995 -1237 855 -742 -149
2072 -149 217 -1022 1287 -1939 1425 -1143 430 -47 -797 905 -1148 1162 -695 1168 -305 1061
2088 1061 -44 128 1050 -760 2025 -1438 1760 -620 434 858 -1001 1249 -1500 1135 -944 64
2104F4o60L73L54j059J194k043K908k719J949j128m5J412k381K701k734K462j405
2121g57N51K94p24J319j805K033k268K661k348J353l40r85K091k770L121k909
2137a483K333j461m8J044j381J600j835K099k033J929j179O41N32j644K339k807
2153a354K903k130J267k23o89J757k230K066j910J994j766J247m47m26R95j968
2169i14K970l362K661j983O69Q88j631J987k462K079j635J222o65J6M88j037J603
2186H94k161K435k447J901r38l06J364k221K662k849K302j420M85L02r37J369
2202D35j804K108k255K343k092J312J5j130K111k766K701k061J638n79k30R15
2218F61j286J723j816K030j758J627j229M28M66j321K209k903K906j958J137r1
$$ plain form
2104 64 -596 -223 131 -928 266 -1777 1131 -1588 361 -767 -812 600 -1781 920 -1814 648 -757
2121 -757 -206 88 -636 683 -1122 911 -1357 1304 -1044 309 -31 -1016 1075 -1695 1426 -1483
2137 -1483 850 -611 -659 385 -996 604 -1231 868 -1165 764 -415 226 758 -886 1453 -1354
2153 -1354 1549 -581 686 463 -226 1531 -699 1367 -543 1451 -315 932 485 59 1054 -914
2169 -914 2056 -1306 1355 -628 41 929 -702 1285 -1177 902 -733 489 -176 -160 328 -709 894
2186 894 -1267 1168 -1279 622 -316 -622 742 -1479 1183 -1666 636 -784 -299 3 -934 435
2202 435 -1369 739 -1516 827 -1265 47 62 -1068 1043 -1723 978 -1083 555 -24 -254 661
2218 661 -625 1098 -718 1312 -446 1181 -48 380 846 -475 1734 -1169 1737 -221 916 825
2234H25j190J674j935K138j774J324j186P83n47m5J081k023K563k598K428j766
2250b48O20N60j816K193k415K221j824J189o00R8M58j271J539k392K682k121J356
2267B29n50m83J413k191K533k419K161j334M64K99o64J027j400J903j883J854
2283I59j676Q91K27j015J870k429K377j995J248n58Q6J019j520J409j582J981
$$ plain form
2234 825 -365 1309 -626 1512 -262 1062 -124 659 112 67 1148 -875 1688 -910 1518 -248
2250 -248 372 932 -884 1309 -1106 1115 -709 480 -120 -22 436 -835 704 -1688 994 -1127 229
2267 229 -321 -804 609 -1582 951 -1468 693 -641 -177 122 -542 485 -915 988 -895 959
2283 959 -717 174 401 -614 1256 -1173 1204 -791 457 -101 -15 1004 -516 893 -689 1292
$$ [...]
8191b74
##END NTUPLES=NMR FID
##END=
