##TITLE=1H_38-2025-Bay
 200.13MHz, DMSO-d6,
 8 sc
 
 26.3.2025
##JCAMPDX= 6.0         $$ Bruker NMR JCAMP-DX V2.0
##DATA TYPE= NMR FID
##DATA CLASS= NTUPLES
##ORIGIN= UXNMR, Bruker Analytische Messtechnik GmbH
##OWNER= pz
$$ XWIN-NMR		Version 3.5
$$ Wed Mar 26 15:49:33 2025 Russian Standard Time (UT+4h)  she@DPX200
##.OBSERVE FREQUENCY= 200.1313
##.OBSERVE NUCLEUS= ^1H
##.DELAY= (6, 6)
##.ACQUISITION MODE= SIMULTANEOUS
##.ACQUISITION SCHEME= undefined
##.AVERAGES= 8
##.DIGITISER RES= 18
##SPECTROMETER/DATA SYSTEM= spect
##.PULSE SEQUENCE= zg30
##.SOLVENT NAME= DMSO
##.SHIFT REFERENCE= (INTERNAL, DMSO, 0, 14.3821)
##AUDIT TRAIL= $$ (NUMBER, WHEN, WHO, WHERE, WHAT)
$$ ##TITLE= Audit trail, XWIN-NMR		Version 3.5
$$ ##JCAMPDX= 5.01
$$ ##ORIGIN= Bruker BioSpin GmbH
$$ ##OWNER= she
$$ F:/spectra/data/she/nmr/H-C/1/audita.txt
$$ ##AUDIT TRAIL=  $$ (NUMBER, WHEN, WHO, WHERE, WHAT)
(   1,<2025-03-26 15:48:12.37 +0400>,<she>,<DPX200>,
      <created by zg, POWCHK disabled, PULCHK disabled
       configuration hash MD5:
       00 E9 B6 7A A2 85 ED C7 34 08 36 98 17 FE 4E 26
       data hash MD5: 16K
       7B 79 E0 73 29 CD 67 AD B9 69 D0 7F 99 19 E1 2E>)
$$ ##END=
$$ 
$$ hash MD5
$$ EE 35 30 28 11 52 70 D7 93 06 8E E6 F5 73 C6 74
##$RELAX= 
##$RELAX= 
##$RELAX= 
##$RELAX= 
##$RELAX= 
##$RELAX= 
$$ Bruker specific parameters
$$ --------------------------
##$DU= <F:/spectra>
##$EXPNO= 1
##$NAME= <H-C>
##$PROCNO= 1
##$TYPE= <nmr>
##$USER= <she>
##$AMP= (0..31)
100 100 100 100 100 100 100 100 100 100 100 100 100 100 100 100 100 100 
100 100 100 100 100 100 100 100 100 100 100 100 100 100 
##$AQSEQ= 0
##$AQ_mod= 1
##$AUNM= <au_zg>
##$AUTOPOS= <>
##$BF1= 200.13
##$BF2= 200.13
##$BF3= 200.13
##$BF4= 200.13
##$BF5= 200.13
##$BF6= 200.13
##$BF7= 200.13
##$BF8= 200.13
##$BYTORDA= 1
##$CFDGTYP= 0
##$CFRGTYP= 5
##$CHEMSTR= <none>
##$CNST= (0..31)
1 1 145 1 1 1 1 1 1 1 1 1 1 1 1 1 1 1 1 1 1 1 1 1 1 1 1 1 1 1 1 1 
##$CPDPRG= <>
##$CPDPRG1= <>
##$CPDPRG2= <>
##$CPDPRG3= <>
##$CPDPRG4= <mlev>
##$CPDPRG5= <mlev>
##$CPDPRG6= <mlev>
##$CPDPRG7= <mlev>
##$CPDPRG8= <mlev>
##$CPDPRGB= <>
##$CPDPRGT= <>
##$D= (0..31)
0 0.7 0 0 0 0 0 0 0 0 0 0.03 0 0 0 0 0 0 0 0 0 0 0 0 0 0 0 0 0 0 0 0 
##$DATE= 1742989691
##$DBL= (0..7)
120 120 120 120 120 120 120 120 
##$DBP= (0..7)
150 150 150 150 150 150 150 150 
##$DBP07= 0
##$DBPNAM0= <>
##$DBPNAM1= <>
##$DBPNAM2= <>
##$DBPNAM3= <>
##$DBPNAM4= <>
##$DBPNAM5= <>
##$DBPNAM6= <>
##$DBPNAM7= <>
##$DBPOAL= (0..7)
0.5 0.5 0.5 0.5 0.5 0.5 0.5 0.5 
##$DBPOFFS= (0..7)
0 0 0 0 0 0 0 0 
##$DE= 6
##$DECBNUC= <off>
##$DECIM= 32
##$DECNUC= <off>
##$DECSTAT= 4
##$DIGMOD= 1
##$DIGTYP= 9
##$DL= (0..7)
0 120 120 120 120 120 120 120 
##$DP= (0..7)
150 150 150 150 150 150 150 150 
##$DP07= 0
##$DPNAME0= <>
##$DPNAME1= <>
##$DPNAME2= <>
##$DPNAME3= <>
##$DPNAME4= <>
##$DPNAME5= <>
##$DPNAME6= <>
##$DPNAME7= <>
##$DPOAL= (0..7)
0.5 0.5 0.5 0.5 0.5 0.5 0.5 0.5 
##$DPOFFS= (0..7)
0 0 0 0 0 0 0 0 
##$DQDMODE= 0
##$DR= 18
##$DS= 0
##$DSLIST= <SSSSSSSSSSSSSSS>
$$ [...]
##$SUBNAM0= <"">
##$SUBNAM1= <"">
##$SUBNAM2= <"">
##$SUBNAM3= <"">
##$SUBNAM4= <"">
##$SUBNAM5= <"">
##$SUBNAM6= <"">
##$SUBNAM7= <"">
##$SUBNAM8= <"">
##$SUBNAM9= <"">
##$SW= 18.0517328524113
##$SWIBOX= (0..15)
0 0 2 0 0 0 0 0 0 0 0 0 0 0 0 0 
##$SW_h= 3612.71676300578
##$TD= 16384
##$TD0= 1
##$TE= 0
##$TE2= 300
##$TE3= 300
##$TEG= 300
##$TL= (0..7)
0 120 120 120 120 120 120 120 
##$TP= (0..7)
150 150 150 150 150 150 150 150 
##$TP07= 0
##$TPNAME0= <>
##$TPNAME1= <>
##$TPNAME2= <>
##$TPNAME3= <>
##$TPNAME4= <>
##$TPNAME5= <>
##$TPNAME6= <>
##$TPNAME7= <>
##$TPOAL= (0..7)
0.5 0.5 0.5 0.5 0.5 0.5 0.5 0.5 
##$TPOFFS= (0..7)
0 0 0 0 0 0 0 0 
##$TUNHIN= 0
##$TUNHOUT= 0
##$TUNXOUT= 0
##$USERA1= <user>
##$USERA2= <user>
##$USERA3= <user>
##$USERA4= <user>
##$USERA5= <user>
##$V9= 5
##$VALIST= <valist>
##$VCLIST= <CCCCCCCCCCCCCCC>
##$VD= 0
##$VDLIST= <DDDDDDDDDDDDDDD>
##$VPLIST= <PPPPPPPPPPPPPPP>
##$VTLIST= <TTTTTTTTTTTTTTT>
##$WBST= 1024
##$WBSW= 4
##$XGAIN= (0..3)
0 0 0 0 
##$XL= 0
##$YL= 0
##$YMAX_a= 41754
##$YMIN_a= -62472
##$ZGOPTNS= <>
##$ZL1= 120
##$ZL2= 120
##$ZL3= 120
##$ZL4= 120
##$ABSF1= 10
##$ABSF2= 0
##$ABSG= 5
##$ABSL= 3
##$ALPHA= 0
##$AQORDER= 0
##$ASSFAC= 0
##$ASSFACI= 0
##$ASSFACX= 0
##$ASSWID= 0
##$AUNMP= <proc_1d>
##$AZFE= 0.1
##$AZFW= 0.1
##$BCFW= 1
##$BC_mod= 2
##$BYTORDP= 1
##$COROFFS= 0
##$CY= -3
##$DATMOD= 1
##$DC= 2
##$DFILT= <>
##$DTYPP= 0
##$F1P= 0
##$F2P= 0
##$FCOR= 0.5
##$FTSIZE= 0
##$FT_mod= 4
##$GAMMA= 1
##$GB= 0.15
##$INTBC= 1
##$INTSCL= 1
##$ISEN= 128
##$LB= 0.25
##$LEV0= 0
##$LPBIN= 0
##$MAXI= 10000
##$MC2= 0
##$MEAN= 0
##$ME_mod= 0
##$MI= 1.114404
##$NCOEF= 0
##$NC_proc= 0
##$NLEV= 6
##$NOISF1= 3.799351
##$NOISF2= 2.8
##$NSP= 1
##$NTH_PI= 0
##$NZP= 0
##$OFFSET= 14.38212
##$PC= 1
##$PHC0= -470.4826
##$PHC1= 12.39221
##$PH_mod= 1
##$PKNL= yes
##$PPARMOD= 0
##$PSCAL= 0
##$PSIGN= 0
##$REVERSE= no
##$SF= 200.129724274929
##$SI= 16384
##$SIGF1= 3
##$SIGF2= 2
##$SINO= 400
##$SIOLD= 16384
##$SREGLST= <1H.CDCl3>
##$SSB= 0
##$STSI= 0
##$STSR= 0
##$SW_p= 3205.1282051282
##$SYMM= 0
##$S_DEV= 0
##$TDeff= 0
##$TDoff= 0
##$TI= <>
##$TILT= no
##$TM1= 0
##$TM2= 0
##$TOPLEV= 0
##$USERP1= <user>
##$USERP2= <user>
##$USERP3= <user>
##$USERP4= <user>
##$USERP5= <user>
##$WDW= 1
##$XDIM= 8192
##$YMAX_p= 0
##$YMIN_p= 0
$$ End of Bruker specific parameters
$$ ---------------------------------
##NTUPLES= NMR FID
##VAR_NAME=  TIME,          FID/REAL,        FID/IMAG
##SYMBOL=    X,             R,               I
##VAR_TYPE=  INDEPENDENT,   DEPENDENT,       DEPENDENT
##VAR_FORM=  AFFN,          ASDF,            ASDF
##VAR_DIM=   8192,          8192,            8192
##UNITS=     SECONDS,       ARBITRARY UNITS, ARBITRARY UNITS
##FACTOR=    0.0002768,     1,               1
##FIRST=     0,             0,               0
##LAST=      2.2672688,     0,               0
##MIN=       0,             -62472,          0
##MAX=       2.2672688,     41754,           0
$$ Real data points
##PAGE= N=1
##DATA TABLE= (X++(R..R)), XYDATA
0 0 0 0 0 0 0 0 0 0 0 0 0 0 0 0 0 0 0 0 0 0 0 0 0 -5 7 -8 8 -8 8 -8 9 -13 15 -16 17 -21 23 -25 29 -31 37 -40 44 -49
44 -49 52 -60 65 -70 78 -86 96 -105 116 -128 142 -157 175 -194 220 -247 282 -324 379 -454 557
65 557 -712 973 -1494 2926 -16779 -42317 -1556 34540 19927 -10773 5074 41754 39463 773
79 773 -7515 24823 39259 4519 -22606 -435 24036 455 -27765 -13532 11509 2382 -19685
92 -19685 -13830 10418 12983 -2218 -1046 17662 22917 9401 6560 24233 27960 7504 891 17939
106 17939 19659 -4690 -15527 2883 10150 -15295 -33802 -15101 5336 -10254 -37072 -25193
118 -25193 8936 6432 -27255 -26057 14693 26499 -8481 -25166 8933 34343 7529 -23682
130 -23682 -6762 25835 15160 -25039 -27102 9603 16274 -20804 -36744 -6416 14848 -8808
142 -8808 -31755 -11675 16518 7741 -15731 -9428 17793 21816 185 -4096 16792 24235 6500
155 6500 -2332 11239 18874 4304 -6318 3939 10238 -1976 -10636 -1068 7373 -3210 -14171
168 -14171 -3018 11991 2956 -12626 -3827 17627 13085 -10099 -7816 18533 20769 -5968 -14526
181 -14526 9145 22639 -354 -22582 -5037 19389 5356 -24503 -18933 12060 12413 -19059 -25433
194 -25433 3510 16748 -7052 -24659 -4400 18498 5436 -18846 -10376 15062 13551 -10457
206 -10457 -13594 8733 15440 -4193 -13749 2158 12499 346 -11723 -2909 9324 2072 -9693
219 -9693 -4198 6905 3084 -8026 -4384 7425 3986 -7806 -3876 8931 6932 -6748 -5802 9820
233 9820 11702 -4400 -8928 7961 15829 -61 -12785 1593 17892 4563 -15111 -6925 14175
246 14175 10036 -13710 -15481 7386 13675 -8652 -19435 -282 15508 734 -18172 -6386 15493
259 15493 9648 -11483 -9695 11777 15328 -3900 -11278 5583 15111 854 -11633 -2102 10738
272 10738 2609 -11898 -7303 5363 2097 -9689 -8850 2707 3562 -6374 -6790 3934 6599 -2480
286 -2480 -4024 6180 10135 303 -4236 6061 11932 770 -7574 1227 10552 1026 -12142 -5817
300 -5817 7725 2697 -13482 -12070 4607 7516 -9165 -14194 2812 12771 -518 -12012 -60
313 -60 15868 8341 -8650 -3744 13409 12308 -5566 -9332 5873 11898 -3388 -13462 -1938 8157
327 8157 -993 -13697 -7431 5634 2489 -9717 -7860 4989 6674 -3441 -5121 5613 9799 935
341 935 -2986 4824 9590 2085 -3889 1930 7653 116 -7396 -2161 4654 -885 -9809 -6068 3634
356 3634 1153 -9362 -7332 4702 6065 -5046 -7438 5101 11273 343 -7386 3008 12759 4884
370 4884 -7472 -2257 10384 6727 -7775 -8292 4714 7245 -6103 -12066 -427 7493 -2250 -11573
384 -11573 -3293 7997 3313 -7524 -4221 7899 7919 -2904 -3908 6436 9606 188 -4852 3091
398 3091 8184 731 -6168 -1034 5182 -23 -7418 -3858 3114 29 -7257 -5148 2742 2148 -5609
413 -5609 -5177 3880 5425 -3047 -5039 3820 7682 -370 -5751 1765 8079 1336 -7179 -2364 6758
428 6758 2850 -7762 -6753 3985 4401 -6565 -9101 1178 6190 -2987 -9034 -683 7701 2152
442 2152 -6481 -2301 8113 6451 -3332 -3289 6698 8336 -912 -4525 3580 8117 235 -5767 136
457 136 5913 1201 -6065 -2735 4212 2234 -5267 -3879 3943 4195 -3081 -3838 3996 5807 -1098 -3240
473 -3240 3544 7130 726 -4003 1059 6223 1310 -5627 -2433 4292 1112 -7308 -6113 2407 1891
488 1891 -7100 -7965 134 3153 -3898 -7888 -800 5258 44 -6636 -2230 6340 3926 -4703 -3386
503 -3386 5322 5293 -3422 -5086 2625 5219 -1990 -6720 -1072 4150 -460 -6462 -2783 4309 1964 -5029
519 -5029 -3153 4965 5016 -1428 -1596 5080 6614 1075 -828 4599 7643 2671 -2348 1512 6196 2173
535 2173 -3949 -1428 4570 1384 -5281 -3849 2678 2549 -3658 -4644 1490 4039 -1220 -4608 1151 5987
551 5987 1177 -4389 -458 5950 2491 -4260 -2750 3605 2310 -4791 -5853 337 2175 -3969 -7744
566 -7744 -2544 2199 -2479 -7339 -2866 3112 405 -5414 -2931 4038 3305 -2277 -2084 3485 4760 -492
582 -492 -2962 1947 5528 332 -4365 -399 4209 643 -4494 -1809 3285 1432 -3857 -2555 3193
597 3193 3696 -1074 -2274 3422 5546 864 -1851 2953 6711 2271 -2527 1070 5551 2670 -2835
612 -2835 -1512 3351 2304 -3303 -4175 1271 2923 -2711 -5351 -287 3137 -1020 -4843 -733 4025
627 4025 820 -3693 -1465 3495 2688 -2704 -2907 2109 2955 -2108 -4183 423 3182 -1645 -5100 -1260
643 -1260 2501 -715 -4566 -2211 2380 939 -3434 -2567 2206 2954 -1838 -2784 2202 4140 -274 -2670
659 -2670 1504 4242 773 -2627 93 3737 1801 -3021 -1437 2660 2180 -2490 -2981 1850 3014 -1514
675 -1514 -3354 1130 3588 -124 -3043 358 3628 1310 -2390 -812 3102 2463 -1933 -1930 2348 2980
691 2980 -1711 -2980 1036 2822 -1081 -3797 -466 2565 -229 -3686 -1539 2237 1140 -2846 -2049
706 -2049 2105 2405 -1857 -2492 1656 3125 -686 -2558 862 3228 270 -2726 -344 2899 1047 -2746
722 -2746 -1878 2143 2010 -2564 -2642 1307 2351 -1253 -2872 735 2715 -393 -2633 -9 2921 801
738 801 -2294 -1035 3070 2113 -1837 -1481 2075 2269 -1542 -2520 950 2136 -1021 -3055 -382 2128
754 2128 -456 -3355 -1296 1888 708 -2363 -1696 1903 2014 -1246 -1916 1728 2681 -493 -1842 937
770 937 2922 514 -1964 -361 2307 1036 -2096 -1348 1835 1296 -2025 -1880 1117 1843 -1076 -2143
786 -2143 713 2660 52 -1961 464 2856 1060 -1454 -111 2851 1727 -1343 -1054 1848 1650 -1257
802 -1257 -2101 515 1742 -1196 -2681 -331 1648 -387 -2551 -946 1593 670 -2173 -1321 1646 1634
818 1634 -1138 -1670 1256 2205 -648 -1812 595 2122 -283 -2511 -598 1709 95 -2412 -1525 1168
834 1168 724 -1797 -1759 983 1547 -802 -1642 943 2279 -18 -1323 651 2462 775 -1396 -66
850 -66 2035 1433 -1066 -981 1556 1285 -1073 -1723 800 1534 -806 -2050 26 1768 -80 -1688 -189
867 -189 1785 936 -1408 -633 1716 1448 -889 -1036 987 1615 -819 -1885 229 1444 -713 -2188 -746
884 -746 1075 -119 -2028 -1141 1184 507 -1836 -1345 956 1241 -751 -1407 777 1689 41 -1408 16
901 16 1908 521 -1325 -227 1517 536 -1298 -1023 947 887 -954 -1431 531 1307 -486 -1700 209
918 209 1636 149 -1162 160 1839 945 -1148 -406 1622 1356 -729 -844 1206 1429 -393 -1453 334
935 334 1370 -711 -1576 -302 1024 78 -1650 -889 863 246 -1364 -1037 704 1162 -848 -1390 552
952 552 1194 -388 -1294 257 1486 104 -1177 -357 955 309 -981 -906 499 729 -934 -1163 341
969 341 1028 -570 -922 324 1399 -39 -961 216 1720 762 -655 -264 1425 1111 -882 -649 1223
986 1223 985 -649 -966 396 1219 -173 -1251 -176 1051 -72 -1342 -739 631 403 -997 -1026 1010
1003 1010 981 -549 -1026 584 954 -316 -1095 174 914 -106 -1107 -522 809 434 -1134 -878 579
1020 579 286 -929 -1182 425 755 -457 -1010 216 828 70 -804 245 1316 524 -715 -151 1434
1037 1434 1010 -538 -338 1057 847 -564 -913 622 857 -241 -1035 -217 643 179 -1191 -161 1148
1054 1148 472 -852 -745 862 1036 -478 -492 524 1124 -39 -876 84 1005 -5 -1239 -633 664
1071 664 235 -1002 -922 654 138 -1113 -850 43 568 -442 -768 267 539 -50 -500 107 1023 515 -653
1090 -653 -265 814 403 -771 -601 706 99 -600 -968 256 557 -367 -1001 -98 790 300 -941 -185
1108 -185 979 624 -759 -347 1109 834 -85 -132 628 921 136 -573 -136 901 27 -1069 -426 591
1126 591 -11 -709 -438 532 362 -778 -598 350 648 92 -561 323 848 -13 -537 120 804 223 -490 -359
1146 -359 724 337 -760 -588 459 154 -529 -793 114 573 -349 -666 203 801 171 -665 -33 1041 402
1165 402 -384 -46 562 536 -295 -585 286 611 -376 -738 -60 588 -189 -961 -191 479 20 -670 -189 409
1185 409 366 -24 -313 281 438 3 -606 351 657 124 -621 -147 741 -90 -721 -355 373 314 -612 -432 479
1206 479 416 -345 -549 390 555 -72 -373 -15 612 16 -344 2 567 258 -477 -288 338 524 -486 -336
1226 -336 119 490 15 -464 174 630 -46 -508 62 653 327 -401 -292 549 323 -184 -434 373 301 -459
1246 -459 -526 191 286 -46 -559 -39 342 4 -430 -186 93 60 -429 -476 137 279 -148 -591 190 352 -272
1267 -272 -683 -373 446 -191 -397 -177 455 239 -371 -359 412 358 -235 -175 549 394 -107 -275 189 414 289
1288 289 -149 225 661 311 -297 -232 535 187 -244 -338 380 487 -137 -207 150 691 28 -273 -88 442 65
1309 65 -312 -120 347 174 -443 -422 66 113 -328 -592 -30 62 -278 -414 -164 286 98 -254 -86 415 281
1330 281 -133 -110 459 336 -149 -233 134 246 -135 -637 -218 -20 -241 -427 -291 229 -36 -210 -236 299 267
1351 267 -90 -15 507 499 70 36 293 491 122 -180 284 550 243 -116 -7 206 152 -378 -438 197 207 100
1373 100 -79 125 453 48 14 152 424 37 -174 43 312 151 -211 -232 25 188 -543 -489 25 -15 -550
1394 -550 -703 -172 -91 -366 -328 -191 149 173 -293 -58 90 129 -158 -66 153 96 66 -70 124 206 -44 -298 -11
1417 -11 193 -230 -165 33 238 268 -314 10 288 233 55 194 341 401 159 -225 167 328 140 -91 -41 298
1439 298 71 -12 -106 59 92 -384 -193 16 277 -266 -165 -54 260 17 -201 -157 310 168 -168 -117 236 170
1461 170 -186 -271 -34 -5 -159 -249 36 111 -241 -365 -229 113 -4 -161 35 212 176 19 12 270 228 103 -101
1484 -101 269 324 304 -367 231 253 -16 -192 -11 266 33 -72 -163 92 6 5 -18 80 342 179 -150 149 253
1507 253 5 161 4 241 141 -235 -5 107 122 -70 105 0 -74 -71 -303 75 35 -198 -465 202 141 -82
1529 -82 -218 83 270 191 -27 -126 -83 158 17 -63 182 -12 -229 -248 -63 166 -48 -109 127 32 141 -303 -128
1552 -128 94 88 -61 -221 70 155 -118 47 19 246 123 47 -20 12 208 97 -187 -116 124 -107 -90 21 145
1575 145 -204 -140 -49 -69 64 -78 63 -65 -78 -79 175 103 186 -295 99 -22 29 -211 -1 306 116 -205 -175
1598 -175 206 175 8 -79 -138 -21 110 -232 -178 41 83 -323 -172 237 160 -164 24 149 -76 77 -120 -168
1620 -168 136 0 -95 -432 -3 282 174 -59 187 8 -135 -87 114 -43 22 -23 -64 134 -212 -68 45 -45
1642 -45 -68 12 100 89 179 -402 31 -128 -181 148 -258 127 272 -32 23 -50 36 -49 -105 75 247 151 -28 213
1666 213 195 183 52 -144 68 380 222 -107 37 185 75 -5 -354 126 200 -85 -133 106 70 -58 -92 -177 14
1689 14 -124 -94 84 77 242 -131 78 133 22 50 -257 140 167 212 -3 84 -64 141 60 -33 134 -86 28 -119
1713 -119 94 -213 34 67 -2 -11 -136 177 42 2 240 -87 -6 146 40 -74 231 250 167 -226 -106 39 -12
1736 -12 -123 -342 -72 123 142 4 -261 201 -83 -34 35 0 65 67 -56 -32 72 152 -40 -14 233 39 -7 -78
1760 -78 -28 0 -95 -124 -49 -144 79 36 24 -272 33 -6 15 -28 -42 129 195 -12 -49 0 113 103 -86 29 136 88
1786 88 -192 -226 15 205 3 -201 -139 154 41 -105 -219 160 257 -64 -150 78 215 192 189 -65 -83 6 31 -43
1810 -43 -27 -23 158 128 -4 -32 -143 -103 -44 -97 -73 60 -233 -60 -56 -135 -97 199 -92 -44 -83 13 -41 -146 -125 84
1836 84 126 -152 -104 -110 -28 -41 -95 -79 86 -48 -114 -21 -3 267 -186 -123 27 292 -98 -187 -78 118 150 -265 125
1861 125 -17 1 60 43 -1 157 -110 -68 -66 -7 -27 -25 -27 6 -214 208 -47 -7 68 -101 -11 143 38 26 74 -24 2
1888 2 -112 35 18 -184 -432 -84 149 -127 -169 -68 -40 112 -25 -5 -60 37 186 -219 -155 134 122 146 18 23
1912 23 51 132 -137 -168 -89 9 -108 26 185 -36 -10 -150 -170 -21 40 -129 -154 -7 33 -7 152 63 -203 -18
1936 -18 4 -68 151 88 0 -114 -211 82 165 114 -211 -76 -82 -133 82 63 -71 77 169 156 33 163 169 6 168
1961 168 -29 44 161 -116 45 161 -224 -214 -37 190 -45 -139 2 -252 362 103 -182 -212 -79 86 52 -197
1983 -197 -117 -73 45 -41 -67 17 -22 231 -121 -89 74 200 -203 -40 -34 33 -20 159 1 41 -125 -78 -87 74 123
2008 123 56 76 56 -97 81 56 -60 -59 -74 -16 -56 34 47 157 199 100 139 -104 -56 -95 -97 104 90 -70 -127 -185 41
2035 41 143 -193 -16 -63 -46 -87 -81 105 26 -78 -122 78 32 231 238 68 -6 202 171 -154 152 184 172 44 97
2060 97 -72 -51 -87 8 -204 234 35 150 39 110 -5 -9 31 40 15 107 -197 19 17 -5 14 -10 153 156 -66 4 -16
2087 -16 -110 186 21 -64 -7 13 103 133 -147 -176 -3 171 -29 80 -155 96 292 -168 -14 132 -17 -121 -93
2110 -93 -131 42 -87 -29 -43 -41 -234 225 -75 -85 76 8 23 -233 7 63 203 -34 -82 153 138 138 -170 133 -54
2135 -54 -6 203 85 124 79 -86 -91 -48 96 -28 -4 -226 -126 -60 -22 -172 -22 -22 98 -55 87 23 -86 -147 140
2160 140 -38 71 11 -360 18 -143 45 -55 112 2 102 -317 9 169 6 -33 -40 85 60 -132 130 -57
2182 -57 29 24 -23 56 -59 295 76 -183 -96 -5 17 -276 -6 -61 -1 -55 262 173 -96 64 -32 -80 83 -239 -57
2207 -57 -73 26 84 -84 -28 28 18 -49 21 125 25 -135 -114 140 68 41 -51 -47 84 70 -39 -81 -75 -134 -57 -259 -309
2234 -309 282 78 -156 -49 235 26 135 -66 95 -15 55 5 138 -172 -209 -232 -10 -142 151 41 150
2255 150 -153 -16 87 -126 221 87 28 -28 -56 85 34 -17 -65 163 -88 -98 61 -289 -209 -29 159 -201 -97
2278 -97 -37 110 -47 220 -123 -87 220 101 -24 115 -93 65 -88 -6 -79 246 140 -68 176 -200 -222 75
2300 75 114 -94 75 -178 310 -29 51 -17 -134 -149 26 -9 -4 49 117 -198 147 19 83 67 -9 111 -138 126
2324 126 -90 151 -131 10 -108 240 30 5 57 -11 216 -145 -115 47 2 271 -103 122 114 26 71 -41 133
2347 133 23 144 -42 -153 138 2 143 -258 72 -45 40 -168 -64 133 104 70 45 -86 -43 -82 -37 -133 65
2370 65 -17 35 303 54 190 31 29 -50 84 -92 -136 88 70 221 -88 -107 -8 158 -28 240 -93 19 -72 -199
2394 -199 -91 -5 20 9 -60 -93 -43 -33 -106 -170 -138 -55 -88 -125 -202 -74 10 -109 -108 140 166 -13 -27 -36 -73 -78 -218 130
2422 130 -206 -178 -12 127 -55 -39 177 -46 -43 -4 134 198 29 -63 -26 89 313 57 -15 89 198 -70 124
2445 124 -129 -137 -34 26 300 -66 44 86 73 24 33 -176 -17 -34 -260 136 39 78 -98 100 -12 10 87 -11 6
2470 6 -42 10 -158 -304 -127 -35 -30 -75 259 -30 123 -187 32 -47 91 69 94 144 176 -173 92 -46 270 -147
2494 -147 -217 11 -53 41 -107 32 24 -64 -104 152 187 -143 32 53 26 104 58 62 17 1 9 222 33 -57 -66 -76 188
2521 188 -63 134 25 -77 -162 118 -74 71 -49 -242 -7 -60 -80 -69 1 55 -228 118 61 56 53 65 17 -135
2545 -135 85 -107 124 -242 45 -141 43 86 133 112 -55 -109 -86 96 44 70 20 112 58 -101 -154 14 -185 -51
2569 -51 -139 -82 176 -53 -44 160 137 -139 35 89 -68 18 113 -134 -151 -51 -275 -139 90 79 -84 194 -100 -28
2593 -28 42 25 -111 278 -24 -70 -20 -151 -115 15 18 -86 -9 -202 -139 -128 45 138 79 87 116 -230 181 -140 122
2618 122 198 10 -86 -31 -99 -181 -83 -89 133 -61 80 115 -55 -15 86 14 52 -82 -6 121 -46 -272 153 72 41
2643 41 -43 209 46 -64 210 -20 36 0 346 -123 86 65 -122 -81 128 -104 -123 -31 67 -7 180 -59 -45 68
2667 68 31 -25 -36 72 70 -26 -34 -6 8 78 159 92 234 24 206 15 -98 -254 -164 -68 119 31 1 127 -64 78
2693 78 -183 52 -26 -1 214 -79 -151 5 -104 -29 -32 -190 87 94 -109 -85 -32 -82 211 -148 -63 -146 27 -25 -45
2718 -45 107 -20 74 155 -238 -102 -62 31 128 117 -221 -39 63 235 60 176 -73 -121 183 -68 -7 143 243
2741 243 -174 -241 18 -115 -20 54 87 -49 -94 20 176 -93 -146 -100 244 -63 -22 -8 111 245 8 15 -125 -99
2765 -99 -27 -51 110 15 -171 102 -14 133 -147 -27 -103 -183 -27 -88 -107 46 303 129 37 13 -267 -75 83
2788 83 -141 4 116 126 113 -109 13 221 -32 31 -114 -3 38 -43 61 6 -192 84 -47 -117 184 -11 -23
2811 -23 123 62 -91 -47 112 27 76 -234 -106 58 -165 -196 -35 -208 -125 77 -231 -91 -96 -78 -89 -25 -45 87
2835 87 107 92 110 -5 -62 -4 169 13 83 58 -129 -42 -82 5 -34 -98 -259 212 143 53 -153 146 269 -116 -70
2860 -70 20 -45 -165 51 19 52 -159 141 153 -48 -89 53 -134 -111 186 138 64 229 -87 229 -33 284 63
2883 63 -39 111 -56 -157 76 89 -14 -11 -93 -6 39 105 -26 189 -44 -101 -233 112 -107 30 183 -42 -178
2906 -178 145 -98 87 100 -130 150 -37 -18 -136 9 -38 148 -210 -121 -134 98 -51 -19 7 -200 60 147 91
2929 91 -88 146 32 -53 -249 111 -274 -31 -197 319 -221 125 168 70 98 87 -3 2 -24 -127 -100 123 150 -184
2953 -184 -62 -89 -468 -194 166 111 -105 8 -138 -16 78 125 127 -60 -111 -79 186 334 81 -269 72 116 3
2976 3 53 -163 99 171 -7 2 175 68 -88 -54 -1 -5 -42 172 7 -158 24 237 198 -64 100 155 -157 90
3000 90 16 -231 75 -75 -40 -80 -12 -87 115 -229 148 57 61 159 314 -153 39 -42 73 0 -155 -331 -40 72
3024 72 75 54 -82 50 81 -79 180 60 21 327 246 4 -76 -86 81 226 -171 166 -91 -186 -21 -74 -151 111
3048 111 -115 -171 -35 -35 -117 187 43 80 115 8 -200 -35 12 -91 -32 -16 331 -5 -102 4 11 28 -200 -124 46
3073 46 112 -65 84 -72 -5 79 -56 -6 71 67 152 -202 -145 -9 43 25 -37 -22 30 260 116 -81 -11 74 108 -136
3099 -136 -122 -91 22 119 -227 54 -126 25 -100 -26 -252 20 -53 64 -10 -48 -233 -49 136 -5 77 -296 -40
3122 -40 -8 92 -20 2 57 -57 -42 126 27 29 -18 142 -5 59 28 -36 97 149 -217 148 72 -83 48 -184 -39
3147 -39 -258 -138 146 142 122 -88 -111 1 -143 -10 -17 238 -18 78 7 -12 25 131 -22 109 -26 66 85 -143
3171 -143 -60 171 95 -147 -137 -42 46 -52 82 -117 73 -9 117 -88 126 86 74 144 31 52 -122 -31 -79 -94 103
3196 103 -29 -93 -177 54 99 -83 196 -106 -103 215 -77 19 -15 -21 38 -251 206 171 -19 28 156 -97 95 -34
3220 -34 24 -177 32 113 -21 29 -24 2 31 -34 95 -4 36 12 13 -247 60 97 -124 181 64 -87 -94 -15 -96 60
3246 60 -81 -92 121 -71 -106 -228 -112 5 -73 -156 -96 97 122 46 -70 -84 -13 -57 132 -125 210 6 28 -82
3270 -82 34 -102 -145 41 -71 60 -39 4 -18 129 111 -103 -25 -188 210 -46 -61 18 -50 17 12 -122 58 -54
3294 -54 -241 81 -189 -310 19 189 -54 -90 105 -160 195 -40 13 106 81 77 -251 -135 -15 -208 159 125 19
3317 19 166 -47 85 -164 -10 -12 125 179 -32 18 -28 -156 -9 -97 54 -90 -101 -2 -159 56 -127 -181 -13
3340 -13 58 -97 -123 51 -69 82 45 146 75 -149 -28 -86 2 -155 246 108 283 140 92 -222 130 151 27
3363 27 119 146 231 -100 -30 -187 114 86 106 11 103 109 104 -71 -103 63 -130 -150 46 -72 -32 56 55 15 187 90 81 -30
3391 -30 68 -169 -49 -195 138 17 284 196 81 56 44 -9 -68 81 -81 97 -122 -107 -169 -124 175 -57 -1 122
3415 122 -29 8 100 -290 168 -81 43 -58 70 184 -88 56 23 75 -45 65 -136 -199 -9 -10 -209 71
3437 71 65 74 34 -57 -3 344 136 90 -122 -25 -138 45 -123 -56 -54 152 284 -360 -43 4 -91 7 -103 -118 -116 189
3463 189 -19 -69 -62 44 92 43 -71 46 -122 130 -5 -63 96 106 -123 171 -170 66 -15 -187 22 -282 36
3486 36 114 -270 -33 -90 84 -58 12 41 75 227 51 -99 -17 -175 -78 -4 -160 28 28 -25 -258 26 -69 -4 -35
3511 -35 122 154 55 74 -107 139 -191 -149 -39 -81 -72 -181 -57 172 60 -148 -59 164 48 -147 -74 121 -6
3534 -6 -69 -158 117 136 58 19 38 199 53 -163 -59 65 17 87 58 -132 -77 111 -87 112 115 -13 -198 -289 82
3559 82 -8 77 -57 -61 20 111 99 -111 0 -28 -4 93 -12 127 81 7 -114 131 -52 -62 -201 37 107 -17 66
3584 66 -20 89 86 102 -57 -99 2 11 17 111 13 -30 133 -149 -142 115 53 74 194 -39 -26 -8 1 166 -157 38 44 153
3612 153 27 -152 -12 151 -33 -26 24 -139 151 -103 -211 82 84 -70 70 120 131 156 59 13 -78 -167 -98 -146 -164
3637 -164 -67 -13 -9 241 37 -23 -26 65 -18 -79 123 28 31 44 -27 -20 131 -77 68 -164 31 -200 68 -22 -158 6
3663 6 -20 23 -16 83 37 50 -118 219 50 94 172 185 -97 -11 271 24 1 -49 -246 192 39 -56 78 -107 -5
3688 -5 -137 -177 168 -9 -119 -16 -103 44 -171 -206 -24 49 -70 -27 75 -76 -180 -43 39 156 3 181 -73
3711 -73 181 -124 -124 162 -203 44 -53 -21 -108 84 -97 -93 125 182 -35 -83 -71 -47 -102 78 150 -106 154 -36 -20
3736 -20 139 95 107 -61 88 -151 114 -119 34 377 22 65 -132 20 -120 52 5 -11 55 -44 80 -130 225
3759 225 -128 -6 -115 -33 -49 -65 100 127 122 88 44 -1 -160 204 43 -41 12 -129 29 -23 -50 -141 -55 181 -53
3784 -53 41 44 118 4 -10 54 166 126 19 -95 3 162 -33 81 -141 11 -184 203 94 -1 -41 96 172 28
3808 28 2 88 257 -268 -103 -14 85 -257 -61 226 -215 149 94 -14 12 2 -88 -77 -29 -56 171 -133 -44 -149
3832 -149 65 -135 59 10 -342 242 -16 48 131 4 -131 -104 132 27 -163 60 83 37 -108 100 -57 -113
3854 -113 -2 -212 152 143 90 -11 186 -4 74 212 120 101 -38 -66 94 116 -12 -144 40 16 -62 -43 -134 178
3878 178 179 -50 -38 -15 -38 -44 83 -59 135 81 -151 8 -14 116 -175 184 -35 49 -136 100 58 102 95 -217 -12
3903 -12 -3 35 -30 -57 95 -30 109 84 121 -173 -178 39 37 -120 95 251 -65 -42 -28 139 -21 -15 171 -80 -17 73
3929 73 -48 67 -135 61 92 -10 60 -181 -95 47 -6 -159 -39 95 -40 67 203 34 -9 -19 -82 205 -33
3952 -33 136 138 -60 18 -171 160 173 -101 -190 -178 -6 -72 -217 87 -111 37 38 29 -25 -6 76 160 -41 178 -157
3977 -157 -13 -141 26 -119 -245 38 -38 -81 37 -18 -146 -213 -3 104 0 19 209 152 -48 36 -85 75
3999 75 87 57 211 166 -110 232 21 -21 -246 -34 98 -131 124 -134 209 7 91 82 0 -4 -58 8 -118 -14
4023 -14 135 50 210 -3 85 -64 91 -33 -79 28 41 224 -47 -35 -157 134 74 -153 -72 9 -38 -1 -30 -186
4047 -186 82 0 -198 -153 -133 153 -123 66 51 17 48 35 0 -125 20 -114 -301 -132 231 -324 40 -34 -135
4070 -135 264 119 -7 -3 122 24 8 161 133 -92 211 141 -73 -132 188 -10 -145 -34 178 130 -84 -181 -3
4093 -3 -151 -142 -143 -54 -111 22 -119 -168 20 77 -58 -33 -156 155 -105 -81 172 84 23 -111 23 -36 -33 -8 -74 -75 55
4120 55 -38 41 48 124 195 113 -35 68 -81 -2 -48 30 123 -43 -196 110 -5 158 58 115 -72 74 -52 -31 32
4145 32 -52 158 -24 58 -94 125 170 -55 -75 28 -160 34 -93 -17 -138 74 -102 -44 -64 21 37 138 50 43
4169 43 117 74 -80 217 -5 -45 96 61 20 108 -7 162 185 -20 146 -75 -118 -16 -81 161 -181 106 0
4192 0 301 34 -176 -173 61 6 -39 182 -1 195 36 -111 -100 97 -42 27 144 182 44 -89 122 -208 94
4215 94 -115 63 143 -184 80 81 90 -29 -27 8 208 -84 -134 -111 -173 -92 -109 -74 -88 86 -48 59 -31 -104 -156 -159 -76
4242 -76 -75 46 163 53 141 -3 -66 173 -359 -37 -87 -86 37 9 -113 228 -343 6 52 -124 -213 75 -81 107
4266 107 140 -168 23 140 74 73 -331 -74 66 23 167 114 102 60 -52 84 264 -151 -76 55 -98 76 -72
4289 -72 109 100 124 194 61 242 48 -41 48 -47 117 -6 -93 13 152 -74 50 144 -64 -108 91 78 37 13 -127
4314 -127 -147 86 -2 -173 82 -286 44 -30 -48 -14 164 28 -61 -86 -259 -175 -15 227 109 -199 13 40 80
4337 80 45 33 58 -25 -156 -41 -59 -156 7 41 37 -170 -180 -257 39 -190 209 66 -14 -231 -161 35 -29 187 -18
4362 -18 -83 -146 127 101 117 48 241 73 -50 -126 49 159 202 -168 61 -127 279 47 -112 64 -61 18 -151
4385 -151 27 102 -41 -21 -52 -85 -46 -69 44 -52 32 -51 -40 -3 44 -116 135 109 237 -137 -132 163 -179 -38 173
4410 173 139 1 -164 158 117 -67 -82 108 10 132 44 2 39 12 42 136 -120 -48 95 90 -212 -82 -52 -19 6
4435 6 -19 11 -30 120 33 -11 -66 88 96 -11 -92 125 -30 132 61 95 -72 -3 -93 80 -81 -116 80 13 -198 150
4461 150 175 102 -90 8 -121 35 -138 158 39 -21 -16 132 -30 96 -17 147 -34 24 361 122 -69 69
4483 69 -63 -34 26 -157 -121 -49 64 -135 -43 -152 148 -22 -202 -206 4 -76 59 50 102 -37 -68 24 204 39 -91
4508 -91 -90 133 208 -32 -264 70 -296 -41 -40 5 198 68 -4 -61 57 -80 55 -51 13 32 -8 -94 -15 62 -59
4533 -59 -136 -56 182 6 -232 -92 110 65 113 -31 -27 -183 11 21 13 -406 55 -117 117 -84 5 -6 35 15 -203
4558 -203 21 -38 89 34 -87 19 -86 80 -47 204 -308 -53 30 74 49 19 66 -54 33 190 -75 -10 -23
4581 -23 220 193 -189 -156 -38 141 46 -88 -14 -4 -50 39 44 152 -20 -17 -129 91 76 -56 -136 -217 -53 119 29
4606 29 107 -32 -118 -77 -33 108 70 -311 157 60 57 -144 -34 167 304 -68 -24 129 -96 160 137 139 -79 -18 -215
4631 -215 -5 -184 107 206 66 29 -71 127 -88 -35 43 139 -138 93 -31 83 -21 98 96 -68 -38 -144 3
4654 3 247 87 74 122 4 172 38 -146 45 28 -75 -123 -98 81 -18 44 49 -210 1 -100 147 60 -52 -8
4678 -8 -189 29 -73 68 -21 8 58 -71 -108 121 12 -192 -78 103 -54 2 59 -138 -41 -31 22 -17 -95 108
4702 108 25 45 -221 75 -153 30 78 -134 -76 209 -32 -49 -239 -54 70 -235 -29 86 -29 -49 170 -182
4724 -182 38 20 85 -133 -61 -8 -113 169 -171 -82 87 -95 93 128 99 24 11 36 -76 339 269 12 -49 99
4748 99 33 -21 127 59 71 82 -32 -259 7 -228 -36 -16 47 -24 64 -91 -87 -50 -292 164 -98 317 -48 96
4772 96 -59 8 220 -92 25 35 0 -82 62 77 160 -8 -44 -288 -100 9 -39 -45 38 144 17 43 -54 61 -119
4797 -119 10 191 -90 147 186 91 139 -83 -59 86 75 75 88 -47 -184 -116 -19 221 -6 -202 43 -30 -213 104
4821 104 -37 95 92 -137 -141 55 71 41 -120 184 38 163 22 91 112 -150 211 -67 -88 206 -23 -225 215
4844 215 194 32 -53 87 -30 170 -38 7 -14 -171 49 -89 -42 42 191 135 130 -116 36 10 10 -31 52 0 -15
4869 -15 138 -99 -79 116 162 3 -10 76 -38 -63 -152 27 96 -62 -44 -66 98 -14 -17 -34 -18 -123 -222 -45 98
4894 98 118 213 -124 -23 -153 19 -89 -87 175 -32 -24 -81 -72 18 56 -16 159 11 9 131 -105 126 5 49 117 76
4920 76 122 -114 -28 110 89 114 105 -118 50 149 -32 282 -91 40 -215 22 57 -150 -29 154 83 9 77 -93
4944 -93 247 -206 3 78 73 -79 104 116 112 99 -40 59 -151 114 -106 -130 96 -16 -49 49 -74 37 -27 158
4968 158 -82 -23 -182 78 -8 -164 0 18 120 99 -8 -93 -7 -237 198 109 132 19 37 121 198 -38 106 -149
4992 -149 40 26 14 -30 -81 156 7 -15 117 9 -73 -43 -145 -50 136 44 283 61 10 174 -65 36 -1 -203
5016 -203 -210 -107 -153 -58 121 93 -8 81 116 13 -138 80 108 169 91 10 48 71 -62 -177 -10 55 3 -101 2
5041 2 58 14 2 -80 -33 -180 -61 -226 -80 -33 11 103 296 -118 60 9 -104 78 79 39 -89 65 121 97 51 -61
5067 -61 -17 -27 75 -175 -274 -13 40 25 26 -101 90 -13 19 -117 -56 235 139 -73 -57 -190 -115 -82 68 -31 -129
5092 -129 167 -7 119 -101 -199 133 199 60 67 -101 -85 -117 106 -87 -50 -126 -247 84 89 -84 -72 178 -149 -128
5116 -128 168 126 70 84 67 -77 6 -133 -143 173 57 5 27 119 -244 -73 91 -125 33 132 -56 -25 95 -148
5140 -148 -157 -75 -189 -58 -6 -57 -15 -13 15 28 -105 -126 36 13 161 145 14 -42 -159 -121 -108 -5 -134 7 194
5165 194 -35 12 52 130 -103 28 245 -6 69 59 191 -23 134 181 -139 -158 -33 -7 -14 -24 -137 -257 138 6
5189 6 104 79 -75 -57 5 -42 50 82 -68 132 -142 -67 -40 -151 20 157 -26 -69 -62 -218 -3 143 -3 39 73
5214 73 -14 72 -96 3 213 94 101 47 47 72 -12 133 87 -14 -10 19 -253 146 -73 158 82 -123 -48 -102 40 -4
5240 -4 -57 -131 16 -200 28 190 -44 16 38 101 102 116 -97 61 -199 -257 60 174 -182 -30 -3 179 163 134 65
5265 65 -82 101 73 106 -38 219 -16 121 -74 -58 19 -144 83 -72 122 80 -3 -95 275 -56 -103 80 -146
5288 -146 44 -129 -147 69 30 82 -148 36 -39 7 -59 15 -119 -156 163 -23 -108 -11 -129 -130 75 -190 -162 9
5312 9 -129 150 31 190 -7 -27 -169 174 -7 -24 104 -249 79 278 41 -174 -59 78 -68 -136 31 56
5334 56 -201 -151 48 -74 -90 140 74 -69 341 51 -68 -49 19 55 -62 258 -52 2 -99 -159 -147 -101 -17 -6
5358 -6 64 -39 92 -52 -141 -62 161 -59 -117 151 -83 -31 207 -106 -148 58 124 7 25 -34 -152 166 47 24
5382 24 -11 50 -44 165 118 -37 47 7 35 102 85 -59 -55 57 -240 -45 35 -21 -13 -66 -56 -77 -76 -116 -25 39 -112 -121 -11
5411 -11 -94 -114 98 61 152 177 -16 122 77 67 -121 -39 15 -40 65 161 -98 -17 121 93 -300 148 89 -65 -82
5436 -82 -44 -148 -104 -79 -137 -99 -148 -35 1 96 -111 -56 -1 -59 23 46 89 -53 -208 -83 12 299 60 -91 -46 -287
5462 -287 -27 139 -10 -105 0 -32 60 5 186 -32 147 -144 -201 61 -202 26 33 -53 34 130 -83 2 113 58
5486 58 -10 201 74 -88 -34 -59 65 7 31 99 94 112 23 -6 -1 -147 12 -203 43 60 -111 -106 170 39 -18 -221
5512 -221 -141 -65 64 -38 -54 -89 -11 134 166 51 -51 -16 -54 -146 -133 16 84 116 106 98 190 47 -17 53 -161 134
5538 134 150 62 44 -154 60 -75 16 -12 -51 105 -132 179 -73 -38 164 77 374 111 23 -10 -100 115 34 19
5562 19 45 33 18 47 312 44 -155 -4 27 -295 33 -120 -154 -18 -31 153 -19 90 -193 -11 -123 -58 -98
5585 -98 13 -23 -111 91 179 -50 109 -2 -36 -12 -117 -173 165 19 148 40 -265 78 28 138 -207 80 150
5608 150 -103 -54 -48 -61 -56 -142 11 -118 85 -91 106 -56 -66 -60 -26 61 -121 286 53 36 -78 191 46 191
5632 191 -97 107 188 -68 93 153 -57 -131 -126 -230 -54 -15 106 -79 32 123 46 142 28 58 -175 -31 38 -117
5656 -117 71 -41 -18 108 -84 -150 171 -114 -47 23 -55 -42 92 -18 -15 153 -214 223 189 -189 -118 11 65 -55
5680 -55 -256 -160 -126 102 -264 46 -159 67 -90 8 130 -29 -2 -17 -59 -84 -48 -37 17 -71 -38 171 -91 -47 170
5705 170 -102 90 -132 -48 -60 172 126 -152 -141 -192 -19 30 -133 53 116 130 -21 16 -225 -14 3 -163 -35
5728 -35 -43 19 113 -150 -67 170 -32 93 25 19 112 6 -106 -31 -72 -45 -12 -34 -118 141 78 -49 -152 81 -96 120
5754 120 -70 30 202 139 -121 123 -62 69 -40 -144 -111 -25 -35 -217 45 104 -68 2 69 29 -14 33 93 -117
5778 -117 62 121 55 -259 -70 69 38 10 75 0 171 81 80 -118 113 77 28 -66 -165 -15 -83 -79 66 -55 53
5803 53 111 -167 240 -16 -28 -48 237 -166 -210 66 -317 59 67 -3 49 -34 86 -43 27 -31 -72 67 22 212 -81
5828 -81 -215 -16 74 25 47 -138 56 -120 105 -161 134 45 21 107 146 -180 110 45 171 -148 -42 91 -190
5851 -190 -114 -100 82 -127 -58 -10 -41 -246 -136 -57 136 -26 5 69 -5 43 -4 30 76 35 -150 -147 10 -87 -232 53
5877 53 50 -58 -81 128 20 12 166 116 -65 -101 19 -17 -113 -162 -266 -21 83 -68 -85 48 -87 -84 17 18 200
5902 200 76 147 -32 36 264 -41 53 -15 -135 -14 -73 56 -81 64 127 50 100 -69 23 122 66 9 -147 -123
5926 -123 -133 17 148 185 183 106 99 355 130 74 34 74 -81 41 96 33 -33 80 -65 -70 -217 -107 50 19 71 -37
5952 -37 103 -11 -5 40 171 -31 -152 20 -60 -276 -177 131 23 153 -148 -118 222 -62 64 99 -128 38 151
5975 151 7 141 -116 155 47 81 -176 -154 93 -3 -8 5 -65 -86 -82 163 103 -340 218 118 174 -18 -203 -79
5999 -79 -52 162 33 4 136 74 114 223 123 -2 162 59 188 -70 -22 20 115 32 95 3 15 70 33 -79 -126
6024 -126 71 -1 38 53 -79 -114 -167 -68 42 57 -18 -48 81 229 -110 -46 81 179 52 33 -88 128 -119 28
6048 28 -85 183 19 71 132 100 49 45 73 95 179 12 -14 -156 -76 -147 -66 84 314 35 63 192 -61 -88 -107 -119
6074 -119 106 -159 73 137 9 -118 -28 -49 -173 111 27 123 -4 227 9 136 -21 189 37 -8 48 -139
6096 -139 -139 -143 66 23 41 -39 36 26 35 -49 -292 -18 183 -119 17 71 -26 -52 105 55 -25 0 19 -67 -178 42 171
6123 171 116 -413 106 73 40 -62 -33 -73 205 142 -76 88 -78 -165 -155 39 7 -115 -24 -18 23 13 -123 -39 3
6148 3 -110 31 88 56 -155 21 65 67 64 2 73 -110 -235 -38 44 -87 -64 203 -212 -168 109 74 -140 -136 191 157
6174 157 -27 127 116 -102 -202 134 -22 -9 -21 205 136 -7 111 97 -50 139 -40 81 -125 -13 104 -88
6196 -88 17 -33 -2 -151 -59 -17 242 -6 -100 135 20 -21 -165 -26 -226 -171 16 -93 28 -67 -168 140 134 -6
6220 -6 43 -67 -51 306 75 -75 30 -79 -21 -88 63 116 68 -179 -265 22 -154 12 124 -139 -174 143 123 -138
6244 -138 -164 -233 -129 -42 -5 153 -47 -122 6 258 -97 249 82 10 161 204 -185 -3 -25 -77 -22 -52 27 -6
6268 -6 -216 -133 280 146 223 81 -17 -48 -54 6 -248 -182 -9 -137 5 161 38 -45 -44 -27 -135 47 50 -118 -23 -78
6294 -78 -157 120 77 61 -110 81 -33 -59 -159 -95 -172 100 -227 35 -63 124 -172 -60 -68 -182 -102 172 -157 205
6318 205 135 -1 24 -121 187 -26 81 104 2 -152 -6 -3 35 92 63 213 -144 141 -48 -71 22 -83 164
6341 164 8 -16 78 57 -12 35 17 -111 -25 70 34 276 -60 -63 51 198 141 -79 10 120 43 -158 -106 106 -170
6366 -170 244 28 69 66 60 0 -125 -61 202 287 -25 69 -94 0 -319 222 -113 -26 -75 169 49 -28 226 58
6390 58 11 78 -9 -47 -114 150 -106 -97 -17 192 59 -136 138 -50 24 187 -185 -15 47 -38 154 19 -66 168
6414 168 114 -2 -72 36 185 272 216 27 63 -108 -109 -20 -93 -120 31 -196 131 -146 85 -263 -166 108 -54 137
6438 137 -20 -100 190 -49 -58 139 32 -22 101 -94 2 -58 31 -30 -58 82 18 -85 108 214 13 -61 -70 -45 -135
6463 -135 -33 81 196 317 -79 13 103 109 21 106 -75 22 79 -131 228 159 7 -186 -90 -129 76 68 -23 -11 4
6488 4 -29 -66 -48 -212 -16 104 -183 25 72 173 53 -132 -134 -80 37 -16 -41 104 2 17 -7 -116 4 43 -195
6513 -195 11 13 -11 -83 22 69 -33 181 -8 240 -7 146 176 -52 -31 21 -26 27 134 301 103 -56 -87 66
6537 66 75 4 125 16 -117 -27 94 -242 -153 45 8 185 -37 65 -110 188 -156 151 -48 -9 99 -42 7
6560 7 -82 -35 -40 41 58 6 -71 -142 114 -145 171 19 -56 23 51 84 133 86 -166 130 -80 -55 -133 51 154 38
6586 38 -68 113 92 -9 -59 -122 12 -113 101 -106 68 -39 71 -9 -92 -83 188 67 -62 -206 149 -119 64
6609 64 -135 -215 -34 -125 214 82 -205 116 9 133 112 -81 45 -163 -55 -119 144 -94 83 160 -54 -163
6631 -163 169 -141 -124 9 35 22 107 -146 -162 61 -113 39 -7 -4 105 -61 146 53 4 125 -164 -70 -107 218
6655 218 195 9 53 16 -160 73 -65 121 1 -39 -61 -218 -19 -20 97 3 -176 98 -15 132 -50 -106 -222
6678 -222 127 28 78 -111 -71 135 4 -167 -166 167 -117 81 -130 -261 -250 -76 117 -157 236 -52 235 -92
6700 -92 55 64 132 -214 282 -73 -111 -18 -315 -64 -83 -105 -41 -160 -93 199 73 -182 -211 205 -93 -127 8 -14
6724 -14 174 -51 14 -6 -53 77 28 77 64 -109 -182 -186 51 269 -175 -17 40 -75 25 201 118 52 -60 -114 161
6749 161 22 -54 33 -117 149 2 -77 111 -164 2 -41 65 148 -120 -87 185 9 364 -29 -11 101 -35
6771 -35 -88 -25 1 127 211 -60 -56 -112 -68 50 84 152 70 -142 165 21 -84 141 -9 -112 25 -179 -92 -336
6795 -336 140 -4 -2 37 -17 53 66 -190 85 125 -86 -82 -232 -34 -221 94 -234 -20 178 34 53 -27 -128 103
6819 103 250 126 138 -312 -28 -307 -86 123 139 203 107 69 -99 -131 -87 77 100 -44 84 -230 71 54 -27
6842 -27 -75 139 312 -37 77 16 141 47 154 -47 207 76 347 -15 -161 160 125 -74 53 76 3 201
6864 201 -18 19 -33 -136 87 -20 -55 100 2 -281 -8 182 -27 39 -61 73 68 92 11 -167 20 93 159 5
6888 5 -87 124 90 150 -78 111 46 87 166 88 -173 -79 34 -53 289 -6 171 -44 -35 -33 17 -219 -139 81 -19 -51
6914 -51 -6 -99 99 -172 34 195 -11 -61 135 -125 226 24 -131 101 78 5 -127 46 -46 -38 100 -65 28
6937 28 76 -22 -152 -264 64 53 0 266 153 94 -96 90 121 143 -132 -20 -59 40 110 -56 194 -131 31 -24
6961 -24 -14 -14 77 -51 -95 -189 -28 102 -79 -123 30 155 198 7 42 41 -165 -33 20 159 -105 119 -191 112
6985 112 102 -10 36 -76 167 -32 -114 -117 81 -25 71 16 -46 37 50 -20 -89 -29 -64 4 104 -206 29 27 78 125
7011 125 -25 93 -51 -74 26 -297 -19 150 -2 201 -56 168 -77 -37 239 -4 -99 35 -5 224 -21
7032 -21 179 -149 -137 -16 168 -20 -19 171 214 68 -204 -387 174 66 144 -137 27 54 -1 23 190 41 -112
7055 -112 -172 -45 -222 206 11 -94 98 -266 13 -78 122 -181 249 25 151 -124 -3 -60 -73 57 100 81
7077 81 85 -98 5 95 236 31 29 -108 -131 38 -101 -47 -18 156 -105 -174 30 -98 -32 24 161 -67 -35 185
7101 185 39 -23 -87 88 -167 -145 182 74 28 -14 -110 18 -113 64 90 234 -112 -72 31 -74 -188 55 288
7124 288 -185 -194 -14 157 72 41 55 -35 -18 150 53 86 -62 350 -7 76 105 -11 -56 32 135 -25 -44 35 -241
7149 -241 -32 -14 150 -76 78 -55 -194 113 3 29 88 89 36 49 174 155 71 67 21 -42 -168 -134 -32 -97 18
7174 18 85 31 -29 152 -20 -104 -6 105 -256 -32 99 -45 20 -175 -95 -28 -143 20 -16 -79 -76 74 27 -234 192
7199 192 22 -124 21 -93 -133 -187 -39 -47 18 -168 -126 -32 349 43 14 12 13 84 -84 18 57 -128 -79 -33 -93 77
7225 77 -56 84 -100 -176 -135 23 61 185 -54 30 66 -51 16 -68 341 43 -155 -29 -67 96 74 217 -17
7248 -17 -43 0 -140 -36 83 -182 11 -40 -140 262 -88 257 71 74 -39 -119 1 -161 28 59 -211 -18 23
7271 23 -80 -363 90 -144 -125 241 59 72 -53 39 -2 25 -47 -28 -211 30 -159 -214 -125 -90 -161 17 -133 -149
7295 -149 -160 73 0 -118 -54 -79 -60 67 123 -256 36 -130 -159 226 33 -86 -164 98 -89 -106 -55 -34 -211 63
7319 63 -72 -13 2 84 -40 42 24 15 -38 -176 -43 120 -52 128 209 54 226 31 -12 9 47 53 -47 99 86
7344 86 -58 106 -137 -76 20 19 -193 92 -118 11 -158 74 90 -12 -5 43 102 -81 44 -135 -82 196 -34 -61
7368 -61 -12 125 205 118 -37 153 -47 -150 115 -201 123 0 13 -79 6 -33 60 -72 95 -49 -75 185 -38
7391 -38 -75 -111 -129 -82 2 -167 -3 -112 202 102 -84 41 -7 -41 52 37 161 73 -12 -138 76 140 22 158
7415 158 41 -163 -238 130 -128 -21 54 9 19 -13 20 235 6 -46 -92 -63 -90 32 -107 151 -43 54 -34 -120
7439 -120 -12 -24 -94 -122 -77 -179 143 230 -208 231 41 58 22 53 335 -143 220 -259 152 -74 112 -30 194
7462 194 30 -44 -3 171 105 -210 -80 -120 78 139 -61 -68 -109 7 -18 12 82 71 210 7 -27 -94 -70 -11 26 7
7488 7 -196 24 -237 152 24 -20 189 195 15 -160 -29 102 125 53 -51 212 78 -144 205 -109 12 -258
7510 -258 -178 -45 -150 -97 -67 -111 -152 -146 -26 5 133 -154 130 49 31 59 139 -28 -217 -222 106 175 128 -66 -28 -14
7536 -14 200 -120 78 -17 -65 -21 120 -58 -76 -28 -69 237 -117 19 8 77 46 19 -123 216 99 -128 3 27
7560 27 -25 -51 -1 -14 155 49 -139 -20 -182 126 26 -134 -16 24 166 -113 32 26 -118 -153 -43 0 -86 105
7584 105 -66 54 153 33 -6 -37 -78 -121 -48 42 148 5 -157 159 62 -75 -3 67 -28 -85 -70 150 63 -160 102
7609 102 117 -77 -239 -135 -155 115 -11 -55 96 -128 26 104 30 -68 -4 40 -14 180 101 -136 -49 -23 -140 28
7633 28 -35 -61 199 127 -210 146 50 13 -123 -61 88 -180 35 -33 -51 -307 95 227 -79 -195 31 28 64 -13
7657 -13 -50 -28 74 211 204 26 -114 -20 61 -29 201 96 43 -275 95 68 14 -103 -34 93 -17 -78 173 -79
7681 -79 -1 38 -137 112 253 105 -236 13 5 -165 65 -189 158 -147 31 -81 112 6 91 196 -229 19
7703 19 90 -35 -19 -95 -201 -2 -23 -73 57 133 66 -173 -31 75 62 12 286 -59 -31 79 -9 46 40 92 -183
7728 -183 56 99 -230 151 -40 152 166 16 -175 80 245 -101 -46 84 188 167 343 -35 -68 -74 -65 -127 162
7751 162 -22 48 -132 -113 -15 -99 129 -52 -56 21 120 34 -109 110 -41 16 -183 140 39 124 154 65 105 126 8
7776 8 -217 137 -32 -43 -289 53 38 1 132 77 26 -201 59 -139 91 -9 -99 210 115 2 -80 -136 195 -92
7800 -92 -237 -6 46 -62 -44 67 -132 21 -54 71 -35 -47 -10 -57 144 12 -200 -55 -151 22 -63 -105 -94 -37
7824 -37 210 -40 -53 43 -104 -36 -63 69 -31 90 25 -67 -14 -108 -71 219 105 -162 -8 -45 -79 1 -154 40
7848 40 207 -66 33 -13 -28 140 -15 -242 -43 -90 -29 -159 -94 -69 -27 11 -51 46 23 33 36 69 126 -21 28 -39 -79
7875 -79 -44 141 -66 -63 166 1 -214 -26 65 103 189 -76 98 -69 -101 -131 108 -67 -100 36 234 -39 -49 112
7899 112 -69 14 -55 -111 -41 64 71 -94 272 129 -13 151 -82 56 107 58 -66 223 -171 15 43 -290 -69
7922 -69 312 -38 -40 166 -214 0 12 30 18 -9 5 -178 -37 -19 -237 -163 -64 177 10 59 81 121 -14 132 -133
7947 -133 14 -155 -104 22 -33 -41 -215 -79 -90 78 12 -214 129 -1 26 96 -77 -97 -158 139 100 248 -54 -20
7971 -20 -113 -96 74 19 50 12 14 72 295 201 6 -102 -8 97 58 85 -7 112 19 126 -59 -153 83 207 -159
7996 -159 102 -4 -19 -88 310 -91 -61 91 -60 71 95 -21 10 55 -110 170 34 -31 -38 -20 -29 29 257 31
8020 31 82 -1 47 -36 -44 -17 64 26 119 171 166 -286 35 103 -210 40 -34 187 67 -105 171 134 120 5 232 105
8046 105 -69 150 8 69 102 10 12 -12 -93 107 -161 145 98 22 -43 31 22 -14 -61 159 -97 -122 -95 -23 -73 -129 -45
8073 -45 245 31 -68 -39 37 -134 26 247 -183 48 43 -86 -111 -66 -152 -239 -66 38 -5 20 -20 121 217 146 -117
8098 -117 -198 131 70 111 75 214 -112 -50 102 -86 -9 -200 -19 -83 90 180 97 -119 87 70 91 -222 -276 189
8122 189 -130 222 8 36 -34 -127 -57 -16 -51 179 -80 -255 -60 -51 57 238 29 -108 -25 -79 170 -28 54 45
8146 45 89 -114 -108 23 48 121 87 140 81 -71 -3 5 -158 7 -30 -34 0 -81 17 21 39 65 -31 52 -11 122 -1 -94 -58
8175 -58 -31 100 280 -23 62 174 157 -64 -33 223 10 31 -77 -100 -80 -31
8191c1
$$ Imaginary data points
##PAGE= N=2
##DATA TABLE= (X++(I..I)), XYDATA
0 0 0 0 0 0 0 0 0 0 0 0 0 0 0 0 1 -8 8 -8 8 -8 16 -16 16 -24 24 -32 33 -40 48 -54 60 -70 79 -89 100 -113 127
37 127 -143 159 -176 197 -219 242 -268 297 -329 362 -399 440 -485 533 -588 650 -716 791 -877
56 -877 972 -1084 1214 -1364 1546 -1770 2050 -2419 2921 -3650 4822 -6999 12466 -60714 -62472
71 -62472 27998 -12854 -51366 -35595 21192 12248 -25523 -28062 21813 35762 2213 -20746 13311
84 13311 38732 13549 -18251 135 23265 7720 -21364 -16139 4303 1782 -20523 -20880 -3338
97 -3338 1580 -12204 -12736 7065 15029 -1 -682 21832 29187 10511 5928 27507 35603 11233
111 11233 -3847 15261 30744 9174 -18534 -9203 17936 7915 -28656 -27994 9299 14749 -22208
124 -22208 -35029 2112 26333 -1477 -27417 -2861 31250 18720 -17031 -12499 25656 28692
136 28692 -10204 -23969 6794 22775 -6978 -32127 -12686 10994 -5040 -31956 -24019 1728
148 1728 1848 -20475 -23200 891 9214 -6896 -12367 5339 15860 3101 -5360 7861 16293 4789
162 4789 -3471 5799 12625 977 -10372 -844 10835 -21 -16134 -7038 11550 5037 -16180
175 -16180 -11316 14856 15597 -9452 -13511 12720 25205 2429 -15085 5413 28504 12266 -15659
188 -15659 -6915 22641 18923 -14028 -18876 10789 19768 -7859 -23787 -2427 17902 1237 -22756
201 -22756 -11452 13898 9391 -14905 -15436 8281 13927 -6564 -14677 3242 13348 -384 -11993
214 -11993 -1616 10467 2445 -9939 -3805 7199 2369 -8908 -5232 5683 2312 -9652 -6270
227 -6270 6250 3223 -9827 -8224 6755 7224 -8304 -11101 5988 12652 -3257 -13081 2598 17620
241 17620 4147 -14021 -2715 18112 11632 -11062 -10157 12976 16428 -6900 -16294 3938 16681
254 16681 -894 -19100 -6359 14295 5426 -16297 -12030 9673 11088 -8488 -13165 5739 15085
267 15085 69 -10783 1615 14595 5898 -8146 -2345 10705 6351 -6922 -5912 5051 4019
280 4019 -7198 -8867 1485 2382 -7580 -8884 977 4236 -4677 -8025 3387 9239 -428 -6448 4052
295 4052 13161 4281 -7040 704 13981 7346 -8734 -6455 8992 8404 -9395 -13944 2413 9456
309 9456 -6042 -16919 -3893 10710 1282 -14148 -6807 11511 9388 -7164 -7624 9598 14989
322 14989 -554 -8642 4357 14340 3223 -9448 -2802 9064 3556 -10295 -8598 3415 3004
335 3004 -8313 -10223 469 4211 -4712 -7876 1593 6864 140 -4286 3102 9529 3208 -3472 2610
350 2610 9542 3645 -5076 -1378 7246 3286 -8293 -6490 4214 3511 -8623 -10717 1555 6328
364 6328 -5292 -11269 113 9376 1025 -9090 -1555 11628 7391 -5846 -4376 9411 10601 -3105
378 -3105 -8146 3733 10402 -1332 -10768 -2494 7338 880 -10683 -7023 4819 3482 -7717 -7714 3344
393 3344 6554 -2449 -6295 3105 8713 1192 -4217 2425 8585 3377 -3693 287 6969 3066 -4840
408 -4840 -2451 4561 2639 -5825 -5526 2662 3263 -5227 -6744 2167 5094 -2785 -6904 1343 7810 1011
424 1011 -6095 -295 8614 4455 -5677 -3477 7200 6399 -4942 -7138 3084 6518 -3856 -9789
438 -9789 -1418 5649 -1614 -10179 -5254 4735 2119 -7749 -6580 4087 5247 -3828 -6037 3434 7704
453 7704 -130 -5112 1861 7474 2313 -4254 -667 6026 2840 -4608 -3388 4050 3277 -4335 -5031 2570
469 2570 3752 -3237 -4676 2351 5437 -587 -3950 2227 7643 2938 -2895 1599 8317 5035 -3036
484 -3036 -1067 7014 5743 -3482 -4471 3432 4868 -3208 -7104 -353 4239 -2009 -8525 -3407 4466
499 4466 1124 -6947 -4646 4132 4112 -4252 -4640 3707 5824 -1502 -5389 635 5418 59 -6109 -2398
515 -2398 3539 183 -7282 -5614 1941 759 -6469 -6317 814 1860 -3739 -4954 1357 4545 224
530 224 -3394 1593 6701 3156 -1978 1063 6899 4149 -2572 -905 5789 4045 -2711 -3639 2629 3820
546 3820 -2230 -4759 756 4737 84 -5129 -243 6392 2971 -3325 -475 6430 5114 -1744 -1397
561 -1397 4950 5784 -466 -3951 1266 4776 -574 -6169 -2005 3057 -1068 -7218 -4383 1980 51
576 51 -5618 -5077 1045 1852 -3177 -4418 978 4329 -575 -4225 516 4740 960 -4240 -1253 3677
592 3677 782 -4861 -3296 1935 1366 -4118 -4723 285 2333 -2432 -4596 556 4369 107 -3588 879
608 879 5773 2810 -1983 695 5349 4412 -1119 -1258 4143 4713 -896 -3341 1751 4422 -486 -4445
624 -4445 -254 3838 162 -4205 -1423 3317 2156 -2683 -2063 3018 3850 -1260 -2714 2245 4710 -356
640 -356 -3585 419 3979 250 -3963 -1225 2369 111 -4247 -3352 1072 1049 -3434 -4156 403 2314
656 2314 -2102 -4116 272 3246 -519 -3502 -71 3717 1233 -2865 -1133 3169 2179 -2030 -2435 2199
672 2199 2814 -1725 -3519 729 3331 -1186 -3608 18 3128 233 -3258 -959 3168 2128 -2114
687 -2114 -1609 2753 3357 -1164 -2245 2174 3764 -398 -2459 941 3365 374 -2947 -562 2822 937
703 937 -2845 -2155 1848 1561 -2397 -2949 1518 2364 -1535 -2984 756 2852 -327 -2725 220 3052
719 3052 1102 -2243 -955 2752 2050 -2012 -1927 1784 2461 -1635 -2650 815 2402 -838 -3059 -402
735 -402 2451 363 -2919 -1105 2244 1621 -2040 -1386 2450 2404 -1367 -1901 1843 3025 -538 -2201 526
752 526 2731 230 -2736 -624 2090 703 -2946 -1889 1463 1328 -2581 -2632 913 1763 -1440 -2394 565
769 565 2497 -133 -2224 203 2797 879 -1949 -761 2344 1454 -1662 -1473 1451 1470 -1536 -2078 600
786 600 1690 -1024 -2817 -96 2265 154 -2213 -587 2648 1603 -1342 -993 2129 2147 -573 -973
802 -973 2018 2689 -182 -1781 568 2244 -79 -2338 -505 1908 511 -2283 -1070 1561 1028 -1745
818 -1745 -1651 1044 1720 -852 -1897 700 2080 203 -1827 81 2164 428 -1780 -665 1655 901
834 901 -2089 -1830 755 1119 -1560 -2515 31 1221 -1055 -2176 -269 1672 -99 -2029 -317 1967
850 1967 946 -1201 -863 1903 1887 -652 -1182 1437 1988 -421 -1549 451 1911 -109 -2010 -456
866 -456 1624 544 -1961 -812 1700 1048 -1039 -901 1454 1611 -391 -1200 1164 2004 84 -1385 273
883 273 1835 434 -1494 -564 1276 581 -1577 -1355 704 698 -1455 -1797 319 1128 -550 -1777 -86
900 -86 1368 -22 -1613 -294 1430 630 -1281 -853 1235 916 -1157 -1097 880 1138 -799 -1637 322
917 322 1466 -309 -1704 -148 1364 171 -1217 -564 1617 1109 -901 -638 1272 1549 -341 -1131 982
934 982 1892 -75 -1074 349 1618 413 -1263 -567 1462 605 -1149 -911 708 828 -929 -1331 432
951 432 1016 -528 -1490 105 1139 -144 -1139 -181 1088 531 -1337 -762 843 804 -812 -1171 604 1024
969 1024 -587 -1493 261 906 -403 -1400 -162 941 -18 -1387 -699 1152 821 -926 -643 1013 1074
986 1074 -314 -877 1146 1482 -53 -955 187 1465 332 -772 -237 1146 286 -786 -900 944 715
1003 715 -624 -878 653 1226 -401 -1202 208 1361 46 -961 -20 1207 576 -744 -486 1050 518
1020 518 -732 -844 383 807 -1010 -1103 -21 600 -730 -1376 -290 766 -8 -1263 -735 964 529
1037 529 -977 -664 1150 904 -488 -576 613 1164 -379 -1002 147 1050 263 -1098 -211 935 502 -1015
1055 -1015 -669 897 530 -599 -847 687 905 -220 -659 563 1201 322 -577 46 1274 587 -578
1072 -578 -251 928 604 -691 -674 514 534 -634 -1180 72 387 -415 -1048 -348 449 -26 -1177 -290 1041
1091 1041 564 -593 -241 809 726 -604 -529 482 672 -276 -1006 -48 651 -269 -1203 -508 409 -41 -1015
1110 -1015 -376 755 580 -704 -574 638 981 -65 -376 382 1160 333 -587 -85 1021 111 -535 -491
1128 -491 573 405 -435 -607 283 464 -201 -726 -12 672 -180 -737 -41 944 255 -275 -274 896 671 -410
1148 -410 -392 632 441 -551 -733 23 449 -330 -907 -186 365 -107 -785 -146 755 115 -645 -102 571 484
1168 484 -339 -417 683 722 2 -514 -40 785 -16 -643 -129 572 30 -543 -332 382 13 -681 -531 297
1188 297 586 -288 -501 310 625 47 -492 182 874 177 -477 -367 651 174 -660 -470 421 245 -413 -552
1208 -552 -24 530 -182 -829 -191 576 -41 -660 -16 540 572 -464 -179 466 339 -343 -324 199 484 -156
1228 -156 -597 45 738 -160 -518 136 626 120 -357 -54 555 466 -331 -387 321 663 -46 -456 249 709 35
1249 35 -587 157 643 113 -503 -116 303 74 -356 -391 337 375 -393 -636 307 396 -320 -681 -44 567 28
1270 28 -635 -103 48 94 -310 -329 96 100 -373 -335 202 285 -161 -483 -75 511 53 -427 56 448 60 -610
1292 -610 -143 288 331 -373 -446 18 111 -97 -387 88 149 229 -284 5 442 367 -138 -103 413 382 -179 -11 288
1315 288 504 43 -310 246 252 -273 -216 -41 344 118 -677 -207 284 165 -402 -161 204 147 -364 -419 310 300
1337 300 -6 -358 165 288 -107 -499 -130 218 -308 -617 -335 -93 -45 -267 -404 88 141 -211 -338 96 463
1358 463 87 -214 152 431 272 -146 53 496 242 -42 -7 220 154 -243 -213 173 173 11 -335 192 424 -3
1380 -3 -79 4 534 276 -89 168 322 380 98 29 265 354 155 -297 65 15 -124 -463 -94 133 -38 -477 -353
1403 -353 86 185 -197 -162 80 214 -130 -336 112 318 55 -288 29 160 13 -317 -49 -104 -29 -406 -214
1424 -214 -34 -58 -509 -353 -233 257 -53 -187 51 417 -16 -224 2 342 213 42 224 346 309 -57 69
1445 69 120 534 -66 -246 8 255 61 -228 78 152 -53 -214 31 268 119 -7 52 197 247 -239 -281 155
1467 155 209 92 -69 -306 112 -62 -315 -536 156 -96 -325 -453 29 -26 -243 -166 -114 412 -75 -124 -184 466
1489 466 156 -245 177 171 -17 -219 -232 96 243 -81 -246 6 303 62 -70 142 260 -93 -267 43 78
1510 78 209 -78 -38 217 40 -96 -65 270 223 75 -131 146 234 -35 -136 105 133 177 -176 -134 170 -19 -89
1533 -89 -114 40 180 -90 -239 92 61 54 -30 463 159 89 -153 -7 97 16 -222 -238 26 28 -266 -125 -354 204
1557 204 97 -109 -44 -2 -106 -30 -80 259 109 -146 -80 15 230 -117 177 214 -83 -100 -120 71 70 -159 14 -77
1581 -77 -73 -223 -55 75 -50 19 -221 -6 180 109 -99 -67 290 94 -83 132 131 65 -166 -213 53 123 295 -242
1605 -242 -241 -34 22 -180 -141 -96 106 31 -40 61 -139 108 -199 -104 313 182 71 -110 312 117 -164 -120 258
1628 258 58 -150 -259 242 238 -169 -72 -86 276 -111 -72 -141 -116 21 -123 -84 31 190 -36 129 -38 98 -2
1651 -2 -29 10 -13 -36 -8 -11 -137 -73 -213 32 -34 81 -275 101 91 186 44 -192 -184 -69 33 72 -9 279 -162 128
1677 128 71 291 -15 -44 137 152 61 -87 -90 -39 93 -41 -301 -144 228 6 -88 219 174 19 47 -11 -15 145
1701 145 23 -134 20 14 -137 -213 154 25 -169 -98 36 69 18 -202 88 -208 -21 -280 46 92 -45 -97 -183
1724 -183 -91 194 8 -51 166 84 87 -78 -133 204 405 85 -195 -13 -8 -144 62 -206 171 -132 110 -55 61
1747 61 217 -154 -53 133 35 51 -93 -103 81 260 -2 95 136 -44 48 37 -4 -38 -61 -25 5 -62 80 108 32
1772 32 -46 -94 -142 30 201 -71 34 323 -44 30 -57 45 205 -99 -169 26 154 42 -105 -74 -21 86 -251
1795 -251 -173 9 -197 88 11 14 85 -83 95 -10 5 96 -174 -69 -33 162 28 -42 243 97 202 94 104
1818 104 177 12 -16 223 62 17 -25 199 124 70 101 -20 -127 -199 300 307 171 -21 47 -45 220 48 -108 -167
1842 -167 115 101 -50 -176 98 -6 208 -318 66 188 58 131 -140 96 29 42 -302 211 212 123 -41 79
1864 79 38 146 -180 55 139 188 329 65 -92 91 -83 -131 -90 185 -3 -139 -53 67 -294 -65 -79 95 -116
1887 -116 19 181 -31 27 -121 -25 209 -26 -33 14 145 123 -38 -90 -50 43 -129 -161 -101 202 10 -153 50 241
1911 241 125 -74 -217 89 189 -44 -39 -211 108 21 5 -43 65 -98 52 -77 -62 71 -166 -154 -198 -180 -278
1934 -278 143 -57 118 158 -6 -66 -143 -106 112 110 100 -25 -196 132 77 283 -77 -139 -58 104 -132 138 123 64
1958 64 -193 -128 166 24 111 125 175 192 -49 98 -85 -9 -25 -133 -60 -106 145 148 43 35 39 116 -87 -312 22 -40
1984 -40 310 -9 -40 281 231 138 60 33 56 -206 -108 -264 -91 -19 -104 -110 58 -99 5 -57 171 214 -18 -51 63
2009 63 -136 -61 106 -126 -152 -19 55 -13 143 -86 11 -47 -137 -33 -198 279 54 -299 79 132 0 -15 -21 144
2033 144 222 245 -27 87 137 230 -244 -88 -20 -144 119 -50 -237 -34 -72 -82 -107 47 -168 -95 -173 65 -186
2056 -186 61 -121 -133 249 50 76 85 -81 -57 251 -224 -32 -42 40 -213 143 -83 72 49 -137 0 115 -151
2079 -151 -61 173 -285 281 147 -18 -121 -269 18 119 109 -76 144 85 52 -287 -104 -3 7 -62 -77 -14 27
2102 27 -160 153 -64 -1 33 -255 -133 219 -80 79 -36 -123 56 -42 -194 -174 -176 -73 -64 52 -34 -71 -29 -106 -10
2127 -10 -93 59 71 154 -272 28 121 157 -67 192 169 -73 96 -25 -129 77 -169 -189 58 -170 268 -158 -54
2150 -54 27 -155 -70 -47 53 -41 22 -144 122 22 -30 -52 -25 61 68 119 56 128 -124 122 -52 -53 7 -29 280 -165
2176 -165 -141 36 -3 -152 -52 -74 -52 17 -39 -169 47 -72 -239 -9 -39 -198 134 -66 -19 74 -122 -269 44
2199 44 -118 -157 133 -228 -60 98 45 135 -90 -18 19 195 26 -248 13 -14 -247 59 22 -44 -31 87 -40
2222 -40 62 12 24 -40 -52 -11 152 -128 8 -109 -68 177 -289 -327 -86 -135 -177 -169 -59 188 179 92 -54 92 -6
2247 -6 -36 30 94 -15 -5 -202 -117 -167 90 89 174 -66 -11 106 -73 39 11 144 42 -58 -96 65 -51 152 95
2272 95 30 84 105 -217 -11 -157 65 -17 56 -22 -79 120 45 -164 169 34 60 -2 35 -45 -201 -43 8 -166 91
2297 91 -111 -52 -98 58 118 -75 11 46 36 -55 -28 -132 -204 -48 0 -133 -16 4 236 244 222 100 -30 58 -67
2322 -67 -217 123 74 -136 -31 130 24 168 -78 143 174 65 -203 110 -252 0 1 -31 -97 82 134 29 -55
2345 -55 3 169 -161 -56 -96 62 193 -7 -200 118 111 -70 194 53 112 -70 -57 -107 124 76 14 -65 255 -23
2369 -23 71 279 -100 -31 257 200 121 4 -233 86 -57 45 136 5 57 48 36 -112 -159 -29 -67 96 -111 -51
2393 -51 128 -141 44 39 67 304 -70 101 105 -85 93 4 -148 -172 150 106 254 -179 -176 50 23 202 147 268
2417 268 -120 -65 -1 86 240 -158 -37 -64 -160 13 127 159 162 53 -27 -84 32 -41 -144 187 16 -209 57 120
2441 120 -82 117 44 27 -91 -107 -132 299 -33 -66 -128 -70 -50 88 -220 4 -119 110 6 6 152 -166 25
2464 25 105 50 -136 74 72 -46 38 87 -1 25 177 -90 172 59 44 147 -17 214 70 -55 7 15 -1 -179 -24
2489 -24 -93 79 -194 5 -81 -29 170 -202 -276 39 151 -32 48 -5 -77 -30 85 42 71 70 43 -109 4 97 91 -143
2515 -143 -56 -77 -80 66 101 56 19 5 112 -80 -2 74 101 -62 17 -73 153 -6 49 104 11 -93 -63 -83 -89 129 -88
2542 -88 35 142 -84 88 -13 9 74 150 9 102 93 -13 -141 -178 93 -186 20 147 125 -109 -25 -6 -6 -46 256
2567 256 -17 -112 -131 75 14 -231 86 140 16 3 216 13 56 -86 -105 69 6 195 53 10 -62 -95 42 -90
2591 -90 7 81 51 -176 -10 295 -91 -54 -57 242 59 -230 58 -56 -195 -50 -31 -277 37 -151 71 -121 -170
2614 -170 37 -96 -233 -179 37 28 -25 182 -5 -62 -25 57 -29 -269 -149 -41 117 167 -75 116 -3 132 -11
2637 -11 -256 140 2 -260 -41 134 105 111 -138 -148 -13 -93 51 -125 8 40 2 102 61 16 -131 -62 -32 -112
2661 -112 -64 25 63 -102 169 49 58 18 102 134 -35 -245 85 -7 8 103 -80 96 -319 -49 -11 104 85 67 -116
2686 -116 122 151 -11 60 61 -150 -56 121 156 77 22 -201 96 -113 81 -6 47 -84 160 93 8 -7 -176 141
2710 141 -263 34 -60 9 80 63 197 17 -37 -144 83 -194 14 -94 86 143 -36 -114 134 133 54 -133 41
2733 41 59 165 -49 104 180 18 -9 -2 -37 13 -91 168 54 -72 -16 -70 -73 8 -126 -106 8 -344 33 11 -142
2758 -142 191 -47 -96 10 -209 100 115 -93 -281 -225 0 -57 54 -191 -78 -132 165 -33 16 -79 19 -2 -67
2781 -67 -74 264 -65 119 -6 -74 101 77 246 122 24 -210 -18 25 105 -87 21 8 -140 -31 -29 -51 -14 33 26
2806 26 -32 15 -30 34 -71 -25 -7 93 118 -89 -78 22 145 -119 55 8 -53 130 -46 219 -65 -97 255 -8
2830 -8 -19 113 67 149 428 7 -128 18 22 82 -98 -145 51 -34 -85 49 -2 -54 5 112 79 -101 106 -134 -30
2855 -30 -211 8 -224 -38 -196 293 149 72 -2 46 -100 -104 69 -4 204 -29 -109 73 40 -10 19 -77 78 -75
2879 -75 -171 57 -30 125 187 -84 75 194 -27 89 4 -97 -129 -23 207 -84 80 36 116 15 42 -95 135
2902 135 -103 30 84 48 164 170 81 -143 140 -62 -7 87 16 -26 -43 3 -49 113 62 28 -3 -143 85 34 127 27
2928 27 94 -48 -121 75 164 -80 11 -118 -163 -68 69 49 163 -124 -88 -64 -80 -31 -157 -95 -97 -4 -182 125 -32
2953 -32 51 -19 -3 5 97 310 61 149 -5 -194 -80 -48 100 -120 -48 -57 26 22 -113 -235 51 -162 -184 68 79 84
2979 84 -150 -43 -61 9 134 73 63 -77 30 167 48 -256 15 31 -175 -131 -134 -140 -168 265 187 179 -117 -173 -10
3004 -10 -2 -23 160 -75 -17 156 -47 -169 90 73 -16 133 93 143 160 150 125 -228 96 -27 -110 -4 -55 82 -176
3029 -176 -169 -140 -91 -56 86 138 -121 164 65 -262 69 2 73 190 76 9 -101 161 135 -89 -196 155 -41 -180
3053 -180 105 -13 -104 106 83 57 5 -34 115 73 104 -115 7 203 18 78 132 -108 -231 -5 36 43 206 -121
3077 -121 52 80 -212 -42 210 -155 -83 -88 42 -91 117 95 -87 62 -147 132 157 -30 -17 -171 -16 -13 -27
3100 -27 102 -57 26 43 164 -37 -107 12 -362 -93 47 -199 107 -100 179 32 -144 -148 44 72 24 -18 -23 -65
3124 -65 -269 198 -46 1 -16 117 59 43 -113 -141 -269 -66 -5 -29 91 71 -80 204 -71 53 -86 52 47 -19
3148 -19 77 60 57 45 465 -49 -51 -21 94 143 92 -24 52 73 -74 85 99 -157 196 83 156 173 65 174 41
3173 41 -91 -247 140 51 20 -63 137 -135 -91 35 109 106 -84 -35 2 133 186 18 -20 166 -20 138 101 -12
3197 -12 33 284 70 -18 -48 -116 -59 -69 66 30 -75 112 61 -91 -141 -10 74 125 -16 -50 162 -48 114 -105
3221 -105 144 -27 -112 145 -115 100 76 -168 131 18 -81 171 -84 -302 46 -78 131 18 115 -141 4
3242 4 -152 81 91 134 -34 -27 67 -121 143 7 129 -91 -118 -92 -68 99 85 -62 69 -35 166 136 -212 -10
3266 -10 103 48 -271 -53 -70 -13 180 -43 -156 33 -101 -1 122 -149 -3 -65 -34 -106 -22 -13 -144 -202 -69 15
3290 15 -65 21 -68 196 -66 -316 74 132 8 182 -56 44 -34 84 -34 46 17 -7 138 74 -60 -64 -62 28 -125
3315 -125 79 3 -75 -85 75 -120 -70 -59 -16 -110 78 76 206 20 -239 -13 38 -63 -17 80 -51 48 7 -104 -39
3340 -39 223 64 -23 -27 -93 105 -155 125 -244 -38 -47 -13 108 -40 169 190 -79 76 70 22 -14 171 -151 104
3364 104 19 210 78 -60 -89 -134 -137 -145 -125 -218 20 -195 -43 44 -89 -96 -149 -229 120 -87 -61 123 39 68 -87 116
3390 116 -77 -81 63 61 287 66 64 -21 -44 89 -124 -95 126 -23 1 94 -42 -194 1 149 204 0 -49 13 9
3415 9 22 17 -138 51 -70 -14 73 105 78 -17 -292 2 22 -79 207 -97 17 4 121 68 -23 57 36 -44 56 69
3441 69 37 138 -54 -111 29 -1 45 68 93 99 -200 -195 108 -18 -81 74 -83 -87 -77 -142 -83 12 -56 54 -106 -79 -115
3468 -115 12 16 -141 139 50 60 5 -104 -91 -48 -299 -98 148 137 45 111 -13 -32 81 80 114 -80 176 60 159
3493 159 -165 25 120 249 84 -66 19 58 -7 -127 69 288 125 258 86 54 5 210 3 71 186 -45
3515 -45 1 160 190 -51 53 -35 -5 101 -27 292 55 330 -47 -147 -157 -90 15 -148 -1 -75 61 -56 -195
3538 -195 18 -118 58 -8 -139 33 120 48 -155 -94 -211 73 67 127 65 40 -77 90 212 -44 -87 -294 -57
3561 -57 -123 -245 63 90 -164 70 -244 -146 3 54 -66 60 -183 -175 -166 117 -103 -101 56 -46 185 -70 -9 119
3585 119 -101 -22 18 -31 172 -26 159 -119 69 126 -25 80 -64 -6 6 -129 6 102 -40 -9 -45 77 -215
3608 -215 222 0 25 -194 -199 9 156 -36 -105 -46 104 -50 -89 -59 -255 -200 10 92 50 122 -83 48 4 143
3632 143 -9 120 79 40 20 41 76 20 100 -54 120 83 -6 -148 -143 82 286 88 -6 261 -65 0 250 -228
3656 -228 -18 158 200 -8 106 198 53 -146 145 -29 137 170 57 -90 130 181 -192 127 -155 66 81 4
3678 4 43 182 29 217 -85 -8 38 -140 -121 164 -59 139 134 -123 5 180 345 -104 194 24 58 101 144 -15
3702 -15 3 42 208 -81 -32 89 -2 -64 -60 -94 -73 204 39 -89 163 -4 -148 132 76 76 278 -74 142 8
3726 8 109 -171 -123 -9 -42 125 -166 -60 -32 4 -48 19 153 -34 24 -333 111 133 -108 -81 205 52 -88 233
3750 233 32 -5 -63 -5 -6 -20 -5 8 16 103 -170 -103 -3 171 -11 -74 164 37 -210 -50 -24 -61 -21 20 212 121
3776 121 169 -113 68 32 147 -86 -86 75 54 -357 -206 -30 -3 -45 132 124 -88 -45 -133 -41 118 175 -143 96
3800 96 -63 -43 -32 120 -17 66 -212 -131 -4 -43 -21 -152 31 215 -42 4 115 -100 -23 120 -106 71 24
3823 24 -204 150 176 45 -4 -59 17 -103 -148 178 86 -139 227 237 61 -141 -165 -179 58 136 40 74 -251 -169 66
3848 66 -1 -53 -38 156 -208 -14 -129 -90 -28 3 -41 -15 10 -148 -38 -93 133 -5 34 -4 104 18 40 -21 -135
3873 -135 117 95 -50 -137 164 -155 53 15 42 47 -125 -242 56 177 -70 127 51 30 41 -9 -152 -25 0 34
3897 34 -212 163 76 -144 122 50 -183 -117 52 -186 123 -112 -24 9 88 22 -103 -13 63 106 -42 40 -98 4
3921 4 -168 10 99 -95 -98 -82 42 -27 -103 47 141 73 5 -80 4 70 172 -92 61 -23 -7 -66 317 146 154 -98
3947 -98 -30 114 132 -164 77 62 96 117 172 26 -23 11 -73 40 75 -32 -115 107 5 -80 -191 9 -62 -30 27
3972 27 159 36 -206 65 -56 -101 30 -86 -88 73 -62 -201 143 292 -4 -95 -313 106 -115 -63 -165 -236
3994 -236 123 28 -26 16 98 49 -55 -190 -125 147 -2 -33 -15 234 -82 -52 -68 -60 99 42 -204 -84 59 3 -7
4019 -7 6 33 53 -168 108 125 -178 177 11 -111 154 100 50 -172 -34 -6 192 28 -66 -145 -111 -36 -42 146 95
4044 95 158 51 160 29 -139 38 79 -22 72 -94 -134 -48 159 102 -138 121 38 -8 -16 54 -76 18 295 -23
4068 -23 -50 106 70 -42 -122 74 -166 -171 68 -25 49 31 -92 -28 124 -36 -94 80 136 -88 -63 136 154 95 93 -5
4094 -5 27 171 -18 -57 -12 14 -22 175 341 -34 -98 2 20 -91 -54 -55 247 -42 -4 32 145 121 -128 -82 -86 -14
4120 -14 -139 -29 -152 94 -118 -39 41 -37 -74 36 3 -45 201 -100 39 -39 144 54 29 -65 277 -48 93 -109
4144 -109 -155 206 66 -22 -164 87 238 48 40 50 -48 -19 106 -41 -62 154 -44 -325 -458 138 -26 -161 -100
4167 -100 134 -38 -162 -135 205 -4 36 52 12 -3 144 49 -144 -116 42 1 -43 79 91 4 268 167 148 165
4191 165 65 57 -93 -42 -54 -95 -197 55 33 29 -138 -125 91 103 115 -56 15 -21 -35 -24 135 -92 -158 -76 -9 -85
4217 -85 27 4 22 54 -14 -116 -146 114 79 -207 43 295 44 86 7 -138 9 -17 -109 61 35 -21 -150 -62 -171
4242 -171 41 -180 117 53 39 26 99 -174 4 -108 -130 52 47 -80 236 29 154 124 -58 46 -207 -128 -114
4265 -114 29 -20 10 -352 115 -57 35 -165 7 42 143 64 41 2 -100 -4 19 168 162 -150 14 139 -104 45
4289 45 2 -154 99 -69 17 -80 182 226 125 76 -145 -85 96 -137 -175 -79 -18 65 0 62 34 98 -12 -81 58
4314 58 -238 103 80 38 40 205 -95 72 52 141 269 -173 124 106 128 -39 -27 -18 152 122 -65 5 -63 92 88 -199
4340 -199 17 -23 -12 -133 4 105 -2 -69 37 70 120 214 39 -60 -52 44 177 96 28 70 93 161 -119 38 12
4365 12 126 57 13 -56 55 16 43 87 -171 -107 147 -117 46 -41 -157 -110 39 124 3 23 -63 59 -19 7 -16
4390 -16 -234 29 -121 -103 55 51 -99 137 257 -47 173 102 -41 42 28 161 -222 28 111 56 23 38 123 202
4414 202 -95 -109 206 150 25 141 -220 -66 147 163 110 -81 17 19 -47 4 -130 45 -58 136 297 52 3
4437 3 8 -239 -83 -52 17 -34 -84 89 2 45 126 150 -305 139 -237 -39 -138 -85 102 -6 47 21 139 -32 -33 59
4463 59 -91 46 48 24 3 -34 -285 -99 -117 206 89 107 165 63 -39 -82 -208 -177 141 -127 143 112 -51 112
4487 112 74 186 -180 0 -124 88 29 -96 -78 77 -95 -295 -169 -152 -42 36 -41 -81 25 133 131 -342 8
4510 8 -107 -51 -48 24 -202 99 -48 -130 -11 -92 -228 -146 196 93 -20 -302 91 81 126 -26 -165 117 -35 128
4534 128 -104 -118 -130 -218 60 -85 -61 29 -169 286 -80 157 -83 7 120 -14 30 155 95 37 127 46 -70 -101
4558 -101 16 10 43 196 154 88 294 -5 149 117 -139 -8 101 14 115 -121 -86 91 -98 -183 -54 -33 -68 -171
4582 -171 5 -50 -133 -38 -97 15 -79 -152 -141 87 -143 97 6 -35 244 114 -107 -39 -70 -42 3 74 -119 -73 -166
4607 -166 -7 -96 -75 -163 -33 136 -128 -58 -73 -60 -112 -31 36 38 138 -183 204 -4 -137 -45 16 -20 -67 -24 -144
4632 -144 128 92 184 29 -6 143 19 -10 -186 -90 43 158 -6 -79 -104 25 -94 285 29 -204 -169 -60 -31
4655 -31 111 -282 55 -217 -120 66 84 76 165 -9 -253 -217 53 121 31 -427 -103 -19 -170 -370 94 -111 71
4678 71 -64 59 148 46 -73 -51 -117 -97 -78 45 28 -55 -22 -117 85 -98 2 99 -167 -104 64 -173 -117 114
4702 114 -48 132 10 4 345 20 40 -178 -164 100 12 18 -129 -114 78 62 95 70 -73 131 -79 -13 76 -81
4726 -81 -206 -161 36 -67 -80 -158 172 -91 -70 -81 145 44 -219 -41 -36 -249 -55 131 -205 31 24 -84 51
4749 51 -8 59 -40 137 -98 121 38 176 -85 -92 146 160 29 142 -54 156 121 20 -43 -81 96 63 -142 47
4773 47 -93 -167 59 -16 -91 7 -329 -73 -11 -151 156 183 -188 3 -185 84 4 -172 -309 227 70 -21 235
4796 235 -2 33 232 -90 129 60 19 79 86 219 100 153 83 30 28 -84 93 184 -82 -222 -175 -69 46 67 106
4821 106 42 -44 -83 60 60 -120 -3 -46 -95 63 -43 46 -45 -34 33 -43 64 27 -171 -75 -90 72 -103 21 -85
4846 -85 66 286 -36 -233 -23 40 12 139 -65 -252 128 170 77 -145 -164 3 72 -181 -25 321 -41 -96 72
4869 72 -138 -140 60 95 -101 26 80 38 21 135 3 296 -46 171 -72 -113 -39 -75 -18 -200 128 -63 57 -29
4893 -29 -116 -124 -172 -52 -33 -7 -105 -15 -208 -254 -205 11 201 -75 -82 63 82 106 133 84 73 179 -11 86 146 -28 63
4920 63 -15 -22 51 64 104 72 -147 153 86 -74 -25 -26 -58 28 -80 -147 13 147 -40 73 -24 -181 -126 -41 -146 -92
4946 -92 30 190 -91 231 22 256 128 39 5 -60 -11 136 -4 -89 122 -262 59 36 -37 50 -185 -20 93
4969 93 177 -94 -196 -109 -5 49 0 59 -178 -88 -217 74 -111 -8 92 88 24 -101 -85 73 -104 97 150 147 150
4994 150 39 -203 34 -105 -85 -41 73 109 53 156 111 54 67 126 142 -43 71 320 -69 32 15 32 -216 -17
5018 -17 161 -65 -5 -26 -215 -31 105 230 76 10 249 -33 148 -225 188 -92 66 36 -18 -21 -47 -132 -44 -11
5042 -11 208 -16 -29 -24 -81 -34 152 5 -72 -23 -171 134 -231 20 23 -137 -93 156 -63 -46 -6 -129 -31 -84 -86 -73
5068 -73 75 -52 -17 -23 94 85 56 -116 29 69 -17 151 30 76 121 165 61 130 104 -289 175 201 -104 -108 -34 27
5094 27 -155 16 -71 42 -158 -94 74 7 1 46 11 5 80 -51 61 -96 -43 28 -116 180 -69 -43 -73 -1 323
5119 323 -38 -90 -4 132 -71 -154 122 176 -173 160 -34 -36 -89 10 115 -18 91 -210 78 -80 42 31 -80
5142 -80 17 46 -122 -60 -96 99 164 169 -101 110 77 -37 -168 89 -28 12 -38 -213 64 -38 99 -35 -19 -7
5166 -7 65 -97 -8 6 -65 123 10 245 138 -61 144 -37 -26 124 -57 -6 115 67 20 -104 -97 -266 -87 37
5190 37 -272 13 -83 -14 55 157 58 57 24 -2 -1 -151 132 -36 181 110 -8 -55 56 50 23 145 70 110 -27 -76
5216 -76 -111 -54 164 -4 -155 5 39 -144 -272 7 -63 -205 -79 -179 81 -197 -110 45 -55 174 11 29
5238 29 49 5 151 18 -78 40 -135 -369 -148 38 44 152 131 38 25 130 8 92 -75 -71 271 252 185 50 -105
5263 -105 12 -198 -42 -177 22 -59 -57 104 -155 -81 82 99 55 127 -70 -33 -365 -126 -64 -42 -225 -144 47 129
5287 129 -11 -147 90 49 -93 -20 -2 -54 13 -241 -71 -13 242 -14 -136 -105 -91 -125 143 62 -4 1 -218 -67
5311 -67 -48 -65 26 264 129 -40 -121 29 6 60 -171 -181 10 83 84 27 209 42 -61 12 -158 -42 -119 -41 -91
5336 -91 67 -193 -45 89 -28 -74 93 30 116 -38 -16 127 144 10 -9 -49 -5 -74 -21 -237 119 176 11 69
5360 69 74 133 -14 -20 55 -3 -62 325 -28 -146 -162 150 14 23 -337 1 -14 86 -74 95 112 -242 -164 101 -57
5385 -57 -165 219 -22 71 266 -159 110 92 214 -196 -242 -16 -79 238 -120 124 -45 24 6 -131 -182 -74 20
5408 20 -27 111 -1 58 182 38 -79 -151 153 -24 -30 45 116 -31 105 69 165 243 -15 -140 -118 -20 -62 54 165
5433 165 -181 132 -267 47 -5 21 5 -12 51 57 83 -130 98 186 142 -17 9 18 28 56 12 -15 -119 161 -62 242
5459 242 22 209 4 106 -32 -84 14 -12 -92 92 -38 -29 87 71 54 31 42 -40 66 -39 -120 -270 55 86
5483 86 -59 -80 95 -77 -6 -36 185 19 -103 37 -17 108 -29 -62 -153 18 84 83 -99 -179 -146 -66 85 -77
5507 -77 -27 80 10 -95 69 -89 40 148 137 130 -196 -118 -16 27 13 -104 135 -38 -89 59 -223 -132 -77 112
5531 112 42 -170 -31 16 -146 -188 79 103 -82 18 39 70 256 -97 -75 34 259 -71 -55 -194 96 -72 -27
5554 -27 49 28 59 141 -323 117 227 49 -299 11 42 -69 77 -103 134 162 -145 12 61 -234 52 -19 42
5577 42 38 160 44 88 -45 -181 117 -95 11 -86 104 60 -13 62 102 145 -88 85 -176 99 -57 121 -139
5600 -139 -154 110 204 -45 -84 18 154 -21 100 27 -157 -8 -69 41 231 68 87 -82 -91 -30 -139 -38 58
5623 58 -176 85 24 -131 20 -85 -172 121 67 18 -57 176 68 19 30 54 167 -118 102 -22 121 134 87 39
5647 39 16 127 -27 -13 -111 -112 18 -105 54 98 27 79 -160 -104 108 85 -44 17 223 123 -60 215 -29 -29 -214
5672 -214 -19 -79 28 64 -285 19 76 -49 212 59 31 35 -141 189 -180 91 27 265 117 -84 62 2 49
5695 49 181 90 55 91 -144 -43 118 -254 9 -138 -11 -140 -14 -75 -35 87 -30 -92 229 -106 8 -101
5717 -101 1 -13 25 -34 40 -15 92 -37 -21 -45 -155 -12 70 -13 130 -8 -17 87 -84 111 36 65 164 277 38
5742 38 -33 34 187 -22 26 -175 56 4 -162 74 148 135 -14 102 21 -34 31 -109 -22 99 123 64 -19 -148 -74
5767 -74 99 68 -86 86 51 138 91 -177 -77 -41 -21 48 -32 27 48 -226 -10 -47 -100 36 -101 -171 -129 1 103
5792 103 -57 205 58 -20 -15 -206 142 -170 137 139 105 72 39 81 -21 -190 -166 -161 -87 -34 -107 100 102 -183 16 86
5818 86 46 -121 264 26 14 -102 -68 101 173 -40 9 3 -74 -18 9 -7 42 -5 -12 -49 -125 -167 -143 -58 -143 12 79 -80
5846 -80 216 -21 -39 -75 4 -163 124 178 146 279 33 -19 -68 -14 94 -36 -127 -60 90 -3 -66 28 83 -322 -259
5871 -259 206 -139 -12 -32 1 -29 -180 69 123 -40 14 -210 105 -109 -110 -112 98 -140 141 -72 -8 103 -130
5894 -130 32 141 4 -65 -8 106 66 -35 32 44 -47 -134 -69 59 -15 -19 37 -142 -131 -209 -33 -205 -33 87 -67
5919 -67 -239 164 82 -52 14 266 -127 -115 -45 82 19 -126 -67 31 88 48 108 -48 81 -181 256 -281 -22 -225
5943 -225 -123 37 121 -78 11 96 -114 -16 78 162 -36 -9 72 -187 58 -115 6 -40 -56 -35 169 -71 58 -147
5967 -147 87 -68 -50 83 -51 -82 94 -183 113 -107 121 159 -68 -4 -109 -5 -43 28 270 -189 66 30
5989 30 11 85 206 -58 89 -154 104 -224 157 89 -311 -49 -30 -96 56 55 38 -4 -49 16 41 -116 -84 -33 -65
6014 -65 27 180 -36 66 -38 78 -4 -101 29 -45 55 -182 -199 99 -120 211 10 80 -24 80 -11 -3 -45 -186
6038 -186 28 -35 -85 -118 -32 -257 -23 86 123 13 -91 55 -157 -89 26 -127 36 -85 73 -145 -27 120
6060 120 -141 -18 -19 -143 -108 -69 169 -1 -175 -24 98 16 -48 42 -2 -16 -80 138 -154 -136 -9 115 131 71
6084 71 -38 -86 -27 -42 112 80 -75 -103 16 -21 84 104 -153 136 -187 -143 213 -129 -57 -84 125 157 196 -211
6108 -211 -163 49 -48 53 -236 -31 191 136 -198 125 -78 -14 -5 -68 85 -106 260 18 -40 -143 -131 21 -43
6131 -43 170 -175 -18 155 80 6 49 -232 -28 34 77 62 -16 189 125 -152 130 43 -73 -54 -58 -88 -176 -102 19
6156 19 -214 49 -73 30 -273 6 2 69 41 4 -95 97 -16 114 -85 41 8 -229 -154 7 3 -111 106 -107
6180 -107 76 93 -76 124 37 174 -289 134 -132 -46 173 140 139 -26 -42 -22 111 108 -16 -99 280 92 119 -70
6204 -70 -13 138 -31 173 -77 -77 98 -37 91 -89 -190 -38 3 82 -90 165 94 -15 -111 -84 133 45 113 4
6228 4 -168 16 -14 -150 153 115 239 -93 -40 -68 -40 -82 38 85 57 36 -161 -40 85 32 30 -20 11 382 -50
6253 -50 114 17 -75 81 -70 165 -181 7 21 -130 -95 96 75 48 -92 89 -104 70 9 47 -87 17 47
6276 47 228 -57 -132 -112 95 33 -76 -47 -125 58 92 -220 -83 -45 6 123 -33 82 47 30 -107 -169 100 70
6300 70 51 115 94 -63 140 117 -227 49 -19 6 135 141 -53 -5 -45 131 46 142 281 -71 65 -42 -126 53 -83
6325 -83 55 73 -84 -103 -51 106 18 -129 -26 92 -36 201 -283 7 129 -161 52 -116 45 77 139 -50
6347 -50 -97 125 -117 -209 26 -197 -54 -53 125 18 15 -16 125 220 80 -17 -76 116 105 -89 96 -117 -86 -109 48
6372 48 49 110 214 59 -1 -81 -154 -81 160 21 107 -160 -345 12 141 166 31 8 -90 -246 55 -87 63 17
6396 17 66 -222 -85 -28 -64 -37 -104 25 154 95 60 89 -325 77 -52 122 12 172 51 -8 135 -157 -71 163
6420 163 -76 124 205 -76 292 128 -96 0 -31 -64 21 145 282 -158 -130 -270 -199 116 -13 274 26 -23 373
6443 373 57 -115 36 9 -1 83 -136 -35 -179 -158 5 -41 -5 -20 -34 -113 -84 23 -67 4 -42 -172 232 107
6467 107 -31 12 -12 -206 -86 -96 12 57 135 -36 -62 -62 19 143 -106 198 181 229 -112 59 -75 184 57 132
6491 132 -196 151 -57 -43 41 -19 -82 93 -72 -18 173 -102 164 -27 101 -58 -240 8 34 -50 158 -162
6513 -162 -134 53 75 -19 -43 52 -158 -153 161 -179 -7 134 88 -175 30 -2 -79 156 40 13 50 9 -9 -39 -45 60
6539 60 94 -134 138 -153 174 50 -57 -110 -30 -211 -314 -31 -145 76 60 36 -33 -69 -140 -16 147 98 79 -88
6563 -88 19 150 66 -23 -96 273 -149 -19 111 49 -49 -13 -28 -63 -37 -133 -91 -83 -126 70 83 -218 -4 26 -168 -128
6589 -128 101 84 32 59 -149 114 65 9 125 -160 -333 9 -216 63 -99 18 -130 63 101 -10 -11 -215 12
6612 12 -92 -80 24 -125 118 114 22 -17 282 -29 -53 -20 -153 0 -116 -154 129 82 117 -60 -35 -83 -92 -214 101
6637 101 -191 -138 120 -67 164 103 74 -61 64 -62 -73 -111 102 152 33 -24 25 -41 65 -55 5 58 -69 55
6661 55 46 158 -100 106 94 -8 -179 180 70 -49 225 2 7 -58 34 -135 -123 97 27 119 135 1 -127 -77
6685 -77 -68 -70 138 78 35 63 -106 -23 45 17 54 -154 2 63 -32 273 -7 -292 242 -37 -111 121 -175 -272 -55
6710 -55 -162 -76 69 -66 62 -33 43 -282 -182 -59 33 -82 -116 34 -101 170 -15 20 -204 120 -119 -224
6732 -224 9 43 88 24 18 271 91 40 6 78 -28 5 39 36 -58 -38 187 -150 -22 -181 -302 -226 79 -293 -149
6757 -149 -99 63 -51 40 -55 -73 -10 -36 -129 202 -67 101 149 3 105 37 -68 -282 87 127 -55 208 42
6780 42 2 148 43 301 97 -52 -204 -76 -120 -203 -287 46 -97 96 -69 -125 -100 -38 60 135 46 -101 22 95
6804 95 -16 -132 19 52 164 -33 71 104 -10 -88 325 -23 -31 -24 139 -18 -38 85 -82 76 166 118 -60 148
6828 148 8 -157 39 -23 191 -53 16 55 106 -28 39 -20 -157 -95 48 -272 -216 107 116 -131 58 -156 -79 196
6852 196 -17 16 -43 110 -1 -155 -135 -144 97 177 -6 146 106 122 -33 17 74 -3 123 -52 -44 -153 -37 9 114
6877 114 182 142 55 33 26 5 130 -245 -47 36 66 -271 141 -2 166 36 23 35 -94 -173 -50 -363 -6 110
6901 110 -83 -252 87 -48 112 3 58 18 -19 32 -77 1 138 -131 -10 245 49 90 38 78 81 -99 173
6924 173 -103 124 40 31 -196 36 109 -100 12 55 78 81 49 -171 65 -180 -4 54 -197 8 -46 -6 -48 44 68
6949 68 -45 -2 29 106 -33 -45 34 118 -96 115 8 -47 1 -156 -61 -142 57 27 -175 59 91 -74 95 -41
6973 -41 -5 -216 66 115 -128 -187 -152 -193 -63 -245 -85 141 -38 145 -11 26 27 134 10 -90 -15 23 44 182
6997 182 -46 -163 -34 -23 42 40 25 -26 48 -118 58 160 -58 41 7 113 -97 85 -24 -152 -247 -20 -62 119
7021 119 17 -16 30 7 106 -39 -145 18 -61 -153 -179 82 39 219 131 32 -25 -30 80 -129 -5 -90 18 -68 0
7046 0 108 298 -123 -88 77 51 148 85 67 2 20 -16 -15 -3 69 81 4 137 70 267 -58 163 38 46 66 87 -160
7073 -160 82 36 111 -137 47 69 79 -4 -9 -52 -19 49 91 184 42 -110 180 99 141 39 147 6 82 29 -75
7098 -75 -76 -176 114 -27 141 173 116 96 137 36 -32 -50 121 -175 14 -54 0 57 -148 53 31 -162 -144 60 115
7123 115 144 2 -6 127 41 -101 51 -10 154 -56 -64 -314 33 81 63 9 42 189 18 -108 -132 -85 -121 35 310
7148 310 -138 130 15 -57 -70 -1 -28 -288 7 154 22 82 -179 101 12 221 188 207 -226 21 155 196 -57
7171 -57 -70 -24 -95 32 -196 92 -286 89 -9 5 -170 39 -149 -90 16 64 -31 67 -39 123 -31 12 -115 -123
7195 -123 -8 96 97 68 5 -98 129 -94 -114 9 -56 169 23 -59 -107 114 -240 -40 -97 62 -49 219 26
7218 26 40 3 -133 39 -43 -223 56 -156 -67 79 -93 39 -52 -122 45 -136 -159 -43 29 108 -6 -58 190 -62
7242 -62 39 -24 -131 159 94 -77 26 -142 72 89 -24 -23 -72 -98 61 -115 -78 180 -17 17 58 -19 85 46
7266 46 -5 -46 21 -233 -8 202 15 96 -91 113 -21 90 -65 5 77 101 102 257 32 -51 94 49 -217 68
7290 68 53 -5 103 76 -75 46 -37 77 132 104 -131 132 -72 188 111 98 135 -137 162 -35 -7 -15 -100 322 48
7315 48 117 213 -89 230 -52 35 -74 32 -25 75 -136 12 -29 -99 359 221 38 149 91 -150 -190 49 -6
7338 -6 119 -97 72 22 -40 -62 -35 -150 17 -140 53 98 -26 101 72 36 6 168 143 -9 -10 -81 17 56 -56
7363 -56 -79 17 -117 -48 98 -146 -140 -337 168 43 84 84 -123 -6 -75 103 -159 -102 -129 -218 6 157 -399 -19
7387 -19 155 -82 -30 -3 -127 36 -171 52 89 164 71 200 116 -66 23 -44 114 -93 68 -49 137 -42 179
7410 179 -62 -29 50 -30 -23 -44 -187 141 -177 23 60 -70 -103 30 176 -47 14 122 -129 -128 -18 87 -7 93
7434 93 33 -28 -65 -157 56 -66 -130 71 44 -159 151 -218 100 -26 104 -110 49 -167 -143 -69 -161 53 -62
7457 -62 6 -49 84 -84 -163 -118 -47 -130 183 -152 -12 110 -156 -232 -133 42 72 -98 -296 69 70 -28 9 161 111
7482 111 -53 -11 47 -48 112 -43 -42 -150 18 -82 26 34 -124 -36 -95 108 -92 55 79 -214 0 11 -51 -145
7506 -145 111 26 92 27 -36 59 84 -10 -65 -17 -82 -108 -32 242 -84 130 -107 74 94 197 73 -190 117 -68
7530 -68 -225 -133 158 183 0 63 46 -82 -148 -157 106 -114 68 -40 3 138 63 -114 -48 -155 -128 -4 89 -73
7554 -73 -118 124 52 -4 -89 71 -78 183 -80 -81 -62 3 -119 105 -259 -69 29 -173 114 149 -69 75 120 -129
7578 -129 -32 14 83 106 169 -72 252 -63 -3 -99 69 -36 -70 -169 162 -137 36 -23 45 41 8 137 4 -193 -140
7603 -140 -55 3 -92 53 -243 -213 51 44 43 89 -76 -28 -41 -57 -25 5 119 -140 11 54 51 93 -266 -37 -166 -76
7629 -76 160 -111 -86 -72 -75 -139 -70 148 74 115 -131 -221 71 -16 -62 -116 91 195 4 28 -165 -241 137 -97 97
7654 97 106 -20 -29 -79 -38 -102 -57 109 -166 64 26 74 -279 -121 -107 -140 117 166 32 226 105 -87 32 -122 84
7679 84 -55 48 -105 -76 -136 -64 -199 -79 184 109 -89 42 49 3 164 24 -95 67 -87 -123 69 -1 -129
7702 -129 -47 21 -42 -328 39 -153 115 51 -135 -2 -219 3 121 -71 33 -80 12 69 61 86 -114 103 7
7725 7 19 -47 -61 153 0 -200 55 32 68 -38 260 -24 -126 -41 143 64 70 144 106 -28 -63 -2 63 -144 59
7750 59 103 -69 40 35 97 -27 211 -12 -163 -112 3 -15 -81 -61 -11 63 -5 100 -79 -164 -205 -102 57 9 -194
7775 -194 -57 -30 -97 -47 26 112 -122 15 169 -19 57 -58 113 162 -41 -43 215 -32 35 -92 -97 -114 -126 -142 55
7800 55 -171 32 -185 11 34 -66 -320 -40 219 -104 16 68 144 -229 -42 -245 -127 -64 84 158 3 52
7822 52 117 -182 89 -155 67 33 -198 -98 139 63 68 -157 -87 41 -26 -103 -3 -80 138 104 -94 -123 10 -35
7846 -35 3 -34 -134 -204 59 120 116 -105 158 95 94 136 -89 -7 -14 -44 150 -58 -249 -18 58 179 -191 40 -100
7871 -100 16 -108 33 177 -47 -135 -30 206 4 15 17 86 -119 -49 43 54 -134 17 -207 -141 -177 -138 -25 106
7895 106 -7 -100 20 47 116 239 -304 20 -6 13 -56 -75 16 -31 92 -84 0 -97 214 -2 -85 107 68 -246
7919 -246 227 58 -55 -46 37 62 -64 -115 8 7 129 -181 89 -135 62 35 -132 -52 -19 -7 32 -73 -51 -223
7943 -223 126 49 131 -21 -84 101 22 288 -21 154 187 -40 -53 66 38 -89 50 56 14 129 -92 -140 -112 84
7967 84 -25 27 53 -103 320 146 -19 25 88 -16 -80 -42 150 -146 -78 45 -188 -72 108 0 90 -49 -68
7990 -68 -76 -265 110 98 -88 -102 -20 237 209 41 -253 133 -6 -200 -32 39 -290 109 -22 -280 207 -288 57
8013 57 73 -52 -51 170 -49 24 124 82 -66 -291 -186 22 -125 -74 -48 35 -101 114 14 34 -85 -72 32 119
8037 119 -34 75 23 -23 -53 25 59 -102 158 129 104 24 166 -87 -23 -82 -61 -32 81 -152 -239 44 -111 151
8061 151 -34 28 65 -207 19 -165 41 73 -51 -16 -49 -28 32 24 38 166 -191 48 112 153 158 -32 -90 -5 156
8086 156 43 -34 -33 -147 159 -107 -179 87 38 70 -53 84 -9 75 30 10 110 -263 -87 -151 119 -34 31 -60
8110 -60 30 22 122 -132 164 -98 151 -26 -73 -40 -6 194 -285 -252 183 78 157 236 205 -339 180 6 -41 51
8134 51 89 2 -133 -8 49 67 -139 -68 -90 -75 -107 -194 -82 127 -269 -12 -3 313 -157 -66 -192 286 66 77 111
8159 111 -94 -152 -4 -8 -28 97 -4 87 43 32 287 130 -192 -123 128 -58 -205 56 -119 145 88 -8 140
8182 140 -181 159 -80 -49 110 -57 12 222 -109
8191a09
##END NTUPLES=NMR FID
##END=
