##TITLE=1H_38-2021
 CDCl3, 8 sc, 
 29.04.2021
##JCAMPDX= 6.0         $$ Bruker NMR JCAMP-DX V2.0
##DATA TYPE= NMR FID
##DATA CLASS= NTUPLES
##ORIGIN= UXNMR, Bruker Analytische Messtechnik GmbH
##OWNER= root
$$ XWIN-NMR		Version 3.5
$$ Thu Apr 29 14:25:57 2021 Russian Standard Time (UT+4h)  she@DPX200
##.OBSERVE FREQUENCY= 200.131506
##.OBSERVE NUCLEUS= ^1H
##.DELAY= (6, 6)
##.ACQUISITION MODE= SIMULTANEOUS
##.ACQUISITION SCHEME= undefined
##.AVERAGES= 8
##.DIGITISER RES= 18
##SPECTROMETER/DATA SYSTEM= spect
##.PULSE SEQUENCE= zg30
##.SOLVENT NAME= CD3CN
##.SHIFT REFERENCE= (INTERNAL, CD3CN, 0, 15.7039)
##AUDIT TRAIL= $$ (NUMBER, WHEN, WHO, WHERE, WHAT)
$$ ##TITLE= Audit trail, XWIN-NMR		Version 3.5
$$ ##JCAMPDX= 5.01
$$ ##ORIGIN= Bruker BioSpin GmbH
$$ ##OWNER= she
$$ F:/spectra/data/she/nmr/H-F/1/audita.txt
$$ ##AUDIT TRAIL=  $$ (NUMBER, WHEN, WHO, WHERE, WHAT)
(   1,<2021-04-29 14:24:01.75 +0400>,<she>,<DPX200>,
      <created by zg, POWCHK disabled, PULCHK disabled
       configuration hash MD5:
       00 E9 B6 7A A2 85 ED C7 34 08 36 98 17 FE 4E 26
       data hash MD5: 16K
       C1 8A F9 F6 71 C8 27 58 C7 31 06 FC 67 56 5C 17>)
$$ ##END=
$$ 
$$ hash MD5
$$ 9F 4E EE 58 72 86 C6 D0 6D 03 74 FB 98 3C 2D D5
##$RELAX= 
##$RELAX= 
##$RELAX= 
##$RELAX= 
##$RELAX= 
##$RELAX= 
$$ Bruker specific parameters
$$ --------------------------
##$DU= <F:/spectra>
##$EXPNO= 1
##$NAME= <H-F>
##$PROCNO= 1
##$TYPE= <nmr>
##$USER= <she>
##$AMP= (0..31)
100 100 100 100 100 100 100 100 100 100 100 100 100 100 100 100 100 100 
100 100 100 100 100 100 100 100 100 100 100 100 100 100 
##$AQSEQ= 0
##$AQ_mod= 1
##$AUNM= <au_zg>
##$AUTOPOS= <>
##$BF1= 200.13
##$BF2= 200.13
##$BF3= 200.13
##$BF4= 200.13
##$BF5= 200.13
##$BF6= 200.13
##$BF7= 200.13
##$BF8= 200.13
##$BYTORDA= 1
##$CFDGTYP= 0
##$CFRGTYP= 5
##$CHEMSTR= <none>
##$CNST= (0..31)
1 1 145 1 1 1 1 1 1 1 1 1 1 1 1 1 1 1 1 1 1 1 1 1 1 1 1 1 1 1 1 1 
##$CPDPRG= <>
##$CPDPRG1= <>
##$CPDPRG2= <>
##$CPDPRG3= <>
##$CPDPRG4= <mlev>
##$CPDPRG5= <mlev>
##$CPDPRG6= <mlev>
##$CPDPRG7= <mlev>
##$CPDPRG8= <mlev>
##$CPDPRGB= <>
##$CPDPRGT= <>
##$D= (0..31)
0 1.2 0 0 0 0 0 0 0 0.06 0 0.03 0 0 0 0 0.0002 0 0 0 0 0 0 0 0 0 0 0 0 
0 0 0 
##$DATE= 1619691841
##$DBL= (0..7)
120 120 120 120 120 120 120 120 
##$DBP= (0..7)
150 150 150 150 150 150 150 150 
##$DBP07= 0
##$DBPNAM0= <>
##$DBPNAM1= <>
##$DBPNAM2= <>
##$DBPNAM3= <>
##$DBPNAM4= <>
##$DBPNAM5= <>
##$DBPNAM6= <>
##$DBPNAM7= <>
##$DBPOAL= (0..7)
0.5 0.5 0.5 0.5 0.5 0.5 0.5 0.5 
##$DBPOFFS= (0..7)
0 0 0 0 0 0 0 0 
##$DE= 6
##$DECBNUC= <off>
##$DECIM= 32
##$DECNUC= <off>
##$DECSTAT= 4
##$DIGMOD= 1
##$DIGTYP= 9
##$DL= (0..7)
0 120 120 120 120 120 120 120 
##$DP= (0..7)
150 150 150 150 150 150 150 150 
##$DP07= 0
##$DPNAME0= <>
##$DPNAME1= <>
##$DPNAME2= <>
##$DPNAME3= <>
##$DPNAME4= <>
##$DPNAME5= <>
##$DPNAME6= <>
##$DPNAME7= <>
##$DPOAL= (0..7)
0.5 0.5 0.5 0.5 0.5 0.5 0.5 0.5 
##$DPOFFS= (0..7)
0 0 0 0 0 0 0 0 
##$DQDMODE= 0
##$DR= 18
##$DS= 0
##$DSLIST= <SSSSSSSSSSSSSSS>
$$ [...]
##$SUBNAM2= <"">
##$SUBNAM3= <"">
##$SUBNAM4= <"">
##$SUBNAM5= <"">
##$SUBNAM6= <"">
##$SUBNAM7= <"">
##$SUBNAM8= <"">
##$SUBNAM9= <"">
##$SW= 16.9725357007746
##$SWIBOX= (0..15)
0 0 2 0 0 0 0 0 0 0 0 0 0 0 0 0 
##$SW_h= 3396.73913043478
##$TD= 16384
##$TD0= 1
##$TE= 0
##$TE2= 300
##$TE3= 300
##$TEG= 300
##$TL= (0..7)
0 120 120 120 120 120 120 120 
##$TP= (0..7)
150 150 150 150 150 150 150 150 
##$TP07= 0
##$TPNAME0= <>
##$TPNAME1= <>
##$TPNAME2= <>
##$TPNAME3= <>
##$TPNAME4= <>
##$TPNAME5= <>
##$TPNAME6= <>
##$TPNAME7= <>
##$TPOAL= (0..7)
0.5 0.5 0.5 0.5 0.5 0.5 0.5 0.5 
##$TPOFFS= (0..7)
0 0 0 0 0 0 0 0 
##$TUNHIN= 0
##$TUNHOUT= 0
##$TUNXOUT= 0
##$USERA1= <user>
##$USERA2= <user>
##$USERA3= <user>
##$USERA4= <user>
##$USERA5= <user>
##$V9= 5
##$VALIST= <valist>
##$VCLIST= <CCCCCCCCCCCCCCC>
##$VD= 0
##$VDLIST= <DDDDDDDDDDDDDDD>
##$VPLIST= <PPPPPPPPPPPPPPP>
##$VTLIST= <TTTTTTTTTTTTTTT>
##$WBST= 1024
##$WBSW= 4
##$XGAIN= (0..3)
0 0 0 0 
##$XL= 0
##$YL= 0
##$YMAX_a= 170300
##$YMIN_a= -190716
##$ZGOPTNS= <>
##$ZL1= 120
##$ZL2= 120
##$ZL3= 120
##$ZL4= 120
##$ABSF1= 10
##$ABSF2= 0
##$ABSG= 5
##$ABSL= 3
##$ALPHA= 0
##$AQORDER= 0
##$ASSFAC= 0
##$ASSFACI= 0
##$ASSFACX= 0
##$ASSWID= 0
##$AUNMP= <proc_1d>
##$AZFE= 0.1
##$AZFW= 0.1
##$BCFW= 1
##$BC_mod= 2
##$BYTORDP= 1
##$COROFFS= 0
##$CY= 11.3945322036743
##$DATMOD= 1
##$DC= 2
##$DFILT= <>
##$DTYPP= 0
##$F1P= 15.9154993809931
##$F2P= -4.1035820241983
##$FCOR= 0.5
##$FTSIZE= 0
##$FT_mod= 4
##$GAMMA= 1
##$GB= 0.15
##$INTBC= 1
##$INTSCL= 1
##$ISEN= 128
##$LB= 0.24
##$LEV0= 0
##$LPBIN= 0
##$MAXI= 10000
##$MC2= 0
##$MEAN= 0
##$ME_mod= 0
##$MI= 1.114404
##$NCOEF= 0
##$NC_proc= 0
##$NLEV= 6
##$NOISF1= 3.799351
##$NOISF2= 2.8
##$NSP= 1
##$NTH_PI= 0
##$NZP= 0
##$OFFSET= 15.70392
##$PC= 1
##$PHC0= -11122.15
##$PHC1= 12.40102
##$PH_mod= 1
##$PKNL= yes
##$PPARMOD= 0
##$PSCAL= 0
##$PSIGN= 0
##$REVERSE= no
##$SF= 200.130013532006
##$SI= 16384
##$SIGF1= 3
##$SIGF2= 2
##$SINO= 400
##$SIOLD= 16384
##$SREGLST= <1H.CDCl3>
##$SSB= 0
##$STSI= 0
##$STSR= 0
##$SW_p= 3612.71676300578
##$SYMM= 0
##$S_DEV= 0
##$TDeff= 0
##$TDoff= 0
##$TI= <>
##$TILT= no
##$TM1= 0
##$TM2= 0
##$TOPLEV= 0
##$USERP1= <user>
##$USERP2= <user>
##$USERP3= <user>
##$USERP4= <user>
##$USERP5= <user>
##$WDW= 1
##$XDIM= 8192
##$YMAX_p= 0
##$YMIN_p= 0
$$ End of Bruker specific parameters
$$ ---------------------------------
##NTUPLES= NMR FID
##VAR_NAME=  TIME,          FID/REAL,        FID/IMAG
##SYMBOL=    X,             R,               I
##VAR_TYPE=  INDEPENDENT,   DEPENDENT,       DEPENDENT
##VAR_FORM=  AFFN,          ASDF,            ASDF
##VAR_DIM=   8192,          8192,            8192
##UNITS=     SECONDS,       ARBITRARY UNITS, ARBITRARY UNITS
##FACTOR=    0.0002944,     1,               1
##FIRST=     0,             0,               0
##LAST=      2.4114304,     0,               0
##MIN=       0,             -190716,         0
##MAX=       2.4114304,     170300,          0
$$ Real data points
##PAGE= N=1
##DATA TABLE= (X++(R..R)), XYDATA
$$ [...]
2153an01R47r11M83n31Q74r29Q58n32L2N30j051J193j314J084o29L62K14o95Q00
2173B83q18Q68p27Q65q62L50K66o49J036j413J468r84M13M3p5J11L0N1p93J324
2193G87j480J508p51j04P27j121Q03l46M03o17R10r01N88n4r16J590j838J341
2211E29p49J52N08l91l0N1K55r68J569j649J165k68r42J485j571R35j77l2k73
2230d01N99p36M37L73j246J705j928J473k82p48J150p40J62j1K57q41J314j120
2248e83O19L67j434J864j671R52J17m75J69N41o83J76O63j577J902j489P82L39
2266E79j350J436q32L75Q3N15j381J453j122L18O89j625K026j424J048m50k34
2283A04M02J86r75M52K01j102J616j285M43M60j304J483j012N21j89K75p63J034
$$ plain form
2153 -1 -502 445 -466 17 -514 360 -569 289 -243 -211 319 -732 461 -853 231 -398 -36 178 -517 283
2173 283 -535 333 -394 471 -391 -41 225 -424 612 -801 667 -317 96 139 64 175 205 256 -537 787
2193 787 -693 815 64 -40 687 -434 369 23 426 -191 719 -182 406 352 -564 1026 -812 529
2211 529 -220 -68 440 49 19 70 325 -643 926 -723 442 174 -768 717 -854 81 -96 -128 -401
2230 -401 198 -538 -101 272 -974 731 -1197 276 -6 -754 396 -344 -182 -193 64 -777 537 -583
2248 -583 36 403 -1031 833 -838 114 231 -244 -75 466 -217 -41 622 -955 947 -542 240 579
2266 579 -771 665 -167 208 291 806 -575 878 -244 74 763 -862 1164 -260 788 338 104
2283 104 506 692 -283 169 370 -732 884 -401 42 502 -802 681 -331 190 1 276 -487 547
2301E47p74j18P53j364J698j451P08M79j147Q12m81Q2K25K07r21J270j210N37
2319a48P69j760J885j297M27N07n45J2L88m60K34P39k000K293j376K32J234k088
2337i54J204R1n13N17L39j748J891p50m81J666k424J878m86n14J089q83m35J209
2355F96l08q98J652k432J832J87j369J509j342L30P97m69p67J154j416J144L79
2372F79j880K003j413P17L09q68n8N42k99MQ75j946K032j047K7P72j189O73M7
2391b0J68p83J128j218P07K98j124J263p77M30mJ67q16R60m29l60J223j804J745
2410G54o58m20P34l07k38N81j52r92J972j798Q53L36j316J456o04k87M44q5q63
2429e90J947j731Q1J138k005K441r15r74J077m80m53J726j709l40K234k638K241
$$ plain form
2301 547 -227 -345 408 -956 742 -709 -1 478 -669 143 -338 -256 -31 176 -745 525 -685 -148
2319 -148 621 -1139 746 -551 -124 383 -162 -150 238 -222 12 751 -1249 1044 -332 -100 1134 -954
2337 -954 250 341 -172 345 684 -1064 827 77 -404 1262 -1162 716 230 -284 805 -78 -513 696
2355 696 388 -510 1142 -1290 542 729 -640 869 -473 -143 654 185 -582 572 -844 300 679
2372 679 -1201 802 -611 106 415 -453 -511 31 -268 -264 611 -1335 697 -350 -323 449 -740 -67 -20
2391 -20 148 -635 493 -725 -18 280 -844 419 -358 72 68 235 -581 379 -50 -410 813 -991 754
2410 754 96 -324 410 103 -135 446 294 -698 1274 -524 329 665 -651 805 201 -86 358 273 -590
2429 -590 1357 -374 -293 845 -1160 1281 366 -608 469 -11 -464 1262 -447 -787 1447 -1191 1050
2446A050r62j480K366j058k89Q84j096k47K383k862J410L24j921K923j909j57
2462f41J214j150K15J470k451J131J030k466L083k016m38K057j917R35P05j799
2478a038R08J342k652K485j145j038K613k356P21Q20j253R01P23k334J866J74
2494G37k040K879k432O64J287j791Q68M61j272J055M41k371K883j770J29J767
2510A495k576J274M10j019P68J95j842K282q11r58K037k658J436Q95j458O88j80
2527b2r77J658k8j819K053j868R31J252k245J127q0l59R28r4j920K176r84JJ507
2546A237k673J494K05n79P14m25j100J828l43r30J740k525J663L73j268J006n67
2563a50l53J100Oj586J847j513Q15J219k299J501l95l72Q80l50j096J580q86k32
$$ plain form
2446 1050 88 -1392 974 -84 -373 511 -585 -832 1551 -1311 99 423 -1498 1425 -484 -641
2462 -641 573 -577 -362 1108 -1343 -212 818 -1648 1435 -581 -1019 1038 -879 56 761 -1038
2478 -1038 -130 1212 -1440 1045 -100 -1138 1475 -881 -160 660 -593 308 1031 -1303 563 737
2494 737 -1303 1576 -856 -192 1095 -696 172 633 -639 416 857 -1514 1369 -401 -272 1495
2510 1495 -1081 193 603 -416 352 547 -1295 987 176 -782 1255 -1403 33 928 -530 158 -22
2527 -22 -999 659 631 -1188 865 -1003 -72 1180 -1065 62 -18 -377 551 457 -1463 713 -271 -270 1237
2546 1237 -1436 58 263 -316 398 -27 -1127 701 358 -572 1168 -1357 306 679 -589 417 -150
2563 -150 -503 597 603 -983 864 -649 166 1385 -914 587 192 -180 700 350 -746 834 -52 -284
2581b84J591k580J840l02p05R40m54m40R48l84p86J590j790J074K69j394J549
2598F82r69j23O16m32k12R30j118P03L49j377J620j054J29M74p54K98L92l40j26
2617c12P04j218J365p81q7R99j374R31l24j44L1M30p06N91k28m35J330j381J040
2636D31q00K36K68m1Q1l55M83n34P56o73M19k62q6O79q13O51n60M41j09k90J90
2657A12J1K09m23O15p89P11m85J05K22p07R26p56L56j96K24k84K09k93J97N94
2677E58j171J191r06K15L46p36N59k43j12M8L64j074R75l00j48J174j793J532
2695D79o92J40L1M7k54N35m52k58R17j247J469j041O25r2l80M64J14m25k9M49
2715D00q89R36m31k91J196j426J030l47k26M45m11k5K49l9l77J050j528J091j49
$$ plain form
2581 -284 1307 -1273 567 265 -440 500 46 -394 554 170 -616 974 -816 258 527 -867 682
2598 682 -287 -410 206 -226 -438 492 -626 77 426 -951 669 -385 -256 218 -536 -238 154 -186 -312
2617 -312 392 -826 539 -242 -329 670 -704 227 -97 -241 -210 220 -486 105 -123 -558 772 -609 431
2636 431 -369 -133 135 94 175 -180 303 -231 525 -148 271 9 -77 602 -211 440 -120 321 212 -78 112
2657 112 123 332 -91 524 -265 446 -39 66 288 -419 507 -249 107 -89 135 -149 60 -233 -36 558
2677 558 -613 578 -328 -113 233 -503 56 -187 -299 -251 113 -961 14 -286 -434 740 -1053 479
2695 479 -213 -73 -42 5 -249 286 -166 -424 493 -754 715 -326 299 207 -173 291 405 -20 -49 400
2715 400 -489 447 16 -275 921 -505 525 178 -48 397 -14 -39 210 171 -206 844 -684 407 258
2734B58m91R76j016M03M2j41j68O51r32P68r0q48J208j135P65k45n9K88k55j51
2754a72J54L13r25J108r59M82L32p35Q49p03L07l15K78k97N49m13N9L10p57J024
2774D89r29N03j09m7K09k95L89m08M24k86L20m57K33J29m50P24q09P65n82L54
2794A67K54k71J24j97J49j89O39j149Q87k92k30R79j396R00j76j73K68O6p67Q37
2814D30j89o76J488j876J273k9q88J094q85l50R60j27r04J555j843J092N85j745
2832a035J802j155N4Q70q09l11R99r73M62Q81k079K069j254n0J396j526M28O05
2850C74q25K14R67k032J955o05r41J790j699P90N54r64L65O14j307J155%j341
2868i36K196k005Q22N35j218Q80K90j093P83L60j540K103j358L2J011j604J139
$$ plain form
2734 258 -233 743 -273 130 172 31 -137 514 -418 350 260 -588 620 -515 250 5 -54 234 -21 -172
2754 -172 -18 295 -630 478 -481 1 333 -402 447 -256 51 -264 14 -283 266 -147 -88 222 -535 489
2774 489 -440 63 -46 -93 116 -179 210 -198 226 -60 260 -197 36 165 -285 439 -370 395 -187 167
2794 167 421 150 274 77 226 37 676 -473 414 122 -108 871 -525 375 199 26 294 360 -407 430
2814 430 241 -435 1053 -823 450 421 -467 627 -258 -608 352 225 -679 876 -967 125 710 -1035
2832 -1035 767 -388 -334 536 -273 -584 415 -558 -96 785 -1294 775 -479 -529 867 -659 -231 374
2850 374 -451 -237 730 -1302 653 48 -893 897 -802 -12 542 -422 -57 557 -750 405 405 -936
2868 -936 1260 -745 77 612 -606 274 564 -529 254 614 -926 1177 -181 -149 862 -742 397
2885C97j5o24M42M83j478J547n03r19J800j833Q95J70r40P56J99j049R17M01j776
2904a130K222j724K41J124j287O65N4r19O89O10j676J662r13k60J745j829O82
2921d4K16r99J063L92j473J108j53r55K195k162O02P52j404J482j70j451J120
2938A19L82j282J971j843r1J915j788J419n33j107J275L73j341J380j353k27K524
2955A793k519J329m81r81J792k95j223R29m51o14K546k583O85P89j736J999q19
2972A60r63R65k4p26J831k008L45J498k244J829o74r47J498m59o68J316j166l5
2990d72J647k517J693o6j120J369p85k33J020o49n49J468j800J193M93j743J807
3007G56j232K71P84p17l98J056p69J59J037k149J707l52k93Q53j226K55P89l47
$$ plain form
2885 397 382 -242 200 683 -795 752 249 -670 1130 -703 192 362 -578 178 377 -672 245 646 -1130
2904 -1130 1092 -632 -391 733 -554 111 165 -754 -65 545 -1131 531 -382 -642 1103 -726 -44
2921 -44 172 -827 236 628 -845 263 110 -845 1350 -812 -210 542 -862 620 450 -1001 119
2938 119 501 -781 1190 -653 -744 1171 -617 802 269 -838 437 810 -531 849 -504 -731 1793
2955 1793 -726 603 122 -859 933 638 -585 344 -107 -721 1825 -758 -73 716 -1020 979 160
2972 160 -803 162 138 -588 1243 -765 -420 1078 -1166 663 -11 -958 540 81 -587 729 -437 -472
2990 -472 1175 -1342 351 285 -835 534 -251 -484 536 -113 -662 806 -994 199 692 -1051 756
3007 756 -476 -205 579 -138 -536 520 -249 -90 947 -1202 505 153 -140 713 -513 -258 531 184
3025A84l19Q45j639J428J38r47P73j054N67P75l36q99O50n10Q05O58k032J241
3043C28n81L27P34j066k86N72J74k45O32j753J358K52n87M68r21L69N52l3p76
3062d82Q02j175Q07Q14j531J132j088N57O24n41j49L26m31J58P56j474J165m90
3080b20M2P78r96L10K33k46N8N13j320J324k86q56J355j357Q90n1l88K88K75n20
3100a74M18K02j010J424j219O50l0n13O25k86k6r2L54p19J121j058L19K64o32
3119c82P85p78M59r2m3o9K35j30l02M89m12N72o11L89L4n50O62n85L81k43K92
3140A01k37L23l10j09L77n46P42p89N98j90j48L77m62L71k26L88o48O69n45L50
3160H6K45q48Q64o44N34o1j87J05O7p4l05N05p73J105q88L53L47p90P44m36K77
$$ plain form
3025 184 -135 710 -929 499 637 -310 463 -591 -24 751 415 -484 166 -344 461 1119 -913 328
3043 328 -253 74 808 -258 -544 28 202 -43 589 -1164 194 446 -141 327 -594 -225 327 294 -482
3062 -482 320 -855 -48 766 -765 367 -721 -164 460 -81 -230 96 -335 -177 579 -895 270 -220
3080 -220 -178 600 -396 -86 147 -99 -41 472 -848 476 190 -666 689 -668 222 171 -217 71 346 -174
3100 -174 244 446 -564 860 -359 291 261 -252 373 87 61 -31 323 -396 725 -333 -14 250 -382
3119 -382 403 -375 84 -8 -51 -120 115 -15 -317 172 -240 332 -279 110 144 -406 256 -329 52 -191 101
3140 101 -136 187 -123 -232 145 -401 341 -448 150 -40 -188 189 -273 98 -128 260 -388 281 -264 86
3160 86 331 -517 347 -297 237 176 -11 94 161 87 -218 287 -486 619 -269 84 431 -359 385 -51 226
3181B26q4K07n18O48o00Q2O80j069R91q14L32J62k60J77j99J27m24N67p83J119
3201E67q11J98L02q70J086p18L64r0O4m08N86m63j66Q92j114Q60n71J27M04k80
3221d1J74j91o0k86P93j012Q27k07l37O57p49M72k71J86J09J10m88L60J06n82
3241d30R49r84O39j95j1L60k86J02k17L69o47P83o22L45K37n50O82n23L43m91
3261a47M61l28K00l8l27N35o00O75m70L72l97J59Rk35P40r09O28m41J11L1r1L2
3283c0j29L07o12R97q68M40on91Q29n69R7J2R8m25P70n45j03P29j181J215m73
3304c8k52M83l54j46O52m25k85J005j559J375l76n27J129j070K20L11j13k18Q12
3323F24j184R45J32j298J572j284N59N21q65M03J18n71M91N37j677J789r90K6
$$ plain form
3181 226 142 349 -169 479 -121 -39 641 -428 563 -251 81 243 -17 160 -39 88 -336 231 -552 567
3201 567 -244 -46 256 -614 472 -246 118 28 92 -316 270 -193 -359 533 -581 279 -292 -165 239 -41
3221 -41 133 -58 -118 -404 389 -623 204 -3 -340 317 -432 40 -231 -45 64 174 -314 46 152 -430
3241 -430 519 -465 174 -21 -32 328 42 144 -73 296 -351 432 -190 155 392 -158 524 1 344 -147
3261 -147 314 -14 186 148 -179 356 -244 431 -39 333 -64 95 104 -131 609 -300 328 -113 -2 29 -62 -30
3283 -30 -159 148 -464 533 -335 105 99 -492 337 -232 -135 -123 -25 -450 320 -225 -328 401 -780 435 -38
3304 -38 -290 193 -161 -307 345 -80 -365 640 -919 456 80 -447 682 -388 -168 143 30 -188 624
3323 624 -560 385 517 -781 791 -493 66 587 -278 125 243 -328 163 700 -977 812 -178 -152
3341a52Q10j294P42L37o02L53K25j297J644p34l91J074j509R35M22q95L11K47
3359B26q23Q99q0j127J499j314Q10M05j299R05n4l76N71oj160J478j028J18J101
3378G45j703J160j42m71O51Lq50J106o16m16J638j793R37J10r73J040k78p44Q06
3397B10j44n49J527j620L61Q17j178J305o16p90R67K02p36J033j381N7J761j704
3415d78J168q45p34J455J18q65M75o72j75K055j914L77j8p61J961q79r21O76k06
3434a83P2J351j999n2J219j065J682j225r62J395j96k64J030j792K04J840j612
3451e57J144q57r22J866m34m80N04r19J44J485j761R35oj078K023j070m81O03
3469A39n07L27R27j604P45M42j324J923j017m04Q95r11M48M06p40M71M96j261
$$ plain form
3341 -152 658 -636 106 443 -159 194 419 -878 766 32 -359 715 -794 141 563 -332 -21 226
3359 226 -597 302 222 -905 594 -720 90 495 -804 101 47 -329 242 236 -924 554 -474 -356 745
3378 745 -958 202 60 -411 240 243 -607 499 -117 -533 1105 -688 249 359 -614 426 148 -596 210
3397 210 66 -483 1044 -576 -215 602 -576 729 113 -677 290 492 -244 789 -592 -535 1226 -478
3415 -478 690 -155 -889 566 684 -181 294 -378 -553 1502 -412 -35 -53 -814 1147 268 -653 23 -183
3434 -183 -111 1240 -759 -811 408 -657 1025 -200 -1162 233 37 -227 803 -989 -785 1055 -557
3451 -557 587 -270 -1192 674 240 -240 264 -655 -511 974 -787 148 142 -936 1087 17 -464 139
3469 139 -368 -41 886 -718 27 469 -855 1068 51 -353 542 -369 79 485 -255 216 712 -549
3487e49J103l26o94J359j488N51N37o61Q5P34j196J070k81q33J242j288P14K88
3505C67o15R0J74k50M98O2j110J207o76K26P25j334M82J45P5j94L00q96R31k27
3525b0k41O98j097P02J90j29j66J65m83M43K97q26Q67q21M38L07n04L42k17RJ89
3546A43L62q90O03j64j56O09q87N56%j11M9J44o40M99K10o70R15j006L91K40k97
3567a00J77m4k60M42J7n42P66n90O8N70r53P32l30K8m7P6k91O15m86j06P28j112
3589f42R73m52j07M28k24j13K09k07k74P26o67M78j29l33N97o94M28r1J61k09
3609a42K46l09L11L5n23O47p59O41l21J16K38j99J24j04O9j53L46n18O13j30m96
3630b68O45p13M35q7M4j6J0l2j00L81n10O65o43L79j28j77K34j18J38m36N33m35
$$ plain form
3487 -549 554 228 -466 893 -595 -44 493 -168 -83 651 -545 525 244 -589 653 -635 79 367
3505 367 -248 -158 16 -234 264 326 -784 423 -253 -27 698 -636 -154 -9 66 -128 172 -724 207 -20
3525 -20 -261 437 -660 42 232 103 -63 102 -381 62 359 -467 400 -421 17 324 -180 162 -55 -46 143
3546 143 505 -385 218 54 -102 507 -380 176 176 65 114 258 -382 117 327 -343 572 -434 -43 197 -100
3567 -100 77 33 -227 215 232 -310 456 -134 -66 504 -449 283 -47 -19 -66 10 -281 334 -152 -258 470 -642
3589 -642 331 -121 -228 200 -24 -137 72 -135 -409 317 -350 128 -1 -334 263 -431 -3 -94 67 -142
3609 -142 104 -205 106 141 -382 265 -494 147 -174 -58 180 -19 105 1 70 -83 263 -255 358 228 -268
3630 -268 377 -336 99 12 56 40 50 18 -82 299 -211 454 -189 190 62 -115 119 1 139 -297 236 -199
3652a99N02n11J43J01k82N44n99N27l00o0J08k6r7O4L53n39M49m82N15j39l90
3673c18N63m79J99k08K67k67L68k51J35J59o27Q31o47J82K17k98L04k41L01l19
3693a29L35m32M22l98L18J11l78N47m17O8M2p0l9J75j33o4L74o48Q98p69J99K16
3715B28l50L86l23K18k03J86l01L92j71n8K17n29N74l31J27n4j40J23J9o7j73
3736b30N59p13O36k38j59K99l36J60j81L61m61L15k63K34J21l17L24l74M21l46
3756a88J24j45K73o6l1J75l51M06k24K17j55p6J26k82N31m32K40k61Q0N0j14J72
3778F9r3J52l22N21n39L65j6m32O69m14L81k83R5j57K52l37Q5L43p47N77j89K05
3800A85j21k33N5K67m7m9J93p19N87k3l60N39n59M02J39k43k98J37k03O13j71
$$ plain form
3652 -199 303 -208 -65 36 -246 298 -301 226 -74 -134 -26 -52 -149 -85 268 -271 178 -304 211 72 -318
3673 -318 245 -234 -35 -243 24 -243 125 -126 9 168 -459 372 -275 -93 124 -174 130 -111 190 -129
3693 -129 206 -226 196 -202 116 227 -151 396 -21 47 89 19 -20 155 22 -42 332 -316 582 -187 12 228
3715 228 -122 264 -59 159 -44 142 -159 233 62 4 221 -308 266 -65 62 8 -132 -9 10 -57 -230
3736 -230 329 -384 252 14 -145 154 -182 -22 -203 158 -303 12 -251 -17 104 -213 111 -263 158 -188
3756 -188 -64 -209 64 -2 -33 142 -209 197 -27 190 35 -41 85 -197 334 -98 142 -119 -39 11 -103 69
3778 69 -24 128 -194 327 -212 153 137 -295 374 -40 341 58 153 -4 248 -89 -4 339 -408 169 -20 185
3800 185 64 -169 -114 153 106 57 250 -469 118 95 -265 274 -285 117 256 13 -285 -148 -351 262 91
3821I1p66Q51n30L98K39n76J49J39q8L58k8q18R60m91R5L25p96N09N6K5j34J60
3843A28o39P88j26l91P40j102Q20L3k16m1Q1l74L64K6l47O48q15O62J46n88K03
3864@J69l27M10L0n30P39p96K12O37r91P53m08m3L78l7n73N02j42k88R12r40M30
3886I7L9n43O85r2m92K82L1l72J067j201K23L22l88R23o35o24P72pj72O63j116
3907e38j40J096o97P50p03m22Q44J31l80K87n09m67J617j110M66m90l96J208k81
3926B66l69K11k10j33J190j253K16L30q00J495q89l91N62l97L12M09r12P8P60
3945D75r85J243p06m34Q30n77K27K27n89J39O35p47O47n06l95R14q61M84R3l82
3965b68L56J10o24M84P1p15J143q70K07L19n74M09j4l14L60m3m63P83l71k00N88
$$ plain form
3821 91 -675 176 -354 44 283 -293 -144 -5 -93 265 237 -581 379 -112 -17 308 -488 21 77 102 -32 128
3843 128 -511 277 151 -240 500 -602 218 251 35 -6 75 -299 65 91 -256 392 -423 239 385 -203 0
3864 0 169 -158 252 282 -248 491 -305 -93 544 -447 306 -102 -145 233 196 -377 125 -17 -305 607 -333 97
3886 97 136 -407 278 186 -306 -24 7 -365 702 -499 -276 46 -342 581 -54 -678 94 87 -85 578 -538
3907 -538 -678 418 -279 471 -232 -654 190 321 -59 228 -281 -748 869 -241 225 -265 -661 547 266
3926 266 -103 108 -102 -235 955 -298 -82 248 -552 943 54 -337 225 -172 140 549 -363 -285 475
3945 475 -510 733 27 -407 423 -154 73 300 -289 -150 485 -262 385 -121 -516 398 -463 21 114 -268
3965 -268 88 198 -426 58 129 -586 557 -313 -106 213 -361 48 34 -280 80 37 -426 357 -14 -214 374
3986C74j057Q54L6k82P8L8k82M86l03k3M69p84O43n4l69K67j17q6K75K4l61M61
4008B87o39M21L16p51M88k79K22O2J24l14K46L4k85M18n93L68j2j50K21j97l58
4029c71L14K51m50O61p20M74J89o05K42j03R9pK79n47N24l41k2L09m49L88j85
4050g0o2K05O3l59J94P0j43N81p57L29l1j79M23l00j26R2J40j88M78o63N00j5
4072A82n20N07m83L37J0j29P8K04l83L54J51o37P79o02K88P1n29M73j04n7l2K97
4094B55n77O24l12m0L33n62M88n69L87K1n1jJ38o6k26L75m95M10r7l6K33m38L70
4117A64l04J67k17Q9j51J81K5k8K94m15K49j00J58j09o4L5P9o0k70N23n63O31
4139C14l37M7o7o4J87j50J18p6J76l57L12j17p1M56o47M65k64L40n4l80K71k37
$$ plain form
3986 374 -683 171 207 -75 3 41 -241 245 -58 -81 388 -396 247 193 -176 91 -26 -112 163 187 -174 287
4008 287 -352 69 385 -366 122 -157 65 127 251 -63 183 217 -68 350 -243 125 113 -37 184 -13 -371
4029 -371 -57 194 -256 405 -315 159 348 -257 -15 -118 -19 -26 253 -294 230 -111 -133 176 -273 115 -70
4050 -70 -132 73 136 -223 -29 41 -102 479 -278 51 20 -159 264 -36 -162 -70 70 -118 360 -303 197 182
4072 182 -338 169 -314 23 33 -96 -18 186 -197 157 308 -329 450 -152 136 207 -322 151 47 -10 -42 255
4094 255 -322 302 -10 -50 283 -279 209 -360 27 48 -3 -4 134 68 -158 217 -278 132 35 -1 232 -206 164
4117 164 -140 27 -190 -101 -252 -71 -46 -74 220 -195 54 -46 112 3 -61 -26 53 -7 -277 246 -317 314
4139 314 -23 24 -43 -107 80 -70 48 -28 148 -209 103 -14 -85 371 -276 189 -75 265 211 -169 102 -135
4161a35K37k32L63k16N6o5j4J12k92N44l45J67j75m3J31j46J55j63J37l89M43
4182A30j82O9J15l01K90j92N8jJ89l62J13l9k2L39n93M70j70K42j99j12K46j14
4204b6J02l70N97o18L31j08N9M11n48L63k16J02r9R4j18J2M6k68N03l37K56p4
4226I4k4K7k33K38j49J29k19M42l97M8L54l54K29m29L75j44J69p9j0n6J68J02
4248B81n73N21m06J52Q1k25K26j93K00r6K11k83J83j85j41M56l46L04l02L28k18
4269b5L7j11J34p9l54M78m45N71l85J02J57l68L20o6K6j37L86n32L66l3k42M87
4291B87o12L72j65L09j95k1j32R8M04n34L34l40K55J46k00K02m37K67K8K97m82
4312a19K05j41n1M05l93J44k19M39j63m1l15J69O1q1M15o25L39m8J34J90m67K8
$$ plain form
4161 -135 102 -130 233 17 73 8 -6 106 -186 358 13 180 5 -38 93 -53 102 -61 76 -313 130
4182 130 -52 17 132 -169 121 -71 -13 -14 175 -187 -74 -113 -135 204 -389 81 -89 153 -46 -158 88 -26
4204 -26 76 -294 303 -315 16 -92 -33 378 -170 193 -23 79 -20 74 -44 -32 14 -254 249 -88 168 94
4226 94 70 97 -136 102 -47 82 -137 305 -92 -44 310 -44 185 -244 131 -13 156 77 67 11 179 281
4248 281 -292 229 -177 -25 56 -169 57 -136 64 -32 179 -104 79 -106 -247 209 -137 167 -135 193 -25
4269 -25 12 -99 35 -44 -398 80 -365 206 -179 -77 80 -288 32 -34 -8 -145 241 -291 75 42 -200 287
4291 287 -325 47 -118 191 -4 -25 -157 -59 345 -189 145 -195 60 206 6 208 -229 38 66 363 -119
4312 -119 86 -55 -106 299 -94 50 -169 270 107 66 -249 -80 -19 -100 315 -310 29 -19 115 305 -162 -134
4334a34J47L45n96N25o40J66L18j47Q8l95J96R7K78k32N2j72k6N14p12N58l92
4355a62K1J47j59J27M6j39j62O75o58L98l12kL95l20J30Q2k04j47P35o79J87J09
4377A08l90P33m26Pj57k9K26K49k58j18K24m07Q08m78l73M26k90O26k26m16r2
4398b53M29k59L91k80m08P22n75O10l50l95N05L3j60O3m2n45J057p03K76j57m45
4419d86P57l8l77J3Ql6O77q06J99J21n43Q56m49k00L17j51jM48n79l9M37m85O04
4442B47k48l33M06j62K15n2j51M3M29n25M24j83l03L41l91L05P8j89K2J99l88
4463b16K56J13l87N07n90K58K45k48K39j13n1J07m2m22N73l99J47J81k12J89j66
4484c1J22r4J1k0P4O4l78M81l04K97k15l1j2J4K0j66M13o34O65m24o3L44k87L13
$$ plain form
4334 -134 13 358 -238 287 -353 -187 131 -16 72 -323 -127 -30 248 16 68 -104 -130 384 -328 230 -162
4355 -162 -141 6 -153 -26 20 -119 -281 394 -264 134 -178 -180 215 -105 25 107 -97 -244 491 -188 -1 108
4377 108 -282 451 25 32 -125 -154 72 321 63 -55 169 -238 570 92 -281 145 -145 481 255 -161 -253
4398 -253 176 -83 308 28 -380 342 -233 377 27 -368 137 170 10 73 31 -514 543 -160 116 -41 -486
4419 -486 271 233 -144 -131 -123 -159 518 -288 -89 32 -511 345 -104 -304 13 -138 -139 309 -270 -309 128 -357 247
4442 247 -1 -334 72 -90 125 73 -78 -35 394 -131 293 110 -193 148 -243 62 140 -49 -27 172 -216
4463 -216 40 153 -234 273 -317 -59 186 -62 177 64 13 120 78 -344 229 -170 -23 158 -54 135 -31
4484 -31 91 -3 8 -12 62 126 -252 229 -75 222 7 -24 -36 -22 -2 -168 245 -389 276 -148 -211 133 -154 159
4508A59l98K17N2J43k71K15j35j71M90n40J80nP9q3J39k0m9J65l88N36m34J42
4530B3J32j11J12j48ko4Q9j47L34k26L8K70m07K56j34M8P2j3j55K84k30j27K05
4553I9l14M13l04JM36m82J69l5m3J1J83l96M18j21l09L64k07J72j41J73q7N3k27
4576a74K3K45k52L42l52K43j92K1K76l24N6kP6k74M80k66J56J10n38M79l32J86
4598a3r5J31o3O4j19P1L05m36K93k42Q6J49j61J41j72J03o6K73k26P9k4q4J36
4621A30k30K80k32J73L5p5Kk05K29j96L52l35K88l06J7J91j60m9n9L32l23K21
4643H0j57J29K3j40O1k67L01k44J84Nq7J64p1J03k65L46k16p1N3P8n0j96L83l42
4667a96L41j90M2R0pl1j10L11l05k3j51K82J33k67L07m05L95l49J98n5L3j12J43
$$ plain form
4508 159 -239 -22 30 173 -98 117 -18 -189 301 -239 -59 -64 15 -68 71 51 2 167 -221 315 -119 23
4530 23 155 44 156 8 6 -58 31 -116 218 -8 30 300 -107 149 15 63 135 122 -33 251 21 -106 99
4553 99 -215 198 -106 -105 331 -151 18 -17 -60 -49 134 -262 156 35 -274 90 -117 55 -86 87 0 53 -174
4576 -174 -151 94 -158 184 -168 75 -117 -96 180 -144 -88 -90 -14 -288 192 -74 82 192 -346 133 -199 -13
4598 -13 -108 23 -40 24 -95 -24 281 -155 138 -104 -18 131 -30 111 -61 42 -24 249 23 102 78 -6 130
4621 130 -100 180 -52 121 156 81 83 -122 107 -89 263 -72 216 -90 -73 118 -42 -91 -150 182 -141 80
4643 80 -77 52 75 -65 -4 -271 30 -214 -30 -25 -112 52 -19 84 -181 165 -51 -122 -69 9 -41 -237 146 -196
4667 -196 145 -45 -3 87 80 49 -61 250 -55 -78 -229 53 186 -81 226 -179 216 -133 65 10 43 -69 74
4690G4J95l73K57k94L75k30j69L74l45K04k3J72n06L66o7J0R9m18N18k85J74j23
4712a5R6k32J70l42K10J70l08L62k02J74qj30K1o2K48k50J29l09O39m09r1M97
4734C58n77L72j32q9J3l3j91M39j23j78M69o26L15J0j30L67k18k22K04J46k33
4755e9L25m30J31N03o60M39j58j28J95j33j97K74k35L07K23p10N50j92JJ76k75
4776e3L8k5OJ99J87p00M33Q9l83N74o91J17L72k7n2j06l21L60J42m49O08o44J96
4799a30K60k40O2k22Q4Q5N71p75M14k84R9L62o02K91N6k97M17J9m04K94j05j61
4821b06P52q50L10P1l06L47P1l19O9J79l81P33o74K95J84n86M59j33l4K40j34
4842H7k64M91l68k87Q30q83N68k7j72jL7j69M84k01n06P29q04P65j07o83O06j19
$$ plain form
4690 74 269 -104 153 -141 234 4 -165 209 -136 68 45 217 -289 77 10 20 119 -299 219 -66 108 -15
4712 -15 81 -151 19 -323 -113 57 -251 111 -91 83 75 -55 -34 -96 152 -98 31 -278 361 -48 -139 358
4734 358 -219 153 21 -68 -55 -88 -279 160 37 -141 328 -298 17 27 -103 264 46 -176 28 174 -59
4755 -59 266 -164 -33 470 -190 249 91 -37 158 25 -172 102 -133 174 397 -313 237 45 46 222 -53
4776 -53 -15 -40 -34 165 352 -348 85 174 -209 365 -326 -209 163 136 84 -22 -343 17 159 -290 318 -326 -130
4799 -130 130 -110 -48 -270 -186 -101 470 -305 109 -175 -76 286 -316 -25 31 -266 151 170 -234 60 -45 -206
4821 -206 546 -304 6 77 -229 118 189 -130 -61 118 -263 470 -204 91 275 -311 148 15 -19 221 87
4842 87 -177 314 -54 -341 489 -394 174 147 -25 -26 11 -158 326 125 -381 348 -456 309 202 -481 125 6
4864Fj3L71l67l32P20o49M12N7p62R03k46m84N13l38J21M61n57J69K50r51J143
4885D27m08l05M16n23K58L05l36p1N74q37O79j0o91R86o50L50J43n55K65K23n53
4906c13M91m1n92R83q52N04J50o08L86O3k06MJ63n28Q16n52J05K27n94O17j03
4927A20j34N0n2j52L55j70k62M69n07M63k54j2K03j66j25J24J20m39O75p08M98
4948I6J08m33L45k66J48n6j3j55L23k14LK90n81M65q8L3j6Nq1j0J43m06P91p99
4972c68M29q9m5J78k46Q8n2K79k80M30n09K10J82n22N73l37J83n6O7k57M42l18
4994a8j02M73o36N09j71k10K74j25J38j19L1l08M84l34J98l4k18M38l78J98j87
5015i7j17K18R4l54K17J73o07P21m88K46L0l04K35n0O9k12K30l69N90l54J1J68
$$ plain form
4864 6 -7 364 -3 -335 385 -264 148 205 -557 346 100 -384 129 -209 -88 373 -184 -15 235 -716 427
4885 427 19 -286 130 -393 -135 170 -166 -237 337 -500 179 169 -522 464 -186 164 307 -248 17 240 -313
4906 -313 178 137 -455 528 -324 180 330 -278 108 171 -35 -31 132 -396 420 -132 -27 200 -394 223 120
4927 120 -14 36 -16 -168 187 17 -245 224 -283 180 -74 -86 117 -49 -174 -50 70 -369 306 -402 96
4948 96 204 -229 116 -150 -2 -58 -71 -226 97 -117 -114 176 -405 60 -28 5 -11 -6 -87 -97 46 -360 431 -368
4972 -368 61 -28 -73 105 -141 -53 -105 174 -106 324 -185 25 207 -315 258 -79 104 48 115 -142 300 -18
4994 -18 -120 353 -283 226 55 -155 119 -6 132 13 44 -264 220 -114 84 50 -168 270 -108 90 -97
5015 -97 -214 4 98 -256 -39 134 -473 248 -240 6 36 -268 -33 -83 -14 -226 4 -365 225 -129 -118 50
5037E0j97L61k28Nq7j3j42L51J2k39K21j98J32j14J98m4k29J14j7K58l47K74l01
5060a80M48k11k45M49m33L82k94R5J50J3j32j39K30k55L06k88L03j57N0O9k93
5081a32K84k77L00l31K50j27j4O6l93O18k85K30l91K59j17j25L17k24K06k70K42
5102H6r4K6m0j62J85j99K87j50P5n1j55J19RM8j29K60k23K35j50J02rj09K00j83
5126b2K13l42J30J1O0%n9J54j65J38j72J98j09J7L0k47K78k12M8j90M95k75r1
5149a12J66k36K99k08L16l01P8n8j28K47j67L26k77K35k24M6Q0j61R6j10J61l52
5171b84M19l03O5K25m73L68k45L79k78K43l18j8K74k51M47m09L84n55L09Jk3r
5193e2j70K73j19K06j69kl2o5K43j87M48o82M94j55j32J03j46K24j21L75l96L40
$$ plain form
5037 50 -147 214 -14 -9 -96 -109 -251 100 112 -127 94 -104 28 -86 112 68 -161 -47 -64 194 -153 121 -180
5060 -180 268 57 -188 261 -172 210 -84 11 161 174 42 -97 133 -122 184 -104 199 42 92 161 -132
5081 -132 152 -125 175 -156 94 -33 -47 19 -374 244 -41 189 -202 57 -60 -185 132 -92 114 -156 86
5102 86 -8 18 -22 -184 1 -198 89 -61 14 -37 -192 -73 -64 -16 -145 115 -108 127 -23 79 70 -39 161 -22
5126 -22 191 -151 -21 -10 50 50 -9 145 -20 118 -54 144 35 52 82 -165 113 -99 -51 -241 254 -21 -112
5149 -112 54 -182 117 -91 225 -76 2 -56 -184 63 -104 222 -55 180 -44 2 82 -79 17 -93 68 -284
5171 -284 135 -168 -103 122 -351 17 -228 151 -127 116 -202 -220 54 -197 250 -159 225 -330 -21 -20 -43 -52
5193 -52 -222 51 -68 138 -31 -33 -65 -130 113 -74 374 -308 186 31 -101 2 -144 80 -41 334 -62 278
5215B78m54K07K14m00J75l4P8r9J99j95K14k33P8L61p06N46j35j29J71j22j26
5236a12J85Jj24L43o33M48n5l67N32m11J20m3K18k65L12l44J87J41m45O22o72
5257c62J68K80j40k6J00j89K54K55q68Q11m63M7N60o25J83Po9Q6L64p03L97j59
5279i2k42O90m92N3K05j70Q9J76l03J48K48n22M94n37J79K60n37N12J6l53J79
5300AK68o31P47n80m3O97p85M99j01k43K01K89n60M78j91n47R67r84O25K15p68
5321d46M07P3m34O02j34n13P41n82K78M36j010O98Q3m57N18l12l41Q76n76j66
5341b59O53r85O80K11o66N26l77n6R15n44m87Q06j007R66j8r10R14m25k42Q95
5361E90o10k65O77n98K19L34r37J067l57k09O18p09P9N04n63J67M04q46R83m32
$$ plain form
5215 278 -176 31 245 -155 20 -14 64 -35 164 -31 183 -50 28 389 -317 229 94 -35 136 14 -112
5236 -112 73 74 -50 293 -340 108 53 -314 218 -193 -73 -116 102 -163 149 -195 -8 133 -312 310 -362
5257 -362 -194 86 -54 -80 20 -169 85 340 -528 283 -180 -133 427 -198 -15 -8 -77 9 373 -330 67 -92
5279 -92 -334 356 -136 -83 122 -48 41 217 -86 62 310 -212 282 -255 -76 184 -353 159 175 -178 1
5300 1 269 -362 385 -195 -238 459 -326 173 72 -171 30 319 -241 237 46 -501 466 -518 107 322 -446
5321 -446 -39 34 -400 202 68 -445 296 -286 -8 428 -582 116 199 -258 260 -52 -393 483 -93 -259
5341 -259 394 -591 89 300 -366 160 -217 -273 642 98 -389 417 -590 376 358 -552 362 -63 -305 590
5361 590 -20 -285 392 -206 13 347 -590 477 120 -89 529 -180 -101 403 -160 7 411 -435 548 116
5381A16l29P71r58M69K52m76K26K68q78P44k13m70R23q78L65L58o44J07M85o73
5401d35M21K63p43J058o78k3M24o22L71K3k97J44K80o16O84m63m7P36p61M01j18
5422Bk44K76J15l97M25j98k92P13p56L29J26k61L47j91k33K44K88n17N34m07l4
5443a31O18q48M83j6j56J49J93m65M24k07m10P73q17O43j9l81J84L4j4J02k07
5464f8k49N34o01L04K50m57L77k40K4J16q7k79N19j89j37N20p24N73k37k72L13
5485a0k00mL60q1l85N98o28M54m7k98K81k49K46j1j07k24N90o47M99k2n18N76
5507A73l42J60K11l04O2K12j16j25L87o03N41k56M7J69n13M28q6M8r2J2k00M24
5529B37k17m9J31j28J61k51K35j84K30j66j21J32k15N11n72L19J1r3J57j32o9
$$ plain form
5381 116 -213 558 -400 69 321 -155 71 339 -539 205 -8 -478 445 -433 -68 290 -354 -247 238 -435
5401 -435 -14 249 -494 564 -114 -137 287 -335 36 59 -238 -94 186 -430 254 -209 -256 480 -281 120 2
5422 2 -242 34 149 -248 177 -21 -313 400 -356 -27 99 -162 185 -6 -239 5 293 -224 310 -97 -131
5443 -131 487 -361 122 106 -50 99 292 -173 251 44 -366 407 -410 233 214 -167 17 51 37 139 -68
5464 -68 -317 217 -384 -80 170 -287 90 -150 -126 -10 -97 -376 143 -46 -183 337 -387 186 -51 -323 -10
5485 -10 -210 -214 146 65 -320 278 -350 104 57 -241 40 -209 37 26 -81 -305 285 -362 137 115 -403 173
5507 173 -169 -9 202 -102 -40 172 56 -69 318 -285 256 0 47 216 -297 131 45 93 1 13 -187 237
5529 237 20 -29 102 -26 135 -116 119 -65 165 -1 -122 10 -205 306 -266 53 64 -29 128 -4 -73
5550g3j04L52k20J46k98K32l3k24L54k22K04k83P8l0M5J41k24K03k56L12j56J85
5572A29j29L7P8p6K1j58K94j51j05jL8K65j17n5k42L34q2l1o2j54M42k90J58o2
5596H1p6j97L24J00k23J74k78L17j46j0j28P7R1k91L59j85J50j47K07l14p9L19
5618A25q5K97n03K19j29j8M7n8J20k47M63m32K13p9RP2k2R9q1Q5j92K30l00J50
5642a7Q2l42M43k28J5L2p0pN1o9j7J80l40K91k67L33R7k18J01k02K84j42K19k71
5666f2J21j79k7L08k35L22m13Q7P3nk3J75j61m1J88j49L09m46K16K9j69K42p7
5689H3N3l63L28j76J70j04j17K38j56J64m49L88oo2J08j60Q3l09L74j33K45k88
5711h9l0K72l26L37m15K98k59K68j20J00q8j92L48k07L72n79L58N8j38N5p5K2
$$ plain form
5550 -73 -177 175 -45 101 -197 35 2 -222 132 -90 114 -169 -91 -121 -76 65 -159 44 -212 100 -56 129
5572 129 0 37 115 39 60 -98 196 45 -60 -61 -23 242 125 70 -172 162 80 49 -13 -167 275 -15 143 81
5596 81 5 -192 132 232 9 183 -95 222 76 66 -62 15 106 -185 174 -11 139 -8 199 -115 -194 125
5618 125 40 337 -166 53 -76 -94 -47 -105 15 -232 231 -201 12 -67 -58 14 -8 91 10 95 -97 133 -167 -17
5642 -17 65 -277 166 -62 -47 -15 -85 -92 -41 -110 -127 53 -287 4 -263 70 167 -51 50 -152 132 -10 209 -62
5666 -62 59 -120 -147 161 -74 248 -165 -78 -5 -10 -33 142 -19 -60 128 -21 288 -158 58 87 -82 160 83
5689 83 136 -227 101 -75 95 -9 -126 112 -44 120 -329 59 53 -9 99 -61 22 -287 87 -46 199 -89
5711 -89 -119 153 -173 164 -251 47 -212 56 -64 36 -52 -244 104 -103 269 -310 48 106 -32 23 -52 -30
5733c0n0K51k93K77l03R0L82m57K25j89M0J36K02m02K96O8k63N08p60L39K43m09
5755i9L19o1j53k04M03l75K98l80J14L89m28K97k52J62Q1l0k04N6q4j7L51l03
5777a20J25J9k11N7Q9k7K0P5k83N04l55J91J44n31K51oR0J5Nm48O63k44k34M99
5801B88n64L72J70k86P7N8k66K66m6l15N98n34J66L53p31N32k52m3L21q8k10M26
5823B92m27K28L37p76M51j23n9M16k57m67N51q5l02N27p31N69Q3l91N31n16J7
5844a32L14j15j96M83q88P71Q2o60O49n97J1M39k77o9O27p27K70M27r20Q12l55
5865e1k63O18n13J04K95m42J6P04q72N25j25m22P88n65K01J30l43K41M09p77M34
5886I2j23k66Q38q16K93K21n06L98l3l38L57K44p41Q24o86L0N00n62M58j67j57
$$ plain form
5733 -30 -80 171 -122 155 -148 -58 324 -133 92 -97 -57 79 281 -121 175 243 -20 488 -272 67 310 -99
5755 -99 220 159 6 -198 205 -170 128 -252 -138 251 -177 120 -132 30 111 81 -123 -67 -151 -168 183 -120
5777 -120 5 24 -187 -130 -41 -68 -48 27 -256 248 -107 84 228 -303 -52 -58 32 47 52 -396 267 23 -211 288
5801 288 -276 96 266 -20 57 115 -151 115 69 -246 352 -182 -16 337 -394 138 -114 -157 164 76 -134 292
5823 292 -135 93 430 -346 105 -18 -77 339 82 -385 166 81 -221 306 -425 144 227 -164 367 -149 -132
5844 -132 182 67 -129 354 -534 237 319 -341 308 -289 -278 161 -116 -185 442 -285 -15 412 -508 304 -51
5865 -51 -314 304 -209 -105 190 -252 -236 468 -404 121 -4 -426 362 -203 -2 128 -215 26 435 -342 92
5886 92 -31 -297 541 -275 18 239 -267 131 98 -240 117 361 -380 444 -242 -212 288 -274 184 17 -140
5907a40K53K98p26N98m51q1P23o24K58o2k94L09l5k49L72J3o01R25n86K02N4m84
5929c28M07j42m5J42K08n93O01m50J54K89n67K90P4k66K18K00l24K35ll05N42
5950C37o59K73J61m83N78j29j71J37j53j44N99m53K5L24m68N24m19N2J94n5k11
5971a41K85k9j83L48p37N14q2j09K60j25j2J78j38l06O45o01M17rl56M30m83L02
5993F8K5k47j38M96l43J68J00k42K99m52K79J77j94j59K26j73K3J44l15M27p1
6014I8k64J55n1K12k39kjJ10j04J54l8k56M54l78L27j12j89J50R8j02q4K31l53
6037a84K30j22OJ31j38O8j63K12j13L36m60L54k41j5J63j77M02l66kJ21M0j06
6059b4J73j5j46J12k68K79r1o1J39r7J21k26J43j55Q7J53k26K32l02L83k53P8
$$ plain form
5907 -140 113 411 -315 283 -168 -249 474 -150 108 46 -248 61 26 -223 149 162 -439 486 -100 102 156 -328
5929 -328 79 -63 -108 34 242 -351 250 -200 -46 243 -324 -34 40 -226 -8 192 -132 103 100 -205 337
5950 337 -322 -49 112 -371 207 78 -93 44 -109 -253 346 -107 -82 242 -226 298 -121 -69 125 70 -141
5971 -141 144 115 -68 280 -457 57 -25 -134 126 1 -11 167 29 -277 368 -233 184 175 -181 249 -234 68
5993 68 93 -154 -292 204 -139 29 129 -113 186 -266 13 190 -4 -163 63 -110 -87 57 -258 169 98
6014 98 -166 -11 -62 150 -89 -91 -92 18 -86 68 30 -226 228 -150 177 65 -124 26 124 22 -62 169 -184
6037 -184 46 -76 -70 61 -77 -9 -172 40 -73 263 -197 157 -84 -99 64 -113 289 -77 -79 42 82 -24
6059 -24 149 134 -12 100 -168 111 20 -41 98 1 122 -104 39 -116 -29 124 -102 130 -172 211 -42 36
6081C6l08L88k45NK65k42K76j98j5m5l6J39j50J19j61K81j49J64K6o9oj60J00
6104A5j45K34l01M03m44L63k10R8J77k56L29l79O7K02k98J89l0K8j82M45l63J24
6126F6rp1j5j53K69k20L28k92K61l23J7K07q3J95k83J06N7qk9J9k13K29J98m15
6150a62L65j64j16R7k48K80o3j10PJ87l32M52j76j10L19n22L41j66K24k32Q6p6
6172a19R3J17m43N21m26K46J23j9n6k17K33j67K90m29L71l36K98K47n06L81k90
6193h8J28J39r9j69J42n0QL98l92J80k07M8o4q1J24r0L71m39L18l45P8K89q0j67
6217d8j88K20r4J62p9J33j63j11L39k31K37k31O4oj01L9j00L61k59J82k56J91
6239F1j33N0M5j66P0k16N67m38L56j92j00J50l17M18l04K05k67K41l2J1K7j72
$$ plain form
6081 36 -272 116 -129 -124 141 -101 175 -23 -38 -83 -119 20 -130 -11 -172 109 -40 124 150 81 75 -85 15
6104 15 -130 104 -197 206 -238 125 -85 13 190 -66 263 -116 -49 153 -145 44 14 42 -140 305 -58 66
6126 66 57 -14 -29 -182 87 -133 195 -97 164 -159 -142 65 -18 177 -106 0 57 49 20 39 -174 55 253 -162
6150 -162 203 39 -77 20 -228 52 -11 -121 -114 73 -259 193 17 -93 226 -296 45 -121 103 -129 -43 -119
6172 -119 -26 91 -352 169 -257 -11 112 93 37 -180 53 -114 176 -253 118 -218 80 327 -179 202 -88
6193 -88 40 179 80 -89 53 3 11 409 17 197 -10 38 -26 -107 17 -73 298 -141 177 -168 -90 199 119 -48
6217 -48 -236 -16 -110 52 -27 106 -57 -168 171 -60 177 -54 10 4 -97 -58 -158 203 -56 126 -130 61
6239 61 -72 -22 23 -143 -73 -289 278 -160 196 4 -96 54 -263 155 -149 56 -211 30 -2 9 36 -136
6261a36L20l48K24p0j30J84n6j6O4j3j10J70j00p2J14p4Q7n8K4j6J62l22J10K63
6285B01k54J58j96K42k15R8j77K64l1j56L56n04K01j3N6P5n7j15o5K61l43L24
6307A10l85J95K58j59J25l56J34J01J17k35J64l74K61L44o20M81l66J69J14r1
6327a3j21J08K32l16K65n38N41r3J1Q1l61K06J46o9k73L82l91M07L6n19O20o11
6349b70L07K33m46J90M8k60J99J83l57L21k73p8L67k86J72q5No5M03n01M18k46
6371b1j00L70n16L88k01K6N2R8j85J87n6l17M86n32M00j01j87K11n7n3kJ47l45
6394c08L46j84N5k1j17L50j57j34R9J33l22L27r4k61N33l68K18o9j02%J31p7l8
6417f0R7j76L58l37J91o1l97O17l32J07n2Q6o2J92r8j78M22m93P2J45o3J04J21
$$ plain form
6261 -136 184 -164 60 -10 -140 44 -12 -28 36 23 -87 83 -17 -89 25 -49 38 -20 4 -12 150 -172 -62 201
6285 201 -53 105 -91 151 -64 34 -143 121 90 -66 290 -214 -13 -26 30 105 48 -67 -132 129 -214 110
6307 110 -275 -80 178 19 144 -212 -78 23 140 -95 69 -305 -44 300 -320 161 -205 -36 78 -13
6327 -13 -134 -26 206 -110 155 -383 158 65 76 157 -204 2 148 79 -194 188 -203 204 240 -279 341 -270
6349 -270 37 270 -176 14 62 -198 1 184 -173 148 -125 -203 164 -122 50 -35 -30 -95 308 -193 225 -21
6371 -21 -121 249 -267 121 -80 -54 -2 96 -89 98 42 -275 211 -321 79 -22 -209 2 -55 -108 -110 37 -308
6394 -308 38 -146 -91 -112 -229 121 -36 -170 -71 62 -260 67 -27 -288 245 -123 95 26 -76 -76 55 -22 -60
6417 -60 37 -139 219 -118 73 12 -385 232 -100 7 -45 41 -21 171 73 -105 317 -176 -104 41 -22 82 203
6440B03j58L9pk92N49m63M5R3o3K22l21N5Q3Q5j21K02j87o1L43l72K48o4J1l7
6464C2p6kM2Jk49L42l42K88j55p3L60l09K03Nj49k9J78k87L37q1k42N07m11P9
6488c1qL9j67K51k16J72R1j44P8l63L04J16j50j45J01K17j00J02j21R9j31J38
6510A32J07m39L20p3R4k23K45k10J75j04j15J71k00J52M1LO3q7N0o5K5k41L14
6533A35k28P9L9k28L64k78L31m14L03j00j8J15k02P4j21L20k02Oq1O3J54j95K4
6556f0k18L03pl5j2j41Q6LK05j32J13j59L5J08j26Q8k67L59o3O3k49J65o5m4J11
6581F1j29J19L4K1j13J16j48l2l7K06M6k33P8p5Q0J73l91L50j55J53j24K2j70
6604a48K53k18L6K55m48N39n93K87M1r7oN8nj14M32n55L82j02j84M87l89P2O8
$$ plain form
6440 203 45 84 77 -215 334 -129 -84 9 -54 168 -153 -98 -15 70 -51 151 -36 -97 246 -126 122 58 69 32
6464 32 -44 -46 -4 -3 -252 90 -252 36 -119 -192 168 -141 62 67 -82 -111 67 -220 117 36 -206 301 -110 -31
6488 -31 -39 0 -167 84 -132 40 131 -13 65 -298 6 122 -28 -173 -72 145 45 147 26 125 -6 132
6510 132 239 -200 120 47 141 -82 163 -47 128 24 -91 80 -120 32 73 76 139 52 102 37 62 -179 135
6533 135 -93 -14 25 -203 161 -117 214 -200 103 3 -15 100 -102 -28 -149 171 -31 -25 -106 -43 111 -84 -60
6556 -60 -278 25 18 -17 -29 -170 -84 -81 124 -8 105 -54 -19 89 -37 51 -216 143 80 143 -106 59 -6 -50 61
6581 61 -68 51 85 106 -7 109 -39 -71 -108 98 144 -89 -11 -86 -6 167 -224 126 -29 124 0 22 -148
6604 -148 105 -113 -77 178 -270 269 -324 -37 4 -93 -99 -41 -46 -160 272 -283 99 -3 -187 300 -89 -17 51
6627E1n5o9K06l18L25p9k16L44l50j0L56j22Pj06j45L85k5m26L23l12J76K11m19
6650b68L22r2J55J12j37j91Q1K9l4J88k49J36k21M9K10n4j11K2J19Q6r9l79K02
6673a24J97j83J39O3k49N4K03l14K29r3N0K38l82K66k30L6J09o8j89K14k1k4L18
6696B39l70J26n3p1N3m7n9J47R9l1Q7l68M38P1m36K43k20K46j28qk6J10Q8j82
6720e2L35m45M21k43PP7q6J30j93J47k05L53m57K65K3j42K36l11K18P4j18q8J27
6743G3j03J46n1k52M88k86J5J2k22K11j26L8N3J51k11J34j59j3K13m2j28O3K4
6766B8k90L66j20K03k06o1K14l19M10k24q8l9J76K5j58J49j78J62j12J04O9l02
6788a91L38j35J9o6j18K3K35j19M1q4p1K58k23Q0%M6p2l0K89l19J99j16Q6J00
$$ plain form
6627 51 -4 -73 133 -185 140 61 -155 189 -161 -171 185 63 70 -36 -181 204 179 -247 76 -236 -60 151 -268
6650 -268 54 -38 117 229 92 -99 -18 11 -23 165 -84 52 -169 -120 90 36 -75 -53 66 152 53 -326 -124
6673 -124 73 -110 29 92 -157 -103 100 -214 15 -78 -28 210 -172 94 -136 -100 9 -59 -248 -34 -55 -79 239
6696 239 -131 -5 -58 -129 -76 -123 -182 -35 64 33 120 -248 190 261 -175 68 -152 94 -34 -42 -68 42 130 -52
6720 -52 283 -162 259 16 23 100 14 144 -49 98 -107 246 -211 54 77 -65 171 -140 78 152 34 -54 73
6743 73 -30 116 65 -187 301 15 30 42 -180 31 -95 -57 -4 147 -64 70 -89 -102 111 69 -59 4 28
6766 28 -262 104 -16 187 -19 -80 134 -185 225 1 -87 -126 50 75 -83 66 -112 50 -62 42 111 -191
6788 -191 147 12 31 -35 -153 -130 105 -14 27 -57 -128 130 -93 -13 -13 33 -39 -69 220 -99 100 -16 70 170
6812A70n5rk20J52j62J18k12L09P0j02j01K5k2q3K07l01J50J09p7L7n3J77k62
6835a35J62j03O4n0J00m4k82M13k01J53j42J07Rqrj55R7j39J70p1j73J99j14J59
6859Gj86J47j62J16J24J1L2l10L40r7n4J25q9J9k1j19J21J47j58J21j93L9J95
6882A55k23R8r8K88m13M51p5q3o6l2P8l72L67m4r3L9Q1Q3j13N2l33L60j81L6k9
6907f7K5P2r7J76k66J40k25J90J79k57P5O4L4J7Q0k26K19k00Q8o8m1K44k45J89
6931A00j25pj12P4K7l5Q2k31L08k58K45K0j09K38m03K58k13J25r5K35j44J09j8
6954G1l12L81j01K5L5l7P7j59J36q3J29k45J67q4K96j85l0K8m4O5j38L2k4jK3
6979B2j20L69l66l6O5J21M0j49J22o6P7k05N8J1K0J0k4p3J17R0k71L28m47M00
$$ plain form
6812 170 115 106 -114 38 -124 -6 -218 91 161 59 -42 -17 -39 -122 85 -216 -66 43 -34 3 -50 127 -135
6835 -135 27 -76 -12 -62 38 -6 -288 125 -76 77 -65 42 51 43 34 -121 -24 -163 7 -64 -237 -38 -152 7
6859 7 -179 -32 -194 -78 46 57 89 -221 119 22 -32 93 4 23 2 -117 4 151 -7 114 -79 -40 155
6882 155 -68 30 -68 220 -193 258 183 100 34 2 80 -292 75 31 -62 -23 58 141 28 80 -253 107 -74 -38 -67
6907 -67 -42 30 -67 109 -157 -17 -242 -52 127 -130 -55 9 43 60 140 -86 133 -67 21 -47 -88 156 -89 100
6931 100 -25 -32 -144 -70 -43 -78 4 -227 81 -177 68 88 -21 217 -186 72 -141 -16 -111 124 -20 89 71
6954 71 -241 140 39 64 99 62 139 -20 116 33 162 -83 84 0 296 111 81 109 65 130 -8 24 0 -1 22
6979 22 -98 271 -95 -131 -66 55 95 -54 68 2 79 -126 -68 -57 -37 -27 -51 -124 -7 83 -188 140 -307 93
7003I3j67J0Q6k51K10k9n1lP4j17J32O6j3l6j99K02Q9l6k8o9oK3J54r4O7n3n0
7030DQ0j96J33m0J30k35J78k01K18m2P9l0Pn0N0o7O4j21R5k6J16k80K25j44N9
7055Fp3O9o1N8K5k81K53k39L47k97O8J91j28QRJ34o9J30k66R2J88k49J46j32O8
7080cO0o5L5j09J50k42K60j61J53j97J01K2q6K99k07J85k49J20n2m4J29j40J54
7103A13k38K95j95j25L25l11R4J28k6k25L26j38l5N8k64L88j39J80l46N4O2j9
7125c8p1J79Q3k38K64k95J77k11K20o9o0j5J54k1j63J07j67J67J50k94J73j93
7147a61K37j59J25j50R1j11K0L47k98P1n7O6J51j75q1J02k2M7O9j74J12j23O1
7170a2N1j71O8K02j25j48J43P6j60K46l85J69j47K34L0r4P4k13K35j7J72j66K7
$$ plain form
7003 93 -74 -64 22 -229 -19 -48 -99 -102 -28 -145 -13 53 40 4 -195 7 96 60 32 -37 -43 -20 134 40 107 54 4
7030 4 84 -112 21 -19 111 -124 54 -147 71 29 108 78 85 35 85 18 82 -39 56 30 146 -134 91 -53 6
7055 6 -67 2 -59 -1 24 -257 -4 -243 104 -193 -125 66 -62 -54 -45 89 20 150 -116 -24 164 -85 61 -71 -3
7080 -3 57 -8 27 -82 68 -174 86 -75 78 -119 -18 4 -82 217 10 195 -54 66 14 -30 99 -41 113
7103 113 -125 170 -25 -150 175 -136 -42 86 60 -165 161 23 -12 46 -218 170 31 211 -135 -81 -19 -38
7125 -38 -109 70 153 -85 179 -116 61 -150 70 1 -59 -74 80 59 -104 3 -164 3 153 -141 32 -161
7147 -161 76 -83 42 -108 -17 -128 -108 239 -59 12 -45 21 172 -3 -84 18 -4 43 112 -62 50 -73 -12
7170 -12 39 -132 -64 138 13 -135 8 84 -76 170 -215 -46 -193 41 71 -23 51 -162 73 56 228 62 89
7193H9j69J11j5n7J74r2n7J26j14j25P3K92l79J88k6k27K76m0J59k92J56j37J70
7216H4k39L37j99jK9j49J95J00j11n0Q7k01Q7R0k54N00n19J49J63L7r8N1j20R6
7240F4J04j70J46k74J76R5k09K5K05j43K9J1j01J69k37J61J02k93L55j69o9P6
7262E3p2O9R5j27j97K46k50J38M9o5O4lL7P6o1j41K17l13J46M6k69J85K8m1LJ40
7288E3j04K36q3k44J94q9K51k38K4J1r7K76k62J04r1N2p5L24l83M1J21j41L17
7311A97l32K78j42j09J21j79J46j23L61l95K43j16Jo2PK74l49L06l54L18k11J28
7333Hl0L6K52l62J78j00L3Q9rk15J95%j81K19p2l7R0j26M7j23M71m11K6q0K98
7358A96q6q0J81l36K59r1oo4M7k5p3J84k21J39J6Pk6m6Q9j27K2M7Rk14L95k93
$$ plain form
7193 89 -80 31 16 -41 133 41 -16 110 -4 -129 -56 236 -143 45 19 -208 68 28 187 -105 51 -86 84
7216 84 -155 182 -17 -18 11 -138 57 157 46 -4 83 -118 -31 59 -195 305 -214 -65 98 135 37 88 -32 64
7240 64 168 -2 144 -130 46 141 -68 -43 162 19 48 59 -42 127 -110 51 153 -140 215 46 -23 53
7262 53 -19 50 145 18 -179 67 -183 -45 4 -61 3 0 37 113 52 -89 128 -185 -39 7 -262 -77 -49 -90 -87 53
7288 53 -51 185 102 -142 52 -37 214 -24 0 11 -86 190 -72 32 -59 -7 -82 242 -141 -100 21 -120 197
7311 197 -135 143 1 -108 13 -166 -20 -143 218 -177 66 -50 -49 -111 -104 170 -179 127 -227 91 -120 8
7333 8 -22 14 266 -96 82 -18 15 104 95 -120 75 75 -106 113 41 4 94 -32 15 -108 363 -48 -22 -102 196
7358 196 110 30 211 -125 134 43 37 -27 20 -5 -78 106 -115 24 40 47 21 -25 64 -63 -41 6 15 -199 196 -97
7384i7L4K19l16O4M7L9n1J72j96J40mq8K18l40J45k36L01q4K7M0k3O7j14J55j41
7409b2J50j39j8MN1o4J52r1o4K24k72L41j61k07K07k37R6P5j30J82q6mo3K54j74
7434Dq8K3J05J02k53J84j57O9j29J73k21K86j40j65K36r4J58k55J48J1Q7j44%
7457f0K80j92R3j24J95k16j32Q2K6J16j76Q3m3l8k9J49N3j25J57k58K61k1o7J02
7481A16l26K79pL6M1j51k4RK03l24J37q7J54j26Q8m0j2Q1l1nN6J45l09k8K47l9
7507H3o1j52J65k29L50l36J99j55O5P3p6J28j38P1j93K08J7O3j48R0j41K6L5K0
7531c6O0j73O7R3r3J60J8l4n0K30k33o8J00j20K76k80K2O3j6q4N8mO1r1m8K45
7557A23k10J95l1j82K86j62q2K9O5j5Q7j99Q7J45k19K47j33q6N9J5J69k73O3n7
$$ plain form
7384 -97 -63 156 -160 -96 -49 -10 -61 111 -85 55 51 -37 181 -159 -14 -250 51 -33 -6 34 11 78 -36 119 -22
7409 -22 128 -11 -29 -25 26 -38 114 23 -41 183 -89 252 91 -116 91 -146 -50 25 -105 77 -9 -13 -76 178 4
7434 4 -84 -61 44 146 -107 77 -80 -11 -140 33 -188 98 -42 -207 29 -65 93 -162 -14 -3 84 -60 -60
7457 -60 220 28 121 -3 192 -24 -156 -74 -48 68 -108 -25 -68 -106 -135 14 67 -58 99 -159 102 81 14 116
7481 116 -210 69 62 98 139 -12 -36 -27 176 -148 -11 -98 56 -70 18 -22 -34 47 16 11 67 212 -97 -125 122 83
7507 83 22 -130 35 -194 156 -180 19 -136 -71 2 -74 54 -84 -13 -206 2 19 82 -66 24 -117 -91 -56 -36
7531 -36 24 -149 -82 11 -82 78 96 62 12 242 9 -59 41 -79 197 -83 -61 2 -14 -98 -40 -44 17 -74 -122 123
7557 123 -87 108 77 -105 181 19 -63 -34 31 16 103 -96 -9 136 -83 164 31 -55 4 19 188 -85 -22 -79
7581g9J53q9J79j05jq1j08J45j12O8J06j49q5L7P6n3K12l31L74j81P1r5LO2K4
7606D1j7j63K68l21L21n4j32l1r5K79j79P0M5k19L18j15K3j3n7O8J27k61K03j32
7630b6j02K50k28J39j04J69%j2L0p0N9l8l3j38K67j29j04J5m3K43j38J19k91J17
7654d8J23j42K22k25k9rJ80k66K09Qo1j1k5J23j50Q4KO3j20j6P3j7K1P7o6pj07
7681a14K20j94J00M9k0j07Q0q4K0J54j63j34J42N7lj08o4J79P5j72R1nj39R4J52
7706A06j09j4L5L9O3l7M5k30P1K04j42J9j46K02k39J19j8J43j05r6K30j37L8r
7730C2QQ6k47Q0J52Pj87J47j58J41r1j10J80j11J32l3k2NJ4L3p7k03J79J09k29
7755a63j17J95L0K39j63N9l4J02k58K33j52jR1k01J16j9j32J57k2m1q3N4l8J47
$$ plain form
7581 -79 74 -15 164 59 58 -23 -131 14 -98 -30 76 -73 -158 -121 -45 -98 114 -217 157 -24 47 -48 -45 17 41
7606 41 24 -139 129 -192 129 75 -57 -88 -183 96 -83 -13 32 -187 131 16 39 26 -31 37 164 -97 106 -26
7630 -26 -128 122 -106 33 -71 98 98 86 116 46 105 67 34 -104 163 34 -70 -55 -98 145 7 126 -165 -48
7654 -48 75 -67 155 -70 -99 -108 72 -194 15 23 -38 -49 -74 49 -101 -17 -15 48 -72 -88 -15 -32 -11 66 0 -7 -114
7681 -114 106 -88 12 61 41 -66 14 -70 -50 104 -59 -193 -51 6 3 -105 -169 10 85 -87 4 -1 -140 -46 106
7706 106 -3 -17 18 57 120 83 128 -102 -31 173 31 50 -96 106 -133 -14 -32 111 6 -90 140 3 41 32
7730 32 40 126 -121 -41 111 118 -69 78 -80 61 -30 -140 40 -71 61 28 6 11 25 58 -19 -222 -43 66 -163
7755 -163 -280 -85 -55 184 21 80 46 148 -110 123 -29 -30 61 -140 -24 -43 -175 -18 -40 -81 -164 -110 -148 -1
7779ao0J77o6k9L5lK0j30J19p5M6k04K47k1p6M3o4K5o8J44j2M2p4Oq8p4K21k39
7807a59L09j95J37j3m7j57K33m0j04K26m63L00qk8J8nk81J53K53k73J28O5j02
7830e3M9j80J42k4j10K29j11L0m5Q3k64J92oj8J37j25J10l04L12j17J75j89J50
7853F3k8r5J66j92J97j41L3P3j29L3j1J19KO2k34J74k4q2j0r3J04P3K2k14K09
7878G7m8M1K9j07J4j3Jo3Q3r3pL2J05j4j53Q5p8J69j06m1J44k39L19j3r8n9R8
7905F5P4k88J60j29n0K9P9q2k6K84j94J23k36J24O2M0o4Q1J2j54L8MJ08j25J56
7930I1j68o8K06L6j00J12L7j85O6P8j37K18r4p8l00J66M6J19j04k7K03j54J96
7953A59l38J59P6pL1p9N5o6O2p7r0J95m3j74J98p8j39K11q4L9k38K95j64L5q2
$$ plain form
7779 -1 -61 116 50 21 56 53 73 -57 62 -13 33 -171 76 55 -21 22 -42 -17 -85 59 47 89 15 21 -67 -141 80 -159
7807 -159 150 -45 92 79 32 -125 108 68 -36 190 -273 27 19 -9 9 4 -277 -124 129 -144 -16 49 -53
7830 -53 -4 -184 -42 -66 -176 53 -58 -28 -73 10 -254 -62 -68 -86 51 -74 36 -268 44 -73 102 -87 63
7853 63 35 -60 106 -86 111 -30 3 76 -53 -20 -31 88 90 152 -82 92 68 -14 -24 -117 -13 60 82 -132 77
7878 77 29 70 99 -8 6 -7 -6 -69 14 -79 -86 -54 51 37 -116 -31 -109 60 -46 -87 57 -182 137 124 26 -33 65
7905 65 139 -149 11 -118 -168 -139 -60 -142 -168 116 -78 45 -191 -67 -5 35 -29 52 64 -90 -52 -48 60 -65 91
7930 91 -77 -145 61 97 -3 109 146 -39 27 105 -32 186 92 14 -286 -120 -74 45 -59 -86 117 -37 159
7953 159 -179 -20 56 49 80 1 56 -10 52 -25 -115 80 37 -137 61 -17 -156 55 -29 10 -228 67 -97 -62 -144
7978a44J28J73l73K42j90J89M7k99L13j70O7R6q3O9j87R4N7l5L0J08k09J28Rn
8002E5M6k41J69m3L0nk3J3j4K5j34L48k10J66k90L2J5j53K11q7R8j32K13k11K73
8027A51q1l8Q6j42N8j9Q1k64J40k0n5K12k23P9ll4O5j4Q3j64Q0K5j37J90j69o5
8053a78P2J19L0R6j39r5L8J45P9q2j39NN7j12K95k66Q0O3L2N2j04J4k79L33k69
8078a53J33J90k08O3p3J33N4jj39q9J57n5K28l25R2l1O7J9j07J55k6j35j07J95
8102C7j67L46p5K7m8j18J78k19o8P7Q4M2j56k2J5J00q0Q0l6o9k7K5J47j79J05
8127aj46J58j33j06K57j52J27j08J4j32J77q6J34Pj77L10k10j47L13J12j79P4
8149A06j4M9q5j15K16k20K85k47M3J5MK0r1L4j79L71j13j82N1OJ17q5J25k00J89
$$ plain form
7978 -144 -16 157 -216 26 -164 25 72 -227 86 -84 -17 79 -4 65 -122 -28 29 -6 24 132 -77 51 60 55
8002 55 101 -140 29 -14 16 11 -12 1 -13 12 -122 226 16 182 -108 -76 -61 -214 -3 -90 8 -124 89 -122 151
8027 151 70 32 118 -24 34 15 96 -168 -28 -48 -103 109 -114 -35 -38 -72 -7 -21 62 -102 -22 3 -134 56 -113 -178
8053 -178 -106 13 43 139 0 -95 -57 88 167 85 -54 -49 8 -104 191 -75 5 68 100 152 48 62 -217 116 -153
8078 -153 -20 170 -38 25 -48 85 139 138 -1 -90 67 12 240 -85 7 -24 43 62 -45 110 84 -51 -158 37
8102 37 -130 216 141 168 120 2 180 -39 -107 -30 54 96 -60 -82 -67 33 -47 33 -3 -72 -99 -74 73 -106 -1
8127 -1 -147 11 -122 -228 29 -123 4 -104 -90 -222 -45 -131 3 10 -167 143 -67 -214 99 211 32 106
8149 106 92 141 56 -59 157 -63 222 -25 18 33 37 57 -34 0 -179 192 79 -103 -52 -46 71 -14 111 -89 100
8174A00p2K2j88J17l9q8K33m8K4N4M0k51J12l5j09J10l5
$$ plain form
8174 100 28 50 -138 -21 -60 -148 85 37 61 115 155 -96 16 -19 -128 -18 -53
8191e3
$$ Imaginary data points
##PAGE= N=2
##DATA TABLE= (X++(I..I)), XYDATA
0@%%%%%%%%%%%%qJ6j6J6k4L2l2M0m9N7p2Q8j04J21j43J67j93K24k57K95l35L78
34B01m32M88n48O18o94P77q66R65j074J191j321J463j618J787j968K167k389K631
52A378k897L192l520L887m298M763n296N910o630P488q526R820j1482J3710j6880
67i381K1838l1182Q1789j86759J20599O9869j19001K21881j81280q1755J67980
78G4598r8414R7185M9312l13397K44573K8773j41877J82203j75230m4464J99989
89A03251j06520K1300K0680j82147K08900P240j66319J75259j50857J514J75329
100A07630j41227K026M9801j06905J34857n697j44312J57464r9975p844J40437
111H6255j47523K7965N7984q1293P3430M504j01729J22402o1611l8154J27470
$$ plain form
0 0 0 0 0 0 0 0 0 0 0 0 0 0 -8 8 -8 8 -16 16 -16 24 -25 32 -40 48 -56 65 -78 89 -104 120 -137 158 -177 201
34 201 -231 257 -291 327 -367 410 -456 509 -565 626 -695 768 -850 937 -1031 1136 -1253 1378
52 1378 -1519 1673 -1847 2040 -2258 2505 -2791 3119 -3511 3977 -4549 5271 -6211 7499 -9381
67 -9381 12457 -18725 63064 -123695 -3096 66773 -52228 169653 -11627 -93382 74598
78 74598 -23816 73369 122681 -190716 53857 82630 -59247 122956 -52274 -96738 103251
89 103251 -3269 18031 38711 -143436 65464 72704 -93615 81644 -69213 -67699 107630
100 107630 -33597 -31571 18230 -88675 46182 40485 -103827 53637 -46338 -54182 86255
111 86255 -61268 -33303 24681 -56612 16818 21322 -80407 41995 -19616 -57770 69700
122F9700j18685K7298N3994p6340M6973K1663o5516O4609k8728m5443J19049r2527
134b3953K93O2697p5156M2296L2456n9384J8802J2434l6136Q3289o7060k3131
146c2553P7732p4065M2305L1298p5184J7222M4360m1298L9639k9565l7718Q2204
158D4377o3162K9698K4375q3088M7552M0398n8736K5393K163m9327P8672m4205
170e890j264L0622p0973O4285J2514o0188L5955M885m6709P0490l2652k8100N1608
183B4583n8272N1195m77m9324M4337r536k5989N0540k8279l0029O1280n2547K9278
196F760J0075m7074M6016j7748r473K8657k2899j4457M4993m1078J4808J9958
208A8538m9168M6977j8625q774K1954j9337j506K0181j9854L160J9302l9599L9127
$$ plain form
122 69700 -48985 -21687 32307 -44033 2940 24603 -40913 23696 -5032 -50475 68574 -23953
134 -23953 -23660 39037 -36119 6177 38633 -20751 -1949 10485 -25651 57638 -9422 -32553
146 -32553 45179 -28886 13419 44717 -30467 -13245 31115 -10183 29456 -109 -37827 44377
158 44377 -18785 10913 35288 -47800 -248 40150 -18586 6807 8970 -40357 38315 -5890
170 -5890 -7154 23468 -47505 16780 29294 -30894 5061 9946 -36763 33727 1075 -27025 24583
183 24583 -33689 17506 17029 -32295 12042 2506 -23483 27057 -1222 -31251 30029 -22518 6760
196 6760 16835 -30239 15777 -1971 -11444 17213 -5686 -20143 24850 -16228 -1420 18538
208 18538 -30630 16347 -2278 -11052 10902 -8435 -9941 10240 -9614 -6454 12848 -26751 12376
221A2376j5711j2922K7616k4687P449O880o455m571J4683k0722J8073m577j4247
234a6815K7828k7963J4128K561o972L08O925o038q16J0285j5939J9090j7619J0954
248h3K496j1694J2419n781K810n620J3065j4228R640j951k827P961j2171J5482
262I518j2877P442k445K825l823J076P182j3524J4464j1164Q215o626L849J795
276E907p618R468q617Q334j1012J1524p752K28N097p095P354j0117J2318j1882
290c863O831k140r52K173n707J0438j3716J1571p805M903l737P52M733j0381J1848
305D948r956Q388q341O997k367l734P866q458Q565r597J1216r054L528K297m966
320b668O306q095J1088j1153Q046l513J406l74j809O896j1452J2529r801O801
$$ plain form
221 12376 -3335 -16257 11359 -13328 -5879 1001 -5454 -10025 4658 -16064 2009 -2568 -16815
234 -16815 11013 -16950 -2822 -261 -7233 -6925 0 -6038 -6854 3431 -12508 6582 -11037 -83
248 -83 2413 -9281 3138 -2643 167 -5453 7612 -6616 3024 1073 -1754 6207 -5964 9518
262 9518 -3359 4083 1638 4463 640 1716 8898 -4626 9838 -1326 6889 263 4112 5907
276 5907 -1711 7757 -860 7474 -3538 7986 234 462 5559 -1536 5818 -4299 8019 -3863
290 -3863 2968 828 -124 2049 -3658 6780 -6936 4635 -3170 1733 -2004 -1252 3481 -6900 4948
305 4948 -5008 3380 -4961 2036 -331 -4065 3801 -4657 3908 -5689 5527 -3527 1 2298 -2668
320 -2668 3638 -4457 6631 -4522 3524 11 1417 1043 -766 6130 -5322 7207 -2594 4207
334D207m315J154L470p566Q674p579O666q066R071o656P36N066r203J0640j0764
349d465R361p120K774R8j210J622m054P556j1837J2865j0017M393M82n253Q208
364C403r032Q007o768M615m096N489n493N97N941j2004J4558j1113O248l420j424
379d492N912n973K173L83L313j0461J5675j1892J544O390j0337J3471j2585O749
393a30J008n573K212Q683j2388K304J1480j8706J8954j1642K750N425j3892J5715
407F200k374j0674P776N881j8443K3342j0954p560J5378j8278K1815r085j1076
420h052J5218n545p036K1272j5481j1856K5809k0433J9529r071j6174K4284j2973
433e09M280J2146k2713l160L0601k1511R760m588j9889L3920j5517K797M515k4088
$$ plain form
334 4207 -108 1046 4516 -3050 5624 -1955 4711 -3355 5716 -940 -204 4862 -4341 6299 -4465
349 -4465 4896 -2224 550 648 -562 1060 -2994 4562 -7275 5590 -4427 -34 448 -4805 3403
364 3403 -5629 2378 -4390 225 -3871 1618 -3875 -3278 2663 -9341 5217 -5896 352 -3068 -4492
379 -4492 1420 -4553 -2380 -1997 1316 -9145 6530 -5362 -3818 2572 -7765 5706 -6879 -130
393 -130 878 -4695 -2483 6200 -6188 -3884 7596 -11110 7844 -3798 -1048 4377 -9515 6200
407 6200 3826 -6848 928 6809 -11634 11708 754 -6806 8572 -9706 12109 3024 -8052
420 -8052 7166 1621 -5415 15857 376 -11480 14329 -6104 13425 4354 -11820 12464 -509
433 -509 3771 15917 -6796 -9956 20645 -866 8894 4306 -15583 18337 2820 5617 10132 -13956
447a3956J3482K4049k4226n74M923j7080L4974j6723p993O495j7599K4660Q532
460A8964k6755j851J5415j2439K3093j3345j8493J7597r127K0020n182k4634P828
473h909J9369j3712P834k362k4360K8254l034J70l890j5733J5183J2334j6641
486e497J745J0272k7802L0742M70k2289J5566r766O707Q985j5451M197J4563l0870
500a8428K8174N258l5811L7167j5592r547K2890j5542L630J1367l0208K6966J0316
513B0640m1365M5322k4977j7544M7802k8967j934J3389k7748K9497J0317m5284
525b0852M2067k4748j4115O2989n3078k615K5831k9890L4017J694m8089M0839
537A4050j4378j1364N8533p0112O310M2464m0912L6069r647m4921M8186p895j5740
$$ plain form
447 -13956 -474 23575 -651 -1225 3698 -13382 21592 4869 -3124 3371 -14228 10432 18964
460 18964 -7791 -9642 5773 -6666 16427 3082 -15411 2186 -6941 13079 7897 -16737 -8909
473 -8909 10460 -3252 4582 2220 -22140 6114 3080 3250 -640 -16373 -1190 11144 -5497
486 -5497 -3752 6520 -21282 9460 9930 -12359 3207 -6559 148 9133 -6318 -2121 12442 -18428
500 -18428 9746 15004 -20807 16360 768 -8779 14111 -1431 2199 13566 -16642 10324 20640
513 20640 -20725 24597 -380 -17924 29878 911 -1023 12366 -15382 14115 24432 -20852
525 -20852 21215 -3533 -17648 45341 -7737 -10352 15479 -14411 19606 21300 -26789 14050
537 14050 -328 -11692 46841 -23271 -16961 25503 -15409 20660 11013 -33908 14278 6383 -9357
550i357M3605o7138J7941N0802n6024L4993j2985l6325N6697j3380k1734L1958
562A9053m8837K3499M5374o5500L3520n570l0134N7788k5346k1746K9470k9663
574a8092J9780L0278o1405L3029N218l1827N2831l2130j7063L3268k1853J0971
586C005J7694m5812K9475J0147l5267M5974k9500j4436L8023k4641M696J3522
598A2880k9101J9391J0709l2470L6335j9864j5595L8961k9046L092J6849k2871
610a0730R440J1997k4702K3459p261j9856L5333k6415K471J9906k5598P747J3870
623I661j9660J2527K510k3359L0976j6686l816K0992k7581J1384J3556j9042P739
636g99O569k2192K6230p650j4166K4079k5094J2227J2618k1722R182N982j7208
$$ plain form
550 -9357 34248 -32890 -14949 35853 -20171 14822 1837 -34488 22209 8829 -12905 19053
562 19053 -29784 -6285 39089 -26411 7109 1539 -28595 29193 3847 -17899 11571 -18092
574 -18092 1688 31966 -29439 3590 8808 -23019 29812 -2318 -19381 13887 -7966 3005
586 3005 20699 -25113 4362 14509 -20758 25216 -4284 -18720 19303 -5338 -642 12880
598 12880 -16221 3170 13879 -18591 17744 -2120 -17715 21246 -7800 -4708 12141 -10730
610 -10730 -1290 10707 -13995 9464 2203 -17653 17680 -8735 -6264 13642 -11956 -4209 9661
623 9661 -9999 2528 5038 -18321 12655 -4031 -7847 13145 -14436 -3052 10504 -8538 -799
636 -799 5770 -16422 9808 2158 -12008 12071 -13023 -796 11822 -9900 -718 5264 -11944
649a1944K0584l597j9915K7307k0435O717J3977k4711J3495M023j2899J4098k624
662D076j7430K5166j5264m79J6876k5693J5964K673j2646J1851k934j0958J7694
675H896r498n281J7586k2721J4479K709j4503J3738n270n791J0935m910o956J5089
689H502j6096Q750M588j5378J5862p702k634P890m370m519J0412r041J562P704
703E530j4030J3859p272j747P622o710Q22M441l798k097Q763j1353Q516j990m478
718c922Q328p953M686l39j278r79N058o197L169K870p769R201o936L623m27j426
734b91J533l77K72j484M480p403P603m181p8K820l860L956l718L823l667L325
750B753l226K378j91l177N684o422N043l303K459k031N17J493l221M088m629M505
$$ plain form
649 -11944 8640 5043 -14872 12435 -8000 -1283 12694 -12017 1478 5501 -7398 6700 4076
662 4076 -13354 11812 -3452 -3931 12945 -12748 3216 5889 -6757 5094 2160 -8798 8896
675 8896 -602 -5883 11703 -11018 3461 6170 -8333 5405 135 -5656 5279 369 -6587 8502
689 8502 -7594 1156 5744 -9634 6228 -1474 -4108 3782 -588 -5107 5305 -3736 -2174 5530
703 5530 -8500 5359 -1913 -3660 3962 -2748 -1926 2515 -1283 -3380 5383 -5970 2546 556 -3922
718 -3922 4406 -3547 1139 800 -478 -1457 3601 -2596 573 3443 -4326 4875 -2061 1562 1135 -291
734 -291 1242 865 1137 -347 4133 -3270 4333 152 74 2894 -966 2990 -728 3095 -572 2753
750 2753 -473 1905 1714 -1463 4221 -2201 2842 -461 1998 -33 484 1977 -1244 2844 -1785 2720
766B720m424L136r04j123K130l112L916n251N696m138J410M80j537K213l237M376
782B351m696L843l160K564j046j443M127n392M979l659K718k004J244j4j095K330
798A647l519N228o048N172k384p20K931l724L742l031K936l069L058k739J940
813A420K01l148O086p336N831k381l37J102o55L69r16K188m001N578o482N307
829B826j370l959O895o127K829m11L72k414L257k716J604P07n517R196r038M382
845E16J513m766L052j15l09j038K240m446O733p032L952K489q661Q981m270L04
861h57N77R9j534K742k501J102K599q348J0953o797J37M307n027L287j114P28
877C53n82J004m311P875n734m32O237r031P305l027J020M04k294J044K457k441
$$ plain form
766 2720 -1704 1432 528 -595 1535 -1577 2339 -2912 2784 -1354 56 536 -1001 1212 -2025 2351
782 2351 -2345 1498 -1662 902 -144 -1587 2540 -2852 2127 -1532 1186 -818 426 412 -683 1647
798 1647 -1872 3356 -2692 2480 96 -624 2307 -1417 2325 -706 2230 -839 2219 -520 1420
813 1420 1621 -1527 4559 -2777 3054 673 336 1438 783 1152 236 2424 -1577 4001 -2481 2826
829 2826 1456 -2503 4392 -1735 1094 683 1055 -1359 1898 -818 786 1493 -4024 5172 -3866 516
845 516 2029 -2737 315 200 -109 -1147 1093 -3353 3380 -3652 300 2789 -5872 3109 -1161 -857
861 -857 -280 -181 -1715 1027 -1474 -372 2227 -6121 4832 -1965 -1828 2479 -2548 739 -375 353
877 353 -229 775 -3536 4339 -1395 -1827 4410 -4621 2684 -343 677 1081 -1213 -169 2288 -153
893a53o50N007r255Q566k743r70K677o186O391j695q03K45Q53n199P565j741l787
910a878M253p417R576m017j507K628m543K106M454k139n529M958m024P602m037
925D86l433M774p049Q542K61n184k686N128l78K215k293m713N563m704R555m752
941A332o767M439K182K155l044l39m012N425K14L360o450m203R384k402K610n294
957a410N83m51K789L954n261l000J073P140n013K478m891J043L523k457O055r904
973c749K032N173j458j738J804l978J778M374o700P987r601L103O900r878O342
988B391m56m855L890J357o077R507r023Q72Q391j3339J2646l210q466Q656k381
1003i7j745P839j0566J59J0817j3500J4015o226j1639J7138o776M65M357j1951
$$ plain form
893 -153 -803 4204 -5051 3515 772 -198 2479 -3707 2684 989 186 431 1284 -3915 3650 1909 -1878
910 -1878 2375 -5042 4534 517 -990 1638 -2905 -799 3655 1516 -4013 945 -3079 4523 486
925 486 -2947 1827 -5222 3320 3581 -1603 -4289 839 461 2676 383 -4330 1233 -3471 6084 1332
941 1332 -5435 -996 1186 3341 297 -42 -4054 1371 1585 4945 -1505 -5708 3676 1274 3884 -1410
957 -1410 -827 -1278 1511 5465 204 -2796 -1723 5417 404 2882 -2009 -966 2557 100 6155 -3749
973 -3749 -1717 3456 1998 260 2064 -1914 -136 4238 -2462 5525 -4076 -973 5927 -3951 2391
988 2391 1935 -2920 970 2327 -3750 5757 -3266 -2394 5997 -7342 5304 2094 -6372 2284 -97
1003 -97 -1842 5997 -4569 -4410 6407 -7093 6922 696 -10943 6195 -581 -116 4241 -7710
1017g710M778J0870j2977J0410p418r942K4142j2882j043M643j1812J1410O287
1030H756j3769O255l560n244K2996j8625k170R640j1944J4805o23j3978P416Q98
1044H53l136J4597j8229p71J4788j3918J3552m923j2309J2403K56m087O941j1833
1058e816J096J4822j5522R906l640j0189J5985m576m931N323o141J067J0967j3635
1072e284N436J773r715J5201q323l693P094m842N92O651r412K464O331j0996J1748
1087E025o360l874R460o589O95M508n876Q46P143j0974Q152q78o759J0604p654
1102b531Q93M331m372K71N348q078M867K985r606J1259o948o23O424n881J076
1117e85L409n195K291M659r895R730m750k908R043q752K972K628m496J714L898
$$ plain form
1017 -7710 -2932 7938 -5039 5371 -2047 -11989 12153 -729 -1772 2871 -8941 2469 8756
1030 8756 -5013 1242 -2318 -7562 15434 -3191 -5361 4279 -7665 7140 6517 -7461 -45 853
1044 853 -2283 12314 -5915 -6686 8102 -5816 7736 2813 -9496 2907 3163 -924 6017 -5816
1058 -5816 -4720 10102 -5420 4486 846 -9343 6642 2066 -2865 2458 -3683 -2616 8351 -5284
1072 -5284 152 1925 -7790 7411 -912 -4605 2489 -2353 -1761 4890 -4522 -2058 4273 -6723 5025
1087 5025 -1335 -5209 4251 -2338 -1643 2865 -3011 -2165 4978 -5996 2156 1278 -5481 5123 -2531
1102 -2531 -1638 2693 -1679 -1408 3940 -4138 729 3714 -5892 5367 -1581 -2204 4220 -1661 -585
1117 -585 2824 -2371 -80 4579 -5316 4414 -336 -3244 5799 -2953 19 2647 -1849 -135 3763
1132C763p884O414j166n324J0153r509L297K844n481L450J673n493L723J426o655
1147d769R378p575J265M665o993N698j224l422K794J701n479O618l847j875O716
1162C651p750N571j513k460L396p87k330L473j285l187P229p199L989K23l595
1177b574M648k374j70J242j1k583N388n110J617K843n484N649l237P15O24m30
1193G53n38J589j153q10L734n731N255k537m66K293k254J354o36R13k095K967
1209B638l424K538m45k239L835m011K841j357O41j001R65m56n95J657l016L490
1225B061l280K369r86o04J206j568J881k337K403k345J766r88K61O38j853K608
1241A232k963L035k387J426m36n41J594k170K160k000K218k305K150j078p36K192
$$ plain form
1132 3763 -4121 2293 1127 -4197 5956 -3553 -256 2588 -2893 557 2230 -3263 460 1886 -4769
1147 -4769 4609 -2966 -1701 2964 -4029 1669 445 -2977 -183 1518 -3961 2657 -1190 -3065 3651
1162 3651 -4099 1472 -41 -2501 895 108 -2222 1251 -34 -3221 4008 -3191 798 1021 -2574
1177 -2574 2074 -300 -470 772 761 -1822 3566 -1544 73 2916 -2568 3081 -156 559 1183 753
1193 753 215 1804 651 -159 3575 -2156 3099 562 96 2389 135 1489 853 1766 -329 2638
1209 2638 -786 1752 1307 -932 2903 -1108 1733 376 1017 16 981 525 -70 1587 -1429 2061
1225 2061 -1219 1150 164 -440 766 -802 1079 -1258 1145 -1200 566 -422 -161 477 -1376 1232
1241 1232 -1731 1304 -1083 343 -93 -634 960 -1210 950 -1050 1168 -1137 1013 -65 -801 1391
1257A391k929L429l069K023q39K9M59k74M96j333K836l931L451j873L49J279k330
1274h36K750k457J483q16J043j768K027r03j343L210m119L656k639J150P42j925
1290g45J544k51k74j071K965l892L218j774n91K622m061M012j979k38Q86K57j908
1307a280K194o25j841L799m885M342j992j132L410l388J309O49p62r50L000m048
1323b200L449r24k471N227n784L473K39k281J743M74k173K414m23k634N305o164
1339b730M073M02l804M172k485K53J361p96j473L467m391K945J258n381O207m102
1355a024Q74J737k369R37O04j896J858R23m721N968m241N03L046m133K779j664
1371h19M23O93pk309L258k539J22L549n348L643j820Q81Q24j558N04q4R8kK466
$$ plain form
1257 1391 -1538 1891 -1178 845 6 35 494 220 716 -617 2219 -1712 1739 -134 215 1494 -836
1274 -836 1914 -543 940 124 1167 -601 1426 523 -820 2390 -1729 1927 -712 438 1180 -745
1290 -745 799 548 274 -797 2168 -1724 1494 -280 -871 1751 -2310 1702 -277 -515 371 628 -1280
1307 -1280 914 289 -1552 2247 -2638 1704 -288 -1420 1990 -1398 -89 560 -202 -1152 1848 -2200
1323 -2200 1249 325 -2146 3081 -2703 770 1009 -1272 471 945 -1228 1186 763 -1871 3434 -2730
1339 -2730 1343 1745 -2059 2113 -372 -119 1242 446 -1027 2440 -1951 994 2252 -3129 3078 -1024
1355 -1024 -150 1587 -782 155 759 -1137 721 1644 -3077 2891 -1350 -847 2199 -1934 845 -819
1371 -819 -396 297 290 -2019 1239 -1300 -1178 2371 -2977 666 -1154 -273 551 -1007 -503 -587 -489 -491 1975
1390A975n060L087m04QJ479k944J933j750K757n77n93j760J460J687j472J017
1406H43k902K418p48K616j733k770K751o61K690k353q40k09J902L50M35k237k198
1423b646N588k834K333k847j942M140n94M36j173k053L91N203m618J010p32k179
1439b517O634m503N50k45k037L369J658n122J640J027k691O640o756J045K426
1454A118l733N376k592l470M092j91k684N076o174J938M036o335O221l961j433
1469b716N632l818r61L784m344K198L326p686O828k971j250N912o877K208K938
1484B203l726K178J289o150P077k064k954N930p732M926K038n246L488q17k833
1499b393N501k159l937O276o144M813J008o579N511k078p09L605l091k648N965
$$ plain form
1390 1975 -3085 2 -402 -394 1085 -1859 74 -1676 1081 504 -89 -1849 -389 1298 -174 843
1406 843 -2059 359 -389 2227 494 -2276 475 -186 2504 151 -689 -898 1004 1354 1789 -448 -2646
1423 -2646 2942 108 2441 -406 -2348 1792 1198 1634 461 -1592 -1201 4002 -616 394 -338 -2517
1439 -2517 4117 -386 164 -81 -2118 1251 2909 -2213 -573 454 -2237 4403 -2353 -1308 1118
1454 1118 -2615 2761 169 -3301 791 600 -2084 2992 -3182 -1244 2792 -3543 2678 -1283 -2716
1469 -2716 2916 -902 -1863 1921 -2423 -225 3101 -4585 2243 -728 -1978 3934 -2943 -735 2203
1484 2203 -1523 655 1944 -4206 2871 807 -2147 3783 -3949 977 3015 -2231 1257 440 -2393
1499 -2393 3108 949 -2988 3288 -2856 1957 2965 -3614 1897 -181 -890 2715 -376 -3024 2941
1514B941m526K575J529o907O568k233p11K898l815O5L978l151L65K129n707O083
1530B081j987j963L565l972J852J841k396j00K323m089M187p59l389M650l777
1545a933J770J300k363M91J343k089J736R16l853M935l551Q25K056l097J656L41
1561D83j111M72J616l576L743j791j012L566m111K401J19j021N97R00k716K307
1577H66M3k541M297m106J841P24k114J887k66j475J295O33k937L936k931K24K300
1594A676l433K752j096o38R83R7k003K909j537j003L095l970L089q58j124J348
1610B87n23n94J381n16j866L483l556K349P1k330K510j326O35Q9k69j349K717
1627A193k006P43R86l314M009j884J94M35q14O9J125n47q07J746k728L298j630
$$ plain form
1514 2941 -1585 990 2519 -4388 2180 -53 -764 2134 -1681 -1616 2362 -789 -424 1705 -4002 2081
1530 2081 94 -1869 1696 -2276 -424 1417 -979 -1079 1244 -2845 1342 583 -2806 1844 -1933
1545 -1933 -163 1137 -1226 -735 608 -1481 255 1171 -2682 2253 -1298 -473 1583 -1514 142 483
1561 483 -628 -156 1460 -2116 1627 -164 -1176 2390 -1721 680 799 -222 375 1275 -1441 866
1577 866 909 -1632 2665 -1441 400 1124 -990 897 631 -844 451 1084 -1853 2083 -848 -624 1676
1594 1676 -1757 995 -101 -739 244 341 -1662 1247 -290 -1293 1802 -2168 921 63 -1061 287
1610 287 -236 -830 551 35 -1831 1652 -1904 445 516 -1814 696 -630 5 94 -175 -1524 1193
1627 1193 -813 -70 916 -2398 1611 -273 -79 356 -458 -389 736 189 -618 1128 -1600 1698 68
1644F8o44J613j884J549o3l38q97J504j480J646l78j755K698k313J732o33n87
1661a62K11M80l86l0O66j946K733k034J108j56j412J919j243P08q08J007j390
1678g35J556j060o7J096j942K366j903J009n01J29J91k27K64r21J200j394J605
1695F66j164M53K98r80J566j580J063r84R60m92J77O6m34J115j496J797j711J240
1713E60m34l79R92j102Q99o93R31j134J023q37L70M79j494K259k098J469n78k72
1731c9L30j86Q7l09R22j379J899k088J242K59j475J844j583J050p81N44o68R44
1749F13j069L89P32j993K682k421J116J77r68R84o26K10j26P79j715K131j670
1766g75N48R40k141K364j815P66l3k18L4O88j023K66J349k459K882k318Q91Q42
$$ plain form
1644 68 -576 1037 -847 702 639 301 -596 908 -572 1074 696 -1059 1639 -674 1058 425 -162
1661 -162 49 529 143 113 779 -1167 1566 -468 640 484 -928 991 -252 456 -352 655 -735
1678 -735 821 -239 -306 790 -1152 1214 -689 320 -181 -52 139 -88 176 -745 455 -939 666
1695 666 -498 -45 253 -727 839 -741 322 -662 298 -194 -17 49 -385 730 -766 1031 -680 560
1713 560 126 -253 739 -363 536 -157 774 -360 663 -174 196 675 -819 1440 -658 811 233 -39
1731 -39 291 105 192 -117 805 -574 1325 -763 479 738 -737 1107 -476 574 -207 337 -331 613
1749 613 -456 -67 665 -1328 1354 -1067 49 226 -742 242 -384 -174 -300 479 -1236 895 -775
1766 -775 -227 713 -1428 936 -879 -113 -146 -364 -330 358 -665 -399 950 -1509 1373 -945 -54 788
1784G88j606J539o91j26K96L32j637K294j591K14J545k658K767j720L10Q69j029
1801a04J50N97o74k1J314k756L014j872M9J847k618J884p07k99K60L89j379K034
1819A108j416k40K052l446L061j224o99J605j362K52P69j077j20J834l035K975
1835A037j284j195K871k875J786l81q38O68L68j430J795n86j386L096l248K108
1851E06m86j169J904r78l34P43k15p60K437k966J569L43j771K937k409N05M63
1868C19j68k6P32j497O90J108k105K551k436Q17R24q58P07r47L41q4J162k022
1886g92J288p93K67J322j711R58j369J351n88P13j037j55J143r77J167j519N73
1903a59l61J262r44k07K68j267K727k136P42m0q51J116r7o81J39Q67j708K801
$$ plain form
1784 788 -818 721 30 -96 200 532 -1105 1189 -402 -188 1357 -1301 1466 -254 56 925 -104
1801 -104 46 643 -31 -52 1262 -1494 1520 -352 -303 1544 -1074 810 103 -196 64 453 -926 1108
1819 1108 -308 -548 1504 -1942 1119 -105 -804 801 -561 -309 460 -617 -737 1097 -1938 1037
1835 1037 -247 -1442 1429 -1446 340 -41 -879 -211 157 -1273 522 -64 -1450 1646 -1602 506
1851 506 20 -1149 755 -223 -557 186 -29 -789 1648 -1318 251 594 -1177 1760 -649 -144 319
1868 319 151 125 857 -640 50 1158 -947 1604 -832 -15 909 51 758 -189 152 68 1230 -792
1886 -792 496 -297 -30 1292 -419 539 -830 521 -67 646 -391 -546 597 -380 787 -732 -159
1903 -159 -520 742 -202 -409 -141 -1408 1319 -817 -75 -115 -966 150 53 -628 -489 378 -1330 1471
1921A471k431J16J767k545K523j014q14J114J2j348K436k026k53L074m065L096
1937A113r26j514K733j497p92K122j543n10L110m409L332l05k441L885l289M05
1953e26K252k408K80K086l502K927L98l888M760l517Q93K502l614J257J411k829
1969a518K450L81l937M884l073o4L212m419K526M11k129K010k48k929M196k191
1985d38j071L722n164L477L69k495K459r51j554K940j498j533L856m148J998J109
2001A078l128L385j316r67J968j143j160L145l246J313J960m047L738j753p66
2016i39K227j224p85K007k099K07K899m130L008r30j533L137j967n28J409j099
2032c40n4K566l655J735P91k385L486k651l98J584q30k27J510k614J093K014l120
$$ plain form
1921 1471 -960 -844 923 -1622 901 -113 -927 187 199 -1149 1287 -739 -992 2082 -1983 1113
1937 1113 187 -1327 1406 -91 -883 1239 -304 -814 2296 -2113 1219 914 -1527 2358 -931 -526
1953 -526 1726 -682 -402 1684 -1818 1109 1507 -2381 2379 -1138 -245 2257 -1357 -100 1311 -1518
1969 -1518 932 1313 -2624 2260 -813 -877 2335 -2084 442 853 -1276 734 486 -2443 1753 -438
1985 -438 -1509 2213 -2951 526 895 -1600 859 -92 -1646 1294 -204 -1737 2119 -2029 -31 1078
2001 1078 -2050 1335 19 -948 1020 -123 -1283 1862 -1384 -71 1889 -2158 1580 -173 -939
2016 -939 1288 64 -721 1286 -813 -606 2293 -1837 1171 241 -1292 1845 -122 -650 759 -340
2032 -340 -394 2172 -1483 252 1043 -1342 2144 -507 -905 679 -151 -378 1132 -1482 -389 1625 -1495
2049a495L159k365m25K754j917kN43j175O12K042l492K283o90j071K998k722L02
2066f61Q68p91M69J136k701J630R57k471L227k904M25J805j444N74J48j304R62
2083g5J426k901K517j535j00K151k498J203Ol97M34P40k225K170m49j265K578
2100A780l006J597L48j036O26O1q51J068J99k088K684k186J034P75j811J385m56
2117A23P1K24r5j243J934j254k2J338k660K197o89k3L66l75l74R69n02o95J332
2136F22j884J931o62n24N29n16P93k95J52j005J270j175R10oj030J376j149J126
2154D63q57L19j64J62J94l12O89j231J339r80P59l14k92P77r94J225j118Q93p61
2173b03M77k28J32J48p43J253j257J058q55M56K25q29J055j014O85n12O74q40
$$ plain form
2049 -1495 1664 -701 -1126 1628 -289 -291 252 -923 -311 1731 -1761 522 -168 -1239 1759 -963 -661
2066 -661 207 -584 -115 1021 -1680 -50 907 -1564 1663 -1241 -816 989 -455 119 267 -1037 -75
2083 -75 1351 -1550 967 -568 -668 1483 -1015 188 194 -203 231 971 -1254 916 467 -798 1780
2100 1780 -1226 371 719 -317 309 370 -481 587 786 -1302 1382 -804 230 1005 -806 579 123
2117 123 194 418 323 -920 1014 -240 -262 1076 -1584 613 -76 -99 267 -108 -482 487 -15 -710 622
2136 622 -1262 669 7 -517 12 -504 289 -6 146 -859 411 -764 146 140 -890 486 -663 463
2154 463 -394 -75 -239 -77 117 -195 494 -737 602 -378 381 67 -225 552 -442 783 -335 558 -203
2173 -203 274 46 178 326 -417 836 -421 637 -218 238 463 -366 689 -325 360 -152 522 -318
2191c18P32m57k50J078j684J727j305M03K63k03N9j38J98o81J310j485J232q18
2209c37l9Q46j448J484j031L56o2K43o41P94k39o43J440j851J621q84J37O50q64
2228d68L73r8J97m91J250j626J262m24o92J590j669J242m33p4K47K37p29O57J0
2247C61r16J889k222J524l50n03J009r20M22j28L28p03J184j411P89j0r41J795
2265A197k053J371k94n03P50q6n71K80M34j353J833j535Q79o8j219J598j017K75
2283h2k53Nk10J016j096N88L96j340J829j608P83J3n10O95m09J21j43L82q76J302
2303F03j398P92L45j160J713j462P66r1j49J30J99n93L47L96j165J848j750R06
2321B77K71j100J207p18j12N37j63q22J720j604O70O97j840K289j843L39Q22p67
$$ plain form
2191 -318 414 -43 -293 785 -899 828 -477 -74 189 -14 45 -93 105 -576 734 -751 481 -337
2209 -337 -376 470 -978 506 -525 -169 -231 12 -629 165 -74 -717 723 -1128 493 -391 -254 396 -468
2228 -468 -95 -193 4 -487 763 -863 399 -25 -717 873 -796 446 13 -61 186 423 -306 351 361
2247 361 -555 1334 -888 636 286 -217 792 -128 294 166 494 -209 975 -436 353 343 -598 1197
2265 1197 -856 515 221 -282 468 382 -189 91 525 -828 1005 -530 349 281 -938 660 -357 -82
2283 -82 -335 -330 -540 476 -620 -32 364 -976 853 -755 28 41 -469 226 -183 -62 -205 177 -699 603
2303 603 -795 -3 342 -818 895 -567 199 108 -41 89 288 -305 42 438 -727 1121 -629 277
2321 277 548 -552 655 -63 -175 362 199 -623 1097 -507 163 860 -980 1309 -534 -195 627 -140
2339a40K58L13j000O99R41k238K331j820L61J411j970J201l76m24O22L80j565
2356a016J622j016k41J946k617J669m98m63R23k51q06Q79r6o95J661k185J272
2373H8J93j014J414j130K07L66J84r27J141j227O38Q29j701J649j177M12K80j25
2391A00m14N09j02m48J415j847J266l41l54M70m47K79P7M67j307J412j113M57
2409G9O42j308J254l96k53o4N68j276J529n42r55J874k209J575j35r21N31J96
2427A89q52J171j09j650K509k217J026P66k238J728r1p30P12j12j456K659j855
2444e50K9J571k858K380j59j350J188m05o94K189j680q68K376k638K157k07j824
2461a343K082r27k50J349j336n90K695k581J419L57k544K965j243m61J243j021
$$ plain form
2339 -140 118 431 -569 130 1071 -1167 1164 -656 -295 1116 -854 347 -29 -453 169 549 -1016
2356 -1016 606 -410 -651 1295 -1322 347 -151 -614 309 58 -748 131 35 -660 1001 -1184 88
2373 88 281 -733 681 -449 -242 124 308 -619 522 -705 -67 762 -939 710 -467 -55 225 100
2391 100 -314 195 93 -355 1060 -787 479 138 -216 254 -193 86 163 630 -677 735 -378 79
2409 79 721 -587 667 271 18 -46 522 -754 775 233 -722 1152 -1057 518 383 -538 -7 189
2427 189 -663 508 399 -1251 1258 -959 67 833 -1405 323 232 -498 214 102 -1354 1305 -550
2444 -550 -521 1050 -1808 572 413 -937 251 -154 -848 1341 -339 -1207 1169 -1469 688 481 -1343
2461 -1343 739 -188 -438 911 -425 -1015 1680 -901 518 875 -1669 1296 53 -408 835 -186
2477a86k60J878k100N10J344k666K822j136j129K028j370N8J390j693J93J882
2493A565k848K150n65j486K522j761L8J139j214L28J303k363J202P93k028K696
2509A471k236J22J626j528N06N16j528R40J322k603K180j393l42K341k122L95
2525c33L91p06O23R27k368J593n5r33K406k465M58Q29n35M34K74j572J163P54
2543H85j899K318k219K60J704j242L13k3p57R30Q44k028J717j021l55K123k180
2560f30P11J51p31Q72M17j688J233J78j210K054k213N93O92j056R57j76q80P68
2578D2M90j318J730j538K1J515j704J072l56n85Q73J72j225J184p84l79J702k030
2596a118J450l72n75R08n13j81M89l11l14J446j817J023L69j344J537r22J51L14
$$ plain form
2477 -186 -446 1432 -668 -158 1186 -1480 1342 206 -923 1105 -265 -207 1183 -510 -317 1565
2493 1565 -1283 867 302 -1184 1338 -423 -385 754 -460 -132 1171 -1192 10 803 -1225 1471
2509 1471 -765 -643 983 -545 -39 477 -1051 -111 1211 -1392 788 -605 -947 1394 -728 -333
2525 -333 58 -648 -25 902 -1466 127 72 -861 1545 -920 -462 367 -168 266 540 -1032 131 885
2543 885 -1014 1304 -915 -655 1049 -193 120 97 -660 270 1114 -914 803 -218 -573 1550 -630
2560 -630 81 232 -499 373 790 -898 335 513 -697 1357 -856 -263 429 -627 330 154 -726 42
2578 42 532 -786 944 -594 -573 942 -762 310 -46 -631 242 414 -811 373 -411 -790 912 -1118
2596 -1118 332 -40 -615 293 -220 -401 88 -223 -537 909 -908 115 484 -860 677 -245 -94 220
2614B20j93n55J147q93K89N84j413J675r74L40R2o29L44K26m8m14Q03j253J419
2633G67p30j56O32r54R20m49K70o29O11l70L73j75m33O99o57P53p80M91k09j47
2653a73M50o98P78p28O48n03M60n74J32M31p84R76r74O29k91o5L61m26K71k25
2673c05M75q17R45r81N87J37p43J108q72N94k58K86l48M73p28N64L92j287J308
2692E30r82M62O21r61K33kM41k26j47m71J194r11k94J061j060J522j167M21l1
2711B33n0k40M84l29k21Q06j182J256r81J49O58r24O81j94j28r2L69r55J188o22
2731i4k49J082j571J256n38o0L94l80j02K41j31k93J083j412J186n55n08J196
2749E45j106P39l02J23l20N86o04N13J15p07R63j169R52m81L3L62l79K26j42L81
$$ plain form
2614 220 27 -528 619 -274 15 599 -814 861 -113 227 319 -310 34 260 212 -202 601 -652 767
2633 767 37 -119 513 -441 479 30 300 -329 282 -88 285 110 -323 376 -281 472 -308 183 -26 -173
2653 -173 277 -421 357 -371 277 -226 234 -340 -208 223 -561 415 -559 70 -221 -286 75 -351 -80 -305
2673 -305 170 -647 298 -683 -96 41 -702 406 -466 128 -130 156 -192 281 -447 117 509 -778 530
2692 530 -452 10 631 -330 -97 -99 342 116 -31 -502 692 -219 -513 548 -512 1010 -157 264 233
2711 233 183 -57 427 98 -123 683 -499 757 -224 -75 583 -341 340 146 18 -74 295 -660 528 -94
2731 -94 -343 739 -832 424 -114 -174 220 -160 -262 -21 -152 -445 638 -774 412 -143 -651 545
2749 545 -561 178 -124 -1 -321 265 -339 174 289 -418 545 -624 328 -153 -120 242 -137 89 -53 328
2769C28o85R08r50P19j60l27P24q49P75p08N06l45L77j61j03M36p24Q29r26Q39
2789E03m41J7L57p50P96p37L07j60L18l98N73n65J03N80j228J454j071m6P29o15
2809b74L39J36n62J77O29j159J357q06n70J630j761R79j41m68N76K62j236J152
2827B60l45p69K019k259J059K58r48J328p54m83J084l80o28J725k094P41Q55j563
2845h94J754j187j14R64o02l61J168j303M65J205k178J927j004j81J163j117J53
2862a42R02r71J06J207k005J595m28q66J700j683M43P06o91rQ43j623J203K65
2880E52j716K038j326J56J111j262J64O01p51L45J026k109J813p46o25J406j259
2897e82M23M70o85n6J269j828J216K5j433K066j470M48N18j095M11J042j242K06
$$ plain form
2769 328 -357 551 -399 320 160 -167 557 -292 483 -225 281 -64 313 152 49 485 -239 590 -336 503
2789 503 62 79 436 -314 482 -255 52 -108 210 -188 385 -180 -77 503 -725 729 -342 -388 341 -274
2809 -274 65 201 -361 -184 445 -714 643 -163 -733 897 -864 115 -26 -494 82 344 -892 260
2827 260 -85 -854 1165 -1094 -35 223 -725 603 -151 -634 450 70 -558 1167 -927 -186 669 -894
2845 -894 860 -327 -441 523 -79 -440 728 -575 -110 1095 -1083 844 -160 -341 822 -295 -142
2862 -142 760 -211 -105 1102 -903 692 264 -602 1098 -585 -142 564 -127 -136 707 -916 287 552
2880 552 -1164 874 -452 -296 815 -447 -283 318 -433 -88 938 -1171 642 -104 -729 677 -582
2897 -582 -159 311 -374 -430 839 -989 227 252 -1181 885 -585 -137 381 -714 -303 739 -503 -297
2915b97P49j522K318j516k11J125j081M12P87j146p0J477j910J804p29j385K232
2932A037j461O60N25j667P48J268j550Q92k00j576K843j587mQ92j737J088Q46
2949A017j414L68L95j632K779j487r02J717j910J509K45j529O17O58j355J919
2965I95r60j485K439j938J242K65j676J070M77j119J148m12j492K666j831M02
2981b09R52j830J440J30j184Q67J60j132J826j414q3J604k196J489k49o65R60
2998D66k56o49R56n35n63J857k046J049K20j090J206m08p55Q84l1q86J648j914
3016h47O51J166j524J159q90k91J176M6r77O18m74O5J417j966O46k20k5Q74n14
3035I0o10K46N78n52J130j887O47P27p48R33j087p7N38M41p96Q08j093K62J279
$$ plain form
2915 -297 452 -1070 1248 -268 -479 646 -435 -23 764 -382 -452 1025 -885 919 190 -1195 1037
2932 1037 -424 236 761 -906 -158 1110 -440 452 252 -1324 1519 -68 -72 820 -917 171 1017
2949 1017 -397 -29 366 -1266 1513 26 -876 841 -1069 440 685 -844 -227 431 -924 995
2965 995 35 -1450 989 -949 293 558 -1118 -48 429 -690 458 46 -1446 1220 -611 -209
2981 -209 743 -1087 353 483 -701 166 326 -806 1020 -394 -477 1127 -1069 420 171 -494 466
2998 466 210 -439 517 -18 -581 1276 -770 279 499 -591 615 207 -548 336 305 -581 1067 -847
3016 -847 -196 970 -554 605 -285 -576 600 646 -331 287 -187 -122 1295 -671 -25 -245 -270 604 90
3035 90 -520 -274 304 -248 882 -1005 -358 369 -379 554 -533 -610 -72 369 -427 381 -712 -450 829
3054H29j522R52p73R1P05P7q28L06L3j95J142j534O77J62m18R41o77k07K42K43
3074B46n61R97j157M25P77j342J338q02k57Q02k49l89M73m97K3R27j388J216o73
3093i1q5P02p94N35m5j81l11P88r85P87l26m01J173j299P76j69q0J48o5k66L57
3114A68j23p34J221j050O06L0m44M27m34L99l80K68l83N46l14J38J35n66R39q54
3134d05P29m11J46j5rL4k79L09n96R06p97N88rm94Q86q65P22o07K50j52J59j23
3156c3P8L01p20J013r97Q56n46o9M38m71L93j87K15l76O33p66M41L3n67R24r01
3177c08N89k34k2J07oj99P8K42r00J275j188O97kq49J162p41K78k9J66m51O03
3198B68o98M94P8o43Q99r03M42m4j04L60k18j80J95K27o84Q62p43K83L61p84R18
$$ plain form
3054 829 -693 259 -514 -423 282 359 -469 -163 -130 -325 817 -717 -40 122 -296 645 -32 -239 3 246
3074 246 -315 682 -475 -50 727 -615 723 -79 -336 466 217 -172 301 -196 -173 754 -634 582 -91
3093 -91 -176 526 -268 267 222 41 -270 518 -467 320 -6 -407 766 -533 243 74 -6 142 77 -189 168
3114 168 45 -689 532 -518 88 118 -326 101 -333 66 -314 -46 -429 117 -197 -59 76 -490 449 -405
3134 -405 324 -87 59 44 35 69 -210 99 -497 409 -388 200 191 -303 583 -282 440 -167 83 -69 90 -33
3156 -33 45 346 -374 639 -358 498 -48 -117 321 -150 243 56 271 -105 528 -238 203 236 -331 593 -308
3177 -308 281 47 25 132 126 -73 5 247 -653 622 -566 131 129 -720 442 -299 -21 -50 116 -335 268
3198 268 -430 64 142 -501 398 -505 -63 -107 -211 149 -69 -249 -54 173 -511 351 -392 -109 252 -532 386
3219C86n80K33O1O1l97O53l73k96P61r97R88o43J67K92l89K17q1m3l09O65p24
3240c48R00m16k45P54j059P75n02K39KJ08j49l2K37m49O54p77M37k00N8J11l41
3261b43M94m29M14m67M76m56K02J67m15L55m83N97n60N04m60J57J57l27L38j63
3281a42K21m83O16o28M70r6l91P68o88M79o1k34J09J04n6M5K63q57J188r32M12
3302A07K49o83P83n06k39L45J01n16R60q35J62Q01j426J234l92m77O51k73l51
3321c05O59k96k91J137j742J179j77p69J320j203J06N85k71p5Q31j396Q46K15
3339C53j078J504j400L62Q02p21r0N84q87O79O16j677J373q45J08R57j203L69
3357a94M30p06M08Q85k003J383j45n80J357j467L62O27n93K72M99j358R19M09
$$ plain form
3219 386 -194 39 100 161 -236 417 44 -252 509 -488 500 -143 24 316 -73 144 63 20 -289 376 -348
3240 -348 552 136 -109 645 -414 361 -141 98 100 208 59 27 264 -185 469 -308 129 -71 -13 98 -243
3261 -243 251 -178 236 -231 245 -211 -9 158 -257 98 -385 212 -348 156 -304 -147 10 -317 21 -142
3281 -142 79 -404 212 -416 54 -42 -433 335 -353 126 65 -169 -60 44 -12 33 296 -561 627 -305 107
3302 107 356 -327 456 -50 -289 56 157 -359 601 -234 -72 729 -697 537 145 -332 319 46 -305
3321 -305 354 58 -233 904 -838 341 164 -605 715 -488 -382 203 -68 -143 688 -708 138 353
3339 353 -725 779 -621 -259 543 -178 -268 316 -571 108 724 -953 420 -425 -317 640 -563 -194
3357 -194 236 -470 -62 823 -1180 203 58 -522 835 -632 -270 357 -236 36 535 -823 96 505
3375E05j080J521j368K08R64j076L60L29r45P55L16j211J534r30k48J265j261
3392c62O40J28r03M83P01j118R08n79p81J826j344O44M78j429P68N88r77N87k56
3411Bj013K157j382o9O87j307J286L21j182K26K90q18K025j301r03J408j346J503
3429E84n2j427O72N33m30R54j066q39J884r95O48k31j427J423K89o91L79m10n84
3448g86J995j244k9M35j472J867r5j095L98M9n21J620j045p89J497j429J495l49
3466E02j335J238l45j12O75r24l45J568j538Q76K72j496J497n87k25P41p35q2
3484c55J121j316O26O63j577J348p43l83J219q31k0M54n79J94P70j583J254l49
3502h7l59J086j053P2M11m9j64M81j088Q78J63q18J122j147L28M93k39n6ol95
$$ plain form
3375 505 -575 946 -422 -214 750 -326 34 363 -582 173 489 -722 812 -118 -366 899 -362
3392 -362 278 406 -497 -14 687 -431 477 -102 -883 943 -401 243 721 -708 60 648 -329 258 2
3411 2 -1011 1146 -236 -305 382 -925 361 682 -500 -274 16 -802 1223 -78 -981 427 -919 584
3429 584 532 -895 -223 310 -120 834 -232 -1071 813 -182 466 235 -1192 231 520 -171 208 -202 -786
3448 -786 1209 -35 -64 371 -1101 766 671 -424 -26 23 -498 1122 77 -712 785 -644 851 502
3466 502 -833 405 60 -52 623 -301 -646 922 -616 260 532 -964 533 -54 -279 462 -273 -355
3484 -355 766 -550 76 739 -838 510 -233 -616 603 -228 -248 206 -373 -179 591 -992 262 -87
3502 -87 -446 640 -413 -341 70 21 -143 338 -750 128 291 -527 595 -552 -224 269 30 -26 -32 -427
3522d27L65N82r97Q41o21R6O65o67K6J11r7K36O04j118L22J71m45Q98p19J6K39
3543H1j60J07M20p87K32N82q53Q26n99m5N01k01J28k12j80p1Q43r67O03k24l85
3564c61Q62q96M57r7j16kM20o62M09Q4n65R27q47K81l7m9J72J92l16K9K21n54
3586d48Q05n51r1M80o02O51k12o8J61q6m63O30k76j21N72r39J012m31L5K52k76
3607C4N7KK7j13K68n69O24m09kL76n15M84k59m5n3L06k41K29r2l36O45p20P67
3630D65n17p4K27j94L47l18Q1j63L62k97J02j07o6M35n21M58m27J88j84J72J32
3651A01k20J58n18P40o33L96k12r8M16m22M35l61K83l92O08m26J80Pl64P21o98
3672b99M16j56M7R8j51M7j04K27l53M70l90K62o5j27L59m71M04k72J02k7n5J2
$$ plain form
3522 -427 -62 520 -477 364 -257 -161 504 -163 -137 -26 -123 113 717 -401 -79 92 -353 545 -174 -158 81
3543 81 -79 28 448 -339 -107 475 -378 448 -151 -196 305 104 232 20 -160 -231 612 -355 248 24 -361
3564 -361 501 -395 62 -35 -151 -153 267 -395 14 98 -467 460 -387 -106 -143 -192 -20 172 -144 -115 106 -448
3586 -448 357 -194 -285 195 -407 244 32 -36 125 39 -424 206 -70 -191 381 -558 454 23 58 310 34
3607 34 91 93 120 7 275 -294 330 -79 -81 295 -220 264 5 -40 -93 213 -28 201 109 -227 418 -302 465
3630 465 -52 -126 101 -93 254 -64 17 -146 216 -81 21 -86 -152 283 -238 220 -207 -19 -203 -31 101
3651 101 -119 39 -479 261 -372 24 -188 -286 130 -292 143 -218 65 -327 281 -145 35 42 -322 399 -299
3672 -299 117 -39 8 106 -45 2 -102 125 -228 242 -148 114 49 -78 281 -190 214 -58 44 17 -38 -26
3694b6LL17o21P23n43M50j80p9J41j47P1j18K03n42O64n06L72N9o11P44p04M19
3716H9j3j48j1K11k41j11L05n98Q44o57K29J69l30M82m06J41k02K65l74M31l11
3737b36J57L31o66O93m30J38J16K3j24k13K79k63N44n96L54k81J48J85k25M90
3757D24l31J01j16R0k43M3J18j43K68l14M16l26K40r1r5P0k54L59l52L40l37M02
3779B69k28l4K42m36M20m26K62j70J30J84j35j28L6K81m49M64q79N78J13l98N31
3800B27m86K23P4O0m64N11l65K6L99p32N20j43L9M06l42j84J86J05j32N25j011
3821e58O14j81l2N00p32L14K9K88k60J90o45N90J78n54O25p80L28M87l92K7O2
3842I8k90K97M79q70O53n12l6P68p96J41J66j90J10M13q77P26k41m1O50r67L42
$$ plain form
3694 -26 -23 294 -327 396 -147 303 123 44 185 38 109 -9 194 -348 316 -190 182 241 -370 374 -330 89
3716 89 76 -72 -83 128 -113 -224 81 -517 327 -330 -101 68 -262 220 -186 -45 -247 18 -356 75 -236
3737 -236 -79 252 -414 279 -151 -13 103 126 2 -211 68 -195 349 -247 107 -174 -26 159 -66 424
3757 424 93 194 78 168 -75 -32 86 -57 211 -103 313 -13 227 136 41 111 -143 216 -136 204 -133 269
3779 269 41 7 249 -187 233 -193 69 -101 29 213 78 -50 -14 267 -182 282 -597 -19 94 -304 227
3800 227 -259 -36 38 98 -366 145 -220 -194 205 -527 -7 -150 -111 295 -47 -231 -45 60 -72 453 -558
3821 -558 56 -125 -157 343 -389 -75 -46 242 -18 172 -473 117 295 -259 366 -414 -86 401 9 36 98
3842 98 -192 105 584 -286 367 -145 -181 587 -209 -68 98 -92 18 431 -446 280 39 -2 648 -319 23
3863B3J8l05K35K84n34L21J63p08J002p92J25L59l52L97n7m94K06K17n38P58k76
3884E2m40O53o60L95M6k91R0L47l85N60k54p45J103p49N83j61o67M00K83o4J34
3905B30k30m80J247p62M6J95r66R93L96o67k14J18l69J239o06o77J052j102J103
3924E46j07p27L06r8K1P04n87o92J058o81Q56k61r76Q61j19j51J73j36n34J100
3944E56p80J61N46j353J305j66m50N82o98k41J079o36KM14j068J030k50n47P81
3963B67n11M5M69m64kN06r78Q55m2p04J084p69K41L35m98O8K54m00L08K37p22
3984d21J157r53k3O33n01Q1K31j88J09L15q01O98m91R5M77o10M66l72J49p4K33
4005B10o43M91M6l33O78p68L34n8p1J58N9k98J33L38n49O13m53L2L11l94K63k38
$$ plain form
3863 23 41 -264 -29 255 -279 42 205 -503 499 -293 -168 191 -161 236 179 -315 -109 108 -430 328 52
3884 52 -388 265 -395 0 46 -245 -155 192 -193 367 113 -632 471 -278 305 144 -523 -123 160 96 230
3905 230 0 -480 767 5 51 246 -720 273 669 2 -212 -94 -463 776 170 -507 545 -557 546
3924 546 439 -288 18 -80 -59 645 58 -634 424 -257 599 338 -638 223 104 -47 126 -10 -544 556
3944 556 -224 -63 483 -870 435 269 -181 401 -297 -538 541 -95 -93 321 -747 283 33 -514 267
3963 267 -244 -199 270 -194 -196 310 -668 187 145 -559 525 -244 -3 332 -166 -98 156 -244 64 301 -421
3984 -421 736 -217 -240 393 -108 -27 204 16 125 440 -361 337 -154 -59 418 -192 274 -98 51 -23 210
4005 210 -433 58 104 -229 449 -319 15 -43 -114 44 103 -195 -62 276 -273 340 -113 -81 230 -164 99 -139
4027a39m5nL99m41L17j13k28N17n03K11r6J6J56Q0k62j12M62l46M86n41K01J62
4049A76l00K14k10P9l7K17m92N57l47k3O24p39N60l65K1j19M21k91Q2m5j87N91
4071C87p05M87j37j27K90l24J03N7J34m27N95n35J54J35m07O99n64J83j2K5m6
4092c5L0k00O6K75n49O91o31M56L8m64K70N4l0K4k8j86L63k61P3J52l70L76k52
4115a38J29J02j37N3m2R5k46M74l76K83k44J57j9k26L32j12j0j19K92l68K47Q
4137A35j57J89n90O65k74J68N4l04K22k9k6K5K95n56L15j53J2J80m18L30k68K28
4159D3j8P9k07Q4k6j12L62l21L62m16l3K05J20j18n8K16m00K36q2J05j42p1J89
4182cl50O24m78K41j18K3P0l4lj77M90o04M59j31j45L38l77L67l68J91m0R2j23
$$ plain form
4027 -139 -184 -189 210 -231 86 -27 -255 262 -241 -30 -126 -110 46 126 -136 -248 214 -132 354 -187 14 176
4049 176 -124 90 -120 -41 -78 139 -353 204 -143 -166 458 -281 279 -86 -65 -184 237 -54 28 -17 -204 387
4071 387 -318 169 32 -95 195 -129 -26 31 165 -262 333 -202 -48 87 -320 379 -185 -2 -14 11 -35
4092 -35 -5 -205 -139 136 -413 278 -353 103 141 -323 -53 1 -29 -5 -33 -219 144 -117 -44 108 -262 114 -138
4115 -138 -9 93 -44 9 -33 62 -184 290 -86 197 -47 110 91 -135 197 85 75 -44 248 -120 127 135
4137 135 -22 167 -423 242 -32 136 190 -114 108 79 53 78 373 -183 132 -21 -9 171 -247 83 -185 43
4159 43 25 104 -103 -19 -45 -157 205 -116 246 -170 -203 2 122 4 -54 162 -238 -2 -84 21 -121 -192 -3
4182 -3 -353 271 -207 34 -84 -61 9 -25 -28 -205 285 -319 140 9 -136 202 -175 192 -176 15 -25 67 -56
4205e6j2K0m5M07n21L45l91P5L53k16Q5j62L26j56K50m02K36n5j57K87k69K00
4227A42j76J48p4K35l16J63j48j66N66n85L45j36O6q8r3J9j62M06m18M35l59K7
4249a69K97l09K76l85L28j37J61j17O2j9j23K68l90N94n57J67Ok12L63j88Q0n
4271iJ92l28J65k48J8L68k00J98k35J48jJ80j33j83N8q4L90l91L03l37j0J74j7
4294A8P3k54J62K7K40l37L8m3o6N77n85J66j53K74j26K35l49Q4J43k26O09p46
4316b39K12n3L1K22k40J09l41N28k83J93k30k85M90j52J75m00R8J16K63q1k93
4337a60L6k23N31k45J12j61oK6K59o6j97K89n26Q73n99J14J07m04M62j89Q8k13
4359i2r4J45K46j61k95N30o92P30j19j92q3jk0L79r7m63O85o03O08j36n10J45
$$ plain form
4205 -56 -68 -48 -93 314 -207 138 -253 -178 175 -41 44 -118 208 52 302 -100 136 81 -76 211 -58 142
4227 142 -34 114 40 275 -41 122 -26 -192 374 -211 134 -2 64 -24 -117 -98 -260 146 -272 163 -196 -169
4249 -169 128 -181 95 -290 38 -99 62 -55 7 -12 -135 133 -257 337 -220 -53 -47 -259 104 -84 -4 -9
4271 -9 183 -145 20 -228 -210 158 -42 156 -79 69 68 248 115 -68 -10 -94 296 -95 208 -129 -139 35 18
4294 18 91 -163 -1 26 266 -71 -33 -76 -142 435 -150 16 -137 137 11 246 -103 -19 124 -102 507 -239
4316 -239 -27 -80 -49 173 -67 42 -299 229 -54 139 -91 -376 114 -38 137 -263 -165 -49 214 133 -160
4337 -160 -124 -347 184 -61 51 -110 -116 -90 169 103 -94 195 -331 542 -57 57 164 -240 222 33 121 -92
4359 -92 -186 -41 205 44 -251 279 -413 317 198 6 -77 -78 -98 281 184 -279 406 -197 411 275 -235 -90
4381i0o7L18J93k40m89O30l16L47q6q34P78l45L56K8m91R6L78l0j07J06q52Q54
4403A37M0k27L44o94K55L38M6l55J05m32R21l48n87M92m52N02J54m23p2L41k57
4424a72K89j31m41O83n29L42J12n29N68j76Q6O2l3o16R76n77J97J77p09P43l71
4445d9P3O3j12q1M68m15j40N38n92O48n45K27K23n24K71J72q5k44K87m62M58j02
4467G7l10P13o01J72j48J36j52J90k92Q2L47l95M81m32R1O8k32K33KL1j79M47
4489C29n93M44k76p6L23k85P2P4R5k47K78j69oJ37k95M40k48R2j48j43J83K04
4511A85k17oL59n64M93k30L2J34k22K22j50J9j88L41k97K36j83j03N15o46N16
4532B46m03J54r5J35k42J92L08n88N27o20M28%j64K73j38j95K66J28m65L85l63
$$ plain form
4381 -90 -157 161 354 114 -375 255 -61 286 200 -634 144 -201 155 183 -308 -212 166 136 29 135 -717 137
4403 137 177 -50 294 -400 -145 193 239 -116 -11 -443 478 130 -457 35 -417 85 239 -184 -256 85 -172
4424 -172 117 -14 -455 228 -301 41 153 -376 192 16 102 164 131 -485 491 -86 111 288 -421 322 -49
4445 -49 24 87 -25 -106 362 -53 -193 345 -247 401 -144 83 306 -218 53 225 140 -104 183 -279 179 77
4467 77 -233 480 -121 51 -97 39 -113 77 -215 -133 214 -181 300 -132 -41 27 -205 28 30 61 -118 329
4489 329 -264 180 -96 -172 151 -134 -62 12 107 -140 138 -31 -37 100 -195 245 -3 89 -59 -202 -19 185
4511 185 -32 -38 321 -243 250 20 52 186 -36 186 36 55 -133 208 -89 147 -36 -139 376 -270 246
4532 246 -157 -3 -98 37 -205 -13 295 -293 234 -386 42 42 -122 151 13 -182 84 212 -253 132 -231
4553b31O6K80k59L65m25Q2J01K7j04K26k14j17N51o99M94k37p8K61l93K66Q1j17
4575g4j15L43l47M27j56j55J65l21L98k57J07p3K07j67K27j32j44K67l39L66n1
4596A76k13K35k10Q2n7n7K4J38j50J38m2k61M48k92K61j85r5j6KK02k82K78k53
4619a29K97k99j1K00j97K13l56M42l04J07k00J61q6q4J85j61K91j69J61j66p1
4640a76K14o0Q8q6L4l21M70m40J84J38j49L10l39K75l21J99L0n9J08j05K25l08
4662h9J79j27Q4L4j28J11o4M0o1J47l76L27M7k76K92k44M41n40L23j49q2J55j59
4685a15J98r0J79k46L85l54J15k34R4J54j64Q9j26N8o6J71o8J8L7k16N32n71K87
4708F7j01q6K29k16K9R3K72n12M13m15J02L03m02M07k50K6O7O5M5Q8k96M9L32
$$ plain form
4553 -231 -165 115 -144 221 -204 -122 -21 6 -98 128 -86 -203 348 -351 143 -94 -172 89 -304 -38 43 -74
4575 -74 -189 154 -193 234 78 -77 88 -233 165 -92 15 -58 149 -18 209 77 -67 200 -139 227 176
4596 176 -37 198 -12 70 13 -44 -20 118 -32 106 64 -197 251 -41 220 35 -60 -76 -74 128 -154 124 -129
4619 -129 168 -131 -142 58 -139 74 -282 160 -144 -37 -237 -76 -162 -246 -61 -222 69 -100 61 -105 -176
4640 -176 38 -22 66 -20 14 -307 163 -277 -93 45 -104 206 -133 142 -179 20 50 -9 99 -6 219 -89
4662 -89 90 -37 47 81 -47 64 0 40 -21 126 -250 77 124 -152 140 -104 337 -203 120 -29 -111 44 -115
4685 -115 83 -7 172 -74 311 -43 72 -162 -68 86 -78 11 -115 -57 -123 48 -20 -2 35 -181 351 -220 67
4708 67 -34 -120 109 -107 -78 15 287 -225 188 -227 -125 178 -224 183 -67 -41 26 91 136 224 -72 -23 309
4731C09n02L42k01p3K88k24J56k6k6q4K80m13L28j04k18N09l73J36j54R3N9J01
4753B03l28O7J81k70N57n63K62k5l14O91m77l27L74K01n51O02m17p8L64n34O24
4774B42l89j14K44m2L5R1l44O4K89m65O06m88j64N52p9j69R4p4k12P36p51L16
4796b2J13m34P58l42k23L02l92K34K98m97M3K97m28P70n97N6L41m70J96M05o14
4817b06L7O12o64M44j37j99N45m10K42j60j84Q7K78n29N31l9m82P27o02K14J34
4838B39l74J53Q2m06M28P4n30O75n08K1M08n05L71j51j07Q9K43p61Q05l79j51
4859b84P03q46L43L16l59Q2L5m22O51k6m09P97j027N76J55o26L89Kk68L17M8n00
4881c53P33q25N60L42r51Q06m05n7N58l66l09N24l70pM24q66R38l75k48N82p05
$$ plain form
4731 309 -193 149 -52 -125 163 -61 95 69 43 -41 239 -174 154 50 -168 341 -32 104 -50 43 102 203
4753 203 -125 -58 123 -147 410 -153 109 84 -230 461 -16 -343 31 232 -319 283 -134 -212 152 -382 242
4774 242 -147 -261 -17 -59 -24 67 -277 -213 76 -389 217 -271 -435 117 38 -131 -37 -111 -323 413 -338 -22
4796 -22 91 -343 415 73 -150 152 -240 -6 292 -205 -162 135 -293 477 -120 -64 277 -193 3 408 -206
4817 -206 -169 443 -221 223 86 -113 432 22 264 104 -80 7 285 -244 287 248 -234 493 -109 105 239
4838 239 -135 18 100 -306 122 196 -334 341 -167 -146 262 -243 128 -23 -130 -41 202 -559 246 -133 -284
4859 -284 419 -427 -84 232 -127 -45 -10 -432 219 193 -216 581 -446 130 285 -341 48 50 -218 99 147 -353
4881 -353 380 -445 115 457 -494 312 -93 -150 408 42 -267 257 -113 -120 304 -562 376 1 -247 335 -370
4902c70K69L79l94PN05r79P42o9m24P21q59M85J96k20l6K78n52L96J38o74P69
4923C08o36K25K41m58L60K5l49K45J64n92N80k99k49O78m26K39m3j65J89l3j48
4944a44K92j09m18O56m32K22K7k86O5L00j49j15J18m35O93m79j2M06k81J00j9
4965@Ml9J70l15L99j84k27N78o28L06k9J1Q6J51l31N5K31n72P17o56M69m6l68
4988b18L15kj18l1L48m60L03l49J62M54o19K97j40O0J13j29j14K22j44j60N51
5009C41p30O77j65l37L24k82M6K07m8l52L62l37L32J21n23N46m46L14L5j06j41
5030a62K54m2J2K00m87L51k60J30J70l45K12r5j2n7J77j14K56j65%J31l31M84
5052C07k36J10p7J5m4j12K25k40L75m70L07j61J4J61l90L10k94K51j50P7LJ24
$$ plain form
4902 -370 -101 278 -116 -109 396 -583 159 90 -334 387 -472 13 209 -11 -47 231 -321 75 213 -461 308
4923 308 -328 -103 138 -320 40 65 -284 -39 125 -467 113 -186 -435 243 -183 56 13 -152 37 4 -144
4944 -144 148 39 -379 277 -155 67 94 -192 -127 173 24 -91 27 -408 285 -194 -206 200 -81 19 0
4965 0 4 -35 135 -180 219 35 -192 386 -242 64 35 46 132 283 -48 7 238 -334 383 -273 196 150 -218
4988 -218 97 95 -23 -54 294 -166 137 -212 -50 404 -215 82 -58 2 115 -14 -128 94 -50 -210 341
5009 341 -389 288 123 -214 110 -172 -126 81 33 -319 43 -294 38 159 -364 182 -264 50 85 -21 -162
5030 -162 92 50 62 262 -225 126 -134 -4 166 -179 33 -62 -74 -131 46 -68 188 23 23 154 -177 307
5052 307 71 181 104 119 75 -37 188 -52 323 -147 160 -1 13 174 -216 94 -200 51 -99 -22 -19 105
5074A05k45k6L98m06K62k47K11o8nJ33j23J02l17K33l71L28r6J63R8l37L17k83
5096a74J78j94K74j09p2J44j83K74l81N24m15K78L3o4k11j5M75m87L97l84L03
5117A91k23L1K80n34O02m39J55j05R4k5j4N6l19L44l31N29m70J01L11j94J15k94
5139a39J85j23K42j67M9j98P2K02k96K78l35K96k14P8J36j47K44o65P24m46L12
5160H8p4k07K40k81L50j99J63k40J19Rj34J51n0K36k56J80j98j9R6j14K86l04
5182a58K09k54M63l16K47r0k87N36o03L51j90K78j04ok6j6K00k03K32m88M12k39
5204e2j10K78k25K73j17J39l74M46l23J41O1l55M85n49L33K3k83K29P6k21R9J99
5226A73m12L60m10J11K06k14L61j59k69K38O1l02M46k34l9M75o01L20k55n2L01
$$ plain form
5074 105 -140 -166 232 -174 88 -159 52 -16 -21 112 -11 91 -226 7 -364 -36 -132 31 129 -208 109 -174
5096 -174 4 -190 84 -25 -97 47 -136 138 -243 281 -134 144 177 113 -98 -113 362 -125 272 -112 191
5117 191 -32 -1 279 -255 347 -92 63 -42 52 27 13 69 -250 94 -237 292 -178 -77 234 40 155 -139
5139 -139 46 -77 165 -2 47 -151 -79 123 -173 105 -230 66 -148 -70 66 -81 163 -502 222 -224 88
5160 88 14 -193 47 -234 116 -83 80 -160 -41 -32 -166 -15 -65 171 -85 95 -103 -122 -26 -140 146 -158
5182 -158 51 -203 260 -56 191 101 -186 350 -253 98 -92 186 82 76 50 34 234 31 263 -225 187 -52
5204 -52 -162 116 -109 164 47 186 -188 258 -65 76 137 -218 267 -282 51 74 -209 20 96 -125 -26 173
5226 173 -239 121 -289 -178 28 -186 175 16 -253 -15 46 -256 190 -44 -83 392 -209 111 -144 -196 105
5247A05r8j88L44q5m00P40p45L69N7k78L62k39j7NP9j03M00m42L1L64o45P83n81
5270a82J25J46j60Q4K94l46k4M44o91O91l89k88M19k37J88J55j29l17N58n93N61
5291C09j86o11R13o48L02j22j80kN17m79Q3L29p41P32l80r8N62n27K34O1j92J5
$$ plain form
5247 105 7 -181 163 78 -322 418 -327 42 99 -179 183 -56 -73 -68 11 -92 308 -134 -103 261 -384 399 -182
5270 -182 -57 89 -71 13 307 -39 -63 381 -310 381 -8 -296 123 -114 74 229 100 -217 341 -252 309
5291 309 123 -488 425 -223 79 -43 -223 -225 292 -187 -104 225 -516 216 -164 -262 300 -227 7 68 -124 -109
$$ [...]
8191i5
##END NTUPLES=NMR FID
##END=
