##TITLE=1H_37-2024
 DMSO-d6
 8 sc, 
 8.5.2024
##JCAMPDX= 6.0         $$ Bruker NMR JCAMP-DX V2.0
##DATA TYPE= NMR FID
##DATA CLASS= NTUPLES
##ORIGIN= UXNMR, Bruker Analytische Messtechnik GmbH
##OWNER= root
$$ XWIN-NMR		Version 3.5
$$ Wed May  8 14:20:16 2024 Russian Standard Time (UT+4h)  she@DPX200
##.OBSERVE FREQUENCY= 200.1309
##.OBSERVE NUCLEUS= ^1H
##.DELAY= (6, 6)
##.ACQUISITION MODE= SIMULTANEOUS
##.ACQUISITION SCHEME= undefined
##.AVERAGES= 8
##.DIGITISER RES= 18
##SPECTROMETER/DATA SYSTEM= spect
##.PULSE SEQUENCE= zg30
##.SOLVENT NAME= CDCl3
##.SHIFT REFERENCE= (INTERNAL, CDCl3, 0, 15.7039)
##AUDIT TRAIL= $$ (NUMBER, WHEN, WHO, WHERE, WHAT)
$$ ##TITLE= Audit trail, XWIN-NMR		Version 3.5
$$ ##JCAMPDX= 5.01
$$ ##ORIGIN= Bruker BioSpin GmbH
$$ ##OWNER= she
$$ F:/spectra/data/she/nmr/H-F/1/audita.txt
$$ ##AUDIT TRAIL=  $$ (NUMBER, WHEN, WHO, WHERE, WHAT)
(   1,<2024-05-08 14:19:00.04 +0400>,<she>,<DPX200>,
      <created by zg, POWCHK disabled, PULCHK disabled
       configuration hash MD5:
       00 E9 B6 7A A2 85 ED C7 34 08 36 98 17 FE 4E 26
       data hash MD5: 16K
       4D 9D F8 C8 2B 67 A1 3E 0D F7 0A 5F 5E 08 84 9E>)
$$ ##END=
$$ 
$$ hash MD5
$$ 26 59 07 C1 EA 3C 22 C2 25 B2 B1 1F D8 4C 02 20
##$RELAX= 
##$RELAX= 
##$RELAX= 
##$RELAX= 
##$RELAX= 
##$RELAX= 
$$ Bruker specific parameters
$$ --------------------------
##$DU= <F:/spectra>
##$EXPNO= 1
##$NAME= <H-F>
##$PROCNO= 1
##$TYPE= <nmr>
##$USER= <she>
##$AMP= (0..31)
100 100 100 100 100 100 100 100 100 100 100 100 100 100 100 100 100 100 
100 100 100 100 100 100 100 100 100 100 100 100 100 100 
##$AQSEQ= 0
##$AQ_mod= 1
##$AUNM= <au_zg>
##$AUTOPOS= <>
##$BF1= 200.13
##$BF2= 200.13
##$BF3= 200.13
##$BF4= 200.13
##$BF5= 200.13
##$BF6= 200.13
##$BF7= 200.13
##$BF8= 200.13
##$BYTORDA= 1
##$CFDGTYP= 0
##$CFRGTYP= 5
##$CHEMSTR= <none>
##$CNST= (0..31)
1 1 145 1 1 1 1 1 1 1 1 1 1 1 1 1 1 1 1 1 1 1 1 1 1 1 1 1 1 1 1 1 
##$CPDPRG= <>
##$CPDPRG1= <>
##$CPDPRG2= <>
##$CPDPRG3= <>
##$CPDPRG4= <mlev>
##$CPDPRG5= <mlev>
##$CPDPRG6= <mlev>
##$CPDPRG7= <mlev>
##$CPDPRG8= <mlev>
##$CPDPRGB= <>
##$CPDPRGT= <>
##$D= (0..31)
0 1.2 0 0 0 0 0 0 0 0.06 0 0.03 0 0 0 0 0.0002 0 0 0 0 0 0 0 0 0 0 0 0 
0 0 0 
##$DATE= 1715163539
##$DBL= (0..7)
120 120 120 120 120 120 120 120 
##$DBP= (0..7)
150 150 150 150 150 150 150 150 
##$DBP07= 0
##$DBPNAM0= <>
##$DBPNAM1= <>
##$DBPNAM2= <>
##$DBPNAM3= <>
##$DBPNAM4= <>
##$DBPNAM5= <>
##$DBPNAM6= <>
##$DBPNAM7= <>
##$DBPOAL= (0..7)
0.5 0.5 0.5 0.5 0.5 0.5 0.5 0.5 
##$DBPOFFS= (0..7)
0 0 0 0 0 0 0 0 
##$DE= 6
##$DECBNUC= <off>
##$DECIM= 32
##$DECNUC= <off>
##$DECSTAT= 4
##$DIGMOD= 1
##$DIGTYP= 9
##$DL= (0..7)
0 120 120 120 120 120 120 120 
##$DP= (0..7)
150 150 150 150 150 150 150 150 
##$DP07= 0
##$DPNAME0= <>
##$DPNAME1= <>
##$DPNAME2= <>
##$DPNAME3= <>
##$DPNAME4= <>
##$DPNAME5= <>
##$DPNAME6= <>
##$DPNAME7= <>
##$DPOAL= (0..7)
0.5 0.5 0.5 0.5 0.5 0.5 0.5 0.5 
##$DPOFFS= (0..7)
0 0 0 0 0 0 0 0 
##$DQDMODE= 0
##$DR= 18
##$DS= 0
##$DSLIST= <SSSSSSSSSSSSSSS>
$$ [...]
##$SUBNAM2= <"">
##$SUBNAM3= <"">
##$SUBNAM4= <"">
##$SUBNAM5= <"">
##$SUBNAM6= <"">
##$SUBNAM7= <"">
##$SUBNAM8= <"">
##$SUBNAM9= <"">
##$SW= 18.0517689322627
##$SWIBOX= (0..15)
0 0 2 0 0 0 0 0 0 0 0 0 0 0 0 0 
##$SW_h= 3612.71676300578
##$TD= 16384
##$TD0= 1
##$TE= 0
##$TE2= 300
##$TE3= 300
##$TEG= 300
##$TL= (0..7)
0 120 120 120 120 120 120 120 
##$TP= (0..7)
150 150 150 150 150 150 150 150 
##$TP07= 0
##$TPNAME0= <>
##$TPNAME1= <>
##$TPNAME2= <>
##$TPNAME3= <>
##$TPNAME4= <>
##$TPNAME5= <>
##$TPNAME6= <>
##$TPNAME7= <>
##$TPOAL= (0..7)
0.5 0.5 0.5 0.5 0.5 0.5 0.5 0.5 
##$TPOFFS= (0..7)
0 0 0 0 0 0 0 0 
##$TUNHIN= 0
##$TUNHOUT= 0
##$TUNXOUT= 0
##$USERA1= <user>
##$USERA2= <user>
##$USERA3= <user>
##$USERA4= <user>
##$USERA5= <user>
##$V9= 5
##$VALIST= <valist>
##$VCLIST= <CCCCCCCCCCCCCCC>
##$VD= 0
##$VDLIST= <DDDDDDDDDDDDDDD>
##$VPLIST= <PPPPPPPPPPPPPPP>
##$VTLIST= <TTTTTTTTTTTTTTT>
##$WBST= 1024
##$WBSW= 4
##$XGAIN= (0..3)
0 0 0 0 
##$XL= 0
##$YL= 0
##$YMAX_a= 92815
##$YMIN_a= -187331
##$ZGOPTNS= <>
##$ZL1= 120
##$ZL2= 120
##$ZL3= 120
##$ZL4= 120
##$ABSF1= 10
##$ABSF2= 0
##$ABSG= 5
##$ABSL= 3
##$ALPHA= 0
##$AQORDER= 0
##$ASSFAC= 0
##$ASSFACI= 0
##$ASSFACX= 0
##$ASSWID= 0
##$AUNMP= <proc_1d>
##$AZFE= 0.1
##$AZFW= 0.1
##$BCFW= 1
##$BC_mod= 2
##$BYTORDP= 1
##$COROFFS= 0
##$CY= 11.3945322036743
##$DATMOD= 1
##$DC= 2
##$DFILT= <>
##$DTYPP= 0
##$F1P= 15.6554695791079
##$F2P= 12.8336369535428
##$FCOR= 0.5
##$FTSIZE= 0
##$FT_mod= 4
##$GAMMA= 1
##$GB= 0.15
##$INTBC= 1
##$INTSCL= 1
##$ISEN= 128
##$LB= 0.24
##$LEV0= 0
##$LPBIN= 0
##$MAXI= 10000
##$MC2= 0
##$MEAN= 0
##$ME_mod= 0
##$MI= 1.114404
##$NCOEF= 0
##$NC_proc= 0
##$NLEV= 6
##$NOISF1= 3.799351
##$NOISF2= 2.8
##$NSP= 1
##$NTH_PI= 0
##$NZP= 0
##$OFFSET= 15.70392
##$PC= 1
##$PHC0= -25294.08
##$PHC1= -2.412518
##$PH_mod= 1
##$PKNL= yes
##$PPARMOD= 0
##$PSCAL= 0
##$PSIGN= 0
##$REVERSE= no
##$SF= 200.130013532006
##$SI= 16384
##$SIGF1= 3
##$SIGF2= 2
##$SINO= 400
##$SIOLD= 16384
##$SREGLST= <1H.CDCl3>
##$SSB= 0
##$STSI= 0
##$STSR= 0
##$SW_p= 3612.71676300578
##$SYMM= 0
##$S_DEV= 0
##$TDeff= 0
##$TDoff= 0
##$TI= <>
##$TILT= no
##$TM1= 0
##$TM2= 0
##$TOPLEV= 0
##$USERP1= <user>
##$USERP2= <user>
##$USERP3= <user>
##$USERP4= <user>
##$USERP5= <user>
##$WDW= 1
##$XDIM= 8192
##$YMAX_p= 0
##$YMIN_p= 0
$$ End of Bruker specific parameters
$$ ---------------------------------
##NTUPLES= NMR FID
##VAR_NAME=  TIME,          FID/REAL,        FID/IMAG
##SYMBOL=    X,             R,               I
##VAR_TYPE=  INDEPENDENT,   DEPENDENT,       DEPENDENT
##VAR_FORM=  AFFN,          ASDF,            ASDF
##VAR_DIM=   8192,          8192,            8192
##UNITS=     SECONDS,       ARBITRARY UNITS, ARBITRARY UNITS
##FACTOR=    0.0002768,     1,               1
##FIRST=     0,             0,               0
##LAST=      2.2672688,     0,               0
##MIN=       0,             -187331,         0
##MAX=       2.2672688,     92815,           0
$$ Real data points
##PAGE= N=1
##DATA TABLE= (X++(R..R)), XYDATA
$$ [...]
1961h7o8J17J71Or5K65k59l0j04J62P2j70Q1j48J65l48J93j92L93k59M6N9L84
$$ -87 -155 -38 133 139 44 309 50 20 -84 78 150 -20 61 -87 78 -270 -77 -269 124 -135 -89 -30 354
1984C54l15J23q0j16j79P3j1j0K1q8L30m2M3j8k16J61l24L32r6k5R6l2k1j72M6
$$ 354 39 162 82 -34 -213 -140 -151 -161 -140 -228 102 60 103 85 -131 30 -294 38 -58 -83 13 -19 -40 -212 -166
2009a66j47J31l6Q0j57K08O4K3l22K52L62k79k19K52k88K55K64j83l09L81j29
$$ -166 -313 -182 -218 -138 -295 -87 -23 0 -322 -70 292 13 -206 46 -242 13 277 94 -215 166 37
2030C7OJ03R1n7n1k45J15O2M8l00N7K82l1k46K09p3j5M7n8k4J92lk21LP4J55l0
$$ 37 43 146 237 180 129 -116 -1 61 109 -191 -134 148 117 -129 80 7 -8 39 -19 -43 149 146 -75 -72 2 157 127
2057A27k98Qr1L91L1Ml03M78j05m25L64pq9p4n8j33J33p2P1k2J62k16J44k9N6
$$ 127 -171 -163 -254 137 168 172 -131 347 242 -183 181 174 85 11 -47 -180 -47 -119 -48 -70 92 -124 20 -9 47
2082D7k62M61k02j75K97O2k36N4K94l89P5J86k69Oj58O41l84J39k30K13j73L3
$$ 47 -215 246 44 -131 166 228 -8 46 340 -49 26 212 -57 -51 -209 432 48 187 -43 170 -3 30
2104C0K32l80J72k39j16L97p3l0j98K65R4k59J18l61K91Pj33K07j21J50k86O2
$$ 30 262 -118 54 -185 -301 96 23 -7 -205 60 154 -105 13 -348 -57 -50 -183 24 -97 53 -233 -171
2126a71M71k55J49n6r7L4K28j29r4J55j82J48j15j82N7K40m28l7M85m58K05O4
$$ -171 300 45 194 138 41 75 303 174 80 235 53 201 86 -96 -39 201 -227 -264 221 -237 -32 32
2148C2q7M2J26l35M8J42q5K01n8M5j60J08J03j44o2J61KJ1J15k20J98ok4l66L94
$$ 32 -55 -13 113 -222 -174 -32 -117 84 26 71 -89 19 122 -22 -84 77 79 90 205 -15 183 177 153 -213 181
2173A81l76M53k38J09j06j63J19L3L87n50O7j77L34j11p1j46P1J50N8J01j95J21
$$ 181 -195 258 20 129 23 -140 -21 12 399 -151 -84 -261 73 -38 -109 -255 -184 -34 24 125 -70 51
2195E1J14j20P3Jl14J66Q2J69k25m1k98K42J92n9K70k43l0M6m5K2j7j00o3N0l32
$$ 51 165 45 118 119 -195 -29 53 222 -3 -44 -342 -100 92 33 303 60 30 76 31 53 36 -64 -127 -77 -409
2220d09L77j94J01J48k48J81K32J43l69J04J7j75j26J06j6K55k52k6O3m0j57K16
$$ -409 -32 -226 -125 23 -225 -44 188 331 -38 66 83 -92 -218 -112 -128 127 -125 -151 -88 -128 -285 -69
2242f9%Q2k02J61j73K17K11l62%m7R1J72l9J68m11K83k3J24l7l22K54j15j58P5
$$ -69 -69 13 -189 -28 -201 16 227 -135 -135 -182 -91 81 42 210 -201 82 59 183 146 -176 78 -37 -195 -120
2266a20J57k1k7J90J2k0k8j21j51J38l01J61J16j63K89j86K5O2k6M8r1P0mN4R1
$$ -120 37 16 -11 179 191 171 143 22 -129 9 -292 -131 -15 -178 111 -75 -50 12 -14 34 -57 13 9 63 154
2291A54k24K36j8J4j36Q0j25Lk4j28J92J68ok11m4K52l8j42k6q2%P5Rj7K31O1
$$ 154 -70 166 148 162 26 106 -19 -16 -40 -168 24 192 186 -25 -69 183 145 3 -23 -105 -105 -30 -21 -38 193 254
2317B54k42ql0L62l38J32j93K04j78q0p9K24J74k90j6J31K9O7j02j5j62R7J2k34
$$ 254 12 4 -26 336 -2 130 -63 141 -37 -117 -196 28 202 -88 -104 27 56 123 21 6 -156 -59 -47 -281
2341b81K59n4L8k90K54K0J90l22K24j8j90J16J8k53R4L65j22k57P7j42M93j61
$$ -281 -22 -76 -38 -328 -74 -54 136 -186 38 20 -170 -54 -36 -289 -195 170 48 -209 -132 -274 219 58
2363E8j25J26l7k6l13M02J06k04k1L4J04N1m7Q7l04j56L60l4K9J52r5k55j5L23
$$ 58 -67 59 22 -4 -317 85 191 -13 -34 0 104 155 108 195 -109 -265 95 61 90 242 147 -108 -123 200
2387B00k54j54J54LK3N8K2K1N8R5l90J69M9o2J58l05L32k94n0N3K4m8K85K02K9
$$ 200 -54 -208 -54 -51 -28 30 52 73 131 226 -164 5 54 -8 150 -155 177 -117 -167 -114 -90 -138 147 349 378
2412C78n53K02k73J88j46K05Pj93Q0k11L76k02L63l00j7k3P5n0j3j08J02K0J43
$$ 378 -175 27 -246 -58 -204 1 8 -185 -105 -316 60 -142 221 -79 -96 -119 -44 -94 -107 -215 -113 -93 50
2435E0o7j99M46k09K64l08K36k71Q3K18k17K1o4j73K40k38K34J93j03o5o7K3L89
$$ 50 -17 -216 230 21 285 -23 213 -58 25 243 26 47 -17 -190 50 -188 46 239 136 71 4 27 416
2458D16m55L6l3M7K8k02L35k14j2J0j11j53M77l39J38L0j08J57k32Q1J04l27K72
$$ 416 -39 -3 -36 11 39 -163 172 -42 -54 -44 -155 -308 169 -170 -32 -2 -110 47 -185 -104 0 -327 -55
2481e5L4J43p4K81m25J26O2j16J23j48J50j07J59l3q0K69k14k66M8J77l2k37J89
$$ -55 -21 122 48 329 -96 30 92 -24 99 -49 101 -6 153 120 40 309 95 -171 -123 54 22 -215 -26
2504b6k3J99l90L41j56J95j63k17N20m00j06J76nJ27L3k33n4J36J30P2j74j66
$$ -26 -49 150 -240 101 -55 140 -23 -240 280 -120 -226 -50 -55 72 105 -128 -182 -46 84 156 -18 -184
2526a84L88k58Q3K03k67J7qJ60l84J10L01j84j85J33J35j78J84o3J50k88j02K08
$$ -184 204 -54 29 232 -35 -18 -26 134 -250 -140 161 -23 -208 -75 60 -118 66 3 153 -135 -237 -29
2548b9p2J89m8K80m92K46k24pJ72K06l71P1J78o8j51J76m24M31P7l79K21L53l92
$$ -29 -101 88 40 320 -172 74 -150 -157 15 221 -150 -79 99 31 -120 56 -368 63 140 -239 -18 335 -57
2571e7J32m24L18j04Rq5K89Jk21J23Q1j45J12j14K36k41P9J41K5k20K70j77J88
$$ -57 75 -349 -31 -135 -126 -211 78 79 -142 -19 62 -83 29 -85 151 -90 -11 130 155 -65 205 28 216
2594B16l8l97K85J95k66j63M08j54p9l0l5L39l00M9N3r3o2L70l26jj59J85K9K49
$$ 216 178 -219 66 261 -5 -168 240 86 7 -23 -58 281 -19 30 83 -10 -72 298 -28 -29 -188 -3 26 275
2618B75m72K12J11k0O5j7j39j11K38k20k9Q1rJ30J6j60r2J22O8r3n1j57K97L5
$$ 275 -197 15 126 106 171 154 15 -96 142 -78 -107 -26 -35 95 111 -49 -141 -19 49 -44 -95 -252 45 80
2642H0j13J04J35k59j78M92l39K4Q0J49J24k67j8P7K17l00j20k3J49J50m1k84
$$ 80 -33 71 206 -53 -231 261 -78 -54 26 175 299 32 14 91 308 8 -112 -135 14 164 123 -161
2664a61J90k31J4K63j44PK07j71p0P6o8q5J87o0N5m19K02O5j85K69j46J20J95
$$ -161 29 -202 -188 75 -69 -62 145 -26 -96 -20 -88 -173 14 -46 9 -410 -208 -143 -328 -59 -205 -85 110
2687A10j21Q6j24k87K89k65L21k3j77J87J60k01J34J84r9l46KK05k5K63j14j61
$$ 110 -11 75 -49 -336 -47 -312 9 -14 -191 -4 156 -45 89 273 174 -172 -170 35 10 273 159 -2
2709bJ69j7l93M88P6k30J46j91N8n1p7Q7j33L82m38K13j06j20J16N6j42K26j14
$$ -2 167 150 -243 245 321 91 237 46 104 53 -24 63 -70 312 -126 87 -19 -139 -23 33 -109 117 3
2732CJ80k75L66l62j00J64k1J11N1j43N1p1J73k68J07L09k17j08L9lJ69p7K38
$$ 3 183 -92 274 -88 -188 -24 -45 66 117 -26 25 -46 127 -141 -34 275 58 -50 -11 -14 155 78 316
2755C16k92n9M8PL21n57M48j30j45J73N9k02L00l14O2q4J86k36k4l8J66O4k92
$$ 316 24 -35 13 20 341 -216 232 102 -43 130 189 -13 287 -27 35 -49 137 -99 -123 -161 5 69 -223
2778b23K38k01L02r1J7k3K3k0J70j63Q7M2j71J11Jj23K21l99J15K70l70k4n3M76
$$ -223 15 -186 116 25 42 19 42 22 192 29 116 158 -13 98 99 -24 197 -202 -87 183 -187 -211 -264 212
2802B12J07l91r2K23p9J19N0o8m72M74n8k58K11M0K34j92k27L45j42j74J18K63
$$ 212 319 -72 -164 59 -20 99 149 81 -391 83 25 -233 -22 18 252 60 -167 178 36 -138 -20 243
2824B43j29p0p7L34l35k62K82k5K21k26J83l87K34J62l14l5K07L1j17rJ24l23
$$ 243 114 44 -33 301 -34 -296 -14 -39 182 -44 139 -248 -14 148 -166 -201 6 37 -80 -89 35 -288
2846b88L56j1o2L5K7n2kJ13l5J12j54l6J24k42K2j16nJ98j07K05j44q5J7J7q4
$$ -288 68 57 -5 30 57 5 3 116 81 193 39 3 127 -115 -93 -209 -214 -16 -123 82 -62 -147 -130 -113 -197
2871a97J29K06j56rj96P0M4K95j91K9L97j50l18L8J12k71N3o7o9K02O0j77K35
$$ -197 -68 138 -18 -27 -223 -153 -109 186 -5 24 421 271 -47 -9 103 -168 -115 -182 -251 -49 11 -166 69
2894F9m8J71k40K0j59K96k13P5J8l77O17n17J36K41N9n2j08j91K65LM5j11o3J67
$$ 69 21 192 -48 -28 -187 109 -104 -29 -11 -388 229 -288 -152 89 148 96 -12 -203 62 65 110 -1 -64 103
2918A03k59J45k87K70o6lk05K53P0q0K14q9p0Lj52R4P9l39M29k15O6N9k01P0J37
$$ 103 -156 -11 -298 -28 -94 -97 -302 -49 21 -59 155 66 -4 -1 -153 -59 20 -319 110 -105 -39 20 -181 -111 26
2943B6K29m40L47m9K4m5l05K79n5l43J73L02j25k01P2L16k59J07J2q8J1J01J06
$$ 26 255 -185 162 113 137 92 -213 66 11 -332 -159 143 18 -183 -111 205 -54 53 65 -23 -12 89 195
2966A95j76L7j93J83M0k69L07l01K10R7j65j38K04L1R8Q9j13n21L86q4k23J72
$$ 195 19 56 -137 46 86 -183 124 -177 33 130 -35 -173 31 62 160 249 136 -385 1 -83 -306 -134
2988a34K25K4k25L21o7Ll6%j21j68M5K25k38K60j48j5J71n26N75p1j53%J68J82
$$ -134 91 115 -110 211 144 147 111 111 -10 -178 -133 92 -146 114 -34 -49 122 -404 171 100 -53 -53 115 297
3012B97l31o8J56J88k62j66L46j81Q6j34k29L37k02K19J51m69L95m5J26k36L50
$$ 297 -34 -102 54 242 -20 -186 160 -21 65 -69 -298 39 -163 56 207 -262 133 88 214 -22 328
3033C28k03j93o3N4p3Q5j35K45R5k36M2O7r3K08r2k13J58L3J68j94K47k76J38
$$ 328 125 -68 -131 -77 -150 -65 -200 45 140 -96 -54 13 -80 128 36 -177 -19 14 182 -12 235 -41 97
3056I7q4k17J7J10N1j04J6J51p7R9Nk6J54n3n47M72k10M9M2M2k2j04J35L0o1l5
$$ 97 13 -204 -187 -77 -26 -130 -114 37 -40 59 64 38 192 139 -408 64 -146 -97 -55 -13 -35 -139 -4 26 -35 -70
3082g0J27K3l6J35L1k17n9K45k31L7p4Q4j34N2J61np4J02K17k85l74L43j28K37
$$ -70 57 80 44 179 210 -7 -66 179 -52 -15 -89 -5 -139 -87 74 69 -5 97 314 29 -345 -2 -130 107
3106A07j35n8J69j69J35m4L8NJ00k84O4K28j76r1J39rr8MpM3m9J7K44j80l1O2
$$ 107 -28 -86 83 -86 49 5 43 48 148 -136 -72 156 -20 -111 28 19 -79 -75 -82 -39 -88 -71 173 -7 -38 24
3132B4j3K01k40J19m2M2P2k64J50k38n2K35r7R8J69j26k29L27j67J36r6J32l42
$$ 24 11 212 -28 91 49 91 163 -101 49 -189 -241 -6 -103 -5 164 38 -191 136 -31 105 9 141 -201
3155b01J10q5k1J76M2J97k22p8k7K94l5j73J06P6k04ll4nj47L70j14l00M32j91
$$ -201 -91 -176 -197 -21 21 218 -4 -82 -109 185 150 -23 83 159 -45 -48 -82 -87 -234 136 22 -278 154 -37
3179c7J2j29J95j39J03j17k15L12j11J20qj00J84j05J57r5k13L39q8pj00J09k10
$$ -37 -25 -154 41 -98 5 -112 -327 -15 -126 -6 -14 -114 70 -35 122 27 -186 153 65 58 -42 67 -143
3202a43J75k19K70j95J23j0J12l9l02K16J48l6k05j02K99J38k28J58K39n14J24
$$ -143 32 -187 83 -112 11 1 113 74 -228 -12 136 100 -105 -207 92 230 2 160 399 -115 9
3223Ij94J26O6K20j9j01l03L48k54J59n5N6J7Q3k37m8K76%n3n8Q5l64J32Q3QJ79
$$ 9 -185 -59 7 227 208 107 -196 152 -102 57 2 58 75 158 -79 -127 149 149 96 38 123 -241 -109 -26 -18 161
3249A61Rm11J57OJ68r2q9J10J39l19L06j56K37k96J79k1L3j1m6K5k63L49k4r6
$$ 161 170 -241 -84 -78 90 -2 -91 19 158 -161 145 -11 226 -70 109 88 121 110 64 89 -174 175 151 55
3273E5j50J51j12J9L4j52j5j18L22J76k15J50l72K18J07n3O6J8j12O0j96l4K22
$$ 55 -95 56 -56 -37 -3 -155 -170 -288 34 210 -5 145 -227 -9 98 45 111 129 17 77 -119 -153 69
3296F9j87n5L14J59k83Qq5K12k04J7o1j97M15l04J60p3p4K8J76PM0J81n20J17
$$ 69 -118 -173 141 300 17 25 -60 152 -52 -35 -96 -293 122 -182 -22 -95 -169 -141 35 42 82 263 -257 -140
3320a40O21o99J19K7K35k57K32L5l16R8K28j53j24K02j86%n1L9N9p7K19m5k28
$$ -140 481 -218 -99 -72 163 -94 138 173 -143 -45 183 30 -94 108 -78 -78 -129 -90 -31 -108 111 66 -162
3343a62L26l98R3N00n49J42m3M7M9j4n5j0j32P4n7K0K6j15M66l43K18J55k18J57
$$ -162 164 -234 -141 359 -190 -48 -91 -44 5 -9 -64 -74 -206 -132 -189 -169 -143 -258 208 -135 83 238 20 177
3367A77k58k12K93N4j60J68k08J23K22m28J29L5N1n8k82N2L26oJ19j47j30K41
$$ 177 -81 -293 0 54 -106 62 -146 -23 199 -229 -100 -65 -14 -72 -354 -302 24 18 137 -10 -140 101
3389A01rO1M7j54J11k30j04K0J17P5j95J88J6j64k85M83j30J6p4J86k35O8P4j12
$$ 101 92 153 200 46 157 -73 -177 -157 -40 35 -160 28 44 -120 -405 78 -52 -36 -110 76 -159 -91 -17 -129
3413a29N40m67k3J09K77k86J77j22k6J68k42N8j94K22Rk32K04Oj58K44k11j11
$$ -129 411 -56 -79 30 307 21 198 76 50 218 -24 34 -160 62 71 -161 43 49 -109 135 -76 -187
3435a87K69p6j00L1JJ09p7L03j62k75J43o9M4K43j37J24l30K96m30K51K89j11
$$ -187 82 6 -94 -63 -62 47 -30 273 111 -164 -21 -90 -46 197 60 184 -146 150 -280 -29 260 149
3457A49n2k23M2J59m8j68j24R3M25l09M8k22J47o3L07k43J30J10k42Q1J03O3n05
$$ 149 97 -126 -84 75 27 -141 -265 -172 253 -56 -8 -230 -83 -146 161 -82 48 158 -84 -3 100 163 -342
3480c42J12M15j08r9K26l12j83J45j04M43k17j39K40J70l76J26J09k2Mm5O4j42
$$ -342 -230 185 77 -22 204 -108 -291 -146 -250 193 -24 -163 77 247 -129 -3 106 84 88 43 107 -35
3502c5K80l39N5M3j23J11P5l60J70j3J69J9j32K19K48k81j55O2K48l95O3k8M11
$$ -35 245 -94 -39 4 -119 -8 67 -293 -123 -136 33 52 -80 139 387 106 -49 13 261 -134 -71 -99 312
3525C12j41k15k07L42j30J88K1j30j58J94J10r0j32n8Q2j17K63m63K95K65m8k31
$$ 312 171 -44 -251 91 -39 149 170 40 -118 76 186 96 -36 -94 -12 -129 134 -329 -34 231 183 -48
3547d8m4K9j7K8j43K50j49K15k45J04P8o3m6j45K73k48K95l23O7N4Jp8K70m65
$$ -48 -92 -63 -80 -52 -195 55 -94 121 -124 -20 58 -5 -51 -196 77 -171 124 -199 -132 -78 -77 -155 115 -350
3571c50K65K60J55n17K51n7n7m0l3P0J60M3k24L38K7j84j85L26l00K61n63K53
$$ -350 -85 175 330 -187 64 7 -50 -90 -123 -53 107 150 -74 264 291 107 -78 248 -52 209 -354 -101
3593a01K05j48L10j7l56mL59J73m13j9PM3j69K10j61o4m5JL30j21k88K10L00l03
$$ -101 104 -44 266 249 -107 -111 248 421 8 -11 -4 39 -130 80 -81 -145 -190 -189 141 20 -268 -58 242 -61
3617f1r6J71P8k99J34j8L58kk51Q9M9l35L05k35K2J44J70k35q8%J91j01K05j52
$$ -61 -157 14 92 -207 -73 -91 267 265 14 103 152 -183 122 -113 -91 53 223 -12 -100 -100 91 -10 195 43
3641D3j61J2J92k30Pn0M04k77p2p4K64q8k0j3J08mJ53k81J5J09j14R4j38O69n65
$$ 43 -118 -106 86 -144 -137 -187 217 -60 -132 -206 58 -30 -50 -63 45 41 194 -87 -72 37 -77 17 -121 548 -17
3666a7R5r0n1K31j58J3K8q5K32o2j90J29q4K49k51j29L00j42k60l2K30q8k89K83
$$ -17 78 -12 -63 168 10 23 51 -34 198 136 -54 75 -9 240 -11 -140 160 18 -242 -274 -44 -132 -421 -138
3690a38K51j32j27Q3J2q4K14P2l53R8J52P1k3j72J12k45K34r5l36N57n0j89j58
$$ -138 113 -19 -146 -63 -51 -135 79 151 -202 -104 48 119 96 -76 36 -209 25 -70 -406 151 101 -88 -246
3713b46J58J27N3J0l07J81K37l25J29qn9J72l1Nj94K10q2OOq1j02j1K30l64J40
$$ -246 -88 39 92 102 -205 -24 213 -112 17 9 -50 122 91 96 -98 112 30 36 42 -39 -141 -152 78 -286 -146
3738a46K13k98K76K92m51K06o7j07J8j95M01L6l52L10l74J71L7Q0jJ41m02Q9J95
$$ -146 67 -231 45 337 -114 92 25 -82 -64 -259 142 178 -174 136 -238 -67 -30 50 49 190 -212 -123 72
3761G2j90K8J02oj97p9L67k64K72n5Rj45j10M69n14k6L60N6k04r6l6j37M38p9
$$ 72 -118 -90 12 6 -191 -270 97 -167 105 50 59 -86 -196 273 -241 -267 93 149 -55 -151 -187 -324 114 35
3785C5k25N5O7K56j94Q5k61O6r9J60J6N3J81j18k63K23P5k42Q3n1kk51J54KL08
$$ 35 -190 -135 -68 188 -6 79 -182 -116 -215 -55 -39 14 195 77 -186 37 112 -130 -47 -98 -100 -351 -197 -195 113
3810A13j15k49O00j81j95j8J32Mk46L5j15L9R5J07j51K72j21N8k4k42K82o7l01
$$ 113 -2 -251 349 168 -27 -45 87 91 -155 -120 -235 -196 -101 6 -145 127 6 64 40 -202 80 13 -288
3833b88j7K07J47K1j50K40k51K19j3q0J21l13m3K14J33j77M6j72P1p7L03j67K52
$$ -288 -305 -98 49 70 -80 160 -91 128 115 35 156 -157 -200 14 147 -30 16 -156 -85 -162 141 -26 226
3856B26k64j95J73j19L7J55J09M5k34j09L52l09n3J23n4j5M95r7j48k18J33j3
$$ 226 -38 -233 -60 -179 -142 13 122 167 -67 -176 176 -133 -186 -63 -117 -132 363 266 118 -100 33 20
3878B0m1J0L9k85J64K3K01L4p5j02p5K1K1M5j4l6J17j44J11k73J71L6J8J40j68
$$ 20 -21 -11 28 -257 -93 -70 131 165 90 -12 -87 -66 -45 0 -14 -50 67 -77 34 -239 -68 -32 -14 126 -42
3903d2J46Q7l48M9K02j63L66j22k16l0L5o5O0p3Q1o4J59k34L6K55q7R6k8R4l91
$$ -42 104 191 -157 -108 94 -69 297 175 -41 -71 -36 -101 -41 -114 -33 -97 62 -172 -136 119 32 128 100 194 -197
3928a97J28P8j81L8J85j58P4r1J29p0R1j52J81K99m10R0l4O7%j27K56k5P7o7k54
$$ -197 -69 9 -172 -134 51 -107 -33 -124 5 -65 26 -126 55 354 -56 34 0 67 67 -60 196 171 248 181 -73
3953g3J78j83J83j75J81l62L79k93J13K57k61K31k39J37P3j90M7p9J35k8j51M15
$$ -73 105 -78 105 -70 111 -251 128 -165 -52 205 -56 175 -64 73 146 -44 3 -76 59 31 -120 295
3975B95l24j60o2K66k99L42R5m53M17j74L0k71M22k75p6L74j59j21K43j26l51
$$ 295 -29 -189 -251 15 -284 58 153 -300 117 -57 -27 -298 124 -151 -227 147 -12 -133 110 -16 -367
3996c67M79k7j20j36o4L05N4K02j7n26N87l69O5k06O7N9On5K31m59M53k04L39
$$ -367 112 85 -35 -171 -235 70 124 326 309 -217 370 1 66 -140 -73 -14 -8 -63 168 -291 162 -42 297
4019B97l38j12R5j49K31j90K7P5P7j17m7Q8J48j58J05k16N7K41p9j83J51n7p4
$$ 297 -41 -153 -58 -207 24 -166 -139 -64 13 -104 -151 -63 85 -73 32 -184 -127 114 35 -148 3 -54 -128
4042a28j25J22J28Q0J59n9j75J50n1p0j25J72k32p1O0M1L49k3k46r3M2L3J03j25
$$ -128 -253 -131 -3 77 236 177 2 152 101 31 -94 78 -154 -225 -165 -124 225 202 -44 -137 -95 -62 41 -84
4066h4Q4k5J80pJ07l37J94m3j18o5k27K01L9J58q5j75k7L33j67J51j16P8N2n2
$$ -84 0 -25 155 148 255 -82 112 69 -49 -114 -341 -140 -101 57 -28 -203 -230 103 -64 87 -29 49 101 49
4090D9L3o1L05k36J06k82J00L0K04l82J52k7J00k14K12q7jo1J42j17K82j62K4
$$ 49 82 21 326 90 196 -86 14 44 248 -134 18 -9 91 -123 89 2 1 -60 82 -35 247 85 109
4113A09k06L14l61q1M09k23p2J06M9j14k6j95L49k32L67j09L1j55M9j69l6nK44
$$ 109 -97 217 -144 -225 184 -39 -111 -5 44 -70 -96 -291 58 -174 193 84 115 -40 9 -160 -196 -201 43
4136D3k51J70o8R6K05l96J99J3j95J75N8j35L0N8k8m8L00j47J74k19j96K27j05
$$ 43 -208 -38 -106 -10 195 -201 -2 11 -184 -9 49 -86 -56 2 -26 -74 226 79 253 34 -162 65 -40
4159d0M2j48R1j32K35M0O5J3j13j90L25j11K12l45k61L38P1p1l06J1P3Q8J14K02
$$ -40 2 -146 -55 -187 48 88 153 166 53 -137 188 77 289 -56 -317 21 92 21 -285 -274 -201 -113 1 203
4183B03k31O4N4J07j9o5J43l20J62j2j5r4J1K0J41K35l85k41M4P8K3m7L04k49
$$ 203 -28 36 90 197 178 113 256 -64 98 86 71 -23 -12 8 149 384 -1 -242 -198 -120 -97 -144 160 -89
4207h9J36k66L26j48J66j09j43L57l32J71K14l56P1q7O1M5K6mj05K8J05p4K07
$$ -89 47 -219 107 -41 125 16 -127 230 -102 69 283 -73 -2 -89 -28 17 43 39 -66 -38 67 -7 200
4230B00j04k11j9K59j48L6R7R1j45Q3q4k54K23k15Q9q8J10K00j02q5N4K27k41
$$ 200 96 -115 -134 125 -23 13 110 201 56 139 55 -199 24 -191 -102 -190 -80 120 18 -67 -13 214 -27
4253b7N1o7r9J30q0n1O9K6N9P3k00L2J4J38j89j1J96k95K25o4M3K69j64k08N1
$$ -27 24 -43 -142 -12 -92 -143 -74 -48 11 84 -116 -84 -70 68 -121 -132 64 -231 -6 -70 -27 242 78 -130 -79
4278g9J17j24K3j0Q6j47pJ11jq2O6n8K25l10M19j60nr2J39J09M2k53k40L77k99
$$ -79 38 -86 -63 -73 13 -134 -141 -30 -31 -113 -47 -105 120 -190 229 69 64 -28 111 220 262 9 -231 146 -153
4303a53Ok0L6J04j75J09L12l50J20J29K5k2j02J63k60J37j54j1J54M1j79O9k02
$$ -153 -147 -167 -131 -27 -202 -93 219 -131 -11 118 143 121 19 182 -78 59 -95 -106 48 89 -90 -21 -223
4326b23O1J76k23J15jo4p4M88m01L94l61K05O2N9k57k48L43j26Q2k58N51l59O9
$$ -223 -162 14 -209 -94 -95 -159 -233 255 -146 248 -113 92 154 213 -44 -292 51 -75 7 -251 300 -59 10
4349A0j4k9N2rJ61j63j49L95l11Knk37K94k74L03p6K6q5k21K12J59J5k18J41J
$$ 10 -4 -33 19 10 171 8 -141 254 -57 -55 -60 -297 -3 -277 26 -50 -24 -109 -330 -118 41 56 -162 -21 -20
4374b0J66k28O5l1J3J00N4j95M5J79o5j64K22n6J54m88K40j4j3P7j39K53j79j09
$$ -20 146 -82 -17 -48 -35 65 119 -76 -31 148 83 -81 141 85 239 -249 -9 -23 -36 41 -98 155 -24 -133
4398a33J6K2J2k5J94Lj5J13m26O6PK85l13K73j05J08j46J60n9l47L65q7J7p9J36
$$ -133 -117 -95 -83 -108 86 89 74 187 -239 -173 -166 119 -194 79 -26 82 -64 96 37 -310 55 -32 -15 -94 42
4423D2r9L02m49K55j50N9O9p1J91k71j18J82LK76k55o1J59j71L5K26k88J79J27
$$ 42 -57 245 -204 51 -99 -40 29 -42 149 -122 -240 -58 -55 221 -34 -95 64 -107 -72 154 -134 45 172
4446A72j45J06k28l8J27N5j87R2J81k52L61o8l0j33j8K35k68J32J10l96J6J63
$$ 172 27 133 -95 -133 -6 49 -138 -46 135 -117 244 176 146 13 -5 230 -38 94 204 -192 -176 -13
4468a3K19j50l81L11l0j46l5K13On5K41j40K5O4o1j58jJ8K5k38J58q4J84n7m7
$$ -13 206 56 -325 -14 -44 -190 -225 -12 -6 -61 180 40 65 129 68 -90 -91 -73 -48 -286 -128 -212 -28 -85 -132
4493a32k43M38l51J93q0N72l22q6N3q1k25K43L04M6n25K39q3k26K75k21K41J28
$$ -132 -375 63 -288 -95 -175 397 75 -11 42 -39 -264 -21 283 329 -196 43 -40 -266 9 -212 29 157
4515A57j23k81O33l53n5m7K74k28RQ9k33L26j51p5o4J69k07Q7J71j82K6k0K81
$$ 157 34 -247 386 33 -22 -69 205 -23 -14 75 -158 168 17 -58 -122 47 -160 -73 98 -84 -58 -78 203
4538B03k30l3kO2P7J20k0j38p8K06j27k41N1J21j49J72L1p9O8J1j60J81J70j29
$$ 203 -27 -60 -62 0 77 197 177 39 -39 167 40 -201 -150 -29 -178 -6 25 -54 14 25 -135 46 216 87
4562H7j86K8K41m0Pj66N1p6J05j01O8j20j05K67r1K56k01l74M76l9PQ0k96L58
$$ 87 -99 -71 170 130 137 -29 22 -54 51 -50 18 -102 -207 60 -31 225 24 -350 126 87 94 174 -122 236
4586B36l30j24N5K27R3l28J56jK39k89j11J43n5J27j15j14K81k80K96J14m63L48
$$ 236 -94 -218 -163 64 157 -171 -15 -16 223 -66 -177 -34 -89 38 -77 -191 90 -190 106 220 -243 105
4608A05j81K38M7m67K00J23l8j07J84J04M1j24k74J45k57J73M82k92l6j95K40
$$ 105 -76 162 209 -258 -58 65 27 -80 104 208 249 125 -149 -4 -261 -88 394 102 66 -129 111
4629A11r4M6o7J82k14J35j81J1P4J9j07L6K08l11K96l16j1K07j57j76M15k01J33
$$ 111 17 63 -4 178 -36 99 -82 -71 3 22 -85 -49 159 -152 144 -172 -183 24 -133 -309 106 -95 38
4652C8k20M15k94RJ2k07L51k47o7K10O0jM3L1j86rk07M02l00J10q0R6qJ1L5J26
$$ 38 -182 233 -61 -52 -40 -247 104 -143 -210 0 60 59 102 133 -53 -62 -269 133 -167 -57 -137 -41 -49 -38 -3 123
4678A23j91j46J81K01j23L0Kj47j75J35PJ28p8M8J43rr3rJ31n8n8L9l27J62k27
$$ 123 -68 -214 -33 168 45 75 77 -70 -245 -110 -103 25 -53 -5 138 129 36 27 158 100 42 81 -246 -84 -311
4703c11L61k11K15o5o4oj15J45K59l15M1K2j4J32k1q0P8l39O23m62L59m07J55
$$ -311 50 -161 54 -11 -75 -81 -196 -51 208 -107 -66 -44 -58 74 53 -27 51 -288 335 -127 232 -175 -20
4726b0kK21j86l2J28L9j23K8k5J32J9j18L9k85K99j3k08R7q3j33L6L16k44J0N7
$$ -20 -22 199 13 -19 109 148 25 53 28 160 179 61 100 -185 114 101 -107 -10 -93 -226 -190 126 -118 -108 -51
4751e1K38Q7k67L6r0j07P5m7L08l04K12N0jj56J35j00J47P9m80PL50j9k09j81
$$ -51 187 274 7 43 -47 -154 -79 -126 182 -122 90 140 139 -17 118 18 165 244 -236 -229 121 102 -107 -288
4775b88L02L7O0J28r7J4k10Ql1K05q4j12J0J52Lo0l9j66K05O6k00QL4j45K32m
$$ -288 14 51 111 239 142 156 -54 -46 -77 128 44 -68 -58 94 97 37 -2 -168 37 103 -97 -89 -55 -200 32 28
4801B8J30j19k21K32J23k42n3K69n7j92n0J44Q6p4j10J44L4l72J63R6k27L41k9
$$ 28 158 39 -182 50 173 -69 -122 147 90 -102 -152 -8 78 4 -106 38 72 -300 -137 -41 -268 73 44
4824D4J32rk95Q5K41j29K83k93l2J12k35J50P0lJ38r4m25K23p3K73r9k25O8l5
$$ 44 176 167 -128 -43 198 69 352 59 27 139 -96 54 124 121 259 165 -260 -37 -110 163 64 -161 -93 -128
4848a28j3L36l3k71J43Q0J3j38K24k85K54l18nL08k14k52J79J46J47k61j8n3K0
$$ -128 -141 195 162 -109 34 114 127 -11 213 -72 182 -136 -141 167 -47 -299 -120 26 173 -88 -106 -159 -139
4871a39L30j65K44l30P7K05m22P9N3k2K24m07L21kJ4k49J28L64l22J63j14j42
$$ -139 191 26 270 -60 17 222 -200 -121 -68 -90 134 -273 48 46 60 -189 -61 303 -19 144 30 -112
4893a12J50P7l69M15p8o1j64K69j49ql4O1J85j84n9k15K32Q6Orn9j12L36n28J72
$$ -112 38 115 -254 161 83 22 -142 127 -22 -30 -64 -3 182 -2 -61 -276 -44 42 48 39 -20 -132 204 -324 -152
4918a52J75K0N4j38K24k52P9j30K5o3R9K29o9l0o3k46J20r7J65J47l69N24k27
$$ -152 23 43 97 -41 183 -69 10 -120 -95 -158 -59 170 101 71 8 -238 -118 -215 -50 97 -272 252 25
4941B5K1r1o9k9J55j06o8J59K0r9Q8Q7k27L33k07k0J36j36j3o0L2M1L33j76q3
$$ 25 46 -45 -114 -143 12 -94 -162 -3 17 -82 6 93 -134 199 -8 -28 108 -28 -41 -101 -69 -28 305 129 46
4966D6r1R0J2l45M43j26k88M2K97l6k16M6j4K99l39J00m9o2lK30P4j94R4n39M16
$$ 46 -45 45 57 -288 155 29 -259 -217 80 44 -172 -126 -140 159 -180 -80 -129 -191 -194 36 110 -84 10 -529 -113
4991a13M11j85J53j61l3M7j00R1j99RO2J68k80K10j86K8P9J06l9l2j53j4J61k50
$$ -113 298 113 266 105 72 119 19 110 -89 -80 -18 150 -130 80 -106 -78 1 107 68 36 -117 -131 30 -220
5015b20J86kL61j93j07k55O8K39J68qk54L7J09l49J88J93j40J8R9j85K33j74P4
$$ -220 -34 -36 325 132 25 -230 -162 77 245 237 -17 20 129 -220 -32 161 21 39 138 -47 186 12 86
5038H6J9j03k61K33J55J34l88J76n8j6K49n8j06J8j75l4Q9K41k94J87K0m2J23
$$ 86 105 2 -259 -26 129 263 -125 51 -7 -23 226 168 62 80 -95 -129 -40 201 -93 94 114 72 195
5061A95k44p1K04j74R2J34k00J24pO8L4j60M8Rj33P5m2%K8o8J78J14k40K81l65
$$ 195 -49 -120 84 -90 2 136 -64 60 53 121 155 -5 43 52 -81 -6 -48 -48 -20 -88 90 204 -36 245 -120
5086a20K63j48K08j98J54n9j93J24o5J18N1l5k35J79k47J19L2m0L4l7K51k99J51
$$ -120 143 -5 203 5 159 100 -93 31 -34 84 135 100 -135 44 -203 -84 -52 -92 -58 -95 156 -143 8
5109HL9l26L71j69P0J78j92j4J26j19J09j66K73j93J69j52J73j48j76J36N6l28
$$ 8 47 -279 92 -77 -7 171 -21 -35 91 -28 81 -85 188 -5 164 12 185 37 -139 -3 53 -275
5131b75M0L94l53K25L6J20j15j1J79k18k14J87p5k35L27j72K61j11k10L58l25
$$ -275 -235 159 -194 31 67 187 72 61 240 22 -192 -5 -80 -315 12 -160 101 -10 -220 138 -187
5152a87n7j6M07q6J09k99Jj2K69k01m7P1k32K28L89k74j90J44J46j68p1p8L00
$$ -187 -244 -260 147 61 170 -129 -128 -140 129 -72 -119 -48 -280 -52 337 63 -127 17 163 -5 -76 -154 146
5175A46L8j91N0M0j16j58J96j10L50l95J81K7n2K8q4K7N6K70k08J69k25j33Q8
$$ 146 184 -7 43 83 -33 -191 5 -105 245 -150 31 58 6 34 -50 -23 33 303 95 264 39 -94 -6
5198fj46Q7m09M21J76r5k9K94l21J60j21R1k28K22k62R3k2J7j0J71r3J09J16l11
$$ -6 -152 -65 -474 -53 123 28 -1 293 -28 132 11 102 -126 96 -166 -73 -95 -78 -88 83 -10 99 215 -96
5222i6K30k44K45j16J0K8P0k86M25m85L61j62l5J36l12N09k93J12m9j45J28j08
$$ -96 134 -110 135 19 29 57 127 -159 266 -219 142 -20 -55 81 -231 278 -15 97 48 -97 31 -77
5244g7n6M8O1L3o3rj5K44j53k53K25J86J43k33j62J90m0j34O6J72K0l8k68J59
$$ -77 -133 -85 -24 9 -54 -63 -78 166 13 -240 -15 171 314 81 -81 109 69 -65 1 173 193 155 -113 46
5268D6l51K45j33K81j13K97k59k88K47L11k01l0P9r6N9N4k69K69l38M80k59m5
$$ 46 -305 -60 -193 88 -25 272 13 -275 -28 283 82 52 131 35 94 148 -121 148 -190 290 31 -14
5290a4O3J7M6j87O1l3j52j58N27k43J3L1K43k01L1p2o2K14l7rK3j01M7j47M89
$$ -14 49 66 112 -75 -14 -47 -199 -357 170 -73 -60 -29 214 13 44 -28 -90 124 87 78 101 0 47 -100 389
5315C89n31M6K18J35l0m01L03j57o8m5K58j99l9k0j62J82J29k13L68j35j36K53
$$ 389 -142 -96 122 257 227 -174 129 -28 -96 -141 117 -82 -121 -141 -303 -121 8 -205 163 28 -108 145
5337A45j19K2K8l82N19k84L05q3k88J47O2j9L0J22p4m7k52K64j67R2nj42J53J41
$$ 145 26 48 76 -306 213 -71 234 151 -137 10 72 53 83 205 131 84 -168 96 -71 21 16 -126 27 168
5361A68k25J02m0J50j71k74J30N0P2j39K31k34J53p0K54k9j40n3Q1rj84o3K12
$$ 168 -57 45 5 155 -16 -290 -160 -110 -38 -177 54 -180 -27 -97 157 128 -12 -65 16 7 -177 -240 -28
5384b8k1J05j82P9L7J60O7l57K49J60j46K2O8k87M9K7j13K22j83P0j83J74K2j98
$$ -28 -49 56 -126 -47 -10 150 217 -140 109 269 123 145 213 -74 -25 2 -111 111 -72 -2 -185 -11 11 -187
5408a87J34J2j15K34j22n6J43j91p3J92j06O0M15k43L2l0j49N0j2L7o9k2oJ77
$$ -187 -53 -41 -156 78 -44 -100 43 -148 -221 -29 -135 -75 340 97 129 99 -50 0 -12 25 -44 -66 -72 105
5432A05o6L4j6k90J09J60L0P3k10l00M10j83J01l0q3O5J25K9P1m2L3r2k61K46
$$ 105 39 73 57 -233 -124 36 66 139 -71 -371 39 -144 -43 -73 -156 -91 34 63 134 92 125 33 -228 18
5456A8J15k00p6J14K55q8j91J64k59M15l30M47n73L6J51P1K62m46P5j00J82lJ68
$$ 18 133 -67 -143 -29 226 138 -53 111 -148 267 -63 384 -189 -153 -2 69 331 -115 -40 -140 42 39 207
5479B07m08J28p2L89k73K02l41M12k44%M32m80l8j48N71m04J59j60j31K02l6K21
$$ 207 -201 -73 -145 244 -29 173 -168 244 0 0 432 -48 -86 -234 337 -67 92 -68 -199 3 -33 188
5501A88p1N4j31j28J06k21L4L53k84L68j98Q7j89j33J19N1Q0l07K85l6j55R7K81
$$ 188 117 171 40 -88 18 -203 -169 184 -100 268 70 157 -32 -165 -46 5 85 -222 63 27 -128 -31 250
5524B50j92j58J91M6k28KK89j32j87QO6m3L42j48j39N7k27K20nj54K36r6j5R3
$$ 250 58 -100 91 137 -91 -89 200 68 -119 -111 -45 -88 254 106 -33 24 -203 17 12 -142 94 -2 -17 76
5548G6p7K4K1J28k94K93j4j25j24j45J24K74k11k7K26N0l10kJ75J48j61k97J96
$$ 76 -1 23 44 172 -122 171 157 32 -92 -237 -113 161 -50 -77 149 199 -111 -113 62 210 49 -248 -52
5571e2j29J16M27l58R9m07K59m5K97l71K80j82L7L24m19J62m9n2j01N4J11R4m90
$$ -52 -181 -65 362 4 103 -304 -45 -90 207 -164 116 -66 -29 295 -124 38 -11 -63 -164 -110 1 95 -395
5594c95L91k15M3Q1j25K69l5J78r2OK9r9q5P6K31m15rJ52L8j02J0J19M9j25n5
$$ -395 -4 -219 -176 -95 -220 49 14 192 100 106 135 36 -49 27 258 -157 -166 -14 24 -78 -68 51 100 -25 -80
5619h0r2M4J09J31j54o4k28L55o2o1K03L2m81L39j01L31j72J81l02K48r7k26K44
$$ -80 -172 -128 -19 112 -42 -106 -334 21 -41 -102 101 133 -348 -9 -110 221 49 230 -72 176 79 -147 97
5642I7j56o0J14L5p9J24M9k53J32j78J77L46l16R4j61J32J81k59J5n6q9P7K39
$$ 97 -59 -119 -5 30 -49 75 124 -129 3 -175 2 348 32 126 -35 97 278 19 34 -22 -111 -34 205
5665B05j34j34L91m37J63j09Q7L3%j35m8K27r3k5j92L75r4j34N7J69j20r3oJ71
$$ 205 71 -63 328 -109 54 -55 32 65 65 -70 -118 109 16 -9 -201 174 80 -54 3 172 52 -41 -47 124
5689A24J87k59j96L33r7L3K55l75R4j39L7m9J3jj74K46K6J42k45J52k92M36m34
$$ 124 311 52 -144 189 92 125 380 5 99 -40 -3 -52 -39 -40 -214 32 58 200 -45 107 -185 251 -183
5712a83R2K8k8K17N1j21K6j70N1J72k32R5q2K21M7L6k00r4J0k8L27k70P2Qj97
$$ -183 -91 -63 -91 126 177 56 82 -88 -37 135 -97 -2 -84 137 184 220 20 -74 -64 -92 235 -35 37 45 -152
5737a52J80m8j59J01l3K36l8k36j99L11L3Q8j66J64L9j74J08m7R6j19j83M9J03
$$ -152 28 -20 -179 -78 -111 125 87 -149 -348 -37 -4 84 -82 82 121 -53 55 8 104 -15 -198 -149 -46
5760d6J30k83K26k07L06Lk51L8L54k05K5n2j93Q3o0p8K08J40k28K09k55j42K94
$$ -46 84 -199 27 -180 126 129 -122 -84 270 65 90 38 -155 -72 -132 -210 -2 138 -90 119 -136 -278 16
5783A6p1JQ1j43J11PR5o7q6O2Q5j99J79L3j60J21n3j29L3M3Qj69L39j7j86J60
$$ 16 -55 -54 27 -116 -5 2 97 30 -56 6 91 -108 71 104 -56 65 12 -117 -84 -41 -33 -202 137 120 -66 94
5809I4J16k89K40j68Q0J03k09K33m7p9j05K46l35L11j80j64j5K61O1k36j68K30
$$ 94 210 -79 161 -7 73 176 -33 200 153 74 -31 215 -120 191 11 -153 -168 93 154 -82 -250 -20
5831b0j9Q8j30K2J38k8O8l1j40k81M27M9k06m4n1R3K72l23J07j79K03K39k89j63
$$ -20 -39 49 -81 -59 79 51 119 88 -52 -333 94 143 -63 -107 -158 -65 207 -116 -9 -188 15 254 -35 -198
5855a98J53J96j73m1J54J1k8p5l9j12Q2j32KJ33J0Q1j9j89L93j40k18L42k30j36
$$ -198 -45 151 -22 -63 91 102 74 -1 -40 -152 -70 -202 -200 -67 -57 24 5 -184 209 69 -149 193 -37 -173
5879a73OK96J02K1n89K58K40k37j06L23m1l65O6J91k43L70p4N9k02J53q1K99l32
$$ -173 -167 129 231 252 -337 -79 161 -76 -182 141 100 -265 -199 -8 -251 119 45 104 -98 55 -26 273 -59
5902e9j17P5q4K90m7j35j04P7j24K87m2j30K32j19k80M13r0K71l75K35o4k03p
$$ -59 -176 -101 -185 105 58 -77 -181 -104 -228 59 17 -113 119 0 -280 133 43 314 -61 174 110 -93 -100
5925a00m2l7K18J37m1Q3j76o6j7J27j37L53r2r1j45L9j96K55k8O2j2l64M8K97
$$ -100 -142 -179 39 176 135 218 42 -24 -41 86 -51 302 210 119 -26 13 -183 72 44 106 94 -270 -222 75
5949G5O5q2k39L15j30J58P2j89J57l89L60j92J11j35k00K12l6R4j13J85r7J4j04
$$ 75 140 58 -181 134 4 162 234 45 202 -187 173 -19 92 -43 -243 -31 -67 27 -86 99 2 16 -88
5972h8l6J20J1L2m0J71l32R4M4J98j00k5n9J49l39N8J10K98j98m2PJ77m30J8q6
$$ -88 -124 -4 7 39 -1 170 -162 -68 -24 174 74 49 -10 139 -200 -142 -32 266 68 26 33 210 -220 -202 -288
5997b88M06k92K48L2m3j18K77q7l20J51K78l4p6j80N2J38j40K5K15k72N0K48l38
$$ -288 118 -174 74 106 63 -55 222 135 -185 -34 244 210 134 -46 6 144 4 29 244 -28 22 270 -68
6020f8M11l85j05J79K81l97r1R2j75L80l0o5J94k01O1m6j61j19K05P6L8n2lJ05
$$ -68 343 -42 -147 32 313 -84 -175 -83 -258 122 92 27 221 20 81 35 -126 -245 -40 36 74 22 19 124
6044A24k02j00N9J88M6j83m9P1J15l6q9Q4k12L12k68l4J20L80l00q6qRJ1J20J8
$$ 124 -78 -178 -119 69 115 -68 -117 -46 69 33 -56 28 -184 128 -140 -174 -54 326 26 -60 -68 -59 -48 72 90
6069I0K7K02k31J29m33K50n8J65l29L42l8l8r1j35J58K18R8m97R6j36K49o5r0
$$ 90 117 319 88 217 -216 34 -24 141 -188 154 116 78 -13 -148 10 228 326 -171 -75 -211 38 -27 -117
6092a17J21j53O6K01j19j53J90N3lj48J36j27N1R8j76J81m2O1j91L12k21k72J77
$$ -117 4 -149 -83 118 -1 -154 36 89 86 -62 74 -53 -2 96 -80 101 59 120 -71 241 20 -252 -75
6115g5p3J12j1%M9J22j43J99l38J68P9j21J81k21J85l3j09R1m37K48J48o0P1K
$$ -75 -148 -36 -47 -47 2 124 -19 180 -158 10 89 -32 149 -72 113 80 -29 62 -375 -127 21 -39 32 34
6139C4J04N0k61k2J52m2J90k35j46J68JJJ80k9j56R7k48J03J37k42K39j10J24
$$ 34 138 188 -73 -95 57 15 205 -30 -176 -8 -7 -6 174 145 -11 86 -162 -59 78 -164 75 -35 89
6162H9k23K42J2j37k0o6L67l20L5j9j05Q5M7m6q9O2K39k80L04k60j67K56j96J02
$$ 89 -134 108 120 -17 -37 -103 264 -56 -21 -40 -145 -60 -13 -59 -148 -86 153 -127 177 -83 -250 6 -190 -88
6186h8J27M0j92L61l28K87P9j93J90l21j09K30j65l1J2o5J98j4k26K42rq1r5K92
$$ -88 39 79 -113 248 -80 207 286 93 283 -38 -147 83 -82 -113 -101 -166 32 18 -208 34 25 -56 -151 141
6210A41j83J11k05J94l5k11K55l3j39J80q7k39l5J87J93ok19J48J56k84j14K64
$$ 141 -42 69 -136 58 23 -188 67 34 -105 75 -12 -251 -286 -99 94 88 -131 17 173 -111 -225 39
6232C9%k30K77k43K42Mj0J41j52j78r0k2QL19l0m11J16N7K08m6j3j95L72j79j25
$$ 39 39 -191 86 -157 85 89 79 220 68 -110 -200 -222 -214 105 75 -336 -220 -163 45 -1 -14 -209 163 -16 -141
6257a41L56m08R2j58M17j67O6k41J54M8K37j67m8l6J18p9J6J5Q4j71q5q5J02J19
$$ -141 215 -193 -101 -259 158 -9 57 -184 -30 18 255 88 40 4 122 43 59 74 158 -13 -98 -183 -81 38
6281C8J69l47K8J98j33Q3m8J0P8k94J93J01K4j24K49j99l50L37K27j29k0l05L11
$$ 38 207 -140 -112 86 -47 36 -12 -2 76 -218 -25 76 100 -24 225 26 -324 13 240 111 91 -214 97
6304I7p0k96L27k16K02Kp8j85J85l7K16j98q8K77l01O0R8K4m32N59j1j56J97m41
$$ 97 27 -269 58 -158 44 46 -32 -217 -32 -69 147 -51 -139 138 -163 -103 -5 19 -413 146 135 -21 176 -265
6328b65L78l51L72K3k00O7k9J07p7R0m6j81J40J0l4j61K35m3k21K20k86L29Mr1
$$ -265 113 -238 134 157 -43 24 -5 102 25 115 69 -112 28 38 4 -157 78 35 -186 34 -252 77 81 -10
6352a0J67k49j47J23J68j54q0J61J65m38N5L44O2j17k77M41j42qr7J97l55J23
$$ -10 157 -92 -239 -116 52 -102 -182 -21 144 -294 -239 105 167 50 -227 214 72 64 -33 164 -191 -68
6374f8P0k7k79O01l43K29j79P2j83Q5l6M12m18K01K7j02j03K03l9o10M17O2j35
$$ -68 2 -25 -304 297 -46 183 4 76 -107 -22 -58 354 -64 137 164 62 -41 162 123 -487 -70 -8 -143
6397a43K35k58L75n4j32J49l36K13r5j5K89k18Q0j92J15m6r4J99K9j72r6K67q7
$$ -143 92 -166 209 155 23 172 -164 49 -46 -61 228 10 90 -102 13 -33 -127 72 101 -71 -167 100 13
6420A3l3P8j36J74K5m11K97mp3l7k4J75N3M1j47L9J10l8j89J65o1O9Q6l02q4J02
$$ 13 -20 58 -78 96 121 -290 7 3 -70 -107 -131 44 97 138 -9 30 140 102 -87 78 17 86 172 -130 -214 -112
6446a12J07j60MK36k66K53l84J8J45K57k53JM7j20J84k21J81L45l14J95j00q6
$$ -112 -5 -165 -161 75 -191 62 -322 -304 -159 98 -155 -154 -107 -227 -43 -264 -83 262 -52 143 43 -43
6468d3K1l17K48L01l49K28l25L96q1k45Q4R9j59K14q7k9L45k97j5K0R2l0Mo9j1
$$ -43 -22 -339 -91 210 -139 89 -236 160 79 -166 -82 17 -142 72 -15 -44 301 4 -11 9 101 71 75 6 -5
6493eM3n9K12N0k29J11L6n6j75J66j59J40r9N9J60j49l5J53l2l45K87j50L9j63
$$ -5 38 -21 191 241 12 123 159 103 -72 94 -65 75 -24 35 195 46 11 164 132 -213 74 -76 -37 -200
6517b00J51K76j04k96K70l76J81N2J82j96K18k29J18K8q6j41k47J99R4K20m08
$$ -200 -49 227 123 -173 97 -279 -98 -46 136 -60 158 -71 47 75 -11 -152 -399 -200 -106 114 -294
6538b94M93l10K94j56N6L5j1j53nN0l9P4K94l06l13Q0J44Q2J86l33L75k31j48
$$ -294 199 -111 183 27 83 118 107 -46 -51 -1 -40 34 328 22 -291 -211 -67 15 201 -132 243 12 -136
6561a36J02N2j08L8J91j37K31m62L08j41j1j57K33k92K73k1j90M50k35k26M17
$$ -136 -34 18 -90 -52 139 2 233 -229 79 -62 -73 -230 3 -289 -16 -37 -227 223 -12 -238 179
6582A79k57Q8j82k0J08J65n4k06M1J64l06J64j21J74l8R3O1l6n1K40J9l92J48
$$ 179 -78 10 -172 -192 -84 81 27 -179 -138 26 -280 -116 -237 -63 -101 -8 53 17 -34 206 225 -167 -19
6605a9j05o6K54k18J85K42k66J18qk70J06J14j5k85m1J72K04k81rK20r4L61l04
$$ -19 -124 -190 64 -154 31 273 7 125 117 -153 -47 67 52 -233 -274 -102 102 -179 -188 32 -62 299 -5
6628eQ0k98L20M3m1j73N4N0l42J85J48k2j44K37l11J07J10K1m6K00j97K74k55
$$ -5 75 -223 97 140 99 -74 -20 30 -312 -127 21 -1 -145 92 -219 -112 -2 19 -27 173 -24 250 -5
6651eK5J19j90L8o7K87l77J66r4K26r0r7M3K3j00j90L62n70O85j20O0k29j21L82
$$ -5 20 139 -51 -13 -80 207 -170 -4 -98 128 38 -59 -16 7 -93 -283 79 -491 194 74 134 -95 -216 166
6675A66l23M08k39L4J66l19J63J20k58K67n91L21M2K49j73o0J40k26K35m41J74
$$ 166 -157 251 12 46 212 -107 56 176 -82 185 -406 -85 -43 206 33 -27 113 -113 122 -319 -145
6696a45L8L8R2m2N1n8q7K12k28L5K5K45p6j06p9p2J34j43K59N1k11m4J18j03N
$$ -145 -107 -69 23 -19 32 -26 -113 99 -129 -94 -69 176 100 -6 -85 -157 -23 -166 93 144 -67 -111 7 -96 -91
6721i1L5jJ11K08j59n5j89r9K22Q2R9k03LJ62j70K61k30l20L73J62l03M3l0J36
$$ -91 -56 -57 54 262 103 48 -141 -240 -18 64 163 -40 -37 125 -45 216 -14 -334 39 201 -102 -59 -89 47
6745D7r7k3J30Q3l03Q7k7J01j37J79q4n4K72k64j31K72j35J41J60r5n9n7q5J8
$$ 47 -50 -73 57 140 -163 -76 -103 -2 -139 40 -44 -98 174 -90 -221 51 -84 57 217 122 63 6 -79 -61
6769f1P9K07k72Q4P3j91J87Jl12M03j96J02p7p8K41j01j91Q7J26j68l77M60N3
$$ -61 18 225 -47 37 110 -81 106 107 -205 198 2 104 27 -51 190 89 -102 -15 111 -57 -434 26 79
6792G9j80p1N1L09j56k54K01J03q1O5l2j61J01J11k33L97m30J69L3J74j87l3j4
$$ 79 -101 -172 -121 188 32 -222 -21 82 1 66 34 -127 -26 85 -148 249 -181 -12 21 195 8 -25 -39
6815c9K3J76k96J29j23j32K08q6j5R2K17k6l1j19m6J92k28K17j22q1M5K41k85
$$ -39 -16 160 -136 -7 -130 -262 -54 -140 -155 -63 154 128 97 -22 -68 124 -104 113 -9 -90 -45 196 -89
6838h9J66j77q6j12K48L12k19P9j34J22n6J24j79q5l4L28k80M9L05k50n3k3J53
$$ -89 77 -100 -186 -298 -50 262 43 122 -12 110 54 178 -1 -86 -120 208 -72 -23 282 32 -21 -44 109
6861A09k08j45R2K99J24k30k1j79O6J2q8L20k37K8O1r3r2M24l34k25K23k1K19
$$ 109 -99 -244 -152 147 271 41 20 -159 -93 -81 -169 151 -86 -58 3 -90 -182 242 -92 -317 -94 -115 104
6884A04J8j52L9p1R2J47l95M2K74l20J4L15q3J51k82J67o8K59J64k94J48k13Q0
$$ 104 122 -30 9 -62 30 177 -218 -176 98 -222 -208 107 24 175 -107 60 -8 251 415 121 269 56 136
6907A36j4j60K93k29k24J64j1K0K2n1j01k1K75j01N7k64J66O4j66K7q3L34j95
$$ 136 122 -38 255 26 -198 -34 -45 -25 -3 -54 -155 -176 99 -2 55 -209 -43 21 -145 -118 -201 133 -62
6930f2J52j98L02r9L7j84K9O7j22J54j35R0j54L88m51L26j24j32j03L32l2l27
$$ -62 90 -108 194 95 132 -52 -23 44 -78 76 -59 31 -123 265 -186 140 16 -116 -219 113 81 -246
6952b46K41j53J37K25m70J75J72M4J8j05o6O8m0N5m6j58J25j80L27l6k6l25L87
$$ -246 -5 -158 -21 204 -266 -91 81 125 143 38 -28 40 0 55 9 -149 -24 -204 123 87 61 -264 123
6975A23l09J62J73p1l00K19J05j7P2j68k18J15J27j35J94k99K16N5j46J7J40N
$$ 123 -186 -24 149 78 -222 -3 102 85 157 -11 -229 -114 13 -122 72 -227 -11 44 -102 -85 55 60
6997F0j66L21k55j87N0J94k07n5J85K4K10j61R5j42Q4o1Q8n6k10J44o4j52K46
$$ 60 -106 215 -40 -227 -177 17 -190 -245 -60 -36 174 13 108 -34 50 -11 77 21 -189 -45 -109 -261 -15
7020a5j02l8J22P4P5Q5k59q0J50n8K52j98L06m27M8l2J3K04M9k16k08J94O0l6
$$ -15 -117 -155 -33 41 116 201 -58 -138 12 -46 206 8 314 -113 -65 -97 -84 120 169 -47 -255 -61 -1 -37
7044c7O9o5q3L85l87J98J53k71O8k30J19R5n5J0k37J66P3j53M30J3j70j83R1J06
$$ -37 32 -33 -116 269 -118 80 233 -38 30 -200 -81 14 -41 -31 -268 -102 -29 -182 248 261 91 -92 -1 105
7068A05j79J61j67N4K23l38L78j78k27r7K96j27r9K73j57K0Rn2Q1N5P8l35N4N9
$$ 105 -74 87 -80 -26 197 -141 237 59 -168 -265 31 -96 -195 78 -79 -59 -50 -102 -21 34 112 -223 -169 -110
7092a10k51N58r1j47k2J13o4k01L40j47k13M4L31l24J39j29K83k58J99k00J94
$$ -110 -361 197 106 -41 -63 50 -14 -215 125 -22 -235 -191 140 -184 -45 -174 109 -149 50 -150 44
7113D4R3q2m4l9P7q2L16l28o5R7j65K90j55k90Q7L79m0j47n2n3L3N0K31P2j74
$$ 44 137 55 11 -28 49 -33 283 -45 -110 -13 -178 112 -43 -333 -246 133 93 -54 -106 -159 -126 -76 155 227 53
7138E3k07J98O0l4J20j71j38M03j46Jo0K1n1J86j69n5J57m31J75k06J02J98o0
$$ 53 -154 44 104 70 190 19 -119 284 138 139 79 100 49 235 66 11 168 -263 -88 -294 -192 6 -54
7161e4J32j06J13k31J53L9J88q0K2m2j08J14q9k97K48J46n37L35q6K09N2k7k65
$$ -54 78 -28 85 -146 7 46 234 154 176 134 26 140 51 -246 2 148 -389 -54 -140 69 121 94 -171
7184a71KJ59J1j00l5J91j78n3M06m77L99L1m37L50j12N8p7k13%J54mJ9j20K14
$$ -171 -169 -10 1 -99 -134 57 -121 -174 232 -245 154 185 -252 98 -14 44 -33 -246 -246 -92 -96 -77 -197 17
7208A7j90J66J8K0J82j47k32J17j40J25j21K01J46j93m6J71j07K11j87R3J74j13
$$ 17 -173 -7 11 31 213 66 -166 -49 -189 -64 -185 16 162 -31 -77 94 -13 198 11 104 278 165
7230A65nj52J46l69J08J16p3j04K38O3j11j4M0j6j14M6o3n8J22K0J17r5J48j7
$$ 165 160 8 154 -215 -107 9 -64 -168 70 133 22 8 48 32 -82 -36 -99 -157 -35 -15 102 7 155 138
7254A38P1n35J75M43l83K8J44J28k66m3QL51l28J54K66l56%r1j33K56rq8J34n0
$$ 138 209 -326 -151 292 -91 -63 81 209 -57 -100 -92 259 -69 85 351 -5 -5 -96 -229 27 18 -70 64 14
7278A4j61Q9K20r6n98P86k11j57NJ3J27l9k21p5MK99L2M5L7k2N2l11K30j36K18
$$ 14 -147 -58 162 66 -532 254 43 -114 -109 -96 31 -8 -229 -304 -300 -1 31 76 113 91 143 -168 62 -74 144
7303A44q6k66J35oJ26l3j33K11j08L5n7O4K70l22K18l22J73j37l6K81l44J19r6
$$ 144 58 -208 -73 -79 47 14 -119 92 -16 19 -38 26 296 -26 192 -130 43 -94 -130 151 -193 -74 -170
7326a70J5L36m13J81j95L90j26N7k07L58n67K96r7L54l25N4k5K79j1l23O3L2K35
$$ -170 -155 181 -232 -51 -246 144 18 75 -132 226 -341 -45 -142 212 -113 -59 -84 195 184 -139 -76 -44 191
7349A91J00k75J08m9J23k41m2m7l9K41P5p1K06l3k07K3j84L45j63j9l0L8j38K26
$$ 191 291 16 124 75 198 -43 -85 -132 -171 70 145 74 280 247 40 63 -121 224 61 42 12 50 -88 138
7373A38l19N4J58j28Q0P0l7J44m77L50k0J17m0k86m8J59J56j34j28J38J62q6O6
$$ 138 -181 -127 31 -97 -17 53 16 160 -317 33 13 130 90 -196 -244 -85 71 -63 -191 -53 109 23 89
7396H9k9J3k48Jp2M41j52l39L09j35K65j65J27Jj51p6K89j41N2J61j36k55j95
$$ 89 60 73 -175 -174 -246 195 43 -296 13 -122 143 -22 105 106 -45 -121 168 27 79 240 104 -151 -346
7419c46L78J7N5j67J81p5N9N1m20L48R4Qj67k40J58J80j79j88P7K37N2j12J02
$$ -346 32 49 104 -63 118 43 102 153 -267 81 175 183 16 -224 -66 114 -65 -253 -176 61 113 1 103
7442A03j88J86MJ31j16R1k57j49L5N1J42J54l39L84n14L50pJ04k77o3K37P9q1
$$ 103 -85 101 105 236 120 211 -46 -195 -160 -109 33 187 -152 232 -282 68 61 165 -112 -175 62 141 60
7465F0o8q7j3J73r6K1J56o7k21J1P4j65K30J29o9j93J08K02m91K85K9m5M7m8j70
$$ 60 -8 -95 -108 65 -31 -10 146 79 -142 -131 -57 -222 8 137 68 -125 -17 185 -306 -21 8 -37 10 -38 -208
7490b08K37j03j8J02j10K25Q3R0n88N04j86j59oJ84p1l2P8j37P2j29J52k6J23
$$ -208 29 -74 -92 10 -100 125 208 298 -290 214 28 -131 -137 47 -24 -56 22 -115 -43 -172 -20 -46 77
7513G7j97K63k16j8J07J95j73l62K82J53j4j66q4K69k4k8k43K17K94m42L2J21
$$ 77 -120 143 -73 -91 16 211 38 -324 -42 111 97 -69 -153 116 92 64 -179 38 332 -110 -78 43
7535D3r8J61j16K42l86R5K14j51j3o2P8q0M8j8J10r7R9l90K52O8K2J09j56K71
$$ 43 -55 106 -10 232 -154 -59 155 4 -9 -71 7 -73 -25 -43 67 -30 69 -321 -69 -1 21 130 -26 245
7559B45k3o9j78J15k17J65O8N4l82J18P9j73K07o3L15m22K54O4k11J99k80R4p6
$$ 245 222 153 -25 90 -127 38 106 160 -222 -104 -25 -198 9 -54 261 -161 93 157 -54 145 -135 -41 -117
7582a17m1L2L26j67l5j99J88m0K06K5l21K7K9P9N1J36J39j16l49K39m2o5j7r8
$$ -117 -158 -126 200 33 -2 -201 -13 -53 153 178 -143 -116 -87 -8 43 179 318 202 -147 92 50 -15 -32 -130
7606a30J60J10p5N7J56j58j34j43j50J80J16lk7J35p5k40r3O20k33r9j08Q6P0
$$ -130 30 140 65 122 278 120 -14 -157 -307 -127 -11 -14 -41 94 19 -221 -314 306 73 -26 -134 -48 22
7629B2l9j36ok0L03J51k46k39p0J10k3J63K2J49O5k57J33M7j94J63j20j36j26
$$ 22 -17 -153 -159 -179 124 275 29 -210 -280 -170 -193 -30 -8 141 206 -51 82 129 -65 98 -22 -158 -284
7652b84L27k35K74m5j4J11j29k4j62J86L3j49L09m12q1M33j23J32l10N5j45J97
$$ -284 43 -192 82 37 23 134 5 -19 -181 5 38 -111 198 -214 -295 138 15 147 -163 -108 -253 -56
7674e6j25P7l3Q5PJ98k34L3J58j07K07l28L13n34J85J14J66j4N9j07n5m1K51l30
$$ -56 -181 -104 -137 -52 -45 153 -81 -48 110 3 210 -118 195 -339 -154 -40 126 112 171 64 9 -32 219 -111
7698a11K66j41M5J58k1j11J0j60N06j58k83k52K25L58j58j15j37J70pM2l73M86
$$ -111 155 14 59 217 196 85 95 -65 441 283 0 -252 -27 331 173 58 -79 91 84 126 -247 239
7720B39k79J5K2M1n2q2o7J74K41j31j18K67k32N0j92j81L44R1k03K37M2m9k19
$$ 239 -40 -25 -3 38 -14 -96 -163 11 252 121 3 270 38 88 -104 -285 59 150 -53 184 226 177 -42
7743d2J00k74K22n1R4k4l5j6J89k28J31J66j67k83L4K15j64K09k12J76j6Q9J3
$$ -42 58 -216 6 -45 49 25 -10 -26 163 -65 66 232 65 -218 -184 31 -133 76 -136 40 24 113 126
7766A26l11J96o5M0j1k30J91J57K09k98M58m66N5j02k92L90M6M3M9j66j57l0M4
$$ 126 -185 11 -54 -14 -25 -255 -64 93 302 4 462 -4 51 -51 -343 47 93 136 185 19 -138 -168 -124
7789a24L04K0k65k52K27r0K27o3j3O4L04k21q1k29J79k2l7l5P0N0K5k03O7p7J3
$$ -124 180 200 -65 -317 -90 -180 47 -16 -29 35 339 118 37 -192 -13 -35 -72 -107 -37 13 38 -165 -98 -175 -162
7814a62K62J49M0l26J14M4j77j1J36k5mj31J40n8O8j68P4p6pK55j41nR2k28j05
$$ -162 100 249 289 -37 77 121 -56 -67 69 44 40 -91 49 -9 59 -109 -35 -111 -118 137 -4 -9 83 -145 -250
7839b50J72j15N27k91k11L81l83L29m15J97L38k43J12j08n0j60J36L29l42K63
$$ -250 -78 -193 334 43 -168 213 -170 159 -256 -59 279 36 148 40 -10 -170 -34 295 -47 216
7859B16k67J23k04m4J04J15K1m1p1K1mN0Q1k15K03p7M04m09j07L86k01r5n6K5
$$ 216 -51 72 -132 -176 -72 43 64 23 -48 -27 -31 19 100 -115 88 11 415 6 -101 285 84 -11 -67 -42
7883d2K9j57L24j77k7n1m4M8n1N7j51K34j78L21l03K47l07K23N6j05k2J35k07
$$ -42 -13 -170 154 -23 -50 -101 -145 -97 -148 -91 -242 -8 -186 135 -168 79 -228 -5 51 -54 -76 59 -148
7906a48K47l7J00o9J47k37k2J73j47j77j01Q1J91J09l83J80J45L67o27q2K29K07
$$ -148 99 62 162 93 240 3 -19 154 7 -170 -271 -190 1 110 -273 -93 52 419 -208 -290 -61 146
7928A46l05k5N6O6l2k2L37l21J83l44q0J71K27k10J67j76j06K69J8PJ6Kn4J65
$$ 146 -159 -184 -128 -62 -94 -116 221 -100 83 -261 -341 -170 57 -153 14 -162 -268 1 19 26 42 44 -10 155
7952A55P0l8j71n0n1K0Q1K0N2J7j64OJ14Q8q9j4R4j2m0mn0M5J2j35j20K47j27
$$ 155 225 187 16 -34 -85 -65 16 36 88 105 -59 -53 61 149 60 46 140 128 88 84 34 79 91 -44 -164 83 -44
7979d4q8J76k1p9j56J67l1L45j20nk56J92j44J80R4k25J9k21J57p3JJ32k9R9n4
$$ -44 -132 44 23 -56 -212 -45 -76 269 149 144 -112 80 -64 116 210 -15 4 -217 -60 -133 -132 0 -29 70 16
8004A6N8j51j0pJ19nO1l56L07k19J64J87m08L77l11J45k46M32m97M12q5k31L2
$$ 16 74 -77 -87 -94 25 20 81 -275 32 -187 -23 164 -244 133 -178 -33 -279 153 -344 68 -17 -248 -216
8027b16L34Mk99p1R0L5p3K96Q0L3k33j0n4L7N7jN0p6J7m5N3K33q4k34J32j82K34
$$ -216 118 122 -177 -248 -158 -123 -196 100 180 213 -20 -30 -84 -47 10 9 59 -17 0 -45 8 241 157 -77 55 -127 107
8054A07j23M6k21J75P0o4j25L02Q1j59k4k15j3l5O0K26j89K7J71j72K27j41Q2
$$ 107 -16 30 -191 -16 54 -10 -135 167 248 89 65 -150 -163 -198 -138 88 -101 -74 97 -75 152 11 93
8077I3j37J44J7K15k99p1Q2L03m04K85j42j73j23J40K55j54K1J45l67J62k31K23
$$ 93 -44 100 117 332 33 -38 44 347 -57 228 86 -87 -210 -70 185 31 52 197 -170 -8 -239 -16
8099a6j21J9K2j44O25l11j96K0J50J00m04N5J74j80L72k27j47N10k52O0j17p2
$$ -16 -137 -118 -96 -240 385 74 -122 -102 48 148 -256 -201 -27 -207 165 -62 -209 301 49 109 -8 -80
8121h0K0J87j05q9j11L18k40L34r7q0j34Nj0n0l4J65o6J77o1j97M42k98Q8l73
$$ -80 -60 127 22 -67 -178 140 -100 234 137 57 -77 -72 -82 -132 -166 -1 -67 110 49 -148 294 -4 84 -289
8145b89K28m8K06p6k1N9j42p9L71k3j77m3J74j5k59j8j31P5Q7K26R7l48N46m50
$$ -289 -61 -109 97 21 0 59 -83 -162 209 186 9 -34 140 125 -134 -152 -283 -208 -121 105 202 -146 400 -50
8169e0j9l4l4J41j57J69j0N3l39K36J45j47J96j23j11K50j28L6O5m03K69l02
$$ -50 -69 -103 -137 4 -153 16 6 59 -280 -44 101 -46 150 27 -84 166 38 74 139 -264 5 -297
8191b97
$$ Imaginary data points
##PAGE= N=2
##DATA TABLE= (X++(I..I)), XYDATA
0@%%%%%%%%%%%%Pj4J4j4K1k8K9l6M9n6O3p7R1j05J21j42J65j88K16k49K82l18
$$ 0 0 0 0 0 0 0 0 0 0 0 0 0 7 -7 7 -7 14 -14 15 -21 28 -28 35 -42 49 -56 65 -77 88 -100 116 -133 149 -169
34a69L60m07M59n14N74o42P15p94Q82r78J082j196J321j456J605j769J951k150
$$ -169 191 -216 243 -271 303 -339 376 -418 464 -514 568 -628 693 -763 842 -927 1024 -1126
52a126K369k614K886l192L539l938M397m934N576o356P329q583J0265j2657J6366
$$ -1126 1243 -1371 1515 -1677 1862 -2076 2321 -2613 2963 -3393 3936 -4647 5618 -7039 9327
67I327k2943L8177j43685o8207J56116j8067k8785n747O5687J6949p062j5150
$$ 9327 -13616 24561 -119124 -187331 -31215 -49282 -78067 -83814 -18127 -1178 -8240 -23390
79b3390O446j7371j5367m602J7188o124n779Q986K0161k196j0466m32J2631q859
$$ -23390 -16944 -34315 -49682 -54284 -37096 -43220 -48999 -40013 -19852 -22048 -32514 -32946 -20315 -29174
93b9174j3266p08J2258k788j3201J416J4709j733r654L546J7629O572p729L585
$$ -29174 -42440 -43148 -30890 -33678 -46879 -45463 -30754 -32487 -42141 -38595 -20966 -14394 -22123 -18538
107a8538J4644o20j5069r049O180k039j4897n42J7093J2465P79N748K0060J0418
$$ -18538 -3894 -4514 -19583 -28632 -22452 -24491 -39388 -39930 -22837 -10372 -9593 -3845 16215 26633
121B6633q503o197N533O10j4863j2179N446K464j3015j0643K327K845j2044j0858
$$ 26633 18130 11933 17466 18076 3213 -8966 -3520 -1056 -14071 -24714 -22387 -19542 -31586 -42444
135d2444Q234J0903L11P24J4305J6989j290q138L262K158j0675j4454M58R851
$$ -42444 -34210 -23307 -22996 -22272 -7967 9022 7732 -406 2856 5014 -5661 -20115 -19657 -9806
149i806n24k331J0096J3601O62j0926m274J703j1412j6851m561P560K628l723
$$ -9806 -10330 -12661 -2565 11036 11698 772 -3502 -1799 -13211 -30062 -34623 -27063 -24435 -28158
163b8158P894J6865N801n284o71O040k922j4471n688M328q36q244l094R644M783
$$ -28158 -20264 -3399 2402 -2882 -3553 2487 -435 -14906 -20594 -16266 -17102 -25346 -28440 -18796 -14013
178a4013n488N4J1137Q028k184l43J0958N826p252n785J658K78j0780r129M344
$$ -14013 -19501 -19447 -8310 -282 -2466 -2809 8149 13975 6723 938 2596 2874 -7906 -17035 -12691
193a2691N147l014k292O849Q091n096p774J823J993o002o742M396R966J640r55
$$ -12691 -7544 -10558 -12850 -6001 2090 -3006 -10780 -8957 -6964 -12966 -19708 -15312 -5346 -3706 -4661
208d661P579Q223j375q275q54L584n578p741N49P231J078n660J540O539j938q329
$$ -4661 2918 11141 9766 1491 637 4221 -1357 -9098 -8549 -1318 -240 -5900 -4360 2179 241 -8088
224h088j902N407N59m834K591R142L638l843j962L767j356j0011m895K783J673
$$ -8088 -9990 -4583 -4024 -8858 -6267 2875 6513 2670 708 4475 3119 -6892 -11787 -9004 -7331
239g331l665q17Q548N171l310j882L548J772n277m508M562M354k081j459M624
$$ -7331 -10996 -11813 -3265 1906 -1404 -3286 262 2034 -3243 -7751 -3189 1165 -916 -2375 2249
254B249M798m504n417J614J170l996m409L008O016q62k607L147M178k870n924
$$ 2249 7047 2543 -2874 -1260 -90 -4086 -8495 -5487 529 -333 -2940 207 4385 1515 -4409
269d409k1L721k114k715L265O161J246l505O36L627k982o384j546L369J53l546
$$ -4409 -4430 -709 -2823 -5538 -2273 3888 5134 1629 2265 5892 2910 -3474 -5020 -1651 -1498 -5044
285e044J809N597J133l095j351L099m57n254j371L983J978k013m40M402J324m533
$$ -5044 -3235 2362 3495 400 -951 2148 1691 -3563 -4934 -951 1027 -986 -1426 2976 4300 -233
301b33k340J427P22l140j459M213K982j398j092J973J439m196m024J512Q59j510
$$ -233 -2573 -1146 -424 -3564 -5023 -810 2172 774 -318 1655 3094 -1102 -5126 -3614 -2755 -4265
317d265q34L650N523r34j621J405J097k898m580N9L015p17j003L367M109N88l120
$$ -4265 -5099 -1449 4074 3140 1519 2924 4021 1123 -3457 -3398 -383 -1100 -2103 1264 5373 5961 2841
334B841O0J298k943m390l61L032J342j272K487M518J268k113p10J585o87l919
$$ 2841 2901 4199 1256 -3134 -3495 -463 879 -393 2094 6612 7880 5767 5057 6642 5955 2036
350B036o36K308N19j516m83K911L69l569j638R22P81k523m12L584J871o06k61
$$ 2036 1400 3708 4227 2711 2228 5139 5508 1939 301 1223 2004 -519 -931 2653 4524 3918 3657
367C657J826J602k689k041J378N45j763j189J378J539k066k356R55K08j546j942
$$ 3657 5483 7085 4396 2355 3733 4278 2515 1326 2704 4243 2177 -179 776 984 -562 -2504
383b504J245K523m94o84J205J725j392k830k89Q58j496j281J347K837M30j675
$$ -2504 -1259 1264 770 86 1291 3016 1624 -1206 -1495 -637 -2133 -3414 -2067 770 1200 -475
399d75N09O21k105l149j844P48L41q84L426M129L190J262J391K221q57l721k790
$$ -475 34 655 -1450 -4599 -6443 -5695 -5354 -6238 -2812 1317 4507 5769 7160 9381 8524 4803 2013
416B013j549j822k533p70K244J437J13O61K052J322j319j144J577K15o93m67J757
$$ 2013 464 -1358 -3891 -4661 -2417 -980 -867 -206 1846 3168 1849 705 2282 2497 1804 1337 3094
433C094J375l11jJ755J446j79m73J140J496j479j296m5k06k028k017J76J116J00
$$ 3094 4469 4158 4157 5912 7358 7179 6706 7846 9342 7863 6567 6522 6316 4288 2271 2447 3563 3663
451C663J78J829K361J072m00L28m8j904k516j911o52j584j855M33J187J71J42
$$ 3663 3841 5670 8031 9103 8703 9031 8983 7079 4563 2652 2000 416 -1439 -1006 181 352 494
468D94Q73J718K86N9J086J123Q91m14N3N01p89k230j471j435j059j639q74O67
$$ 494 1367 3085 3371 3430 4516 5639 6530 6116 6169 6670 5881 3651 2180 745 -314 -1953 -2827 -2160
486b160N09m0M7J86Mj745j649o12q35m63j36J725K446J474J287J900P84k75j396
$$ -2160 -1651 -1691 -1644 -1458 -1454 -3199 -4848 -5460 -6295 -6758 -6894 -5169 -2723 -1249 38 1938 2722 2447 1051
505A051j092j600k276j245j070M32R7M42J811J416J174R48M31J199l22j712q67
$$ 1051 -41 -1641 -3917 -5162 -6232 -5800 -5703 -5261 -3450 -2034 -860 88 519 1718 1396 -316 -1183
522a183r23j877j815j043k29j92K98J083J732J338J358N34R87K95j206j00m34
$$ -1183 -2106 -3983 -5798 -6841 -7070 -7262 -6964 -5881 -4149 -2811 -1453 -919 68 363 -843 -943 -1377
539a377j17k73LJ737J043O47M65L85q4j420j312j379j188j599j086m80J85M4N12
$$ -1377 -1494 -1767 -1764 -27 1016 1663 2128 2513 2429 1009 -303 -1682 -2870 -4469 -5555 -6035 -5850 -5806 -5294
558e294J173Q03J129Q40Q27P99J7J27L4l88j086r11j027l97p26N6P76P81R38P47
$$ -5294 -4121 -3318 -2189 -1349 -522 277 294 421 455 67 -1019 -1930 -2957 -3354 -4080 -4024 -3248 -2467 -1529 -782
578g82J058N69L91o69o48m52j206q82n93l79J76j2J88R71R8j15J28K0l33j81l73
$$ -782 276 845 1236 567 -81 -533 -1739 -2621 -3214 -3593 -3417 -3429 -3241 -2270 -2172 -2287 -2159 -2139 -2472 -2653 -3026
599c026R5M42J37L66J050R01M76R39N86L88o2l06m11p83j109j006m43r50n16n1
$$ -3026 -2931 -2489 -2352 -1986 -936 -35 441 1380 1966 2354 2292 1986 1575 792 -317 -1323 -1766 -2716 -3232 -3283
619c283K31Q24L92J181Q96K17M15M8l76l92k51n56m50k21lj3M61M98L3N34l31
$$ -3283 -3052 -2228 -1836 -655 241 458 873 921 545 153 -98 -654 -1104 -1325 -1328 -1341 -880 -382 -349 185 -146
640a46K23l4j74j16l25J61J57n45K44O9j35M13m65K71k09j08J44m93o52j47k93
$$ -146 77 43 -131 -247 -572 -411 -254 -799 -555 -486 -621 -208 -673 -402 -611 -719 -575 -1068 -1720 -1867 -2160
661b160K12n19K87j07Q97pN82O09P32J32m1k11j95j57n26j4m80N7p6l2l20N77
$$ -2160 -1948 -2467 -2180 -2287 -1390 -1397 -815 -206 526 658 617 406 211 54 -472 -486 -966 -909 -985 -1017 -1337 -760
683g60N4L07j20K77J05K29l49J52p7K28rn0lMj37N5k22J12K12J53r4j51J75l20
$$ -760 -706 -399 -519 -242 -137 92 -257 -105 -182 46 37 -13 -16 -12 -149 -94 -316 -204 8 161 67 -84 91 -229
707b29M2L7J24P2k41j04N83k49K30J92j0M4k11l06k75j2l34Q6l69R1rK36K20R0
$$ -229 -187 -150 -26 46 -195 -299 284 35 265 457 447 491 280 -26 -301 -313 -647 -561 -930 -839 -848 -612 -392 -302
731c02j88J32K10l7m13r0k4P5K79j10K91l48j61j9J46q5J83K0l5L10J10M9l8R8
$$ -302 -490 -358 -148 -185 -598 -688 -712 -637 -358 -468 -177 -525 -686 -705 -559 -644 -461 -441 -476 -166 -56 -7 -45 53
755E3L34n61P8j93L65l84J70J36R5K17K64k29K81o0K0L32k74ok3J94o6l74K55
$$ 53 387 -174 -96 -289 76 -308 -138 -2 93 310 574 345 626 566 586 918 644 638 615 809 743 369 624
778F24L11q7M52l55M43j65J23Q2j46o8j67lk22K30L1o5N08j33J62l00J20k33m97
$$ 624 935 848 1300 945 1388 1223 1346 1428 1282 1214 1047 1044 822 1052 1083 1018 1526 1393 1555 1255 1375 1142 645
801F45j42k71J62k04K22J76M47j28L28l09l46l0m88j62k33k0K46m5L1p1J36L59
$$ 645 503 232 394 190 412 588 1035 907 1235 926 580 550 62 -100 -333 -353 -107 -152 -121 -192 -56 303
823C03k62k51k68k10J91j79j17L47J81K26k40L47M8l30j27o1m3J81j57j61J97
$$ 303 41 -210 -478 -688 -497 -676 -793 -446 -265 -39 -279 68 116 -214 -341 -402 -445 -264 -421 -582 -385
844c85j45J91o8J68J63k36M91n5K85J58j25Lj61k4K56j92K58J38P1J59J6R4q3
$$ -385 -530 -339 -407 -239 -76 -312 179 124 409 567 442 445 284 260 516 324 582 720 791 950 966 1060 977
867I77j66j3j00j80N20J08M28N14p2J7l30o2j82k82j27j60k7L98L32K23m6O6J31
$$ 977 811 798 698 518 1038 1146 1574 2088 2016 2033 1703 1641 1459 1177 1050 890 863 1261 1593 1816 1770 1836 1967
890A967m86j26l34o7J45m4M12M96J1L86K11n13j23n88k87l17l39M34J84l68K49
$$ 1967 1481 1355 1021 954 1099 1055 1467 1963 1974 2360 2571 2058 1935 1347 1060 743 404 838 1022 654 903
911I03K26J19M26o76k5M43l53j16J3r1Q2l82L87j38q3K51j68L40J20j69J00l1
$$ 903 1129 1248 1674 998 973 1416 1063 947 960 869 951 569 956 818 735 986 818 1158 1278 1109 1209 1178
933A178j73l92M4o1k53M20J93R6L22K63J47j91k73k84p71O4k37m4K22N05L11p
$$ 1178 1005 613 657 596 343 763 956 1052 1374 1637 1784 1593 1320 1036 265 329 92 48 270 775 1086 1079
955A079K47J30R8n78R9o41M26L4J66K14l8M52n37M4l24j09l92J25k93K68K23O6
$$ 1079 1326 1456 1554 976 1075 434 860 894 1060 1274 1236 1688 1151 1195 871 762 370 495 202 470 693 759
977G59J40L07l16k23k16n43O0j6M9K02K16K0R5J24m72k50R3k40K1p0j75L56j0
$$ 759 899 1206 890 667 451 -92 -32 -48 1 203 419 439 534 658 186 -64 29 -211 -190 -260 -435 -79 -89
1000h9L30l12k13K97l07J37J63k32J4N4J78j01k80p6l72J82k73K20K74M06K12
$$ -89 241 -71 -284 13 -294 -157 6 -226 -212 -158 20 -81 -361 -437 -809 -627 -900 -680 -406 0 212
1021B12J6K25n41M40n28j18k70Q0j20M55K62N2K87K87l86k58Kk26m46L21N2K79
$$ 212 228 453 -88 352 -176 -294 -564 -484 -604 -149 113 165 452 739 353 95 97 -129 -575 -254 -202 77
1043G7J69r3J83J91k39j11N6j08n0J35N7J49k0J85l02k76J74k72N7j57L69J32
$$ 77 246 153 336 527 288 177 233 125 75 210 267 416 396 581 279 3 177 -95 -38 -195 174 306
1065C06J32m5K38j57P7m32j62j39K3r9Q2L99L5L34R3j9k74m04J39l28l95K72M67
$$ 306 438 393 631 474 551 119 -43 -182 -159 -258 -176 223 258 592 685 666 392 -12 127 -201 -596 -324 143
1088A43l01K76K65j45J8k08k70J13j91P8J63K16N3J47j36m6N6k96k22K95j36J79
$$ 143 -158 118 383 238 256 48 -222 -109 -300 -222 -59 157 210 357 221 175 231 -65 -287 8 -128 51
1110E1J47K89mk02o8r0j37r6J0m0J20J93N0K4q8j47j47k51L50r1r8L02O3K11K70
$$ 51 198 487 483 281 213 123 -14 -110 -100 -140 -20 173 223 247 159 12 -135 -386 -36 -127 -225 77 140 351 621
1135F21l31j66o17jk32K65o0L31J93J42N06j95k13m37L5p31J60O5m4J39K67N17
$$ 621 290 124 -493 -494 -726 -461 -521 -190 3 145 651 456 243 -194 -159 -890 -730 -665 -709 -570 -303 214
1157B14m9m27N43m51k50m12J18j47K99N7OJ86R3o1K09l44j33m8j48K98k45L29
$$ 214 165 -262 281 -170 -420 -832 -714 -861 -562 -505 -499 -313 -220 -281 -72 -416 -549 -597 -745 -447 -692 -363
1179c63K03j35K06k09l56J50K20L09r9K9Q6J2p4l1r7p4n4M5L45QQ4M05j81K3n13
$$ -363 -160 -295 -89 -298 -654 -504 -284 25 -74 -45 41 53 -21 -52 -149 -223 -277 -232 113 121 205 610 429 452 -61
1204f1J14k87l33R7L26O26J66J64Rk14j04k34j83l19p4j11J35M36K66O5RJ51L78
$$ -61 53 -234 -567 -470 -144 482 648 812 821 607 503 269 86 -233 -307 -418 -283 153 419 484 493 644 1022
1227A022q85k29k92k15K09R1R5K07%N37k10k6k88J8m94K2j83p0J80K56qj26J15
$$ 1022 137 -92 -384 -599 -390 -299 -204 3 3 540 330 304 16 34 -460 -438 -621 -691 -511 -255 -263 -389 -274
1250b74k50N4L6L31n56L53k95K85k29r0K39k53L35r9j27L89m10L64o1J40l10l21
$$ -274 -524 -470 -434 -103 -659 -306 -601 -316 -545 -635 -396 -649 -314 -413 -540 -151 -561 -197 -258 -118 -428 -749
1272g49j3j21J80L35j19M00K61j78m6m5k26j8m00K85J7n9N28r4L77k9o5j30j99
$$ -749 -762 -883 -703 -368 -487 -87 174 -4 -50 -95 -321 -339 -739 -454 -437 -496 32 -62 315 286 221 91 -108
1295a08m50J6K9k5J57N99j26R9L08J0J57m14n13l63L08l46J07L02M46Q4o2L6K39
$$ -108 -558 -542 -513 -538 -381 218 92 191 499 509 666 252 -261 -624 -316 -662 -555 -253 193 277 215 251 490
1318D90k99K4n04l6k5j06K56M4J33M8K1k6rj12J73k11mJ87l51M2J6m41J53l9L26
$$ 490 191 215 -289 -325 -350 -456 -200 -156 -23 25 46 20 11 -101 72 -139 -143 44 -307 -265 -249 -690 -537 -576 -250
1343b50nK32n8M51l54Q2j09l91N0j99p5J43m6L2M32k9J3n7J55l00Q1j16J07pM77
$$ -250 -255 -23 -81 370 16 98 -11 -402 -352 -551 -626 -483 -529 -497 -65 -94 -81 -138 17 -283 -202 -318 -211 -218 259
1368B59k5j11L24l14K39k95j60j4R8l0J43Q8K39j24j9K8m99J05k52J61n7J27K97
$$ 259 234 123 447 133 372 77 -83 -97 1 -29 114 202 441 317 298 326 -173 -68 -320 -159 -216 -89 208
1391B08L2N15j91K12j16k13k02m3k79K2M8n2o5O33j35N3K08k33J06N1R1p3l84
$$ 208 240 755 564 776 660 447 245 202 -77 -55 -7 -59 -124 509 374 427 635 402 508 559 650 577 193
1414A93O1q5M9j91o5m7o1K26k97J92O8M06m43j67J86k49J03J39l49J38L29j34
$$ 193 254 169 218 27 -38 -85 -146 80 -217 -25 43 449 6 -161 25 -224 -121 18 -331 -193 136 2
1436BJ89J52r7J33q9j92j00j32mN6k39j31M67j30K32k41l1J69k8j60L6L92k17
$$ 2 191 343 246 379 290 98 -2 -134 -138 -82 -321 -452 15 -115 117 -124 -155 14 -14 -174 -138 254 37
1459C7j82M1n4lk19J18K0r6Q8l3N65j37K43l74k0jj14O1j47j00M15J74j20j81
$$ 37 -145 -104 -158 -161 -380 -262 -242 -338 -250 -283 282 145 388 14 -6 -7 -121 -60 -207 -307 108 282 162 -19
1483a9Q9k55K35m2l09j55R9n8J15k72M15R7L2l3J17k1r7R1J92j98k08J71Q3l7
$$ -19 70 -185 50 8 -301 -456 -357 -415 -300 -572 -157 -60 -28 -61 56 35 -62 29 221 23 -185 -14 69 32
1507C2L44n18P3j62M07k77Q4j9K85O8l24J01J86q4j48k9r2l05N86j28j6J41j4
$$ 32 376 -142 -69 -231 176 -101 -17 -36 249 317 -7 94 280 196 48 19 -73 -378 208 80 64 205 191
1530A91K64m04j83K27o8J04m5J64p2J13j82R6N3Or5K14J9J03N4n1j52k60Lm2l06
$$ 191 455 51 -132 95 27 131 86 250 178 291 109 205 258 264 169 383 402 505 559 508 356 96 99 57 -249
1555b49M15l04L09L0j42L91j00n2K03k31j69r2j79k53M37M5J29Qj97O6o8k51J39
$$ -249 166 -138 171 201 59 450 350 298 501 270 101 9 -170 -423 14 59 188 196 -1 65 -3 -254 -115
1578a15J01k68K42p7P3J30J83k29J12k17K51k3m13l4K85J61j67j83j30n7K33j
$$ -115 -14 -282 -40 -117 -44 86 269 40 152 -65 186 163 -250 -284 1 162 -5 -188 -318 -375 -142 -143
1600a43K95k56J91l29L85l44j05P3J18J87J5J10m15L21j05K34r0j6j16k97J07
$$ -143 152 -104 87 -242 143 -201 -306 -233 -115 72 87 197 -218 103 -2 232 142 126 10 -287 -180
1621a80J07j43K15L26j26O8j21J96k31j06K7k44J49m1R2l6M51j99k44Q5J83m8
$$ -180 -73 -216 -1 325 199 267 146 342 111 5 32 -212 -63 -104 -12 -48 403 204 -40 45 228 180
1643A80l06J82M3j27k7J40k6J75l1J54m1J37l90K52l14K0j51R1J29k58o7J26%
$$ 180 -126 56 99 -28 -55 85 59 234 203 357 316 453 63 315 1 21 -130 -39 90 -168 -235 -109 -109
1666a09O2j74M63j94l21K80l19M10m55K52J40o1k63M73j77j79L53j26j58J74n4
$$ -109 -47 -221 242 48 -273 7 -312 98 -357 -105 35 -26 -289 184 7 -172 181 55 -103 71 17
1687A7m96M68j39J82j93j17K62j59O6k6Q0o8l45K12MR1j49K68P8l9l99K98L00
$$ 17 -479 -11 -150 32 -161 -278 -16 -175 -109 -135 -55 -123 -468 -256 -252 -161 -310 -42 36 -3 -402 -104 196
1710A96k99O7m4J98J21j32j12J52n7qo3M0k28J00k9K37rl31L57o0j52K11j26n6
$$ 196 -103 -36 -80 118 239 107 -5 147 90 82 19 59 -169 -69 -98 139 130 -201 156 96 -56 155 29 -27
1734b7j9K7j39j20K13l8O0J97n4q4J1J79M0n37K56j09R7l8j19J67R7J3r4oP8J22
$$ -27 -46 -19 -158 -278 -65 -103 -43 154 100 16 27 206 246 -291 -35 -144 -47 -85 -204 -37 60 73 -21 -27 51 173
1760A73j15J09l12QJ62j3j17k50L01l01J84N6J50J72l24M0j86J46N3j50j54J72
$$ 173 58 167 -145 -137 25 12 -105 -355 -54 -355 -171 -115 35 207 -117 -77 -263 -117 -64 -214 -368 -196
1782a96j62K44k30L54J09j81j7P2J32l9j66n3K39k81o7j34N7J02N6j11J11L7P6
$$ -196 -358 -114 -344 10 119 -62 -79 -7 125 86 -80 -133 106 -175 -242 -376 -319 -217 -161 -272 -161 -124 -48
1805d8J6M1%J68J3l6m42j30n5N41q6M6P3r7kJ07l34M50k50j46N6j27K26k12L77
$$ -48 -32 9 9 177 190 154 -288 -418 -473 68 -18 28 101 4 2 109 -225 225 -25 -171 -115 -242 -16 -228 149
1830A49j81K69l87L33J26o2P7j95j17R1j17j36N7n0K38r8q3K83R9mk28N64n19
$$ 149 -32 237 -150 183 309 247 324 129 12 103 -14 -150 -93 -143 95 -3 -86 197 296 292 64 628 109
1853A09J24j93j57J5R9Mj3j72J59J38k4L0L2j79K08J26l23J58jr9k35M3L57j57
$$ 109 233 40 -117 -102 -3 1 -12 -184 -25 113 89 119 151 -28 180 306 -17 141 140 41 -194 -151 206 49
1877D9o7n6J15K31l17J07l33L01j73K15j48r6R5Nl3J14RJ02M5l7K50j31J70l55
$$ 49 -18 -74 41 272 -45 62 -271 30 -143 72 -76 -172 -77 -72 -105 9 18 120 165 128 378 247 417 62
1901F2k75Q8mj0J26j74J8j32K28N1j08K68k43R7l63N23j80l39K24m1J0k5J11m
$$ 62 -213 -125 -129 -139 -13 -187 -169 -301 -73 -22 -130 138 -105 -8 -371 152 -28 -367 -143 -184 -174 -199 -88 -92
1925i2J8j00p8K76J1p4m6K8j87j6M59m15L9J82j43J79m4P0j29L08l10o5j62K42
$$ -92 -74 -174 -252 24 35 -39 -85 -57 -244 -260 199 -216 -177 5 -138 41 -3 67 -62 246 -64 -129 -291 -49
1949d9L0m28N0K99P4J53K57m86P4M14m96k3M70k43k42n0K13k42J76j30K83k11
$$ -49 -19 -447 -397 -98 -24 129 386 -100 -26 388 -108 -131 339 96 -146 -196 17 -225 -49 -179 104 -107
1971a07R3M3R0K7j70M05j50l9l01K55n9L04k94J33O7j41j22j62M90j62k68P0o4
$$ -107 -14 29 119 146 -24 381 231 192 -109 146 87 391 97 230 297 156 34 -128 362 200 -68 2 -62
1994f2J23r3r6M84l05o2J37o8j7J3j06K63Q9j05l05J62M8j65l1J82l18K49j89
$$ -62 61 -32 -128 356 51 -11 126 58 41 54 -52 211 300 195 -110 52 100 -65 -96 86 -232 17 -172
2017a72J75J08m49J35K53j36L16j53K52r0J6k98j11J61M8k77L18J03P2m39J43
$$ -172 3 111 -338 -203 50 -86 230 77 329 239 255 -43 -154 7 55 -222 96 199 271 -168 -25
2038b5q7j06K34O1m8l4J06N2J75k73Jj40J76k61J30k86K12J96l83K31K80j45n4
$$ -25 -112 -218 16 77 29 -5 101 153 328 55 56 -84 92 -169 -39 -325 -113 83 -300 -69 211 66 12
2061A2K6k7K27o0l67L90J85k79j69L26j46m0j91J53J79l5M7M4j29l3j74J93q7
$$ 12 38 11 238 178 -189 201 386 107 -62 264 118 78 -113 40 219 184 231 275 146 113 -61 132 45
2084D5J61k13J74p7k21k2J52R9L4j38mL9j21J26j01R4O6J90o4j75j21J67k86M89
$$ 45 206 -7 167 90 -131 -153 -1 98 132 -6 -10 29 -92 34 -67 27 93 283 219 44 -77 90 -196 293
2108B93K6j54r5l02J67K38J6k59K19k6j92P9m4k08J15m0J58J68p8j03j91L85j49
$$ 293 319 165 70 -232 -65 173 189 -70 149 123 -69 10 -34 -242 -127 -167 -9 159 81 -22 -213 172 23
2131B3L6l18L80r5p5J60p0q3K72p6J3J58k95l0l3K10j97oK1L62l70R9m87M46Q
$$ 23 59 -259 121 26 -49 111 41 -42 230 154 167 325 30 0 -33 177 -20 -26 -5 357 -13 86 -401 45 53
2156E3j90L04Mj5l32K13j30J45J04j26J69j8l1j86O0j15L05p6l5J80k44p7J36
$$ 53 -137 167 171 156 -176 37 -93 52 156 30 199 181 150 -36 24 -91 214 138 103 283 39 -38 98
2179I8l3n6n4k75L24j15K24j71K22l14K00k67NJ33J13j97J05l1J49J03k9K48j94
$$ 98 65 9 -45 -320 4 -111 113 -58 164 -150 50 -217 -212 -79 34 -163 -58 -89 60 163 134 382 188
2202A88Mj23K1q5j76J02k7L9K2j90L68O5j99j37K58j00l5R9k56J79N1q4m0l18
$$ 188 192 69 90 5 -171 -69 -96 -57 -35 -225 143 208 9 -128 130 30 -5 94 -162 17 68 -16 -56 -374
2226c74M57k83J4J59K5J19j52P4J71l07j39K21K34j34l8M6L1j74j26L73l22J96
$$ -374 83 -200 -186 -27 -2 117 -35 39 210 -97 -236 -15 219 85 47 93 124 -50 -176 197 -125 71
2248G1J5j48K3Q0k9n5J4L2j79j12J4L14r0J03M4k54K00j72l6n0M24l33n9M44l56
$$ 71 86 -62 -39 41 12 -43 -29 3 -176 -288 -274 40 -50 53 97 -157 43 -129 -165 -215 209 -124 -183 261 -95
2273i5r1L07J47l18J17O0M1j64K77n23K70N4k64K2k52K22K17O0J51l46K67J52
$$ -95 -186 121 268 -50 67 127 168 4 281 -242 28 82 -182 -160 -412 -190 27 87 238 -108 159 311
2295C11m50L52k60l3m4m5K33J26n13L39N7J51J13j79J31l69K51j95k56L95k98
$$ 311 -139 213 -47 -80 -124 -169 64 190 -323 16 73 224 337 158 289 -80 171 -24 -280 115 -183
2316a83K07Q0O4jq3J84k55m4RK98m11K92l84J54L6P4J8J58l1O3l12K60k57J51
$$ -183 24 104 168 167 84 268 13 -31 -22 276 -135 157 -227 -73 -37 37 55 213 182 245 -67 193 -64 87
2340H7p2Q1k01K40k08k5K11l1k77K32j1k16p9N01k40J22l18QJ08%Q3j6m2J00j05
$$ 87 15 96 -105 135 -73 -98 113 82 -195 37 26 -190 -269 232 -8 114 -204 -196 -88 -88 -5 -21 -63 37 -68
2365f8K90l00M79l13n2j60M50m23l7j59J38K45l52K17p3Q6J00Q7o0j37J66K15
$$ -68 222 -78 401 88 36 -124 326 -97 -134 -293 -155 90 -262 -45 -118 -32 68 155 95 -42 124 339
2387C39m74J10O7J2j37l6J18Q3r0qk6p9N48l08k64QJ48j88l2L07M7m80K33J50
$$ 339 -135 -25 42 54 -83 -119 -1 82 -8 -16 -42 -121 427 119 -145 -137 11 -177 -209 98 145 -335 -102 48
2411D8Q0j49r9j35L27J37l40J16J15j70mJ71m1j02K06Q3j27J63j62o2K05l13m32
$$ 48 128 -21 -120 -255 72 209 -131 -15 100 -70 -74 97 56 -46 160 243 116 279 117 55 260 -53 -485
2434d85N36k5q2J13k04J44j08J32MN6j37P9j49K47p1m25K04K18J88K0k02j80r8
$$ -485 51 26 -56 57 -147 -3 -111 21 25 81 -56 23 -126 121 50 -375 -171 47 235 255 53 -127 -225
2457b25K5J63J43r1r3j96R5L47l13K82o0J31j39O7j35Pk20r4K70j32J76K12n82
$$ -225 -200 -37 106 15 -78 -274 -179 168 -145 137 77 208 69 136 1 8 -212 -306 -36 -168 8 220 -362
2480c62M84j54qJ01j06J30J4j12N1O4Ll40L61J64l12J57k24L10m34L59k37Q6J75
$$ -362 122 -32 -40 61 -45 85 99 -13 38 102 105 -235 126 290 -22 135 -89 221 -213 146 -91 -5 170
2503A70l33K70RmJ19j08k59K17lk88J40j01J20J02j07J89q4j39p9L3L02R8j50
$$ 170 -163 107 116 112 231 123 -136 81 78 -210 -70 -171 -51 51 -56 133 49 -90 -169 -136 166 264 114
2526A14j52K97l43K02J49j71J0p0m0L7rn3o5K54j68q8L27p7k94l6M6oj09K56l4
$$ 114 -38 259 -84 118 267 96 106 36 -4 33 24 -29 -94 160 -8 -96 231 154 -140 -176 -130 -136 -245 11 -23
2551b3j4N2J06r5p3N5Q3L1j93L93m42J90Qj73L33l11J34J82j54r6M6nrN8j4k97
$$ -23 -37 15 121 26 -47 8 91 122 -71 322 -120 70 78 -95 238 -73 61 243 89 -7 39 34 25 83 69 -228
2577b28K17k36L91R4l70J0pJ63p2L94l03j10L08ok31J53j29j19J90j92K34l13
$$ -228 -11 -247 144 238 -132 -122 -129 34 -38 356 53 -57 251 245 14 167 38 -81 109 -83 151 -162
2599a62L02K7n9l33L9J8K61p1j69K05j20K8J38j6O1O7k71j87J11l94N81J75j34
$$ -162 140 167 108 -225 -186 -168 93 22 -147 58 -62 -34 104 88 149 216 -55 -242 -131 -525 56 231 97
2622I7L2P8l06oK96j95J9K33k24j61R4J59k30j68M14j60M0J43J41l92J4K86j60
$$ 97 129 207 -99 -105 191 -4 15 248 24 -137 -43 116 -114 -282 132 -28 12 155 296 -96 -82 204 44
2645D4J9L7jn1J4r5Qj1M1J40r5l9%P8P0k45K38k14P9J21p8lO9j44j57K60jm25
$$ 44 63 100 99 48 62 -33 -25 -36 5 145 50 11 11 89 159 -86 152 -62 17 138 60 57 126 -18 -175 85 84 -341
2673c41K40J91K0j67o0N2L5K28o8m28K48P3J86l95J66K3m9K60p5o0O0k77K46N0
$$ -341 -101 90 110 -57 -117 -65 -30 198 130 -298 -50 23 209 -186 -20 3 -46 214 139 79 139 -138 108 158
2697A58l0K3j80L72k68o3J5N1k1O3k21n1L86k04l23j55L81J79k30R8j92N3J36
$$ 158 128 151 -29 343 75 12 27 78 57 120 -101 -152 234 30 -293 -448 -67 112 -118 -20 -212 -159 -23
2720b3J1N5n1j62J98j65K51n6N3j73LL3J55K5l01j24M04j11M1r3j22K99k05K31
$$ -23 -12 43 -8 -170 28 -137 114 58 111 -62 -59 -26 129 154 -147 -271 133 22 63 -30 -152 147 -58 173
2744A73m48J25K63l62N50l16K67j6k01j66J48N3k90o1K76L3n2r7J88N2j28K39
$$ 173 -275 -150 113 -249 301 -15 252 236 35 -131 17 70 -220 -281 -5 28 -24 -121 67 119 -9 230
2766B30j52j13J84k05j0N1k5N6n7k11J94K78kl33K34k29R1L9Q1Oj9j69K51o5p2
$$ 230 78 -35 149 -56 -66 -15 -40 16 -41 -252 -58 220 218 -115 119 -110 -19 20 101 107 88 -81 170 105 33
2791C3k2L9NK26m62R8J2o7K8R2j07P2K18j46k46K04L6K6K34l19K27j99m23N35
$$ 33 11 50 55 281 -181 -83 -71 -138 -110 -18 -125 -53 165 19 -227 -23 13 39 273 -46 181 -18 -441 94
2815I4k48J7J43j71J0J04K00k4l17M35k4p9j19r6K03qr1j67J93J23j36o9K11l35
$$ 94 -154 -137 6 -165 -155 -51 149 125 -192 243 219 140 21 -75 128 120 29 -138 55 178 42 -27 184 -151
2839a51r9J38j10L78l2j27Q5Q4j58K10j65j77j52q9L10J41J64l60l6K44j17k1
$$ -151 -250 -112 -222 156 124 -3 82 166 8 218 53 -124 -276 -365 -55 86 250 -110 -146 98 -19 -40
2861d0r0j82K77m0N9K66k17J14j63J81k04J74l38j01L18K3mj28R8jk71K18j68
$$ -40 -130 -312 -35 -75 -16 250 33 147 -16 165 -39 135 -203 -304 14 37 33 -95 3 2 -269 -51 -219
2884b19k2J78l7L13j10p3J32m5M7k4Pp3k31Q1K55k64J18r0J28j17J99j07j03L9
$$ -219 -241 -63 -100 213 103 30 162 117 164 140 147 74 -157 -76 179 -85 33 -57 71 -46 153 46 -57 -18
2908a8j11j82L31k17J58k24J60K14M8m5l98K11J37P4n4j17p7L44k62PK02l81J12
$$ -18 -129 -311 20 -197 -39 -263 -103 111 159 114 -284 -73 64 138 84 -33 -110 234 -28 -21 181 -200 -88
2931h8K11j24j00K3n2J41m3J43j65L8Ql9Oj21J41j61L59k06K91m11l3J18J12q0
$$ -88 123 -1 -101 -78 -130 11 -32 111 -54 -16 -8 -47 -41 -162 -21 -182 177 -29 262 -149 -182 -64 48 -32
2955c2j74L27p9L7K4j90J65k30L72l35K43k62K5J10k86L46k81K00J15j28K3j43
$$ -32 -206 121 42 79 103 -87 78 -152 220 -115 128 -134 -109 1 -285 61 -220 -20 95 -33 -10 -153
2977a53L28J73m27J32K28m78J52L27k55p7P6j80o0L27j65n6M7J4K32j40k1o7N3
$$ -153 175 348 -79 53 281 -197 -45 282 27 -50 26 -154 -214 113 -52 -108 -61 -47 185 45 24 -43 10
3000A0m2QL1j23K37Q3n5o4n8K3k82K68M7J31K6l0k06m7j6N2R6j20j14m0M33j72
$$ 10 -32 -24 7 -116 121 204 149 85 27 50 -232 36 83 214 240 210 4 -43 -59 -7 89 -31 -145 -185 248 76
3026G6J86j40J22k60J42k70L00K6j75Qm6j44K78K8l72J36J02j84L84k09l7K30
$$ 76 262 122 244 -16 126 -144 156 182 7 15 -31 -175 103 131 -241 -105 -3 -187 197 -12 -49 181
3048A81j64J50k00M6j45M8J91k9J98m02K24o4m4j04j04J73Q1L8j29J85O3q8r4
$$ 181 17 167 -33 13 -132 -84 107 78 276 -126 98 34 -10 -114 -218 -45 36 74 -55 130 193 105 11
3071A1k51L40P2j15j76R2j47J13R5q0j00k6J29Pj11L02j69j26N13k86l6j61OL3
$$ 11 -240 100 172 57 -119 -27 -174 -61 34 -46 -146 -172 -43 -36 -147 155 -14 -140 373 87 51 -110 -104 -71
3095g1J36j61K7P2N5j48J77k83L75k29j91K21J35r7m1k5J20n4o2Q1J94r3n3p8
$$ -71 65 -96 -69 3 58 -90 87 -196 179 -50 -241 -20 115 18 -23 -48 72 18 -44 37 231 138 85 7
3119GJ75j23j39kM8r3L35P3r9l26l5m5M5J96k18K73j41M3R0j40J15o9o1Q9l1J63
$$ 7 182 59 -80 -82 -34 -127 208 281 182 -144 -179 -224 -179 17 -201 72 -69 -26 64 -76 39 -30 -91 -2 -33 130
3145A30N2j62j21J10J23l12K46j68K30j45K6j69L79j10mk79KL27J3l60J46K78
$$ 130 182 20 -101 9 132 -180 66 -102 128 -17 9 -160 219 109 105 -174 -172 155 168 -192 -46 232
3167B32j63p9j16J50n3q1J23k0O9j00R6j72n3P1J7L12l21K61j90o5R0J58K34m07
$$ 232 69 -10 -126 24 -29 -110 13 -7 62 -38 58 -114 -167 -96 -79 233 -88 173 -17 -82 8 166 400 -7
3191gO7l1j73M34j00r0j81J00N8j74P9k06K82O2k53L39l75K56j70J36J26l19J12
$$ -7 60 29 -144 290 190 100 -81 19 77 -97 -18 -224 58 120 -133 206 -169 87 -83 53 179 -140 -28
3214b8r1J38l5j97L07j01k8j29Q6J02nJ51j72J49n93L78J09j72M5O2j61K9J96
$$ -28 -119 19 -16 -213 94 -7 -35 -164 -78 24 19 170 -2 147 -446 -68 41 -131 -86 -24 -185 -156 40
3237D0K0J2k60J20J81j67J78j17R5k17K29p5j82K44l58K97J38l00L6k74K53J53
$$ 40 60 72 -188 -68 113 -54 124 7 102 -115 114 39 -143 101 -257 40 178 -122 -86 -360 -107 46
3259D6j11K06j22k7J41k54K68J98j48J5j02J52k47J63k91q3J40J75m6J39j5k17
$$ 46 -65 141 19 -8 133 -121 147 345 197 212 110 262 15 178 -113 -196 -56 119 73 212 197 -20
3281b0L1j4P3j57j76J91k9j10M37l26J25j09K43k4J21l15j67K75j39J7J63m2p2
$$ -20 11 -3 70 -87 -263 -72 -101 -211 226 -100 25 -84 159 135 256 -59 -226 49 -90 -73 90 48 -24
3304b4O1J54j50q5K22k38P6j8O4j63K2J2J80p8M5j16J37J35k03j13l02M35M5j1
$$ -24 37 191 41 -44 178 -60 16 -2 62 -101 -79 -67 113 35 80 -36 101 236 33 -80 -382 53 98 87
3328H7k80O1J73J2j76K79L8l82J08j87N7J40J25k67J30J76k1M1L6l37K64o6o2
$$ 87 -193 -132 41 53 -123 156 194 -188 -80 -267 -210 -70 55 -212 -82 94 73 114 150 -187 77 11 -51
3351e1J91L2J08l43m8NO4J43R4m49L02k55J10R6R4j15m9r6R6K28k80K89j97O5
$$ -51 140 172 280 -63 -111 -106 -42 101 195 -254 48 -207 -97 -1 93 -22 -71 -167 -71 157 -123 166 -31 34
3375C4J16l7j51r7R9o1kQ9R9l75J47o2J20J52K22m64J28K27p2J4k12L6K03j4j77
$$ 34 150 113 -38 -135 -36 -97 -99 -10 89 -286 -139 -201 -81 71 293 -171 -43 184 112 126 -86 -50 153 139 -38
3400c8J31J61k88k9J99k95K51m6N7j52k25K61j39j6J20P0k39K31J00k15L99k01
$$ -38 93 254 -34 -63 136 -159 92 46 103 -49 -274 -13 -152 -168 -48 22 -217 14 114 -101 298 97
3422I7o8j57L5J59j71K28j33k17J95O1n7l0j7K46J5nj03j53%j45K83J31k07N0
$$ 97 29 -128 -93 66 -105 123 -10 -227 -32 29 -28 -58 -75 171 186 181 78 -75 -75 -220 63 194 -13 37
3446C7J78m06L71j04p3L34k73j24J46J46n0k37n8j15O35n54N3N4r1K93%k53k6
$$ 37 215 -191 180 76 3 337 64 -60 86 232 182 -55 -113 -228 407 -147 -94 -40 -131 162 162 -91 -117
3469a17L11m7k11j69J79J23j17l0J60k51J2R0L3L2Q8j94K72l49K40j44j59K62
$$ -117 194 147 -64 -233 -54 69 -48 -78 82 -169 -157 -67 -34 -2 86 -108 164 -185 55 -89 -248 14
3491A4j13M4p5K63l32J73k7p7M03l51j91O2K32J5N2k35L39q8n5o5N6j76J10o4
$$ 14 -99 -55 -130 133 -199 -26 -53 -130 273 -78 -269 -207 25 40 92 -143 196 108 53 -12 44 -132 -22 -86
3515h6J71L5l96L84k9j03k37K32j58J37J38k03k09K73o3K08K83n28K85nj58P8
$$ -86 85 120 -276 108 79 -24 -261 -29 -187 -50 88 -115 -324 -51 -114 94 377 -151 134 129 -29 49
3537D9L6k08mJ88l06J56J04j4j78k1K73k16J77r2L02k77J36k52p2J34K23k05r7
$$ 49 85 -123 -127 61 -245 -89 15 1 -177 -198 75 -141 36 -56 246 -31 105 -147 -219 -85 138 -67 -164
3560a64K64j73J55k52J93k07J04J66K5k27J79j16J25k42J27M3k15J81J44Q7k36
$$ -164 100 -73 82 -170 23 -184 -80 86 111 -116 63 -53 72 -170 -43 0 -215 -34 110 197 -39
3581c9L26n73M02j67j97K23mk9J83J71l18J79k31M11k72J01k04J26p7J04k28p3
$$ -39 287 -286 116 -51 -248 -25 -29 -58 125 296 -22 157 -74 337 65 166 -38 88 11 115 -113 -186
3603a86K77k26J37J48J47l39P4Q2r8J65o6K2J31l17j31j5J97j14J02Q5k21J5K71
$$ -186 91 -135 2 150 297 -42 32 114 16 181 115 137 268 -49 -180 -195 2 -112 -10 75 -146 -131 140
3626A40k55K1K06l24K60J68j75l04L52n6k8J46k66o4J4K20j11j59L62j30n9P2
$$ 140 -115 -94 112 -212 48 216 41 -263 89 33 5 151 -115 -179 -165 55 -56 -215 147 17 -42 30
3648C0J55l14J52Q3r2J43j24k60K05J53j15j89P7M0L06l13j43m2K33J82j30k5
$$ 30 185 -129 23 106 14 157 33 -227 -22 131 16 -173 -96 -56 250 -63 -206 -248 -15 167 37 12
3670A2Q9K41m07o9K3K23k33K86j90j21J01m9J43j61J94oj78j7Q4O3P0l97J85L0
$$ 12 101 342 -65 -134 -111 112 -121 165 -25 -146 -45 -94 49 -112 82 76 -102 -119 -35 28 98 -299 -114 -84
3694h4j0J04o7NK02M8k87L08k94K55Jj45L7q5J76j50NM2o5L9R4k9l31J75m3j80
$$ -84 -94 10 -57 -52 150 198 -89 219 -75 180 181 36 73 -12 164 14 19 61 -4 35 129 100 -231 -56 -99 -279
3720b79N89o14L57m7j69M64m74j28K41k21P19j52j74kj81N6j63K90j67j08p1J72
$$ -279 310 -304 53 6 -163 301 -173 -301 -60 -281 438 286 112 110 -71 -15 -178 112 -55 -163 -234 -62
3742f2M01j03j71J12m7j73J59r1l89L15NjJ31k61L00m7K2j4j12pk50J14J16J61
$$ -62 339 236 65 177 130 -43 116 25 -364 -49 -44 -45 86 -175 125 78 100 86 -26 -33 -283 -169 -53 108
3766A08K0l1j45P5k3P4o3NK91n83M72j27j06J63j29k87L10J66j23k46j6K01P6
$$ 108 128 97 -48 27 4 78 15 20 311 -272 200 73 -33 130 1 -286 24 190 67 -179 -195 6 82
3789H2j5n2K45m76K68j08J07J11k65q8J40j5j48K25n8r6N5J61J0k00J68j59J64
$$ 82 67 15 260 -216 52 -56 51 162 -103 -191 -51 -66 -214 11 -47 -143 -88 73 83 -117 51 -108 56
3812E6k94J81J7K7NK58n12L43j28O2N4r1J0p9p8K61k78M16k49K21k53K8Q8m2J24
$$ 56 -238 -57 -40 -13 -8 250 -262 81 -47 15 69 -22 -12 -91 -169 92 -186 230 -19 202 -51 -23 65 23 147
3837A47k24J39nRJ67j17j53K3p5J28o5J07J07l38J33q4l0K27j67JN9J86k40j45
$$ 147 -77 62 57 66 233 116 -37 -14 -89 39 -26 81 188 -150 -17 -101 -131 96 -71 -70 -11 175 -65 -210
3861b10J96j44j0L48k6n8M5j82J47q4k9J46n3l3K9l2j3L4k21R7L6l4K67j54K12
$$ -210 -14 -158 -168 180 154 96 141 -41 106 22 -7 139 86 53 82 50 37 71 -150 -53 -17 -51 216 62 274
3886B74n33M06j0l1o4k20J32K34j61r7Q4l21K96L0r8L61k64l7J41k57J77n1K4
$$ 274 -259 147 137 106 42 -178 -46 188 27 -70 14 -307 -11 19 -79 282 18 -19 122 -135 42 -9 15
3909A5j55J81o8K54k44q2R9l8k25L77J39n2k01K11q6j75j9M0m2P8o1J86k53K81
$$ 15 -140 41 -27 227 -17 -99 0 -38 -263 114 253 201 0 211 125 -50 -69 -29 -71 7 -54 132 -121 160
3933A60n5Jj98m0K91Q3j98j02j1J98j97J05O4J17m51J79L17k73M4M8n0j05J79
$$ 160 105 106 -92 -132 159 242 44 -58 -69 129 -68 37 101 218 -233 -54 263 -10 34 82 32 -73 106
3956A06j54J83l27J94j83L64l19J59K18k33K15J3l64K67M9k63j41J09L0J9J13
$$ 106 -48 135 -192 2 -181 183 -136 23 241 8 223 236 -128 139 188 -75 -216 -107 -77 -58 55
3977E5k33O8k3L8K38oj57j58J26Rj32L41p4R5l54J17L07j99K19o0n8l57L20k76
$$ 55 -178 -110 -133 -95 143 137 -20 -178 -52 -43 -175 166 92 187 -167 -50 257 58 277 217 159 -198 122 -154
4001a54J20M1j02J60q1Q4j50P1j36J68n6Q4l61L14jr4q6K54M2lmo8q7j38M59j66
$$ -154 -34 7 -95 65 -16 68 -82 -11 -147 21 -35 49 -312 2 1 -93 -179 75 117 114 110 42 -45 -183 276 110
4027A10o6j60J73p6O7j21J06J54k49j07J13J9J85j04J38j46j35j02O8K02J2j31
$$ 110 44 -116 57 -19 48 -73 33 187 -62 -169 -56 -37 148 44 182 36 -99 -201 -133 69 81 -50
4049e0qJ82j69L1K08l24L33k97L74k01J80l85J95j86J79l6M5j30J52j58j67J87
$$ -50 -58 124 -45 -14 194 -130 203 -94 280 79 259 -126 69 -117 62 26 71 -59 93 -65 -232 -45
4071d5R6k70K65j66rL49l03J41j05J03J17l26p0L35k61Q2n0J99j12j9L4M0k44
$$ -45 51 -219 46 -120 -129 220 -83 58 -47 56 173 -153 -223 112 -149 -67 -117 82 -30 -49 -15 25 -219
4094b19JK79k14L5Q4J15j95N8j06k18N42m09L91k29K02j04J05N5m3r9On4J60j87
$$ -219 -218 61 -153 -118 -34 81 -114 -56 -162 -380 162 -247 144 -85 117 13 118 173 130 31 37 -17 143 -44
4118d4j97O7K13q4k61L22k16L92r2j07K69l91L9J96J04j31o1pJ87m60L1K27J5
$$ -44 -241 -174 39 -45 -306 16 -200 192 100 -7 262 -129 -90 106 210 79 18 11 198 -262 -231 -4 11
4141A1n7k8j69L86m47N25k33R0p6MJ50N7j62Q7J0j72n5K2k36J88j89L72j62J33
$$ 11 -46 -74 -243 143 -304 221 -12 78 2 6 156 213 51 138 148 -24 -79 -57 -293 -105 -294 78 -84 49
4165D9k72N7O5j37J69P1J79j06r9L0J00j49J05j8n1J3o4L61l02p7q7L58j00k77
$$ 49 -223 -166 -101 -238 -69 2 181 75 -24 6 106 -43 62 44 -7 6 -58 303 1 -76 -163 195 95 -182
4189a82L84L2j51Q6j56OJ0%j45J90r6K27n72M24rj64K46j48j14J59k19k0L43j62
$$ -182 202 234 83 169 13 19 29 29 -116 74 -22 205 -367 57 48 -116 130 -18 -132 27 -192 -212 131 -31
4213c1L1r4K73m72L87r6o5Q3p2R3o9K4J12J6j39l5k63M45k47n8K38q0J42k43K61
$$ -31 0 -94 179 -293 94 -2 -67 16 -56 37 -32 -8 104 120 -19 -54 -317 128 -119 -177 61 -19 123 -120 141
4238A41l0J37o2m6l00L22j86L2l23L43oM7M0k90K85r6j12J77k29o0J58K2NJ02
$$ 141 111 248 186 140 -160 162 -24 8 -315 28 22 69 109 -181 104 8 -104 73 -156 -216 -58 -36 -31 71
4262G1O9q4J63j39j71R2j86L41j41j75L38k70q2J29J43l71M96k39K5p0j11J92
$$ 71 140 56 219 80 -91 1 -185 156 15 -160 178 -92 -174 -45 98 -273 223 -16 9 -61 -172 20
4284B0K88k64k34J34JK28j90R9J8J79k24o9o0J53k95J48P5j77P3J0K23j43J20
$$ 20 308 44 -190 -56 -55 173 -17 82 100 279 55 -14 -74 79 -216 -68 7 -170 -97 -87 136 -7 113
4307A13q3P7m9Jr9j69R7r8L17j14J23k57K64j90R0j0R7l6k40K70jJ90l90l4J53
$$ 113 30 107 58 59 -40 -209 -112 -210 107 -7 116 -141 123 -67 23 13 110 74 -166 104 103 293 -97 -131 22
4332B2J89m94K57k00L11N1j47K29j47P2q4p5j4R8K08j14j91j50P6R8J76j19l20
$$ 22 211 -283 -26 -226 85 136 -11 218 71 143 59 -16 -30 68 276 162 -29 -179 -103 -5 171 52 -268
4355b68M14k19j92L95q3j05J51J46l30J73Q6l40o0J74K14l04R9q5K36k15J47l50
$$ -268 146 -73 -265 130 47 -58 93 239 -91 82 168 -172 -232 -58 156 -148 -49 -134 102 -113 34 -316
4377c16J35K97p0M4l85n6L37P0j23M1P9n0n6j26J15L2J80j63k28K95p9P9L7jr3
$$ -316 -181 116 46 90 -295 -351 -14 56 -67 -26 53 3 -53 -179 -64 -32 148 -15 -243 52 -27 52 89 88 -5
4402eqJ21O5j97J91j3p7j09K36k91%J40j68J05Q4j75m3L08r5N7Q3j72o7q7R7j3
$$ -5 -13 108 173 -24 167 154 77 -32 204 -87 -87 53 -115 -10 74 -101 -144 164 69 126 209 37 -30 -117 -20 -33
4428c3J47k48J16J02Q4m19M3J78%J59j57J51p4K04n15J83j4J16m4k3K70j33J58
$$ -33 114 -134 -18 84 168 -251 -208 -30 -30 129 -28 123 49 253 -262 -79 -93 23 -21 -44 226 93 251
4451B51K28l63N1l42j08M06k50R4k13J34M2q1J54m7p3K84k22j24J62j6O7k04K72
$$ 251 479 116 167 -175 -283 123 -127 -33 -246 -112 -70 -151 3 -44 -117 167 -55 -179 -17 -33 34 -170 102
4474A02j31K60l78J90K45k33l14L11J61q1m61L01n0m3N98m74M4o1J7j56J24m8
$$ 102 -29 231 -147 43 288 55 -259 52 213 132 -329 -28 -78 -121 477 3 47 -14 3 -153 -29 -77
4496g7k66M12k15R8N9j12J62k03o2J04J70O0J9o8k18M5K57j73n5Q6J7j0k83J51
$$ -77 -343 69 -146 -48 11 -101 61 -142 -204 -100 70 130 149 81 -137 -92 165 -8 -63 23 40 30 -253 -102
4520a02L82l55J23p8Q6lJ24m21K44q7nJ25j93M8Q7n6J10o6M6j25R3jK11m43K00
$$ -102 280 -75 48 -30 56 53 177 -244 0 -87 -92 33 -160 -112 -25 -81 29 -37 9 -116 -23 -24 187 -256 -56
4545e6J95j40l7K05K1l80J59j4J78l44N76l91M2K8j16J51n3J6j5j34J59k11K42
$$ -56 139 -1 -38 167 188 -192 -33 -47 131 -213 363 -28 14 42 -74 77 24 40 25 -109 50 -161 81
4568H1l4r1L8J58k84K79l56J02J09l09K95Q9j56K32P8m80J25LR8J9K02k45J3J70
$$ 81 47 -44 -6 152 -132 147 -209 -107 2 -307 -12 77 -79 153 231 -249 -124 -121 -23 -4 198 -47 -34 136
4592A36l03J88N2j46R2j1J83j48M4O8j2l51K62P1q4J9m23O0J87J44J75k68mj66
$$ 136 -167 21 73 -73 19 8 191 43 87 155 143 -208 54 125 41 60 -363 -303 -116 28 203 -65 -69 -235
4616b35M6R0m8K68n5l3M0J71l24K15k62J21J4j66K72j84K16k05J10o0j44K09j68
$$ -235 -189 -99 -147 121 66 33 73 244 -80 135 -127 -6 8 -158 114 -70 146 -59 51 -9 -153 56 -112
4639a12K43j29j52K18k80K77k74K00K0qJ03m05N02j97j42N3K13k78K6M5Q6K09
$$ -112 131 2 -150 68 -212 65 -209 -9 11 3 106 -299 203 6 -136 -83 130 -148 -122 -77 9 218
4661B18k86Q0J14m1k05J73k1J28k80O6K4m2M6L01j60j46L6J29l63M04k53j69N20
$$ 218 -68 12 126 85 -120 53 32 160 -120 -54 -30 -72 -26 275 115 -31 5 134 -229 175 -78 -247 273
4684B73k48J0l36O63j62K2k08O3J17j99N2j49J1J75j86R6r8K28k86M7L69k51Q1
$$ 273 25 35 -301 362 200 222 14 77 194 -5 47 -102 -91 84 -102 -6 -104 124 -162 -115 254 3 84
4707H4p5J19J2j40n7K63j72M8n4k55L30J54k50J17K7k06j01O5K28k5j67kJ23J42
$$ 84 9 128 140 0 -57 206 34 82 28 -227 103 257 7 124 151 -55 -156 -91 137 112 -55 -57 66 208
4731B08j44rj86q1n0L67j66J72j44j79K50l00O06j66k35J50j1j11l9n3J97k08
$$ 208 64 55 -131 -212 -262 105 -61 111 -33 -212 38 -262 344 178 -57 93 82 -29 -68 -121 76 -132
4753a32L4J43k89J20K38l1m04k8L15m6J42j70k18M25j53k9J34l01J58Q5J15k9
$$ -132 -98 45 -244 -124 114 83 -321 -349 -34 -80 62 -108 -326 99 -54 -83 51 -250 -92 -7 108 79
4775G9j92J16R1j17N0o9k5J19j47O5K1r5j19K12K80j91r1O3o1N8L3j71Q6L7J60
$$ 79 -113 3 94 -23 27 -42 -67 52 -95 -30 -9 -104 -223 -11 269 78 -13 50 -11 47 80 -91 -5 32 192
4800A92k39k12M24m12O1O62l55q2q8J16J18j08l64K86K04l57J39j11j0L63j37
$$ 192 -47 -259 165 -247 -186 476 121 39 -49 67 185 77 -287 -1 203 -154 -15 -126 -136 227 90
4821I0m3K30r8p1k51lJ33j98M86m26K89k23j67j56L95J42j24J1O4k50L37N6k65
$$ 90 47 277 179 108 -143 -146 -13 -211 275 -151 138 -85 -252 -408 -13 129 5 16 80 -170 167 223 -42
4844d2j52J75K34j62j26j00K39J22Q0l04K1j25J71K56n31J74n0J04Q0J47l59q
$$ -42 -194 -19 215 53 -73 -173 66 188 268 -36 -15 -140 31 287 -244 -70 -120 -16 64 211 -148 -156
4866a56L4J99j06k04J31P3Q4q5Q6L5k10K45m8r6L9l05J41K37O2j86K57k75O6J8
$$ -156 -122 77 -29 -233 -102 -29 55 -30 56 91 -119 126 78 -18 21 -284 -143 94 156 -30 227 -48 18 36
4890C6J44j98j9J21P4k42K10l37L25o1L5j76J38k63J59J80k58M06l28J37j17J0
$$ 36 180 -18 -37 84 158 -84 126 -211 114 53 88 -88 50 -213 -54 126 -132 274 -54 83 -34 -24
4912b4J78K31n77N05l91j0j90M3L8L30k13j50K78j06Q8o8R9j10j31q2J23j27O14
$$ -24 154 385 -192 313 -78 -88 -278 -235 -197 133 -80 -230 48 -58 30 -38 61 -49 -180 -262 -139 -266 348
4935C48m04J46l82K99k83J70K9J52L5j35j23O3J18j03L78l20J40k12PL15l17K71
$$ 348 -56 90 -292 7 -276 -106 -77 75 110 -25 -148 -85 33 -70 308 -12 128 -84 -77 238 -79 192
4957A92j33J45n72L87q2k93L55K5j43J39p8k41J75K02j30m6k9m8QR5j04K4L40
$$ 192 59 204 -368 19 -63 -356 -1 24 -119 20 -58 -299 -124 78 -52 -98 -127 -175 -167 -72 -176 -152 188
4980A88l25Q0m5J96j80P2m3o5k3J35j33k0K02l5j40M3J19p9n5M67n49q0L55j87
$$ 188 -137 -57 -102 94 -86 -14 -57 -122 -145 -10 -143 -163 39 4 -136 -93 26 -53 -108 359 -190 -270 85 -102
5004a02K31J20n7q7l73K45N1rJ31k34k6m1P7J01R0M5p3j58Q2j46J14Q5j50NL71
$$ -102 129 249 192 105 -268 -23 28 19 150 -84 -110 -151 -74 27 117 162 89 -69 13 -133 -19 66 -84 -79 292
5029B92k54l49M27K5m1k68J09o6M1L01m51J45r6J70K70n64L43L24n88L5J26K00
$$ 292 38 -311 116 141 100 -168 -59 -125 -84 217 -234 -89 -185 -15 255 -309 34 358 -230 -195 -69 131
5051A31j67M6K8L89k87q2M7l37L57j11o6o7P2K69k84m5Nk63K90K41j43n6j3J03
$$ 131 -36 10 38 427 140 58 105 -232 125 14 -52 -119 -47 222 -62 -107 -102 -365 -75 166 23 -33 -46 57
5075E7m4J72j52k0N7l07K37P5O9k82M3J68N0k72J23O0j8n6K33l28L1M2K24j58
$$ 57 13 185 33 13 70 -237 0 75 144 -138 -95 73 123 -149 -26 34 16 -40 193 -135 -104 -62 162 4
5099Dj18K95l26L0J80O1o6Rk18L85l57J54P0m3J27m10R9K21Q0j00j16k2N1k69
$$ 4 -114 181 -145 -115 65 126 60 69 -149 236 -121 33 103 60 187 -223 -124 97 177 77 -39 -61 -10 -279
5123b79O5L2J68J63l64K78j35K15k39O4P2n4J09P5j82P5J55k00Jr6m4J46M8k22
$$ -279 -214 -182 -14 149 -215 63 -72 143 -96 -32 40 -14 95 170 -12 63 218 18 19 -77 -121 25 73 -149
5147a49O7j3J42j8k22j31K13J97N7l32J1L71M3m34M05m33J67k6P9o5K23J6k82
$$ -149 -82 -95 47 29 -193 -324 -111 86 143 -189 -178 193 236 -198 207 -226 -59 -85 -6 -71 152 168 -114
5170a14J88O5O1j94q1J04J91m90M99k77p5J97k33J59o3J9J72j04J33k68j26P1
$$ -114 74 139 200 6 -75 29 220 -270 229 -48 -123 74 -159 0 -63 -44 128 24 157 -111 -237 -166
5192a66L04R7k57m8J83j12J21j80L12j79K3j21q2Q0K18j16p3r9q6J43O2n3K43
$$ -166 138 235 -22 -70 113 1 122 -58 254 75 98 -23 -105 -25 193 77 4 -95 -181 -38 24 -29 214
5215B14k53k2K21j83J10r9J71j20j48L9j78K60J08J31j14j78K86j39k0j2k24K50
$$ 214 -39 -61 160 -23 87 -12 159 39 -109 -70 -248 12 120 251 137 -41 245 106 86 74 -150 100
5237A00L7j57j24L10M8k55q5j13N35k32j87K64j02j2m5M5q5p2L48l22J54J01j97
$$ 100 137 -20 -144 166 214 -41 -126 -239 296 64 -123 141 39 27 -18 27 -58 -130 218 -104 50 151 -46
5260d6L21m09k8K19K5n8j3j41J04J55k17J57O2Lo8k84p2K21L40k02k59K14k3k5
$$ -46 275 -134 -162 57 82 24 11 -130 -26 129 -88 69 131 134 66 -218 -290 -69 271 69 -190 24 1 -24
5284b4K46j30l11L04r7k58L26k64J87r2M2L56l51m3O5P7l4l42J73K19k56M60k98
$$ -24 222 92 -219 85 -12 -270 56 -208 -21 -113 -71 285 -66 -109 -44 33 -1 -343 -170 49 -207 253 -45
5307d5p1j14J63P5j6k43L18J02l09J13k42L13K5J38O3j29j32j20J80mk33J25k12
$$ -45 -116 -230 -67 8 -8 -251 67 169 -140 -27 -269 44 69 207 270 141 9 -111 69 65 -168 -43 -255
5330b55K76K10l77j06M14k44K0lK01l87R4j5J79J85l08R2m7p7L6J35j1j79K34
$$ -255 21 231 -146 -252 162 -82 -62 -65 136 -251 -157 -172 7 192 -116 -24 -71 -148 -112 23 12 -167 67
5353F7J46j73j23K02j92J83k87K09K8K3j32j02L7N6l3M3K47o1j13r1J96k40K26
$$ 67 213 40 -83 119 -73 110 -177 32 60 83 -49 -151 -114 -58 -91 -48 199 138 25 -66 130 -110 116
5376A16o7j17R5R1j20K12l2m41J10K40j52k7J71j22P8rM2nk47M30k34r4K76j79
$$ 116 49 -68 27 118 -2 210 178 -263 -153 87 -65 -92 79 -43 35 26 68 63 -184 246 12 -82 194 15
5400A5Q9K41n19q5L42j65L11l55L14k8o7k43M52l49k9Q4J00R9m85L82k16K54m26
$$ 15 104 345 -174 -259 83 -82 229 -126 188 160 93 -150 302 -47 -76 8 108 207 -278 104 -112 142 -284
5423b84K46J81q0j8j9k18L21q1l5L68k41M1j34q8K60j17k23m1P7J29j00j26L70
$$ -284 -38 143 63 45 26 -192 129 48 13 381 140 181 47 -41 219 102 -121 -162 -85 44 -56 -182 188
5446A88m27L54p7K38K5k91j15qN03m48J45M9k01L32k64%k89K01k07J07K44j49
$$ 188 -239 115 38 276 301 10 -105 -113 390 -58 87 136 -65 267 3 3 -286 -85 -292 -185 59 -90
5468i0J18k29L4K19j13K6r8l4K24lQ7j49R0J03p3m45L71J28k26K15l07pJ47n0
$$ -90 28 -201 -167 52 -61 -35 -133 -167 57 54 141 -8 82 185 112 -333 38 166 -60 155 -152 -159 -12 -62
5492f2J01R9r4l07J11K87j41p3K57p7r7k17J69P5p8p8J81j78m4K49L26m09jQ0
$$ -62 39 138 44 -263 -152 135 -6 -79 178 101 4 -213 -44 31 -47 -125 56 -122 -166 83 409 0 -1 79
5516G9j35k49N07j29j65J9j11J66q5J42J22J09k10k39K21M2p5M3k62Q3K27j92
$$ 79 -56 -305 202 73 -92 -73 -184 -18 -103 39 161 270 60 -179 42 84 9 52 -210 -127 100 -92
5538i2J46k63l37O53j80m3p8j70N30k04p1J11k07K85o9q3J41k10Q8l2O4J37j17
$$ -92 54 -209 -546 107 -73 -116 -194 -364 166 -38 -109 2 -205 80 11 -72 69 -141 -53 -85 -21 116 -1
5561aR2p3J19l5K27l40O5j19M6R2j99Q4PR8k43L45j87n4j0J87j43M4n4m6q4J56
$$ -1 91 18 137 102 329 -11 54 -65 -19 73 -126 -42 -35 63 -180 165 -22 -76 -86 101 -42 2 -52 -98 -182 -26
5587b6j4J21R8k52N0j05Q8R8j66K34q7J08j24MJ00l37L56k18l6j45J81j70K50
$$ -26 -40 81 179 -73 -23 -128 -40 58 -108 126 39 147 23 27 127 -210 146 -72 -108 -253 -72 -242 8
5610Hp6k94J70J03R6j74J86l4k6r5J89J17k41L9K0m1K9p1J7M13p05M04n8O9p4
$$ 8 -68 -362 -192 -89 7 -167 19 -15 -41 -136 53 170 -71 -32 -12 -53 -24 -95 -78 335 -370 34 -24 45 -29
5635b9J52m5J05j64J92j20k00L58l19J88J79l10J01l64J66m0K34l60J25J03N8
$$ -29 123 78 183 19 211 91 -109 249 -70 118 297 -13 88 -276 -110 -150 84 -276 -151 -48 10
5656A0o2L0o2R1J0o5J87j80R2R4%K1N3k67J32jj65K90l15k72L54J08k60K38j54
$$ 10 -52 -22 -84 7 17 -48 139 -41 51 145 145 166 219 -48 84 83 -82 208 -107 -379 -25 83 -177 61 -93
5681i3j87L43J76k66lq7K38r9P0j36J3r4M93l73r7j6o2M8J94L3j67O3O7N7j3N3
$$ -93 -280 63 239 -27 -30 -117 121 22 92 -44 -31 -125 368 -5 -102 -118 -180 -132 62 95 -72 -9 58 115 102 155
5707A55j21K55m21O9n0R7j12J66K32n42J91J2Q8P9p4N3l04L37j76j48J76j45J51
$$ 155 34 289 -132 -63 -113 -16 -128 38 270 -272 -81 -69 19 98 24 77 -227 110 -66 -214 -38 -183 -32
5730c2Q6j23M00k62k83Q5J92o5j5j30L67l00J37n9p7j0Q7J95k35J65l05n4K37
$$ -32 54 -69 331 69 -214 -129 63 -2 -17 -147 220 -80 57 -2 -79 -89 -2 193 -42 123 -182 -236 1
5753Ar9J39j46k0P0K8j54J44J15l60M25j74k5J76K1j74o3J52j97J28p2J81k55
$$ 1 -98 41 -105 -125 -55 -27 -181 -37 78 -282 143 -31 -56 120 141 -33 -96 56 -141 -13 -85 96 -159
5776a59K03J95m6l0j65N0k34M7J81J49j71j33NJ43p1J96K5m58J01L12l05J27j8
$$ -159 44 239 193 163 -2 48 -186 -139 42 191 20 -113 -108 35 -36 160 185 -273 -172 140 -165 -38 -56
5799e6N8J27j83Q5m9J79k0k11J42j2n2l5j96K08L2k0J43j49N2q2k98L77M4J02
$$ -56 2 129 -54 31 -18 161 141 -70 72 60 8 -27 -223 -15 17 -3 140 -9 43 -39 -337 40 84 186
5823A86k34m2J98k86O0j58M93m02J57m2J34j72K29k4k04K39j96q3L38r8j42k0
$$ 186 -48 -90 108 -178 -118 -276 217 -185 -28 -70 64 -108 121 97 -107 132 -64 -147 191 93 -49 -69
5845f9L41k70K7m7j23J93j95J79K6k31J44k8R1j73o5K36j19K46o3j28J6l2L7j76
$$ -69 272 2 29 -18 -141 52 -143 36 62 -169 -25 -53 38 -135 -200 36 -83 163 100 -28 -12 -44 -7 -183
5869a83L09m5j78l4QJ7Q4k44L09M3M2j21N0J52l16J72j93O3L5J53Mj93J99N8j59
$$ -183 126 81 -97 -131 -123 -106 -22 -266 43 86 128 7 57 209 -107 65 -128 -65 -30 123 127 -66 133 191 32
5894C2r3K12J34k84n3l5J7K24m69K58k59J64K19n3j84J77K16k73k17L78k76N70
$$ 32 -61 151 285 1 -52 -87 -70 154 -315 -57 -316 -152 67 14 -170 7 223 -50 -267 111 -165 405
5916D05m72j4K17qL7j31L2k35J20q4J90j9l20P6L89R8nj44K4j75O2j09K02j39
$$ 405 -67 -81 136 128 165 34 66 -169 -49 -133 57 38 -282 -206 183 281 276 132 156 -19 43 -66 136 -3
5940cj78J84K03k59J43p6Pq0O2j44N0K09k90N13l78P2R4l71J19Jj9J99O3q3jm8
$$ -3 -181 3 206 -53 90 14 21 -59 3 -141 -91 118 -172 341 -37 35 129 -242 -123 -122 -141 58 121 38 37 -11
5966a1J15n4j70J81j04Rk3R6k04J09p4M32l42J57o9j05N2l31L84K6J15j87j36
$$ -11 104 50 -120 61 -43 -34 -57 39 -165 -56 -130 302 -40 117 48 -57 -5 -336 48 74 189 2 -134
5989a34L2K32j60K2k8j70J96J22qk45R9Q7p7J07l02K07J48n5J40n5r2j29k0J58
$$ -134 -102 130 -30 -8 -36 -206 -10 112 104 -141 -42 45 -32 75 -227 -20 128 73 213 158 66 -63 -83 75
6013G5M5O4k15OK22l40J70j8p9j15J98J27j7k22K75k46j5K27k0j76J1P5k20J85
$$ 75 120 184 -31 -25 197 -143 27 9 -70 -185 13 140 123 -99 176 -70 -85 142 122 -54 -43 32 -188 -3
6037cM9M2j65R2L23l20r5k5m3K33r9j9J77J7l20K45l1l0l05K57J60k87J55K1j59
$$ -3 46 88 -77 15 338 18 -77 -102 -145 88 -11 -30 147 164 -156 89 58 28 -277 -20 140 -147 8 29 -130
6062a30J03n4L24k37k7J47j22MlJj69l1J30j21J79Rj08J85P1j65l2o4J3K37l30
$$ -130 -27 -81 243 6 -21 126 4 8 5 6 -163 -194 -64 -185 -6 3 -105 80 151 -14 -46 -110 -97 140 -190
6087a90jO8K25j29j45J56j07J18M40j87j62k6J33k95K07j28L4K3J23k84j8K91
$$ -190 -191 -123 102 -27 -172 -16 -123 -5 435 248 86 60 193 -102 105 -23 11 34 157 -127 -145 146
6109A46j92n7J78j92Q8j7l7M19l69N1l65R5L51j11j40M6O9K11q2k35K05oJ6L0
$$ 146 -46 -103 75 -117 -29 -46 -83 336 -33 18 -347 -252 99 -12 -152 -106 -37 174 92 -143 62 56 72 102
6133A02k31K13k84L58j32l5Kq3K08k36j03K04L20Ok57m4k1J1J14J42j42j45J1
$$ 102 -129 84 -200 158 26 -9 -7 -90 118 -118 -221 -17 303 309 52 8 -13 -2 112 254 112 -33 -22
6156b2n1L06l67K51j28K09l51K92l94K04J88K34k03j93L3m6j02Q7j67K87k16p6
$$ -22 -73 233 -134 117 -11 198 -153 139 -255 -51 137 371 168 -25 8 -38 -140 -53 -220 67 -149 -225
6178b25J18o3O4J19J99r7o1M3J11l49J40J42k94K40k2j81Q4n2p6J85j17k50O12
$$ -225 -107 -170 -106 13 212 115 54 97 208 -141 -1 141 -153 87 65 -116 -32 -84 -160 25 -92 -342 270
6201B70j43m51L29j25K36J05O6m20M2J77j57M4k09J85p8J64J42l45O6N2J98j55
$$ 270 127 -324 5 -120 116 221 287 -133 -91 86 -71 -27 -236 -51 -129 35 177 -168 -102 -50 148 -7
6223gq7J42p5j74j2N18m33K28J17m4k49K51k35J11j25J37j2J2oo4J16j89M4k25
$$ -7 -94 48 -27 -201 -213 305 -128 100 217 173 -76 175 -60 51 -74 63 51 63 57 -7 109 -80 -36 -261
6247b61J11L01m7K62m77n2P1R6jJ30j39N1l2J42P2k30k5J13j75M4r6P7J26Nmq
$$ -261 -150 151 104 366 -111 -163 -92 4 3 133 -6 45 13 155 227 -3 -28 85 -90 -46 -142 -65 61 66 62 54
6273E4Q4k21P9J4QN7l18J50O2q6J71k81K20j18K26q2J6K88l98J36L0N3N4k57J13
$$ 54 138 -83 -4 10 18 75 -243 -93 -31 -117 54 -227 -7 -125 101 19 35 323 -75 61 91 144 198 -59 54
6298E4j08J03R2k58J96k47O8k0J05k2k32L06j95J03J41L7O5l93J99O0m2o0j1j1
$$ 54 -54 49 141 -117 79 -168 -100 -120 -15 -37 -269 37 -158 -55 86 123 188 -205 -6 54 12 -48 -59 -70
6322g0J28J35l13k4Q8J36M4j16r4K18l8R6n0l56J84rJ57Mo2j50O1j91R4j14J91
$$ -70 58 193 -120 -144 -56 80 124 8 -86 132 94 190 140 -216 -32 -41 116 120 58 -92 -31 -222 -128 -242 -51
6347e1L0j17J71r8J77N7k89J52K9K0o2R7M2l16Q7j63J95j43M4J64J14l2m82N24
$$ -51 -21 -138 33 -65 112 169 -120 32 61 81 19 116 158 -158 -71 -234 -39 -182 -138 26 140 108 -374 150
6371A50j03K10j38j29j06K79m35K74n5k7J76k65rJ06J48l48J85Q6r3J55J37l51
$$ 150 47 257 119 -10 -116 163 -272 2 -53 -80 96 -169 -178 -72 76 -272 -87 -1 -94 61 198 -153
6393a53J54p4K06m26J21K31k57J95k08j6K30Q3M4m2j70N8N4j37K18j12O5J19N8
$$ -153 1 -73 133 -293 -172 59 -198 -3 -211 -227 3 86 130 88 -82 -24 30 -107 111 -1 64 183 241
6416B41l7j42p6j06j7J13J92j14j04J87j10J72j72Q6k81p6L50j32J3o9K7o3M1
$$ 241 204 62 -14 -120 -137 -24 168 54 -50 137 27 199 27 113 -168 -244 106 -26 -13 -82 -55 -118 -77
6439g7O1J24j14J69Qk91K57M6m88K58N3K39k92K6k32M37k55L55j18l51K41Kl35
$$ -77 -16 108 -6 163 171 -120 137 183 -305 -47 6 245 -47 -21 -253 184 -71 284 166 -185 56 58 -277
$$ [...]
8191G2
##END NTUPLES=NMR FID
##END=
