##TITLE=1H_37-2021
 CDCl3, 8 sc, 
 29.04.2021
##JCAMPDX= 6.0         $$ Bruker NMR JCAMP-DX V2.0
##DATA TYPE= NMR FID
##DATA CLASS= NTUPLES
##ORIGIN= UXNMR, Bruker Analytische Messtechnik GmbH
##OWNER= root
$$ XWIN-NMR		Version 3.5
$$ Thu Apr 29 14:20:38 2021 Russian Standard Time (UT+4h)  she@DPX200
##.OBSERVE FREQUENCY= 200.131506
##.OBSERVE NUCLEUS= ^1H
##.DELAY= (6, 6)
##.ACQUISITION MODE= SIMULTANEOUS
##.ACQUISITION SCHEME= undefined
##.AVERAGES= 8
##.DIGITISER RES= 18
##SPECTROMETER/DATA SYSTEM= spect
##.PULSE SEQUENCE= zg30
##.SOLVENT NAME= CD3CN
##.SHIFT REFERENCE= (INTERNAL, CD3CN, 0, 15.7039)
##AUDIT TRAIL= $$ (NUMBER, WHEN, WHO, WHERE, WHAT)
$$ ##TITLE= Audit trail, XWIN-NMR		Version 3.5
$$ ##JCAMPDX= 5.01
$$ ##ORIGIN= Bruker BioSpin GmbH
$$ ##OWNER= she
$$ F:/spectra/data/she/nmr/H-F/1/audita.txt
$$ ##AUDIT TRAIL=  $$ (NUMBER, WHEN, WHO, WHERE, WHAT)
(   1,<2021-04-29 14:19:21.56 +0400>,<she>,<DPX200>,
      <created by zg, POWCHK disabled, PULCHK disabled
       configuration hash MD5:
       00 E9 B6 7A A2 85 ED C7 34 08 36 98 17 FE 4E 26
       data hash MD5: 16K
       BD 6E 7D B5 B7 41 43 8A 2B 70 C0 F4 11 92 B2 8D>)
$$ ##END=
$$ 
$$ hash MD5
$$ EC 03 45 F9 26 5E 4A 27 32 5C 8C 36 EC FA 78 62
##$RELAX= 
##$RELAX= 
##$RELAX= 
##$RELAX= 
##$RELAX= 
##$RELAX= 
$$ Bruker specific parameters
$$ --------------------------
##$DU= <F:/spectra>
##$EXPNO= 1
##$NAME= <H-F>
##$PROCNO= 1
##$TYPE= <nmr>
##$USER= <she>
##$AMP= (0..31)
100 100 100 100 100 100 100 100 100 100 100 100 100 100 100 100 100 100 
100 100 100 100 100 100 100 100 100 100 100 100 100 100 
##$AQSEQ= 0
##$AQ_mod= 1
##$AUNM= <au_zg>
##$AUTOPOS= <>
##$BF1= 200.13
##$BF2= 200.13
##$BF3= 200.13
##$BF4= 200.13
##$BF5= 200.13
##$BF6= 200.13
##$BF7= 200.13
##$BF8= 200.13
##$BYTORDA= 1
##$CFDGTYP= 0
##$CFRGTYP= 5
##$CHEMSTR= <none>
##$CNST= (0..31)
1 1 145 1 1 1 1 1 1 1 1 1 1 1 1 1 1 1 1 1 1 1 1 1 1 1 1 1 1 1 1 1 
##$CPDPRG= <>
##$CPDPRG1= <>
##$CPDPRG2= <>
##$CPDPRG3= <>
##$CPDPRG4= <mlev>
##$CPDPRG5= <mlev>
##$CPDPRG6= <mlev>
##$CPDPRG7= <mlev>
##$CPDPRG8= <mlev>
##$CPDPRGB= <>
##$CPDPRGT= <>
##$D= (0..31)
0 1.2 0 0 0 0 0 0 0 0.06 0 0.03 0 0 0 0 0.0002 0 0 0 0 0 0 0 0 0 0 0 0 
0 0 0 
##$DATE= 1619691561
##$DBL= (0..7)
120 120 120 120 120 120 120 120 
##$DBP= (0..7)
150 150 150 150 150 150 150 150 
##$DBP07= 0
##$DBPNAM0= <>
##$DBPNAM1= <>
##$DBPNAM2= <>
##$DBPNAM3= <>
##$DBPNAM4= <>
##$DBPNAM5= <>
##$DBPNAM6= <>
##$DBPNAM7= <>
##$DBPOAL= (0..7)
0.5 0.5 0.5 0.5 0.5 0.5 0.5 0.5 
##$DBPOFFS= (0..7)
0 0 0 0 0 0 0 0 
##$DE= 6
##$DECBNUC= <off>
##$DECIM= 32
##$DECNUC= <off>
##$DECSTAT= 4
##$DIGMOD= 1
##$DIGTYP= 9
##$DL= (0..7)
0 120 120 120 120 120 120 120 
##$DP= (0..7)
150 150 150 150 150 150 150 150 
##$DP07= 0
##$DPNAME0= <>
##$DPNAME1= <>
##$DPNAME2= <>
##$DPNAME3= <>
##$DPNAME4= <>
##$DPNAME5= <>
##$DPNAME6= <>
##$DPNAME7= <>
##$DPOAL= (0..7)
0.5 0.5 0.5 0.5 0.5 0.5 0.5 0.5 
##$DPOFFS= (0..7)
0 0 0 0 0 0 0 0 
##$DQDMODE= 0
##$DR= 18
##$DS= 0
##$DSLIST= <SSSSSSSSSSSSSSS>
$$ [...]
##$SUBNAM2= <"">
##$SUBNAM3= <"">
##$SUBNAM4= <"">
##$SUBNAM5= <"">
##$SUBNAM6= <"">
##$SUBNAM7= <"">
##$SUBNAM8= <"">
##$SUBNAM9= <"">
##$SW= 16.9725357007746
##$SWIBOX= (0..15)
0 0 2 0 0 0 0 0 0 0 0 0 0 0 0 0 
##$SW_h= 3396.73913043478
##$TD= 16384
##$TD0= 1
##$TE= 0
##$TE2= 300
##$TE3= 300
##$TEG= 300
##$TL= (0..7)
0 120 120 120 120 120 120 120 
##$TP= (0..7)
150 150 150 150 150 150 150 150 
##$TP07= 0
##$TPNAME0= <>
##$TPNAME1= <>
##$TPNAME2= <>
##$TPNAME3= <>
##$TPNAME4= <>
##$TPNAME5= <>
##$TPNAME6= <>
##$TPNAME7= <>
##$TPOAL= (0..7)
0.5 0.5 0.5 0.5 0.5 0.5 0.5 0.5 
##$TPOFFS= (0..7)
0 0 0 0 0 0 0 0 
##$TUNHIN= 0
##$TUNHOUT= 0
##$TUNXOUT= 0
##$USERA1= <user>
##$USERA2= <user>
##$USERA3= <user>
##$USERA4= <user>
##$USERA5= <user>
##$V9= 5
##$VALIST= <valist>
##$VCLIST= <CCCCCCCCCCCCCCC>
##$VD= 0
##$VDLIST= <DDDDDDDDDDDDDDD>
##$VPLIST= <PPPPPPPPPPPPPPP>
##$VTLIST= <TTTTTTTTTTTTTTT>
##$WBST= 1024
##$WBSW= 4
##$XGAIN= (0..3)
0 0 0 0 
##$XL= 0
##$YL= 0
##$YMAX_a= 255130
##$YMIN_a= -193455
##$ZGOPTNS= <>
##$ZL1= 120
##$ZL2= 120
##$ZL3= 120
##$ZL4= 120
##$ABSF1= 10
##$ABSF2= 0
##$ABSG= 5
##$ABSL= 3
##$ALPHA= 0
##$AQORDER= 0
##$ASSFAC= 0
##$ASSFACI= 0
##$ASSFACX= 0
##$ASSWID= 0
##$AUNMP= <proc_1d>
##$AZFE= 0.1
##$AZFW= 0.1
##$BCFW= 1
##$BC_mod= 2
##$BYTORDP= 1
##$COROFFS= 0
##$CY= 11.3945322036743
##$DATMOD= 1
##$DC= 2
##$DFILT= <>
##$DTYPP= 0
##$F1P= 15.9154993809931
##$F2P= -4.1035820241983
##$FCOR= 0.5
##$FTSIZE= 0
##$FT_mod= 4
##$GAMMA= 1
##$GB= 0.15
##$INTBC= 1
##$INTSCL= 1
##$ISEN= 128
##$LB= 0.24
##$LEV0= 0
##$LPBIN= 0
##$MAXI= 10000
##$MC2= 0
##$MEAN= 0
##$ME_mod= 0
##$MI= 1.114404
##$NCOEF= 0
##$NC_proc= 0
##$NLEV= 6
##$NOISF1= 3.799351
##$NOISF2= 2.8
##$NSP= 1
##$NTH_PI= 0
##$NZP= 0
##$OFFSET= 15.70392
##$PC= 1
##$PHC0= -11119.89
##$PHC1= 9.60102
##$PH_mod= 1
##$PKNL= yes
##$PPARMOD= 0
##$PSCAL= 0
##$PSIGN= 0
##$REVERSE= no
##$SF= 200.130013532006
##$SI= 16384
##$SIGF1= 3
##$SIGF2= 2
##$SINO= 400
##$SIOLD= 16384
##$SREGLST= <1H.CDCl3>
##$SSB= 0
##$STSI= 0
##$STSR= 0
##$SW_p= 3612.71676300578
##$SYMM= 0
##$S_DEV= 0
##$TDeff= 0
##$TDoff= 0
##$TI= <>
##$TILT= no
##$TM1= 0
##$TM2= 0
##$TOPLEV= 0
##$USERP1= <user>
##$USERP2= <user>
##$USERP3= <user>
##$USERP4= <user>
##$USERP5= <user>
##$WDW= 1
##$XDIM= 8192
##$YMAX_p= 0
##$YMIN_p= 0
$$ End of Bruker specific parameters
$$ ---------------------------------
##NTUPLES= NMR FID
##VAR_NAME=  TIME,          FID/REAL,        FID/IMAG
##SYMBOL=    X,             R,               I
##VAR_TYPE=  INDEPENDENT,   DEPENDENT,       DEPENDENT
##VAR_FORM=  AFFN,          ASDF,            ASDF
##VAR_DIM=   8192,          8192,            8192
##UNITS=     SECONDS,       ARBITRARY UNITS, ARBITRARY UNITS
##FACTOR=    0.0002944,     1,               1
##FIRST=     0,             0,               0
##LAST=      2.4114304,     0,               0
##MIN=       0,             -193455,         0
##MAX=       2.4114304,     255130,          0
$$ Real data points
##PAGE= N=1
##DATA TABLE= (X++(R..R)), XYDATA
$$ plain form
0 0 0 0 0 0 0 0 0 0 0 0 -8 8 -8 8 -16 16 -24 24 -32 38 -42 53 -64 72 -84 97 -112 130 -151 173 -197 221 -253
33 -253 285 -321 359 -406 452 -503 561 -622 689 -765 846 -934 1031 -1135 1251 -1377 1517
50 1517 -1670 1840 -2028 2239 -2476 2743 -3050 3405 -3820 4312 -4909 5647 -6588 7830 -9543
65 -9543 12056 -16095 23550 -41596 166471 132185 -193455 247579 -64699 -26677 241649
76 241649 -108969 11857 131814 -138651 104033 43218 -113675 76965 -64481 -48735
86 -48735 62527 -63501 -39629 7447 -73917 3735 48625 -95701 51911 -15941 -65226
97 -65226 139780 -35218 -9360 109059 -93526 93877 139407 -114842 128231 9072 -59441
108 -59441 221598 -73196 -5709 99282 -96782 104899 53906 -90727 50081 -29197 -7845
$$ packed form
0@%%%%%%%%%%qJ6j6J6k4L2m0M8n6P0q0R5j17J36j56J81k09K42k81L24l70M18m74
33b53N38o06O80p65Q58r55J064j183J311j454J611j780J965k166K386k628K894
50A517l187L510l868M267m715N219n793O455p225Q132r221J0556j2235J4418j7373
65i543K1599k8151L9645o5146K08067l4286l25640M41034l12278L8022K68326
76B41649l50618J20826J19957k70465K42684o0815j56893J90640j41446J5746
86d8735J11262j26028K3872M7076q1364P7652M4890j44326J47612o7852m9285
97f5226K05006j74998K5858J18419k02585J87403M5530k54249K43073j19159o8513
108e9441K81039k94794O7487J04991j96064K01681n0993j44633J40808p9278K1352
$$ plain form
119 -7845 91556 -67380 -13425 -3317 -19547 70264 -26545 -27633 -3267 -327 29978 27507 -32803
132 -32803 -17789 36795 -16193 46403 9422 -60502 42156 15349 -17215 63567 -45782 -25882
144 -25882 87341 -54515 45002 25225 -66810 82292 -13796 1707 59445 -37649 28907
155 28907 30116 -19028 60710 -7462 -8909 51071 -36259 48897 16513 -31072 40841 -22591
167 -22591 6958 36662 -13299 -13527 13586 -14501 18009 28878 -40406 -38 13585 -4333
179 -4333 24004 2752 -45596 27173 10524 -12869 41795 -56515 2456 28944 -22454 33649
191 33649 -31922 -28433 33323 -8965 6664 4815 -50084 33644 10139 -14200 32591 -44232
203 -44232 18111 29944 -11334 24077 -7669 -6203 30592 13025 -5095 16701 -11770 12423
$$ packed form
119g845R9401j58936N3955J0108j6230Q9811r6809j088K4366K940L0305k471o0310
132c2803J5014N4584n2988O2596l6981o9924J02658k6807l2564Q0782j09349J9900
144b5882J13223j41856R9517j9777r2035J49102r6088J5503N7738r7094O6556
155B8907J209m9144P9738o8172j447N9980q7330Q5156l2384m7585P1913o3432
167b2591K9549K9704m9961k28K7113k8087L2510J0869o9284M0368J3623j7918
179d333K8337k1252m8348P2769j6649k3393N4664r8310N8971K6488n1398N6103
191C3649o5571L489O1756m2288J5629j849n4899Q3728k3505k4339M6791p6823
203d4232O2343J1833m1278L5411l1746J466L6795j7567j8120K1796k8471K4193
$$ plain form
215 12423 21901 -11539 3196 -446 -1363 1781 5533 -22847 8161 -2627 -20922 17708 -28986
228 -28986 4143 6330 -25055 9763 -6741 -11104 21003 -12144 -11442 22974 -21135 25801 5590
241 5590 -25210 28338 -8857 14020 14242 -19011 5129 14158 -1418 11608 -5493 -17660 22979
254 22979 -4229 4375 -1515 -17732 8071 7572 -882 -9176 -1909 -13253 18014 273 -17906
267 -17906 6501 -14971 10620 7942 -16477 -4725 4065 -7125 13394 -5821 -20921 19572
279 19572 -12865 9813 3107 -21451 13278 620 -161 3864 -8098 -4515 17731 -7075 851
292 851 1328 -11374 19384 -4712 -2034 -1911 -2405 5933 4394 -4887 -9239 8250 -4883 9852 -6053
307 -6053 -10472 7136 -136 4986 -2547 -5410 -2553 15373 -3710 2803 676 -7605 22584 -2540
$$ packed form
215A2423R478l3440J4735l642r17L144L752k8380L1008j0788j8295L8630m6694
228b8986L3129K187l1385L4818j6504m363L2107l3147P02L4416m4109M6936k0211
241E590l0800N3548l7195K2877K22l3253K4140R029j5576J3026j7101j2167M0639
254B2979k7208Q604n890j6217K5803m99q454q294P267j1344L1267j7741j8179
267a7906K4407k1472K5591k678k4419J1752Q790j1190K0519j9215j5100M0493
279A9572l2437K2678o706k4558L4729j2658p81M025j1962L583K2246k4806P926
292H51M77j2702L0758k4096K678J23m94Q338j539r281m352J7489j3133J4735j5905
307f053m419J7608p272N122p533k863K857J7926j9083O513k127q281L0189k5124
$$ plain form
321 -2540 2847 2245 -2095 12953 9015 -3960 -544 5334 -1282 15673 -10659 -4647 2953 -4993
335 -4993 8332 -11429 -8240 -6856 995 -4603 -7112 -11788 -10704 4842 -7992 -2465 -12512 -3722
349 -3722 2170 1773 -2238 -7196 4231 -200 13774 -4405 494 5321 2393 14944 -3091 1379
363 1379 1862 6926 4282 2239 -6988 -35 6693 -5198 4511 -14170 269 1960 -4350 -675 -12263
378 -12263 -517 -950 2749 -7666 -4965 -3120 2886 4652 -7765 -2382 -6014 8592 -60 -2574
392 -2574 -7602 -4786 8226 -2963 836 -13943 -1797 2581 409 -560 -13261 -3760 1419 4945
406 4945 -4693 -4259 -10942 6035 6625 -6646 2208 -13675 7160 5301 -2348 -1677 -7901 1417 2670
421 2670 2370 -8119 -2363 -5729 2875 -272 -6770 -3233 -8144 3977 -6921 -1658 -8075 -4728 -190
$$ packed form
321b540N387o02m340J5048l938j2975L416N878o616J6955k6332O012P600p946
335d993J3325j9761L189J384P851n598k509m676J084J5546j2834N527j0047Q790
349c722N892l97m011m958J1427m431J3974j8179M899M827k928J2551j8035M470
363A379M83N064k644k043r227O953O728j1891R709j8681J4439J691o310L675j1588
378a2263J1746m33L699j0415K701J845O006J766j2417N383l632J4606q652k514
392b574n028K816J3012j1189L799j4779J2146M378k172r69j2701R501N179L526
406D945r638M34o683J6977N90j3271Q854j5883K0835j859p649O71o224R318J253
421B670l00j0489N756l366Q604l147o498L537m911J2121j0898N263o417L347M538
$$ plain form
436 -190 -10275 -901 -10564 -1636 -5884 -10709 -6499 -5518 -6096 -5280 -9314 -14607 3791 -9510 275
451 275 -5773 -14256 6471 -437 7118 -3429 -4144 3568 12081 12503 855 -923 3653 16333 9233
466 9233 7921 -9391 420 10027 2316 5375 -17604 -8951 -5046 1064 -5213 -21266 -16374 -14931
480 -14931 -773 -6112 -18210 -20392 -6002 -5627 2617 -4851 -17992 5702 -2508 10302 5616 -5129
494 -5129 4561 3052 13852 5423 2453 40 1214 5121 6080 -5060 -3115 -523 -12021 5574
508 5574 -8945 -5179 -3903 -14249 -2022 -3635 2294 -8348 -4865 -2957 680 9796 1377 -4816
522 -4816 1127 5863 4661 17001 -8073 -4661 5837 988 15424 -7869 -10765 -7176 3885 7066
536 7066 -8398 -12034 -13208 -1334 7287 -727 -16228 -4233 -6232 8937 14093 -12602 -759
$$ packed form
436a90j0085R374r663Q928m248m825M210R81n78Q16m034n293J8398j3301R785
451B75o048q483K0727o908P555j0547p15P712Q513M22j1648j778M576J2680p100
466I233j312j7312R811R607p711L059k2979Q653L905O110o277j6053M892J443
480a4931J4158n339j2098k182J4390L75Q244p468j3141K3694q210J2810m686j0745
494e129R690j509J0800q429k970k413J174L907R59j1140J945K592j1498J7595
508E574j4519L766J276j0346J2227j613N929j0642L483J908L637R116q419o193
522d816N943M736j202J2340k5074L412J0498m849J4436k3293k896L589J1061L181
536G066j5464l636j174J1874Q621q014j5501J1995j999J5169N156k6695J1843
$$ plain form
549 -759 -2073 13232 15779 1458 -2815 -1221 16412 11700 5527 -1418 -2589 3564 13987 473
563 473 -3530 -1042 -11116 11084 -427 -4545 -5584 -9917 3182 -1860 1492 -8516 -6115 -183
577 -183 -1923 793 2723 -6447 -4128 4010 -5027 12054 -3934 -7493 3195 -2171 10962 -315
591 -315 -2282 -4728 1064 9617 5170 747 -4012 -1978 7916 15987 -2994 96 -4241 5322 19208
606 19208 -190 -1234 -7855 5977 10679 4957 -1454 -12320 1222 7203 5098 -2117 -8820 -11164
620 -11164 9954 5815 -3707 -2819 -15105 8974 6542 1094 -2488 -8648 5011 5335 6664 -996
634 -996 -3847 -218 6985 3695 3898 -2681 -5729 8308 -1560 5431 -2963 -4872 2745 -2602 3987
649 3987 -2895 206 -3391 -2346 1804 1804 563 -2409 -3201 -1254 8358 -2380 2508 -5027 -3266 8909
$$ packed form
549g59j314J5305K547j4321m273J594J7633m712o173o945j171O153J0423j3514
563D73m003K488j0074K2200j1511m118j039m333J3099n042L352j0008K401N932
577a83j740K716J930r170K319Q138r037J7081j5988l559J0688n366J3133j1277
591c15j967k446N792Q553m447m423m759K034R894Q071j8981L090m337R563J3886
606A9208j9398j044o621J3832M702n722o411j0866J3542N981k105p215o703k344
620a1164K1118m139r522Q88j2286K4079k432n448l582o160J3659L24J329p660
634i96k851L629P203l290K03o579l048J4037r868O991q394j909P617n347O589
649C987o882L101l597J045M150%j241k972p92J947R612j0738M888p535J761J2175
$$ plain form
665 8909 -1027 5090 -6686 -4159 3994 4150 3480 -5081 -6919 753 7932 573 -375 -10929 636
680 636 7403 1336 2741 -11017 396 3770 5725 1773 -7230 -2573 1762 8269 818 -3285 -6121
695 -6121 2959 4726 3314 -2483 -7033 4831 -469 6580 -3074 -4586 2941 -1032 5759 -1501 -2042
710 -2042 -695 1991 795 1646 -2527 -1143 2963 -3616 3800 -5159 1264 629 -4793 1466 -4168 2010
726 2010 -1725 -2738 -3730 -99 379 -554 -1644 -5791 1852 -455 3691 -3471 -2708 -373 954 6962
742 6962 -4692 -207 -2702 3570 5875 -1974 -2017 -2548 3352 3617 2172 -6159 440 -402 3668 3415
758 3415 -8117 1690 -2662 4345 2044 -4751 -1739 -291 3987 1067 141 -5066 3586 2297 2618
773 2618 672 -3210 4033 1262 5208 -2428 683 1015 1649 4293 -4168 843 -1518 2169 74 -2727
$$ packed form
665H909r936O117j1776K527Q153J56o70q561j838P672P179p359r48j0554J1565
680F36O767o067J405j3758J1413L374J955l952r003M657M335O507p451m103k836
695f121R080J767j412n797m550J1864n300P049r654j512P527l973O791p260n41
710b042J347K686j196Q51m173J384M106o579P416q959O423o35n422O259n634O178
726B010l735j013r92L631M78r33j090m147P643k307M146p162P63K335J327O008
742F962j1654M485k495O272K305p849m3n31N900K65j445q331O599q42M070k53
758C415j1532R807m352P007k301o795L012J448M278k920r26n207Q652j289L21
773B618j946l882P243k771L946p636L111L32O34K644q461N011k361L687k095k801
$$ plain form
789 -2727 -3570 -439 481 -2529 -1077 -7357 2369 -1776 -1259 -916 -6343 3248 -224 1326 -1894 -1321
805 -1321 1024 4404 1851 -1396 1666 -698 7518 246 941 -625 520 5700 -421 1317 -4371
820 -4371 2165 1213 328 -1752 -5027 420 -528 1136 -4624 -2208 -2821 2470 153 -3957 -210 -3993
836 -3993 5562 -749 -818 -595 -1394 5039 1000 254 -1820 2276 1629 4818 -1572 -932 3002 104 6075
853 6075 -3456 386 164 1836 3001 -2416 -708 -1937 3425 -899 -634 -3657 -1284 1444 -1177 -703
869 -703 -5267 879 -1720 2011 -3175 -4070 1657 -1767 4102 -3645 -1525 402 1729 2127 -779 -2197
885 -2197 -487 4541 -1108 2384 -4942 -136 3461 -1524 1015 -6372 -369 240 373 -2528 -4605 -2242
901 -2242 -365 2581 -3544 -1364 -3546 3044 2502 584 -102 -1955 5589 1438 4551 -1233 662 4812
$$ packed form
789b727q43L131R20l010J452o280R726m145N17L43n427R591l472J550l220N73
805a321K345L380k553l247L062k364Q216p272O95j566J145N180o121J738n688
820d371O536r52q85k080l275N447r48J664n760K416o13N291k317m110L747l783
836c993R555o311o9K23p99O433m039p46k074M096o47L189o390O40L934k898N971
853F075r531L842k22J672J165n417J708j229N362m324K65l023K373K728k621M74
869g03m564O146k599L731n186q95N727l424N869p747K120J927J327L98k906j418
885b197J710N028n649L492p326M806L597m985K539p387O003O09J33k901k077K363
901b242J877K946o125K180k182O590n42j918o86j853P544m151L113n784J895M150
$$ plain form
917 4812 1596 4006 -1355 -268 970 2000 -1855 -389 -3130 -1913 1215 -5992 -264 -5726 -1448
932 -1448 -776 -4369 -1137 -3671 905 -998 -761 -1756 2016 1843 2223 884 -1774 5079 1132 4750
948 4750 -1217 -413 1807 1471 4263 -4296 -826 -2594 1402 1663 -4652 -5028 -3108 617 -105 -1145
964 -1145 -8528 -350 -21 1775 2039 -6601 1323 160 5082 2025 -2236 -961 1384 5497 2700 -341
980 -341 -4415 3235 1374 3420 -1526 -5306 1315 -844 3514 -2631 -1513 -1784 -219 2673 -1640 629
996 629 -2085 113 1871 1907 -742 951 69 -24 3854 -2477 3841 -1239 -1533 1286 -894 3879 -2251
1013 -2251 -1573 -1965 746 1540 586 -3920 -2439 1334 -101 4741 -4892 -2073 -813 1938 4744 -2957
1029 -2957 -2300 -4065 4697 3487 -613 -3854 -4199 2384 3890 860 -5772 -2080 -2434 5456 1693 -4526
$$ packed form
917D812l216K410n361J087J238J030l855J466k741J217L128p207N728n462M278
932a448O72l593L232k534M576j903K37r95L772j73L80j339k658O853l947L618
948D750n967Q04K220l36K792q559L470j768L996K61o315l76J920L725p22j040
964a145p383Q178L29J796K64q640P924j163M922l057m261J275K345M113k797l041
980c41m074P650j861K046m946l780O621k159M358o145J118k71J565K892m313K269
996F29k714K198J758L6k649J693q82r3L878o331O318n080k94K819k180M773o130
1013b251O78l92K711P94r54m506J481L773j435M842r633K819J260K751K806p701
1029b957O57j765Q762j210m100l241l45O583J506l030o632L692l54P890l763o219
$$ plain form
1045 -4526 -1920 -4241 6328 1896 -770 -3455 -3010 4725 3691 539 -3145 -804 597 6219 -586
1060 -586 -926 -537 -1970 5449 -513 1226 -2881 -1236 1846 606 1948 -3100 -266 -493 1297 428
1076 428 859 -1713 -640 792 -861 4959 -2457 34 -1611 453 4908 -1287 -7 -3521 976
1091 976 2991 2001 -1607 -2844 -2043 1993 4640 -2956 -1319 -5455 2209 4939 -1048 -1828 -6409 2318
1107 2318 3230 2125 -3062 -4745 -88 2949 3572 -2391 -3177 -3835 4345 2471 540 -3021 -4844 4718
1123 4718 1540 3273 -3440 -3178 2113 2249 2879 -1774 -1550 -724 3353 830 1607 -2248 -1285 2598 -478
1140 -478 3854 -3276 -278 451 -153 2399 -1347 605 -1455 375 -338 2255 62 -627 -1016 -459 3811
1157 3811 -637 1696 -3745 803 2815 795 2345 -4094 -245 693 3124 864 -2126 -3099 130
$$ packed form
1045d526K606k321J0569m432k666k685M45P735j034l152l684K341J401N622o805
1060e86l40L89j433P419n962J739m107J645L082j240J342n048K834k27J790q69
1076D28M31k572J073J432j653N820p416K491j645K064M455o195J280l514M497
1091I76K015r90l608j237Q01M036K647p596J637m136P664K730n987p80m581Q727
1107B318R12j105n187j683M657L037O23n963p86o58Q180j874j931l561j823R562
1123D718l178J733o713K62N291J36O30m653K24Q26M077k523P77l855R63L883l076
1140d78M332p130K998P29o04K552l746J952k060J830p13K593k193o89l89N57M270
1157C811m448K333n441M548K012k020J550o439L849R38K431k260k990r73L229
$$ plain form
1172 130 3693 705 -773 -6001 1140 1771 2270 -460 -6161 1039 483 3588 -575 -3409 -1838 1364
1188 1364 3361 169 -1147 -3862 2518 2093 2615 -1955 -2742 2048 203 4038 -2738 -922 79 636
1204 636 2101 -1252 -577 -1487 1309 -131 941 -1923 -204 75 -392 1881 -2712 2318 -1087 156
1220 156 915 -1004 2344 -255 577 -585 1972 1053 1940 -552 -740 1894 911 3215 -2182 644 -614
1237 -614 1608 2940 -2532 -115 -2342 2006 1073 -887 -3116 -1748 752 739 359 -4458 -555 -1477
1253 -1477 2324 -558 -3309 -569 -1864 3352 -731 -1135 -2095 -73 2068 650 -442 -2480 1347
1268 1347 374 2486 -1795 -743 555 274 2726 -2801 713 -808 1192 1490 -1468 195 -654 1672
1284 1672 -351 553 -1756 1122 777 332 361 -2499 2414 -607 1342 -1304 -1255 1394 -157 1366 -2160
$$ packed form
1172A30L563k988j478n228P141O31M99k730n701P200n56L105m163k834J571L202
1188A364J997l192j316k715O380m25N22m570p87M790j845L835o776J816J001N57
1204F36J465l353O75r10K796j440J072k864J719K79m67K273m593N030l405J243
1220A56P59j919L348k599Q32j162K557r19Q87k492j88K634r83K304n397K826j258
1237f14K222J332n472K417k227M348r33j960k229J368K500j3l80m817L903r22
1253a477L801k882k751K740j295N216m083m04r60K022K141j418j092k038L827
1268A347r73K112m281J052J298k81K452n527L514j521K000K98k958J663q49K326
1284A672k023R04k309K878l45m45K9k860M913l021J949k646M9K649j551J523l526
$$ plain form
1301 -2160 -252 -426 1502 -420 -1006 -1115 -550 2224 -1370 415 -2928 936 1553 -655 333 -2861
1317 -2861 1760 448 1181 -1151 -1157 379 1477 1495 -1564 516 -1105 3235 257 -456 73 -1232 3309
1334 3309 -586 445 -1658 2 1308 207 -591 -2227 78 -460 1177 -2739 -1153 -1159 61 1066
1350 1066 -3081 -76 -2262 1389 120 -1471 -361 -1008 2216 351 433 -1068 1599 1191 2405 569
1366 569 -575 2734 454 3948 -654 716 1431 1280 2864 -1043 396 -74 2059 578 71 -1589
1382 -1589 -90 1767 -260 801 -2963 993 418 875 137 -2778 953 -468 1844 -1156 -1391 -322
1398 -322 832 1268 -758 -996 -1710 2104 -386 936 -1645 -1015 2237 -522 2014 -2248 112 1113
1414 1113 906 1059 -884 332 809 2348 -348 1030 -735 1670 1611 -391 1485 -1417 2491 66
$$ packed form
1301b160J908j74J928j922n86j09N65K774l594J785l343L864O17k208R88l194
1317b861M621j312P33k332oJ536J098J8l059K080j621M340k978p13N29j305M541
1334C309l895J031k103J660J306j101p98j636K305n38J637l916J586oJ220J005
1350A066m147L005k186L651j269j591J110o47L224j865Q2j501K667m08J214j836
1366E69j144L309k280L494m602J370P15j51J584l907J439m70K133j481n07j660
1382a589J499J857k027J061l764L956n75M57p38k915L731j421K312l000k35J069
1398c22J154M36k026k38p14L814k490J322k581O30L252k759K536m262K360J001
1414A113k07J53j943J216M77J539k696J378j765K405n9k002J876k902L908k425
$$ plain form
1430 66 623 -78 -883 1869 -194 252 -1377 435 253 908 -1523 -921 418 -210 1841 -2680 202
1447 202 -507 1199 1811 -1975 266 -716 2206 1293 81 -1488 372 1741 1865 960 -2543 1486 395
1464 395 3093 190 -1955 537 -162 3453 -391 -849 -1010 432 2145 318 -1043 -2147 689 277
1480 277 2101 -2428 -1292 -367 -77 1931 -2711 -261 -1853 232 696 -1290 -652 -1304 -106 -384 494
1497 494 -1567 517 -846 78 615 -1430 1684 -1472 918 -446 359 1700 -526 428 -1309 999
1513 999 1246 1043 -1362 -321 245 1512 1896 -2209 102 -1563 2253 1392 -1141 -1024 -2400 2477 1267
1530 1267 -178 -2418 -1639 945 2199 132 -2524 -1160 -820 3691 -376 -1199 -1801 -1506 3118 -148
1546 -148 -2 -2741 -1117 1512 1418 -207 -2528 -1148 102 2284 -1176 -685 -1960 7 1656 -1046
$$ packed form
1430F6N57p01q05K752k063M46j629J812j82O55k431O02J339o28K051m521K882
1447B02p09J706O12l786K241r82K922r13j212j569J860J369J24r05l503M029j091
1464C95K698k903k145K492o99L615l844m58j61J442J713j827j361j104K836m12
1480B77J824m529J136R25K90K008m642K450j592K085M64j986O38o52J198k78Q78
1497D94k061K084j363R24N37k045L114l156K390j364Q05J341k226R54j737K308
1513I99K47k03k405J041N66J267L84m105K311j665L816q61k533J17j376M877j210
1530A267j445k240P79K584J254k067k656J364L40M511m067q23o02K95M624l266
1546a48J46k739J624K629r4j625k321J380J250K182l460M91j275J967J649k702
$$ plain form
1562 -1046 771 -2661 224 -8 360 550 -1521 -320 -501 901 -244 189 -1296 497 -351 271 1704
1579 1704 -1574 1161 -1898 1094 1759 -163 -136 -2021 1006 1182 1408 -995 -1020 -588 1551 1790 -534
1596 -534 -575 -2545 2512 1302 1051 -1110 -2908 1954 1680 1772 -1734 -1998 231 2331 1623 -974 -1831
1613 -1831 -1307 2787 788 1321 -2511 -1240 2193 976 2123 -2619 -937 803 1972 1297 -1035 -924
1629 -924 109 2171 635 854 -1562 633 680 639 1696 -2017 900 -550 1040 850 -707 -131 -985
1646 -985 365 -447 541 -350 -156 -1617 118 517 -283 390 -2718 941 257 819 508 -1947 377 544
1664 544 2282 507 -386 -964 1366 2327 1553 175 -1653 2096 1342 3108 -297 -1348 1236 991 3183
1681 3183 -332 -892 -680 1543 1887 303 -1172 -1887 965 945 1516 -2469 -1093 -391 646 1778 -2647
$$ packed form
1562a046J817l432K885k32L68J90k071J201j81J402j145M33j485J793q48O22J433
1579A704l278K735l059K992O65j922K7j885L027J76K26k403k5M32K139K39k324
1596e34m1j970N057j210k51k161j798M862k74R2l506k64K229K100p08k597q57
1613a831N24M094j999N33l832J271L433j217J147m742J682J740J169o75k332J11
1629i24J033K062j536K19k416K195M7m1J057l713K917j450J590j90j557N76q54
1646i85J350q12R88q91J94j461J735L99q00O73l108L659o84N62l11k455K324J67
1664E44J738j775q93n78K330R61p74j378j828L749p54J766l405j051K584k45K192
1681C183l515n60K12K223L44j584j475p15K852k0N71l985J376P02J037J132m425
$$ plain form
1698 -2647 -574 -1291 812 647 -967 -1001 -943 295 -40 401 -1590 418 -530 527 357 -1033 1123
1715 1123 -1029 1058 -97 314 697 -234 665 -438 981 404 1137 -680 317 327 940 1145 -1405 821
1733 821 -870 1796 601 -733 -289 -1097 1332 169 -345 -1902 -800 9 823 -762 -2244 -515
1749 -515 -1026 2005 -1320 -1129 -1252 -735 1807 -818 -214 -1539 457 1149 696 -140 -728 621 810 2144
1767 2144 -800 481 -48 1507 1541 -646 986 -822 1650 294 -84 -360 -497 536 -385 -290 -1509
1784 -1509 52 -1113 -19 -1373 -1602 -41 -1480 524 -2345 -556 -552 -564 59 -1683 -463 -542 776
1801 776 -706 -127 -1116 714 941 -140 450 -1480 1592 429 799 -65 -867 1292 435 1597 -648
1818 -648 107 443 1424 817 -59 150 -228 2120 -100 943 -873 190 1472 -295 590 -1668 250
$$ packed form
1698b647K073p17K103j65j614l4N8J238l35M41j991K008r48J057j70j390K156
1715A123k152K087j155M11L83r31Q99j103J419n77P33j817R97J0O13K05k550K226
1733H21j691K666j195j334M44q08K429j163n14j557J102Q09Q14j585j482J729
1749e15n11L031l325J91j23N17K542k625O04j325J996O92m53q36n88J349J89J334
1767B144k944J281n29J555L4k187J632j808K472j356l78k76j37J033r21R5j219
1784a509J561j165J094j354k29J561j439K004k869J789Mj2O23j742J220p9J318
1801G76j482N79r89J830K27j081N90j930L072j163L70q64q02K159q57J162k245
1818f48P55L36R81o07q76K09l78K348k220J043j816J063J282j767Q85k258J918
$$ plain form
1835 250 158 281 -612 -1085 -622 -339 518 -1654 -248 -1608 793 -124 -930 -60 -1315 1443 -349 252
1853 252 -598 4 1233 273 257 -382 811 344 1425 -496 148 400 311 1683 -1279 461 -721 922
1871 922 587 -796 14 -719 982 49 15 -1164 263 209 257 -49 -1400 765 -709 1320 -772 -959
1889 -959 198 -258 1246 -1005 -474 -796 533 263 -89 -774 -752 1050 -133 982 -1355 565 636 594
1907 594 1129 -1150 1038 26 1455 409 -261 8 504 1091 -189 245 -937 1106 -396 256 -513
1924 -513 -1385 770 -1343 385 -1315 -427 -266 -551 -319 -1448 -342 -591 382 -1146 -401 -821 -63 465
1942 465 -1598 309 -1285 1006 -258 -475 -370 -785 1068 41 152 -1246 -15 164 806 -397 -1243
1959 -1243 0 -473 1671 -1088 -577 -792 -113 1388 -1000 -324 -1520 277 312 200 -1061 -888 -78
$$ packed form
1835B50r2J23q93m73M63K83Q57k172J406j360K401r17q06Q70j255K758j792O01
1853B52q50O02J229r60j6o39J193m67J081j921O44K52q9J372k962J740j182J643
1871I22l35j383Q10p33J701r33l4j179J427n4M8l06j351K165j474K029k092j87
1889i59J157m56J504k251N31l22J329k70l52o85K2J802j183J115k337J920P1m2
1907E94N35k279K188j012J429j046o70K69M96N87j280M34j182K043j502O52p69
1924e13q72K155k113J728j700Q88J61k85K32j129J106k49R73j528P45m20P58N28
1942D65k063J907j594K291j264k17J05m15J853j027J11j398J231J79O42j203q46
1959a243J243m73K144k759N11k15O79J501k388O76j196J797L5j12j261J73Q10
$$ plain form
1976 -78 342 941 -1674 -108 -928 869 640 -1009 -61 -1258 1152 -250 -113 -822 -633 253 -191 -102
1994 -102 -1192 7 -1019 484 -762 -756 -252 -1385 510 -1735 135 -596 -562 -278 -1126 186 -394 353
2012 353 -1192 -362 -652 898 34 -990 62 -1394 1585 -384 -103 -958 -917 975 138 291 -1768
2029 -1768 -625 220 1235 -375 -1155 -1002 -190 1755 -730 -109 -1854 203 1144 7 101 -2045 235
2046 235 351 1024 -342 -1094 -723 421 1298 -741 -242 -1766 1132 308 71 62 -1560 1007 -135 1025
2064 1025 -389 -371 -203 -25 730 -38 -32 -627 757 -420 818 -22 -420 465 -1122 1346 -166 527
2082 527 -524 -688 691 324 994 -970 -374 -312 1096 88 -140 -979 -1200 1374 -324 760 -1834
2099 -1834 -1389 260 242 700 -2112 -1217 -634 1152 131 -696 -1511 -462 1514 614 1173 -1686 472
$$ packed form
1976g8M20N99k615J566q20J797k29j649R48j197K410j402J37p09J89Q86m44Q9
1994a02j090J199j026J503j246ON04j133J895k245J870p31L4K84q48J312n80P47
2012C53j545Q30k90J550q64j024J052j456K979j969K81q55M1J892q37J53k059
2029a768J143Q45J015j610p80J53Q12J945k485O21j745K057R41j137R4k146K280
2046B35J16O73j366p52L71J144Q77k039M99j524K898q24k37rj622K567j142J160
2064A025j414J8J68J78P55p68On95J384j177J238q40l98Q85j587K468j512O93
2082E27j051j64J379l67O70j964N96O2J408j008k28q39k21K574j698J084k594
2099a834M45J649j8M58k812Q95N83J786j021q27q15J049J976r00N59k859K158
$$ plain form
2116 472 973 1779 1612 -855 736 376 2687 1030 107 -173 577 1633 768 326 -1168 852 -188
2133 -188 973 -86 -1170 -13 -1256 1122 -665 -476 -874 -596 318 -299 232 -885 221 -839 818
2150 818 -181 257 126 -949 995 -146 1489 -516 -597 15 389 1288 -320 -161 -939 730 459 889
2168 889 -801 -971 505 283 1779 -1381 -429 -242 732 1487 -724 -372 -846 1176 715 422 -974 -689
2186 -689 509 629 863 -1553 -98 -779 1045 298 -1239 -418 -1125 1140 -166 -247 -1046 -353 179 191
2204 191 402 -756 312 -570 1193 -165 179 300 -213 1367 -235 1081 86 475 733 204 900 282
2222 282 686 -485 499 -231 823 -202 -716 -178 -890 942 -955 -375 -1067 -678 246 -597 -415 -1723
2240 -1723 -250 -381 583 -763 -961 -501 -92 1203 -641 291 -1059 682 973 92 327 -917 911
$$ packed form
2116D72N01Q06j67k467J591l60K311j657r23k80P50J056q65m42j494K020j040
2133a88J161j059j084J157j243K378j787J89l98K78R14o17N31j117J106j060J657
2150H18r99M38j31j075J944j141J635k005q1O12L74Q99j608J59p78J669k71M30
2168H89j690j70J476k22J496l160R52J87R74P55k211L52m74K022m61k93j396K85
2186f89J198J20K34k416J455o81J824p47j537Q21p07K265j306q1p99O93N32J2
2204A91K11j158J068q82J763j358L44J21n13J580j602J316r95L89K58n29O96o18
2222B82M04j171R84p30J054j025n14N38p12J832j897N80o92L89R24q43J82j308
2240a723J473j31R64j346j98M60M09J295j844R32j350J741K91q81K35j244J828
$$ plain form
2257 911 477 1153 -450 -376 191 617 961 -725 182 -872 1364 114 -28 -41 -530 1400 -42 562
2275 562 -601 162 369 370 274 -408 519 -470 657 -751 60 -396 -298 339 -978 284 -954 492 -370
2294 -370 -515 -159 -323 533 -279 91 -503 829 363 585 41 -337 1397 -117 1222 -607 -58 365
2312 365 270 583 -778 -165 -485 702 -394 -202 -973 -389 503 -526 271 -1491 527 -190 208 115 -877
2331 -877 428 -127 928 -359 -44 -115 366 443 -274 232 -677 1014 -347 370 -512 -502 806 -580 636
2350 636 -899 340 113 247 19 -440 349 79 892 -380 555 -247 819 740 -376 654 -634 1214
2368 1214 124 167 -186 -322 563 -159 61 -1143 211 -363 351 -607 -790 -147 -516 751 -1145 -150
2386 -150 -739 18 361 -831 -87 -879 648 -146 -22 -798 -46 276 87 405 -1017 507 -376 757
$$ packed form
2257I11m34O76j603P4N67M26L44j686R07j054K236j250j42j3m89J930j442O04
2275E62j163P63K07Jr6o82R27r89J127j408Q11m56R8O37j317J262j238J446q62
2294c70j45L56j64Q56q12L70n94J332m66K22n44l78J734j514J339j829N49M23
2312C65r5L13j361O13l20J187j096J92p71N84Q92j029P97j762K018p17L98r3r92
2331h77J305n55J055j287L15p1M81P7p17N06r09J691j361P17q82J0J308j386J216
2350F36j535J239k27J34k28m59P89k70Q13j272R35q02J066p9j116J030j288J848
2368A214j090M3l53j36Q85p22K20j204J354n74P14r58j83O43l69J267j896R95
2386a50n89P57L43j192P44p92J527p94J24p76P52L22j89L18j422J524q83J133
$$ plain form
2404 757 19 -665 180 -301 853 -528 -262 -519 372 180 -214 -283 -845 428 -474 287 -939 -237 -95
2423 -95 -220 431 -963 160 -361 336 44 -324 65 53 801 -271 586 -617 791 74 -133 202 -747
2442 -747 843 -517 102 -857 -496 257 -401 -258 -990 -372 -542 288 -815 -648 -570 -289 712 -947 -47
2461 -47 -1036 342 302 -206 -175 -797 672 121 349 -803 -319 -220 610 181 -843 -219 -683 990 -285
2480 -285 -314 -635 -783 555 -584 119 -805 -177 2 160 -166 -585 -92 -640 487 -794 48 -309 -348
2499 -348 307 -752 394 -680 454 -399 92 119 68 363 -257 277 -314 848 -159 261 -325 89 917
2518 917 -355 492 -946 -122 100 39 -48 -1010 -168 -317 797 -378 -396 -1166 70 720 -211 -77 -1273
2537 -1273 645 332 680 12 -850 327 228 839 -509 -605 -636 333 405 -368 -710 -1251 552 -454 204
$$ packed form
2404G57p38o84Q45m81J154j381K66k57Q91j92l94o9n62J273r02P61j226P02J42
2423i5j25O51j394J123n21O97k92l68L89j2P48j072Q57j203J408p17k07L35r49
2442g47J590j360O19r59L61P53o58J43p32O18j70Q30j103J67P8K81J001j659R00
2461d7r89J378m0n08L1o22J469n51K28j152M84R9Q30m29j024O24m64J673j275
2480b85k9l21j48J338j139P03r24O28J79J58l26m19M93n48J127j281Q42l57l9
2499c48O55j059J146j074J134q53M91K7n1K95o20N34n91J162j007M20n86M14Q28
2518I17j272Q47j438Q24K22o1q7r62Q42j49J114j175j8p70J236O50r31J34j196
2537a273J918l13L48o68q62J177r9O11j348r6l1R69P2p73l42n41J803j006O58
$$ plain form
2556 204 -1061 -797 162 -490 606 -769 30 -162 572 576 430 285 -131 894 227 1278 45 489 487
2575 487 288 1126 -224 705 -666 41 -102 144 111 -791 -494 -726 323 -672 -192 -1083 -313 332 -252
2594 -252 576 -1163 204 181 999 669 -633 -126 -83 1422 301 165 -920 371 591 522 112 -1289
2612 -1289 277 -79 1011 -268 -841 -563 -335 920 -320 -344 -979 161 546 313 -315 -810 413 -34
2630 -34 1041 -545 -393 -58 -117 848 -323 58 -746 213 189 130 -31 -517 118 -331 476 -284 308 -572
2650 -572 -22 445 -180 963 -481 169 -292 653 650 -210 -77 -252 666 201 606 -662 65 182 420 778
2670 778 -837 63 -531 978 359 -277 -406 -763 765 294 150 -1089 -345 -97 601 71 -1114 -244
2688 -244 -684 1017 -232 -262 -623 -470 838 -17 108 -753 38 254 691 -36 -530 51 -345 851 -530
$$ packed form
2556B04j265K64R59o52J096j375P99j92P34Mj46j45m16J025o67J051j233M44k
2575D87j99Q38j350R29j371P07j43K46l3r02K97k32J049r95M80q91P70O45n84
2594b52Q28j739J367k3Q18l30j302N07M3J505j121j36j085J291K20o9m10j401
2612a289J566l56J090j279n73K78K28J255j240k4o35J140L85k33o28m95J223m47
2630c4J075j586J52L35n9R65j171L81q04R59k4n9j61m86O35m49Q07p60N92q80
2650e72N50M67o25J143j444O50m61R45lq60J33j75R18m65M05j268P27J17K38L58
2670G78j615R00n94J509o19o36j29l57J528m71j44j239P44K48O98n30j185Q70
2688b44m40J701j249l0l61J53J308q55J25q61P91K16M37p27m94N81l96J196j381
$$ plain form
2707 -530 108 -586 45 457 -342 391 -522 321 -71 316 -11 118 91 -126 477 -104 770 -491 319 -74
2727 -74 201 839 -328 445 -661 342 270 81 -176 -468 16 0 556 -560 -134 -636 396 547 -333
2746 -333 168 -847 803 345 381 -50 -257 571 352 706 -313 33 -188 738 365 -187 -123 -741 869
2765 869 -248 101 -800 -485 106 -437 137 -980 -35 -276 290 -398 -156 -134 -186 600 -285 642 -482 786
2785 786 111 -4 624 -345 695 -109 207 -218 137 126 -123 227 -307 451 -231 459 -504 19 261 -224
2805 -224 503 -915 196 -243 654 124 -49 251 -188 648 109 457 -537 447 201 214 230 -680 467 -167
2825 -167 614 -324 -240 132 -77 572 -549 79 -512 399 -160 39 -328 -453 423 -493 294 -914 -118 43
2845 43 -25 292 -622 335 -213 587 -58 -64 77 166 414 -380 452 -733 730 -79 239 -77 -449 628 -351
$$ packed form
2707e30O38o94O31M12p99P33r13Q43l92L87l27J29k7k17O03n81Q74j261Q10l93
2727g4K75O38j167P73j106J003p2j89k57k92M84j6N56j116M26n02J032J51q80
2746c33N01j015J650m58L6m31k07Q28k19L54j019L46k21R26l73n52O4o18J610
2765H69j117L49r01L15N91n43N74j117R45k41N66o88K42K2n2P86q85R27j124J268
2785G86o75j15O28r69J040q04L16m25L55j1k49L50n34P58o82O90r63N23K42m85
2805b24P27j418J111m39Q97n30j73L00m39Q36n39L48r94R84k46J3J6r10J147o34
2825a67P81r38Q4L72k09O49j121O28n91R11n59J99l67j25Q76r16P87j208P96J61
2845D3o8L17r14R57n48Q00o45oJ41Q9K48p94Q32j185J463q09L18l16l72J077r79
$$ plain form
2866 -351 354 -726 54 -201 81 -16 -469 189 -279 588 -372 175 -91 167 482 -253 518 -438 715 486
2886 486 256 -65 -212 555 -14 365 -340 250 -225 393 -25 -597 304 -509 531 -482 -62 -140 -197 395
2906 395 -244 156 -519 379 -36 331 -167 -249 169 -259 325 -542 294 -371 160 114 -593 191 -301 460 -331
2927 -331 -117 -255 126 250 21 185 -265 550 -341 534 -282 -134 404 -350 398 -636 193 -71 249 -302
2947 -302 -497 -81 -229 507 -466 66 -383 355 383 -237 302 -480 883 -7 640 19 -149 592 367 742
2967 742 -472 400 -202 682 -248 -216 -304 -512 624 -604 24 -876 -386 78 -197 145 -691 285 -148 616
2987 616 -103 103 315 166 497 -218 727 -446 541 67 -45 222 -493 376 -411 -26 -591 -250 -424 -390
3007 -390 -367 -752 123 -696 184 -719 89 161 -99 382 -493 623 118 687 362 -48 363 241 790 -155
$$ packed form
2866c51P05j080P80k55K82r7m53O58m68Q67r60N47k66K58L15p35P71r56J153k29
2886D86k30l21j47P67n69L79p05N90m75O18m18n72R01q13J040j013M20p8n7N92
2906C95o39M00o75Q98m15L67m98q2M18m28N84q67Q36o65N31m6p07P84m92P61p91
2927c31K14j38L81J24k29J64m50Q15q91Q75q16J48N38p54P48j034Q29k64L20n51
2947c02j95M16j48P36r73N32m49P38K8o20N39p82J363q90O47o21j68P41k25L75
2967G42j214Q72o02Q84r30L2q8k08J136j228O28r00M90M64k75L42q36R76m33P64
2987F16p19K06K12j49L31p15R45j173R87m74j12K67p15Q69p87L85n65L41j74L4
3007c90K3l85Q75q19Q80r03Q08P2k60M81q75J116n05N69l25m10M11j22N49r45
$$ plain form
3027 -155 368 -529 500 72 90 -53 -793 711 -224 322 -574 -452 -18 226 505 -423 -11 -528 789
3046 789 138 464 -159 -114 687 94 778 -726 264 195 77 341 -541 85 -558 335 -263 31 -501 -298
3066 -298 -113 -273 379 -751 225 -490 255 207 -321 348 -396 483 -152 522 -29 -93 -175 -34 590 -158 384
3087 384 -595 246 -159 274 58 -644 192 -305 565 -67 -187 -279 26 690 -42 69 -562 375 30 570
3107 570 -184 -598 279 -92 1169 -326 113 -288 2 662 -215 -80 -767 212 -41 478 -464 -326 29
3126 29 40 679 -630 91 -449 211 441 -83 239 -452 385 -99 425 -192 -337 -101 -19 308 -333 305 -686
3147 -686 348 -135 52 169 -685 222 -375 540 -212 -64 -532 -157 224 -108 281 -607 68 -195 575 110
3167 110 -332 44 -425 938 -55 193 -426 -123 517 300 314 -540 172 -46 765 -162 -264 -371 -144 925
$$ packed form
3027a55N23q97J029m28J8j43p40J504r35N46q96J22M34K44K79r28M12n17J317
3046G89o51L26o23M5Q01n93O84j504R90o9j18K64q82O26o43Q93n98K94n32K03
3066b98J85j60O52j130R76p15P45m8n28O69p44Q79o35O74n51o4q2J41O24p48N42
3087C84r79Q41m05M33k16p02Q36m97Q70o32j20r2L05O64p32J11o31R37l45N40
3107E70p54m14Q77l71J261j495M39m01K90O60q77J35o87R79k53N19r42J38L55
3126B9J1O39j309P21n40O60K30n24L22o91Q37m84N24o17j45K36Q2L27o41O38r91
3147f86J034m83J87J17q54R07n97R15p52J48m68L75L81l32L89q88O75k63P70m65
3167A10m42L76m69J363r93K48o19L03O40k17J4q54P12k18Q11r27j02j07K27J069
$$ plain form
3187 925 -327 181 -732 28 271 43 277 -611 209 7 739 -220 -77 -176 153 515 -237 407 -461 466
3207 466 4 142 213 -524 296 -335 311 -358 -64 -277 -46 68 -243 158 -927 210 -610 243 -60 -254
3227 -254 122 -574 425 -198 185 -363 -28 261 321 286 -240 250 -525 672 10 -46 -83 -485 510 -160 558
3248 558 -722 -42 41 190 218 -454 7 -366 566 -183 265 -275 -150 358 -174 372 -717 270 141 -37
3268 -37 431 -288 131 -192 521 -212 127 -148 217 177 -133 389 -582 277 -407 93 -120 -157 210 -452 132
3289 132 -440 160 -245 -160 -303 -196 41 -330 283 -531 401 -71 204 196 -364 398 -222 319 -188 -85 -283
3310 -283 -172 170 18 187 -504 300 -229 31 -314 -159 162 -389 306 -434 97 -224 129 296 -273 69
3330 69 -142 440 -120 423 -48 83 229 49 390 -442 268 -173 205 -71 -267 247 -188 336 -363 150
$$ packed form
3187I25j252N08r13P60K43k28K34q88Q20k02P32r59J43r9L29L62p52O44q68R27
3207D66m62J38P1p37Q20o31O46o69K94k13K31J14l11M01j085J137q20Q53l03j94
3227b54L76o96R99o23L83n48L35K89O0l5n26M90p75J197o62n6l7m02R95o70P18
3248E58j280O80Q3J49K8o72M61l73R32p49M48n40J25N08n32N46j089R87j29j78
3268c7M68p19M19l23P13p33L39k75L65m0l10N22r71Q59o84N00k13l7L67o62N84
3289A32n72O00m05Q5j43J07K37l71O13q14R32m72K75qn60P62o20N41n07J03j98
3310b83J11L42j52J69o91Q04n29K60l45J55L21n51O95p40N31l21L53J67n69L42
3330F9k11N82n60N43m71J31J46j80L41q32P10m41L78k76j96N14m35N24o99N13
$$ plain form
3350 150 -232 281 -27 133 139 -190 553 -408 383 -261 -12 211 -373 238 -596 174 -190 127 -316 -272 -104
3371 -104 -368 65 -617 77 -515 460 -106 -240 172 -349 704 -93 394 -119 170 265 203 395 -158 248
3391 248 -66 422 -182 -25 -341 -335 294 -466 289 -419 3 18 -202 36 -261 183 73 561 -126 300 87
3412 87 474 540 -171 620 -182 626 100 -20 191 -215 384 -196 129 -286 74 -284 11 -191 -246 191 -366
3433 -366 283 -335 324 -62 -10 350 -247 487 -93 471 22 191 -30 105 236 -172 149 -426 138 -328
3453 -328 -112 -386 -400 42 -359 238 -584 -125 -318 -34 71 -326 168 -346 490 53 318 -37 277 529
3473 529 -84 420 -324 272 -102 161 -8 -291 184 -185 163 -307 59 -325 94 0 -204 226 -280 399
3493 399 -290 322 -107 51 271 5 515 -18 486 -157 54 -51 -66 13 -183 130 -606 265 -310 -106 -178
$$ packed form
3350A50l82N13l08J60Ol29P43r61P91o44K49K23n84O11q34P70l64L17m43M4J68
3371a04k64M33o82O94n92R75n66j34M12n21J053p97M87n13K89R5o2J92n53M06
3391B48l14M88o04J57l16OO29p60P55p08M22J5k20K38k97M44j10M88o87M26k13
3412H7L87O6p11P91q02Q08n26j20K11m06N99n80L25m15L60l58K95k02n5M37n57
3433c66O49o18O59l86N2L60n97P34n80N64m49J69k21J35J31m08L21n75N64m66
3453c28K16k74j4M42m01N97q22M59j93K84J05l97M94n14Q36m37K65l55L14K52
3473E29o13N04p44N96l74K63j69k83M75l69L48m70L66l84M19r4k04M30n06O79
3493C99o89O12m29J58K20k66N10n33N04o43K11j05j5P9j96L13p36Q71n75K04p2
$$ plain form
3514 -178 -383 -26 -316 308 -388 -99 -191 111 300 -192 129 -375 584 67 257 -167 -196 299 -216 290 -546
3535 -546 -10 -277 108 75 -250 -115 -378 349 -141 117 -554 -4 -12 93 345 -359 337 -104 469 -19 -59
3556 -59 174 -123 394 -24 158 -327 142 -175 157 247 -334 152 -443 456 -76 130 116 -219 252 -253 336
3577 336 -105 79 -262 256 191 -18 32 -376 420 -114 263 -167 -158 80 -251 406 -357 -199 -331 68 124 69
3599 69 -162 -425 159 -163 311 -445 -127 -88 -50 389 -466 186 -446 153 213 -17 97 -467 302 117 450
3620 450 -215 35 -183 345 183 -380 321 -385 522 24 205 66 -180 202 83 199 -235 21 -286 307
3640 307 17 31 127 -269 255 -206 352 -208 44 124 -115 449 -146 185 -300 301 74 194 41 -216 169
3661 169 -85 521 -326 96 -108 -73 457 -265 -1 -627 -106 -80 55 -138 -213 -91 -89 542 -330 -112 -488 55
$$ packed form
3514a78k05L57k90O24o96K89r2L02J89m92L21n04R59n17J90m24k9M95n15N06q36
3535e46N36k67L85l3l25J35k63P27m90K58o71N50qJ05K52p04O96m41N73m88m0
3556e9K33k97N17m18J82m85M69l17L32R0n81M86n95Q99n32K06j4l35M71n05N89
3577C36m41J84l41N18o5k09N0m08P96n34L77m30RK38l31O57p63J58j32L99N6n5
3599F9k31k63N84l22M74p56L18L9L8M39q55O52o32N99O0k30J14n64P69j85L33
3620D50o65K50k18N28j62n63P01p06R07m98J81j39k46L82j19J16m34K56l07N93
3640C07k90J4R6l96N24m61N58n60K52Q0k39N64n95L31m85O01k27J20j53k57L85
3661A69k54O06q47M22k04L5N30p22K64o26N21K6J35j93p5J22KO31q72K18l76N43
$$ plain form
3683 55 199 -141 27 -464 260 69 218 -19 -330 99 -131 475 -283 15 -266 239 143 -164 71 -450 181
3704 181 -237 242 -272 -51 158 -128 267 -210 111 -427 262 -15 158 23 -36 277 -305 416 -85 107
3724 107 -290 -300 358 -96 199 -250 124 -151 70 -106 -229 -263 -322 124 -148 279 -438 -77 -34 -153 137
3745 137 -478 188 -223 253 -37 -305 -180 -82 494 -94 161 -379 120 1 -140 76 -478 250 -245 283
3765 283 -193 -171 -163 -225 125 -239 34 -299 201 -124 262 -69 -195 231 -172 387 -111 200 -23 -78 202 -125
3787 -125 184 -182 242 -106 48 -146 -97 -22 -260 231 -63 252 -207 -116 104 -41 530 -310 208 -130 85
3808 85 29 74 82 -152 178 -65 111 -298 -24 -89 -50 143 -438 16 -491 80 -3 -110 -136 -96 205 -7 370
3831 370 -149 355 -68 167 219 -123 349 -289 277 -138 213 46 -92 -5 -264 -27 -321 58 -282 226 -245
$$ packed form
3683E5J44l40J68m91P24j91J49k37l11M29k30O06p58K98k81N05r6l07K35n21O31
3704A81m18M79n14K21K09k86L95m77L21n38O89k77J73j35n9L13n82P21n01J92
3724A07l97j0O58m54K95m49L74k75K21j76j23l4n9M46k72M27p17L61M3j19K90
3745A37o15O66m11M76k90k68J25R8N76n88K55n40M99j19j41K16n54P28m95N28
3765B83m76K2Qo2L50l64K73l33N00l25L86l31j26M26m03N59m98L11k23n5K80l27
3787a25L09l66M24l48J54j94M9P5k38M91k94L15m59R1K20j45N71q40N18l38K15
3808H5n6M5Qk34L30k43J76m09K74o5L9J93n81M54n07N71q3j07k6M0L01k12L77
3831C70n19N04m23K35N2l42M72o38N66m15L51j67j38Q7k59K37k94L79l40N08m71
$$ plain form
3852 -245 -25 146 -216 495 -240 252 -70 121 143 55 313 -143 328 116 428 47 185 31 -28 170 -260
3873 -260 300 -423 194 -85 -68 152 -158 62 -232 173 -259 35 -32 5 44 31 175 -132 276 -180 330 48
3895 48 -98 205 -353 283 -34 164 -259 -101 2 -257 63 -382 61 -302 60 -114 -206 -69 -282 197 -299
3916 -299 234 4 270 109 19 55 -15 178 -45 48 -200 176 -63 5 207 -195 282 -380 250 -110 -76 222
3938 222 -150 265 -82 295 -34 263 156 53 228 -128 472 -165 379 -104 122 -210 -122 169 -440 152
3958 152 -113 -72 -65 -70 -105 -326 274 -188 17 -227 185 63 35 45 -358 233 -238 345 -190 63 -129 -96 92
3981 92 -125 185 -391 20 -265 94 -72 -127 62 -330 231 -320 67 -118 43 294 -217 291 -176 99 -34
4002 -34 56 -19 54 128 -119 331 -137 301 -189 212 131 -245 319 -273 326 -292 165 -120 67 -41 -102 138
$$ packed form
3852b45K20J71l62P11p35M92l22J91K2q8K58m56M71k12L12l81J38j54n9J98m30
3873b60N60p23O17k79J7K20l10K20k94M05m32K94o7L7L9j3J44l07M08m56N10k82
3895D8j46L03n58O36l17J98m23J58J03k59L20m45M43l63L62j74r2J37k13M79m96
3916b99N33k30K66j61r0L6p0J93k23R3k48L76k39O8K02m02M77o62O30l60L4K98
3938B22l72M15l47L77l29K97j07j03J75l56O00o37N44m83K26l32Q8K91o09N92
3958A52k65M1Pnl5k21O00m62K05k44M12j22k8J0m03N91m71N83n35K53j92L3J88
3981I2k17L10n76M11k85L59j66n5J89l92N61n51L87j85J61K51n11N08m67K75j33
4002c4R0p5P3P4k47M50m68M38m90M01q1l76N64n92N99o18M57k85J87j08o1K40
$$ plain form
4024 138 -162 215 -347 200 43 -56 174 -288 370 -61 252 -25 -174 -51 34 109 -167 33 -395 135 -96
4045 -96 129 38 -159 40 -260 282 -80 171 -39 -120 20 -163 174 -265 169 -189 366 -164 -49 187 -214
4066 -214 241 -220 215 -160 -103 15 -94 128 -114 88 -235 184 -79 182 -4 -101 291 -147 397 -248 210
4087 210 16 265 30 -217 208 -242 256 -175 93 -196 -35 163 -48 334 -328 65 -252 121 150 -113
4107 -113 236 -218 515 8 39 -170 -68 -47 13 218 -252 122 -292 326 -213 -193 -155 -197 238 -154 204 -331
4129 -331 -75 -68 91 41 -17 16 -101 242 50 23 -183 -279 152 -146 132 -516 186 -131 121 157 -47 37 -281
4152 -281 257 -278 176 -175 64 152 7 407 -308 163 -186 137 261 142 46 -351 222 -99 218 -110 -16
4173 -16 13 -106 309 -29 270 -103 145 -99 96 3 -275 176 -98 213 -215 11 -147 134 66 -111 52
$$ packed form
4024A38l00L77n62N47j57r9K30m62O58m31L13k77j49J23Q5P5k76K00m28N30k31
4045i6K25r1j97J99l00N42l62K51k10q1J40j83L37m39M34l58N55n30J15K36m01
4066b14M55m61M35l75N7J18j09K22k42K02l23M19k63K61j86r7L92m38N44o45M58
4087B10j94K49k35k47M25m50M98m31K68k89J61J98k11L82o62L93l17L73K9k63
4107a13L49m54P33n07L1k09J02K1O0K05m70L74m14O18n39K0L8m2M35l92L58n35
4129c31K56PJ59n0n8L3j17L43j92k7k06r6M31k98K78o48P02l17K52L6k04Q4l18
4152b81N38n35M54l51K39Q8j45M00p15M71l49L23J24j19r6l97N73l21L17l28R4
4173a6K9j19M15l38K99l73K48k44J95r3k78M51k74L11m28K26j58K81o8j77J63
$$ plain form
4194 52 -299 200 -169 -3 -218 -281 170 -138 264 -53 140 -122 -7 13 -89 -97 -247 48 -132 257 -161 -185
4216 -185 29 -172 348 -228 196 -196 114 -79 42 145 -319 258 -54 258 -222 277 -177 112 216 -187
4236 -187 256 -278 314 109 143 64 -151 118 -274 218 -74 212 -212 97 122 20 179 -274 217 23 253
4257 253 -222 -9 106 -162 269 -161 102 -153 20 71 -103 21 -338 62 -204 136 -52 -62 -87 -70 260
4278 260 -197 84 -227 140 -25 -69 87 -125 165 -156 111 -115 134 -158 46 99 -84 125 -159 199 -183
4299 -183 151 47 -149 110 -191 230 -198 117 -19 130 43 -19 276 -245 218 -243 171 -54 58 49 -294
4320 -294 201 -165 122 -250 200 -11 -119 -12 -249 240 -280 327 -234 69 -101 -18 60 -208 172 -405 150
4341 150 -98 11 87 -273 59 -103 149 -206 131 -44 -89 -12 -142 115 -292 76 -183 -26 -80 -88 -24 -134
$$ packed form
4194E2l51M99l69J66k15o3M51l08M02l17J93k62J15K0j02qj50K95j80L89m18k4
4216a85K14k01N20n76M24l92L10j93J21J03m64N77l12L12m80M99m54K89J04m03
4236a87M43n34N92k05L4p9k15K69l92M92k92K86m24L09K5j02J59m53M91j94K30
4257B53m75K13J15k68M31m30K63k55J73N1j74J24l59M00k66L40j88j0k5J7L30
4278B60m57K81l11L67j65m4J56k12K90l21K67k26K49k92K04N3j83K09k84L58l82
4299a83L34j04j96K59l01M21m28L15j36J49q7o2K95n21M63m61M14k25J12rl43
4320b94M95l66K87l72M50k11j08J07k37M89n20O07n61L03j70Q3P8k68L80n77N55
4341A50k48J09P6l60L32j62K52l55L37j75m5P7j30K57m07L68k59J57n4qO4j10
$$ plain form
4363 -134 56 -118 160 -222 121 -56 -128 152 -247 164 -324 164 -49 59 -61 -287 264 -153 145 -122
4383 -122 9 -74 15 70 -66 289 -136 155 58 212 56 -114 239 -115 184 -132 295 -43 127 5 -112
4404 -112 165 -7 228 -155 486 -3 76 152 -99 128 -412 218 -302 -116 -193 1 145 -189 132 -228 224
4425 224 -302 74 -11 -85 236 -228 259 -187 107 -65 111 94 -123 158 -153 86 -184 158 -63 -60 -24 -47
4447 -47 97 -218 186 -58 10 101 105 148 -79 437 -136 148 65 16 -48 -117 350 -232 321 -48 111 -88 115
4470 115 84 -144 345 -264 165 -202 -2 -54 -15 88 15 211 -247 306 -126 -29 -90 13 213 -72 57 -106
4492 -106 9 -161 56 -70 -176 51 -113 180 -151 49 -152 63 152 -211 84 -384 113 10 140 -38
4512 -38 -69 103 -188 152 -112 64 -185 -9 -116 -173 -1 -246 265 -112 138 -41 56 171 -202 -64 -252
$$ packed form
4363a34J90j74K78l82L43j77p2K80l99M11m88M88k13J08j20k26N51m17K98k67
4383a22J31q3Q9N5j36L55m25K91r7J54j56j70L53l54K99l16M27l38J70j22j17
4404a12K77j72K35l83O41m89P9P6k51K27n40O30n20J86p7J94J44l34L21l60M52
4425B24n26L76q5p4L21m64M87m46K94j72J76j7k17K81l11K39k70L42k21LL6k3
4447d7J44l15M04k44O8R1MM3k27N16n73K84q3m9o4o9M67n82N53l69J59j99K03
4470A15l1k28M89o09M29l67K00n2L9J03p3J96m58N53m32R7o1J03K00k85J29j63
4492a06J15j70K17j26j06K27j64K93l31K00k01K15Q9l63K95m68M97j03J30j78
4512c8l1J72k91L40k64J76k49J76j07n7J72k45N11l77K50j79R7J15l73J38j88
$$ plain form
4533 -252 113 57 -31 -52 111 212 -250 231 -294 91 -94 -90 -17 102 7 -165 349 -183 -76 -4 -62 -37 -84 101
4557 101 -127 259 -176 275 -13 78 219 -336 -91 -217 463 -169 267 16 -274 -298 -267 -2 -101 100 -200
4578 -200 -198 427 -228 -144 -4 471 -391 70 278 357 45 108 246 11 213 -428 25 -74 -46 -67 -51 -65 -271
4601 -271 242 -228 -42 21 52 272 -318 275 -72 4 -62 207 0 -40 172 -107 160 -84 172 -209 67 47
4623 47 -103 184 -281 148 -202 268 15 -50 101 -3 98 -150 289 -286 84 35 143 173 -156 -97 -124 261
4645 261 -91 -127 -122 -195 202 -91 163 -316 36 -72 202 11 -165 291 -139 315 -152 23 -263 -8 165
4666 165 -170 196 -66 182 -23 298 50 -129 47 -77 173 -173 21 -151 113 -57 -130 225 -165 279
4686 279 17 106 -39 114 69 -240 248 -9 -128 -237 37 8 20 33 -61 -19 -116 178 -76 21 -44 -233 -51
$$ packed form
4533b52L65n6q8k1J63J01m62M81n25L85j85MP3J19r5j72N14n32J07P2n8K5m7J85
4557A01k28L86m35M51k88R1J41n55K45j26O80o32M36k51k90k4L1K65r9K01l00
4578b00KO25o55Q4J40M75q62M61K08P9l12O3J38k35K02o41M53r9K8k1J6j4k06
4601b71N13m70J86O3L1K20n90N93l47P6o6K69k07m0K12k79K67k44K56l81K76k0
4623D7j50K87m65M29l50M70k53o5J51j04J01k48M39n75L70m9J08L0l29N9k7L85
4645B61l52l6Np3L97k93K54m79L52j08K74j91j76M56m30M54m67J75k86K55J73
4666A65l35L66k62K48k05L21k48j79J76j24K50l46J94j72K64j70p3L55l90M44
4686B79k62Q9j45J53m5l09M88k57j19j09K74k9J2J3r4M2r7K94k54R7o5j89J82
$$ plain form
4709 -51 -1 247 -228 149 -46 193 -59 -47 -21 -216 285 21 22 -153 -32 -148 -30 108 -222 24 -260 62
4731 62 30 -134 -46 -119 156 -127 29 -231 8 11 -201 183 -95 176 52 43 -115 49 -41 99 183 -123 25
4754 25 -122 256 -133 26 -5 -142 -132 -121 152 7 24 -189 1 125 -208 315 -2 70 -18 116 154 -31 198
4777 198 -244 188 -180 192 -124 -27 -9 -42 -39 -200 168 -290 227 -105 75 55 -198 100 -190 122 -192 53
4799 53 -107 -67 128 54 355 -249 219 58 56 -144 -217 -35 -160 93 -194 -37 -22 -69 35 -306 107 -34 49
4822 49 -75 80 93 -105 185 -104 151 -285 171 -201 171 47 -170 226 -35 177 -82 24 26 101 164 -8
4844 -8 9 -232 -30 -93 134 -128 230 163 -33 163 -269 312 -142 -8 -75 99 206 -82 233 -161 -103 -85 117
4867 117 -128 -180 26 -144 80 -186 -52 -75 -9 31 -81 -155 -71 167 -89 261 -152 50 -88 -47 144 -401
$$ packed form
4709e1N0K48m75L77j95K39k52J2K6j95N01k64Jj75J21j16J18J38l30K46k84L22
4731F2l2j64Q8p3K75k83J56k60K39Lk12L84k78K71j24rj58J64r0J40Q4l06J48
4754B5j47L78l89J59l1j37J0J1K73j45J7k13J90J24l33N23l17P2q8J34L8j85K29
4777A98m42M32l68L72l16R7J8l3Lj61L68m58N17l32J80k0k53K98k90L12l14K45
4799E3j60M0J95p4L01o04M68j61kk00p3J82j25K53k87J57J5m7J04l41M13j41Q3
4822D9j24J55J3j98K90k89K55m36M56l72L72j24k17L96k61K12k59J06KP5O3j72
4844hJ7k41K02o3K27k62L58o7j96J96m32N81m54J34o7J74J07k88L15l94N8J8K02
4867A17k45n2K06j70K24k66J34k3O6M0j12p4Q4K38k56L50m13K02j38M1J91n45
$$ plain form
4889 -401 254 -48 -42 42 -151 90 -92 192 -230 73 -257 14 52 -77 88 -198 210 -39 242 40 49 75
4911 75 -7 174 -157 152 -28 170 9 97 245 -75 239 -184 222 -144 124 130 -30 131 -253 155 -93 163
4933 163 -185 80 -39 -41 117 -35 50 -141 96 -87 9 66 -50 256 -219 166 -45 30 16 27 104 -167 242
4956 242 -249 109 -77 27 -1 -38 128 -253 113 -342 14 -51 -77 41 -107 168 -118 97 -72 107 -95
4977 -95 108 64 -134 150 -147 180 -149 -62 89 131 201 -123 167 -243 70 -19 -31 -54 18 148 -147 58 -279
5000 -279 251 -95 102 -11 -158 247 -81 266 -97 28 -78 6 217 -19 -36 -107 244 -8 -27 -5 52 159
5022 159 -73 93 -174 370 -56 -62 -50 -133 96 -95 117 -86 65 -354 28 -57 -306 -58 -213 -5 -87 3
5044 3 4 -71 215 -17 334 -82 15 -77 71 31 -7 55 -319 258 -148 -21 -225 235 145 -165 94 19 296 -174
$$ packed form
4889d01O55l02OQ4j93K41j82K84m22L03l30K71L8j29J65k86M08k49K81k02RK6
4911G5q2J81l31L09j80J98j61Q8J48l20L14m23M06l66K68Oj60J61l84M08k48K56
4933A63l48K65j19kJ58j52Q5j91K37j83R6N7j16L06m75L85k11P5j4J1P7k71M09
4956B42m91L58j86J04k8l7J66l81L66m55L56o5k6J18j48K75k86K15j69J79k02
4977i5K03m4j98K84k97L27l29Q7J51M2P0l24K90m10L13q9j2k3P2J30k95K05l37
5000b79N30l46J97j13j47M05l28L47l63J25j06Q4K11k36j7p1L51k52j9K2N7J07
5022A59k32J66k67N44m26oJ2q3K29j91K12k03J51m19L82q5k49K48j55K08q2R0
5044CJp5K86k32L51m16R7r2J48m0l8O2l74N77m06J27k04M60r0l10K59p5K77m70
$$ plain form
5068 -174 82 -26 37 102 68 334 -191 181 -83 139 70 -118 228 -60 320 -182 -23 -77 79 185 -112 61
5090 61 -193 79 -152 292 -106 -85 -158 -101 154 -264 86 -174 -24 -29 -189 -20 -122 203 -145 113 -191 95
5112 95 -60 49 103 -2 339 -202 280 -5 19 -48 -54 82 -109 225 28 42 -193 -104 157 113 134 -251 177
5135 177 26 263 109 96 118 -119 161 -67 164 -28 -22 43 101 -82 -191 15 -135 298 -134 -23 -138 -158
5157 -158 102 -87 249 28 283 -45 141 13 -67 170 142 445 83 100 18 16 128 -227 79 -355 121 -64
5179 -64 -140 -190 -92 30 -140 -54 -230 -86 -67 161 17 90 218 -134 135 -132 234 -9 51 84 -186 110 -34
5202 -34 177 -170 -74 48 73 36 -216 94 -345 180 -114 153 -119 60 335 -28 332 -169 125 27 314 265
5224 265 -67 178 20 394 17 4 -42 -28 98 -100 184 -392 18 -146 -26 -70 -243 195 -265 207 -93
$$ packed form
5068a74K56j08O3O5l4K66n25L72k64K22o9j88L46k88L80n02J59n4J56J06k97J73
5090F1k54K72k31M44l98K1p3N7K55m18L50k60J50nj60J69j02L25l48K58l04K86
5112I5j55J09N4j05L41n41M82k85K4o7oJ36j91L34j97J4k35Q9K61m4K1l85M28
5135A77j51K37j54j3K2k37K80k28K31j92OO5N8j83j09K06j50M33m32J11j15k0
5157a58K60j89L36k21K55l28J86j28q0K37k8L03l62J7q2kJ12l55L06m34M76j85
5179f4p6n0R8J22j70Q6j76J44J9K28j44P3J28l52K69k67L66k43O0L3k70K96j44
5202c4K11l47R6J22K5l7k52L10m39N25k94K67k72J79K75l63L60n01K94r8K87m9
5224B65l32K45j58L74l77j3m6J4J26j98K84n76M10j64J20m4j73M38m60M72l00
$$ plain form
5245 -93 200 -109 132 -2 -5 175 -183 269 -188 174 -116 -3 118 94 71 -234 212 -103 -95 -79 -82 74 -79
5268 -79 238 -75 143 3 166 80 39 102 -90 168 -54 -7 -80 -52 -61 -111 63 -268 49 -184 82 -125 30
5291 30 208 76 269 -147 29 -136 295 15 -98 244 -107 277 142 182 -131 137 195 81 216 -84 108
5312 108 -124 269 107 -44 174 -103 31 -223 -26 -256 74 -53 99 38 -98 316 -60 253 -162 29
5332 29 -23 -84 90 -189 283 -115 80 -176 14 -64 -114 87 -224 55 -285 178 -86 -70 48 -215 134 -155
5354 -155 158 -98 137 7 47 -7 -19 227 -2 315 -183 202 -1 96 534 -89 168 -158 294 108 170 -56
5376 -56 -258 192 -153 260 -146 25 -92 53 111 -276 33 -179 277 -346 -103 -69 3 83 22 5 56 90 -112
5399 -112 92 -29 28 81 122 217 -100 166 -60 47 -13 -135 -57 -187 122 -213 154 -167 98 -34 -406 84
$$ packed form
5245i3K93l09K41j34lJ80l58M52m57L62k90J13J21k4k3l05M46l15QJ6lJ56j53
5268g9L17l13K18j40J63q6m1O3j92K58k22M7p3K8rn0J74l31L17k33K66k07J55
5291C0J78j32J93m16J76j65M31k80j13L42l51L84j35M0l13K68N8j14J35l00J92
5312A08k32L93j62j51K18k77J34k54J97k30L30j27J52o1j36M14l76L13m15J91
5332B9n2o1J74k79M72l98J95k56J90p8n0K01l11K79l40M63k64J6J18k63L49k89
5354a55L13k56K35j30M0n4j2K46k29L17m98L85k03R7M38o23K57l26M52j86O2k26
5376e6k02M50l45M13m06J71j17J45N8l87L09k12M56o23K43L4P2Q0o1j7N1L4k02
5399a12K04j21N7N3M1R5l17K66k26J07o0j22P8j30L09l35L67l21K65j32l72M90
$$ plain form
5421 84 -264 130 -84 58 94 -226 145 -72 49 -106 248 -9 179 183 -196 117 -149 194 -122 123 -92
5442 -92 -7 37 -266 43 -275 81 -119 109 -13 -38 19 134 114 -189 115 -110 233 161 -45 191 -64 186
5464 186 -7 158 -6 124 110 -6 117 -174 171 -53 147 -124 114 155 -26 147 -184 -31 -44 83 0
5485 0 -119 79 -61 62 -120 -176 -231 21 122 16 10 -249 75 -90 185 -262 -160 10 -69 179 -218 3
5507 3 -341 63 70 79 17 -92 202 -200 132 -199 181 25 -37 207 -64 234 -75 381 -40 124 173 95 217
5530 217 -218 206 -168 16 -25 -18 -38 -112 149 -216 110 -170 -78 -141 33 -37 -338 -19 -82 71 -48 -32 -233
5553 -233 156 59 -85 60 -234 84 -42 -66 -82 -90 129 -15 161 -127 57 -153 -50 -123 -66 -88 -309 4 4
5576 4 -75 -256 106 53 -96 186 -156 250 5 -4 78 -11 127 -41 -32 -274 92 -92 152 23 -179 -23 -216
$$ packed form
5421H4l48L94k14J42L6l20L71k17J21j55L54k57J88Ml79L13k66L43l16K45k15
5442i2Q5M4l03L09l18L56k00K28j22k5N7J15k0l03L04k25L43p2k06K36k55K50
5464A86j93J65j64J30j4j16J23k91L45k24K00k71K38M1j81J73l31J53j3J27q3
5485@j19J98j40J23j82n6n5K52J01j06ok59L24j65K75m47J02J70p9K48l97K21
5507Cl44M04PRo2j09K94m02L32l31L80j56o2K44k71K98l09M56m21J64M9p8J22
5530B17m35M24l74J84m1Pk0p4K61l65L26k80R2o3J74p0l01L19o3J53j19J6k01
5553b33L89r7j44J45k94L18j26k4j6qK19j44J76k88J84k10J03p3N7k2k21L13%
5576Dp9j81L62n3j49K82l42M06k45rQ2q9J38j68Rk42L66j84K44j29k02J56j93
$$ plain form
5599 -216 266 -108 -46 -348 -145 44 -62 145 -177 154 15 217 -6 52 325 -16 215 49 312 88 147
5620 147 160 -81 49 -168 136 -252 -57 -22 -159 -11 -188 -68 -523 191 -345 -50 -186 -150 157 -172 -55
5641 -55 -302 103 -32 206 106 95 19 -48 305 -41 118 -148 97 194 3 17 -368 60 16 195 -121 113
5663 113 104 126 102 -218 116 72 160 74 -7 62 3 131 -57 197 -22 145 -125 -75 44 -167 18 -160 123 -282
5687 -282 1 -56 -150 80 -263 115 184 303 -84 -77 138 -48 -4 -234 165 22 269 50 -33 -49 -248 28 49
5710 49 275 -238 -21 124 215 147 -183 201 -43 152 18 146 71 0 168 2 129 -175 105 9 -33 39 -215
5733 -215 139 -99 169 -320 -168 -45 -15 237 -196 146 -78 383 -11 48 0 -1 304 -26 391 111 266 120
5755 120 335 71 57 87 -46 237 -149 169 -66 87 -125 -251 90 -217 143 -326 -152 -45 -91 77 -146
$$ packed form
5599b16M82l74O2l02K03J89j06K07l22L31j39K02k23N8K73l41K31j66K63k24N9
5620A47J3k41J30k17L04l88J95L5j37J48j77J20m55P14n36K95j36L6L07l29J17
5641e5k47M05j35K38j00j1p6o7L53l46J59k66K45R7j91J4l85M28m4J79l16K34
5663A13rK2k4l20L34m4Q8q6q1O9n9J28j88K54k19J67k70N0J19k11J85j78K83m05
5687b82K83n7r4K30l43L78O9J19l87PK15j86M4k30L99j43K47k19q3j6j99K76K1
5710D9K26n13K17J45R1o8l30L84k44J95j34J28p5p1J68j66J27l04K80r6m2P2k54
5733b15L54k38K68m89J52J23L0K52m33L42k24M61l94N9m8jL05l30M17k80J55j46
5755A20K15k64j4L0j33K83l86L18k35J53k12j26L41l07L60m69J74J07m6J68k23
$$ plain form
5776 -146 130 -192 160 -62 166 -118 -156 156 12 267 -177 104 90 0 52 -222 135 -341 74 -78 -48 -56
5798 -56 -193 64 -85 91 -230 88 -3 61 -168 19 99 -127 113 -109 19 103 117 220 32 145 43 117
5820 117 -85 198 3 65 213 -5 104 -180 77 -108 116 -140 31 217 -23 163 -215 -60 -227 -1
5840 -1 -56 -146 215 -115 212 -11 50 -86 -8 121 -89 191 -196 199 135 176 -1 -34 -12 -40 108 -177 -181 -11
5864 -11 -3 -15 -180 -116 -114 72 -80 9 -239 107 -70 111 145 -175 -25 -90 349 -187 39 156 107 205 -76 -58
5888 -58 -76 -11 128 -104 5 -196 128 -11 -89 -285 74 -127 23 11 -115 177 -91 318 -34 -16 55 -91
5910 -91 159 -74 72 -158 161 -32 133 -99 39 293 -37 236 -299 157 -74 -63 27 -153 83 -94 182
5931 182 -233 -47 -61 -116 89 -125 14 -307 -94 -134 -123 -51 -304 61 -31 -58 -261 -1 -85 32 -28 -222 102
$$ packed form
5776a46K76l22L52k22K28k84l8L12j44K55m44K81j4r0N2k74L57m76M15j52L0q
5798e6j37K57j49J76l21L18r1O4k29J87Q0k26K40k22J28Q4J4J03j88J13j02P4
5820A17k02K83j95O2J48k18J09k84K57j85K24k56J71J86k40J86l78J55j67K26
5840an5r0L61l30L27k23O1j36P8J29k10K80l87L95o4M1j77l3K2k8J48k85mJ70
5864a1Qj2j65O4KJ86j52Q9k48L46j77J81L4l20J50o5M39n36K26J17m9R8k81J8
5888e8j8O5J39k32J09k01L24j39p8j96L59k01J50j2j26K92k68M09l52J8P1j46
5910i1K50k33J46k30L19j93J65k32J38K54l30K73n35M56k31J1R0j80K36j77K76
5931A82m15J86j4n5K05k14J39l21K13m0J1P2k53L65r2k7k03K60q4J17o0j94L24
$$ plain form
5954 102 93 249 -143 251 -137 -8 223 1 143 -34 186 83 232 -12 -36 78 0 186 -81 118 -67
5975 -67 209 85 -3 158 -88 163 -115 148 -114 51 41 -81 113 -105 98 -115 -4 -83 -240 -53 -54 50
5997 50 -292 76 -35 22 227 -173 57 -166 244 -10 85 15 132 86 -93 108 -348 -20 -45 86 -166 -214
6019 -214 31 -329 3 -239 -71 -93 11 51 -169 13 -119 80 38 84 -355 101 56 23 106 -133 164 -295
6041 -295 30 -43 30 82 -190 78 -46 84 -265 185 -72 -131 -4 -19 238 -27 66 -101 95 166 91 255 3
6064 3 257 214 304 -29 -29 132 59 124 -258 145 -168 56 19 -65 -102 -390 -123 -183 -122 -290 -167 -149 32 15 -195
6089 -195 -62 -80 144 -93 9 5 -55 188 -33 53 129 179 6 -54 -57 8 305 -111 233 -69 143 9 -10 44
6113 44 -19 202 -73 96 -51 81 -178 -186 109 -188 97 49 44 87 52 -50 -69 -143 -109 128 3 25 19 41 22 -5
$$ packed form
5954A02rJ56l92L94l88J29K31k22J42j77K20j03J49k44k4J14p8J86k67J99j85
5975f7K76j24q8J61k46K51k78K63k62J65j0j22J94k18K03k13J11p9j57J87jJ04
5997E0l42L68j11N7K05m00K30k23M10k54R5p0J17m6j79K01m56L28k5J31k52m8
6019b14K45l60L32k42J68k2J04M0k20J82j32J99m2M6m39M56m5l3Q3k39K97m59
6041b95L25p3P3N2k72K68j24J30l49M50k57n9J27j5K57k65R3j67J96P1p5J64k52
6064CK54m3R0l33%J61p3O5l82M03l13K24l7q4l7k88K67o0O1j68J23J8J81j7k10
6089a95J33j8K24k37J02mo0K43k21Q6P6N0j73o0lO5K97m16L44l02K12j34j9N4
6113D4o3K21k75J69j47J32k59qK95k97K85m8nM3l5j02j9p4L4K37j25K2oK2j9k7
$$ plain form
6139 -5 74 33 83 18 -50 -96 32 174 176 125 -18 120 -25 90 7 -118 92 -102 16 -233 98 -151 63 17
6163 17 -48 87 -126 284 -37 115 -19 56 60 -17 76 -173 136 -58 14 -27 -122 157 -137 127 -226 36 108 -107
6187 -107 -186 -98 50 -114 300 -91 126 82 7 124 -88 49 -96 295 157 107 85 -38 280 157 315 -140
6209 -140 122 193 129 32 -35 184 -120 122 -139 -24 -220 -103 -85 -108 13 -302 191 -284 298 -3 -171 87
6231 87 -107 219 -166 35 -28 73 18 -99 -56 133 177 -203 93 -83 -25 58 -23 -24 -131 173 -154 -16 -131
6254 -131 -60 32 -185 124 -189 82 19 0 -26 52 42 -95 334 -52 76 -87 257 112 67 49 -152 294 138
6277 138 177 -65 4 130 -14 162 11 50 -32 186 91 7 -90 -94 180 -177 -14 -60 57 194 148 56 -149 161
6301 161 156 211 12 158 -16 -36 227 -237 144 -92 232 -91 87 -34 -61 86 -19 -61 -214 124 -108 83
$$ packed form
6139eP9m1N0o5o8m6J28J42Kn1j43J38j45J15q3j25K10j94J18k49L31k49K14m6
6163A7o5J35k13M10l21J52j34P5Mp7R3k49L09j94P2m1r5K79k94K64l53K62P2k15
6187a07p9Q8J48j64M14l91K17m4p5J17k12J37j45L91j38n0k2j23L18j23J58m55
6209a40K62P1o4r7o7K19l04K42k61J15j96J17J8k3J21l15M93m75N82l01j68K58
6231H7j94L26l85K01o3J01n5j17M3J89M4l80K96j76N8Q3q1jj07L04l27J38j15
6254a31P1R2k17L09l13K71o3j9k6P8j0j37M29l86J28j63L44j45m5j8k01M46j56
6277A38L9k42O9J26j44J76j51L9q2K18r5q4r7mK74l57J63m6J17J37m6r2k05L10
6301A61nN5j99J46j74k0K63m64L81k36L24l23J78j21k7J47j05m2j53L38k32J91
$$ plain form
6323 83 150 -114 160 -272 78 -217 -85 -46 116 60 -201 133 -161 57 -95 131 -112 16 136 -106 223
6344 223 -105 4 35 89 -26 -66 104 74 175 -23 56 -111 64 143 -13 179 120 191 15 159 -44 -90 17
6367 17 91 60 -107 41 -62 11 -32 -113 40 -179 141 -57 149 -126 94 85 -117 -132 -300 310 -51 -97 -2 -13
6391 -13 189 -117 143 -53 103 7 70 -35 -203 -41 -177 212 -271 52 -119 3 32 -34 -31 -51 31 -124 157
6414 157 33 91 73 -84 192 -152 101 6 177 39 -177 -61 -80 122 -182 42 -312 133 -96 -54 -103 -206
6436 -206 75 50 71 -30 -124 78 -106 18 -154 -25 55 197 5 -50 123 -112 145 143 222 -17 74 -39 133
6459 133 4 -106 225 -17 10 -63 -44 10 -106 195 -317 0 -152 243 -155 -55 18 -76 290 -242 -101 -268
6481 -268 10 24 -64 27 -124 175 -42 53 -140 -32 117 63 125 -146 176 -148 42 -61 21 -215 -90 166
$$ packed form
6323H3O7k64K74m32L50k95J32L9J62n6k61L34k94K18j52K26k43J28J20k42L29
6344B23l28J09L1N4j15m0J70l0J01j98P9j67J75P9j56J92n9P1j76J44k03m6J07
6367A7P4l1j67J48j03P3m3q1J53k19L20j98K06k75K20rk02j5j68O10l61m6R5j1
6391a3K02l06K60j96J56r6O3j05j68J62j36L89m83L23j71J22K9o6Lk0Q2j55K81
6414A57j24N8j8j57K76l44K53r5J71j38k16J16j9K02l04K24l54M45k29M2m9j03
6436b06K81k5K1j01r4K02j84J24j72J29Q0J42j92n5J73k35K57kP9k39R1j13J72
6459A33j29j10L31k42K7p3J9N4j16L01n12L17j52L95l98J00P3r4L66n32J41j67
6481b68K78J4q8R1j51K99k17R5j93J08J49n4O2k71L22l24J90j03Q2k36J25K56
$$ plain form
6503 166 -73 -15 -87 115 109 56 -134 -131 -28 -10 265 -13 -36 -128 25 74 -100 146 -87 69 -20 -48 -134 -112 28
6528 28 -114 -123 -157 -3 44 62 -176 -279 26 -61 56 -60 -40 -91 -69 70 -60 169 -74 240 42 7 -134 15
6552 15 169 -62 2 -260 0 -154 30 -32 -168 208 -88 230 -124 -33 -125 -133 1 -30 -63 -125 -25 -70 -88 -4
6576 -4 -203 176 14 59 -227 38 -67 258 64 -95 144 59 145 -94 95 38 135 213 -63 86 58 173 11
6599 11 -19 -141 -4 -96 -97 196 -166 16 -168 -24 -23 -130 -138 -237 -112 -130 31 -178 -40 71 12 91 -58 226
6623 226 -124 164 20 -26 4 121 -10 -165 26 -129 233 -15 -96 10 -14 98 -184 23 -1 175 19 -65
6645 -65 -93 -34 45 138 41 -131 52 -19 60 121 -74 -15 57 35 69 -206 101 61 99 -274 85 -1 58 63 100 124 -85
6672 -85 -13 -63 123 -74 -72 -107 -86 -21 -155 106 -91 165 -28 55 -61 -77 184 -89 123 -147 -21 132 -46
$$ packed form
6503A66k39N8p2K02on3j90LJ03J8K75k78k3r2J53M9j74K46k33J56q9k8q6K2J40
6528B8j42rl4J54M7J8k38j03L05q7J17j16K0n1K2J39j30K29k43L14j98l5j41J49
6552A5J54k31O4k62K60j54J84o2j36L76k96L18l54R1r2qJ34l1l3o2J00m5j8Q4
6576dj99L79j62M5k86K65j05L25j94j59K39q5Q6k39J89n7R7P8k76J49k8J15j62
6599A1l0j22J37r2jK93l62J82j84J44Jj07qr9J25j8J61k09J38J11n9P9j49K84
6623B26l50K88j44m6L0J17j31j55J91j55L62k48q1J06k4J12k82K07k4J76j56q4
6645f5k8N9P9R3r7j72J83p1P9O1j95N9P2k2L4k75L07m0L8l73L59q6N9NL7K4k09
6672h5P2n0J86j97Kl5K1O5j34K61j97K56j93Q3j16j6K61k73K12k70J26J53j78
$$ plain form
6695 -46 -102 37 -12 -20 50 -87 88 -49 -69 186 -71 84 -78 41 17 -85 -175 -85 44 92 19 -150 -65 10 -47
6720 -47 -100 52 195 21 131 -7 25 96 -47 30 -298 -38 22 193 -6 -58 -122 81 66 -131 135 -213 -82
6743 -82 -131 -64 11 141 34 -58 73 -105 111 -150 44 33 -84 17 -157 80 -4 90 16 81 189 -69 -42 -325
6767 -325 99 119 -38 -1 -217 157 88 109 -3 30 -3 62 93 -92 113 43 309 60 78 -199 -65 156 15
6790 15 36 -198 170 10 191 -57 99 25 60 158 -208 -54 -136 205 8 -55 -18 -79 224 72 -55 -24 92
6813 92 27 229 75 -172 41 21 28 -75 -82 31 -37 82 -106 -27 -166 -16 31 0 223 27 230 -10 61 5
6837 5 30 84 36 98 -186 19 -8 40 -19 -24 31 -56 -22 -46 73 -191 -3 -291 -2 -7 -37 103 102 -33 -164 -181 -7
6864 -7 51 81 -16 68 -76 191 -4 -119 7 61 41 -1 91 -122 128 143 -2 21 10 44 11 229 32 83 -13 62
$$ packed form
6695d6n6J39m9qP0j37J75j37k0K55k57J55j62J19k4j02r0R0J29M8p3j69Q5P5n7
6720d7n3J52J43j74J10j38L2P1j43P7l28K60O0J71j99n2o4K03j5j97K66l48J31
6743h2m9O7P5J30j07r2J31j78K16k61J94j1j17J01j74K37q4R4p4O5J08k58K7k83
6767c25M24K0j57L7k16L74o9K1j12L3l3O5L1j85K05p0K66k49J8k77J34K21j41
6790A5K1k34L68j60J81k48J56p4L5R8l66J54q2L41j97o3L7o1L03j52j27L1J16
6813I2o5K02j54k47K13k0Pj03pJ13o8J19j88P9j39J50M7l1K23j96K03k40P1n6
6837EK5N4m8O2k84K05k7M8n9nN5q7L4k4J19k64J88k88K89nl0J40jj35j31j7J74
6864gN8L0r7Q4j44K67j95j15J26N4k0m2R2k13K50J5j45K3j1L4l3K18j97N1r6P5
$$ plain form
6890 62 62 -161 56 75 105 -166 -13 -223 -72 -10 44 25 -213 26 11 136 62 -144 73 7 209 -283 185 24
6914 24 71 0 -44 24 -100 81 -65 -43 -130 -4 -2 -143 -86 -192 50 30 54 -64 -237 69 15 101 -150 -86 -67
6939 -67 20 -31 -125 2 -3 38 -1 163 36 70 -80 -42 -17 -35 123 32 44 149 10 -4 -78 188 -87 117 -157
6964 -157 133 95 -134 13 179 114 -40 178 -126 -13 183 -86 62 17 136 97 55 -80 -67 121 89 101 -78
6987 -78 -41 71 -83 -180 -113 -58 -64 75 -15 -134 -28 165 98 -125 -47 38 27 36 44 -146 -25 38 -179 108 -164 -172
7013 -172 -78 158 85 135 90 -64 228 -4 31 -149 56 89 -85 43 -108 214 63 66 -86 -205 79 6 180
7036 180 -154 180 -117 42 122 -78 44 -99 129 -67 260 -113 20 181 139 80 -166 157 93 104 -169 40
7058 40 88 27 195 36 11 -114 177 -90 8 63 42 234 -77 45 -84 71 42 11 -63 -9 35 -82 29 -29
$$ packed form
6890F2%k23K17J9L0k71J53k10J51O2N4j9k38K39j5J25p4k06K17o6K02m92M68j61
6914B4M7p1m4O8j24J81j46K2q7J26Kj41N7j06K42k0K4j18j73L06n4Q6k51O4J9
6939f7Q7n1r4J27nM1l9J64j27L4j50L8K5j8J58r1J2J05j39j4p4K66k75K04k74
6964a57K90l8k29J47J66o5j54K18l04J13J96k69J48m5J19l9m2j35J3J88l2J2j79
6987g8L7J12j54r7O7N5oJ39r0j19J06J93o7k23P8Q5j1RQj90J21O3k17K87k72q
7013a72R4K36p3N0m5j54K92k32L5j80K05L3j74J28j51L22j51Lj52j19K84p3J74
7036A80l34L34k97J59Q0k00J22j43K28j96L27l73J33J61m2n9k46L23o4J1k73K09
7058D0M8o1J68j59k5j25K91k67R8N5k1J92l11J22j29J55k9l1p4N4M4j17J11n8
$$ plain form
7082 -29 -108 31 -123 103 6 -87 -107 4 -91 11 23 -220 56 -13 -56 -205 27 13 89 -42 -62 21 19 -2 -57 75
7108 75 90 26 127 -9 123 -22 180 -42 96 -41 72 21 -56 133 -291 65 -150 -63 77 -141 28 -11
7130 -11 153 -78 123 97 96 85 41 3 -49 123 -115 22 -170 25 40 -131 123 -78 -39 -43 -50 -106 -281 57 -55
7155 -55 -33 -95 -42 -72 -42 35 -156 57 -222 53 -70 56 -11 -181 48 -49 127 44 93 158 113 52 -9 74 22 226
7181 226 -143 112 9 72 40 54 56 -10 316 6 96 30 -25 22 128 56 -220 91 -14 -23 60 54 105 -1 74 -39
7207 -39 7 -124 139 -24 -135 -58 -80 150 143 238 -170 -81 -50 -39 154 -22 -60 40 20 25 -31 28 86 231 65 90
7233 90 -77 40 161 95 -52 -152 119 10 215 -108 -5 19 58 108 -124 96 -95 49 -84 3 41 10 -17
7256 -17 -126 39 -93 64 41 52 123 -3 -53 31 264 -223 58 70 135 84 50 63 -121 -11 -112 68 -129 15
$$ packed form
7082b9p9J39j54K26r7r3k0J11r5J02J2k43K76o9m3j49K32j4P6j31k0Q3kk1n5J32
7108G5J5o4J01j36J32j45K02k22J38j37J13n1p7J89m24L56k15Q7J40k18J69l9
7130a1J64k31K01k6jj1m4l8n2J72k38J37j92J95J5j71K54k01L9mpn6j75L38j12
7155e5K2o2N3l0L0P7j91K13k79K75j23J26o7j70K29r7J76q3M9O5m5o1o1Q3n2K04
7181B26l69K55j03O3l2J4Ko6L26l10R0o6n5M7J06p2k76L11j05rQ3oN1j06P5j13
7207c9M6j31K63j63j11P7k2K30pR5m08Q9L1J1J93j76l8J00k0Nn6N9N8J45j66K5
7233I0j67J17J21o6j47j00K71j09K05l23J03K4L9N0k32K20j91J44j33Q7L8l1k7
7256a7j09J65j32J57k3J1P1j26n0Q4K33m87K81J2O5n1l4J3j84J10j01J80j97J44
$$ plain form
7280 15 320 -160 171 -166 156 206 -42 -13 -93 62 -112 102 -167 -24 -142 50 43 -132 -24 -37 -238 -3
7302 -3 -71 1 7 147 -10 8 -48 133 -21 40 -199 -118 156 -173 115 -230 120 -137 8 317 -147 53 -81
7325 -81 193 -124 44 99 100 66 -140 13 -213 -64 52 -97 -45 -273 162 7 87 -45 -94 -97 -200 90 26 -20
7349 -20 15 123 -101 39 -125 67 58 55 27 -216 59 9 -30 31 -101 18 -152 114 -66 147 -47 201 69
7372 69 98 79 -76 15 -194 103 115 -72 64 73 -1 -44 -21 -32 -59 -143 -12 -54 28 31 -113 -17 -70 46 5 38 -198
7399 -198 -243 200 -128 18 164 131 -76 151 12 -121 205 61 42 -149 -31 -58 45 72 -131 -100 -198 163
7421 163 167 -64 44 -50 33 -77 92 -104 36 16 -19 113 -31 -55 -143 272 -87 -140 83 -34 21 -15 -20 -100 -100
7446 -100 -91 11 -106 -134 85 -40 72 127 -72 0 51 -96 34 104 55 82 98 93 -14 146 52 36 -79 32 74
$$ packed form
7280A5L05m80L31l37L22N0k48K9q0J55j74K14k69J43j18J92pj75J08j3k01K35
7302co8P2OJ40j57J8n6J81j54O1k39Q1K74l29K88l45L50k57J45L09m64K00j34
7325h1K74l17J68N5Jl4k06J53k26J49J16j49N2k28M35j55Q0j32m9lj03K90o4m6
7349b0L5J08k24J40j64J92rlk8k43K75n0l9O1j32J19j70K66j80K13j94K48j32
7372F9K9j9j55R1k09K97J2j87J36Rp4m3K3j1k7q4J31m2Q2Lj44R6n3J16m1L3k36
7399a98m5M43l28J46J46l3k07K27j39j33L26j44j9j91J18k7J03K7k03L1r8L61
7421A63Mk31J08r4Q3j10J69j96J40k0l5J32j44k4q8M15l59n3K23j17N5l6nq0%
7446a00RJ02j17k8K19j25J12N5j99P2N1j47J30P0m9K7J6nj07J60r4j6j15J11M2
$$ plain form
7471 74 36 142 -39 142 160 -101 92 -20 12 41 122 -48 -24 -22 -25 125 45 -42 -182 -49 85 -197 -9 -191
7495 -191 -73 -90 104 22 49 61 -194 113 -218 -56 79 121 103 -192 48 100 -22 -9 -54 116 60 302 -12
7518 -12 -100 -134 23 59 66 79 -8 -56 76 -39 56 12 -187 139 153 -68 -69 -127 79 -114 -84 97 -16 -60 26 114
7544 114 -160 144 -113 140 -5 -67 -88 -90 -23 -90 44 -39 67 20 11 21 -83 111 0 34 -80 93 52 -8 107
7569 107 -85 58 -53 -24 -20 -19 97 -46 128 30 -18 -143 185 25 134 139 -86 16 -52 12 -11 -47 92 -2 169
7594 169 -110 -57 -51 60 56 -8 161 -85 -97 -66 -33 -135 80 -175 -167 -80 -67 -93 -144 -36 -113 -28 136 164 86 18 144
7621 144 56 106 -55 -161 -12 -111 52 -28 177 -78 173 -52 142 -52 -17 43 -58 38 -205 32 -40 185 2
7644 2 -177 104 -126 86 98 -35 -122 -130 30 -82 -8 -189 3 -57 239 96 -48 34 66 8 -11 -66 74 -44
$$ packed form
7471G4l8J06j81J81J8k61J93j12L2K9Q1j70K4KlJ50q0q7j40J33J34k82J88j82
7495a91J18j7J94q2K7J2k55L07l31J62J35M2j8k95K40N2j22J3m5J70n6K42l14
7518a2q8l4J57L6PJ3q7m8J32j15R5m4j99L26J4k21jn8K06j93L0J81j13m4Q6Q8
7544A14k74L04k57K53j45o2k1kO7o7J34q3J06m7rJ0j04J94j11L4j14J73m1o0J15
7569A07j92J43j11K9MJJ16j43J74r8m8j25L28j60J09Nk25J02o8O4k3l6J39r4J71
7594A69k79N3OJ11mo4J69k46j2L1L3j02K15k55QQ7J3k6n1J08p7Q5J64K8p8o8J26
7621A44q8N0j61j06J49r9J63q0K05k55K51k25J94j94L5O0j01R6k43K37p2K25j83
7644Bj79K81k30K12J2j33q7qJ60j12P4j81J92o0K96j43j44Q2L2n8j9n5J40j18
$$ plain form
7668 -44 -7 -166 22 50 -4 -32 -30 -119 15 18 -82 -82 -86 108 36 -28 27 75 106 -24 140 -115 68 -78 178 -61
7694 -61 -69 76 -53 -15 -175 19 -108 22 -55 -75 -2 -88 66 -14 92 -49 26 6 73 243 -14 3 159 -1
7718 -1 -14 -33 62 86 26 65 245 -50 200 150 -131 95 -183 -85 -84 -70 -111 -96 82 83 -32 125 -87 71 120 -37
7744 -37 -37 -137 -135 101 -167 126 -44 103 -83 -68 30 -20 141 -73 62 118 87 176 33 51 -250 -39 -70 68
7768 68 90 121 68 -51 158 -108 2 -38 -107 -73 140 -73 -119 20 -81 87 -36 -21 5 45 5 -122 -99 -141 129
7793 129 35 -106 22 26 193 -149 7 80 69 -11 0 -103 -30 3 38 131 -124 58 32 193 52 -4 50 7 65
7818 65 67 -26 -26 3 131 -177 -73 -187 39 7 -21 -17 -296 -87 -72 153 80 -30 -22 -132 1 5 -85 -18 -62 54 -55
7845 -55 61 -158 8 -117 14 -143 1 1 -7 179 29 26 9 121 -4 101 -86 19 43 -61 3 -61 170 7
$$ packed form
7668d4L7j59J88K8n4k8Kq9J34Lj00%mJ94p2o4N5M8L1j30J64k55J83j46K56k39
7694f1qJ45j29L8j60J94j27J30p7k0P3q6J54q0J06j41P5k0O7J70k57J7J56j60
7718aj3j9R5K4o0L9J80k95K50n0k81K26k78R8JJ4m1J5J78Jj15J57k12J58M9j57
7744c7%j00KK36k68K93j70J47j86J5R8n0J61k14J35N6l1Q9j43J8l01K11l1J38
7768F8K2L1n3j19K09k66J10m0o9L4K13k13m6J39j01J68j23J5K6M0m0j27K3m2K70
7793A29r4j41J28MJ67l42J56P3j1q0J1j03P3L3L5R3k55J82k6J61j41n6N4m3N8
7818F5Kr3%K9J28l08J04j14K26l2k8Mk79K09J5K25p3j10Qj10J33Mr0O7m4J16j09
7845e5J16k19J66j25J31j57J44%qJ86j50lj7J12j25J05j87J05K4j04O4o4K31j63
$$ plain form
7869 7 29 -90 106 105 -30 -2 -121 49 124 9 7 -124 31 -4 101 94 -145 24 -25 77 79 37 -14 -63 56 45
7895 45 -7 41 151 -126 8 -93 -72 -19 -7 147 -84 177 -19 200 -46 24 -137 42 -133 -92 2 195 198 43
7919 43 127 206 -36 277 21 24 -201 103 51 38 -122 -12 54 -147 5 -54 65 26 61 75 -17 3 -56 233 61
7944 61 7 -155 -144 39 46 128 -90 -98 -68 101 39 -31 29 70 235 -82 39 -26 -17 30 75 81 1 105 30 -37 -94 -161
7972 -161 -56 -62 50 -65 65 6 191 -147 -56 14 -28 109 -109 47 -78 91 50 93 -69 -266 -57 93 125
7995 125 7 -52 10 -163 220 -7 -6 -120 98 35 20 -30 -87 71 -10 -1 105 26 -7 119 -120 -259 181 121 219
8020 219 61 -168 -3 60 76 -81 39 28 69 -14 39 -218 -131 24 -44 23 -45 156 -55 -17 -38 -59 156 -42
8044 -42 76 -92 41 23 0 13 -98 -7 -140 86 74 88 -80 -121 -16 -183 151 -329 -22 -99 -105 -173 -38 -88
$$ packed form
7869GK2j19J96jj35K8j19J70P5j15kj31J55l5J05pk39J69m9J02Km2n1m9J19j1
7895D5n2M8J10k77J34j01K1N3J2J54k31K61j96K19k46P0j61J79j75M1R4J93Lj55
7919D3Q4P9k42L13k56Lk25L04n2j3j60J10O6k01J52n9J19l9L5J4r2K0n9K89j72
7944F1n4j62J1J83PQ2k18qL0J69o2p0O0M1J65l17J21o5RM7M5Oq0J04p5o7n7o7
7972a61J05oJ12j15J30n9J85l38R1P0m2J37k18J56j25J69m1M3j62j97K09J50L2
7995A25j18n9O2j73L83k27Jj14K18o3j5n0n7J58q1RJ06p9l3J26k39j39M40o0R8
8020B19j58k29J65O3J6j57J20j1M1q3N3k57Q7J55o8O7o8K01k11L8k1k1K15j98
8044d2J18j68J33j8k3J3j11R1j33K26j2J4j68m1J05j67L34m80L07p7oo8J35n0
$$ plain form
8068 -88 -81 70 -130 -11 -76 133 -150 -55 91 -20 129 116 111 -103 -35 36 32 -61 100 99 -28 -40 -34 23 233 -125
8094 -125 67 -254 -185 -18 -4 19 -229 -5 -176 -27 -67 -3 -32 6 -59 67 83 -50 98 -49 151 46 2
8117 2 -135 -56 108 -65 57 -70 57 11 44 11 -141 -8 -91 4 -58 3 67 67 167 -102 -48 -148 -61 -36 -126 -24
8143 -24 -47 155 -127 -38 -72 89 -112 15 -120 -145 240 -123 80 -19 -10 -212 35 -41 -32 55 37 41 111 258 -3
8168 -3 85 80 106 165 70 64 -41 73 44 -32 158 138 91 -162 -64 -57 -110 -16 -49 -141 -31 77 -170
$$ packed form
8068h8PJ51k00J19o5K09k83R5J46j11J49j3nk14O8P1mr3J61jj27j2ON7K10l58
8094a25J92l21O9J67J4K3k48K24j71J49m0O4k9L8o5J26J6j33J48j47K00j05m4
8117Bj37P9J64j73J22j27J27m6L3l3j52J33q3R5o2O1O4%J00k69N4j00Q7K5r0J02
8143b4k3K02k82Q9l4J61k01J27j35k5L85l63K03r9Rk02K47p6RQ7j8MP0J47k61
8168cQ8nK6N9r5oj05J14k9p6J90k0m7k53R8Pn3R4l3r2J10J08k47
8191a70
$$ Imaginary data points
##PAGE= N=2
##DATA TABLE= (X++(I..I)), XYDATA
$$ plain form
0 0 0 0 0 0 0 0 0 0 0 0 -8 8 -8 8 -8 16 -16 24 -25 32 -40 48 -56 71 -80 96 -112 129 -151 172 -200 227 -259
33 -259 293 -333 373 -422 475 -532 595 -663 736 -819 911 -1007 1114 -1230 1357 -1495 1648
50 1648 -1816 2001 -2204 2426 -2677 2956 -3272 3630 -4041 4519 -5081 5753 -6573 7605 -8946
65 -8946 10767 -13403 17636 -26052 84354 -162997 101494 95046 -179853 255130 -27536
76 -27536 -117684 133502 -105188 1868 147181 -155800 12377 3624 -64970 103693 -22003
87 -22003 -81401 28855 -1057 18352 81193 -77568 -12093 85463 -55297 105465 613
98 613 -105581 113825 -25753 -21966 124379 -149695 285 106326 -145341 109788 -34492
109 -34492 -140112 138572 -80771 -17344 75728 -112599 33113 41970 -58362 77454 -15457
$$ packed form
0@%%%%%%%%%%qJ6j6J6j6K4l2M0m9N7p2Q8j04J27j51J76k08K41k80L23l72M27m86
33b59N52o26P06p95Q97j007J127j258J399j555J730j918K121k344K587k852L143
50A648l464L817m205M630n103N633o228O902p671Q560r600J0834j2326J4178j6551
65h946J9713k4170L1039m3688J10406k47351K64491o448k74899M34983k82666
76b7536r0148K51186k38690J07056J45313l02981J68177q753o8594J68663j25696
87b2003n9398J10256k9912J9409O2841j58761O5475R7556j40760J60762j04852
98F13j06194K19406j39578L787J46345k74074J49980J06041k51667K55129j44280
109c4492j05620K78684k19343O3427R3072j88327J45712Q857j00332J35816r2911
$$ plain form
120 -15457 -25095 67568 -22760 57156 22558 -15782 39734 5720 24577 35978 3052 -19918
132 -19918 31115 -11020 12340 41331 -66882 -3111 22592 -38026 37677 -17005 -91442 58183
144 58183 -23615 -23946 54111 -109585 17839 28332 -44301 50750 -54432 -35775 46809 -18399
156 -18399 21523 -5812 -64228 51624 -852 2666 27812 -67894 35157 24148 -9625 28234
168 28234 -23008 -13158 38257 13091 -10893 19287 -25735 5751 38571 -18447 -8512 7551
180 7551 -25165 9909 17949 -54496 19560 -18407 -33775 33218 -52119 770 89 -44701 17749
193 17749 -15748 -22313 22002 -34304 -3210 23371 -35374 37714 -12345 -21468 37348 -18638
205 -18638 23170 11329 -24176 11984 17443 -1518 14131 -10908 -17981 27111 -1497 1030 -5752
$$ packed form
120a5457r638R2663r0328P9916l4598l8340N5516l4014J8857J1401l2926k2970
132a9918N1033m2135K3360K8991j08213O3771K5703o0618P5703n4682p4437J49625
144E8183q1798l31P8057j63696J27424J0493p2633R5051j05182J8657Q2584o5208
156a8399L9922k7335n8416J15852n2476L518K5146r5706J03051j1009l3773L7859
168B8234n1242R850N1415k5166k3984L0180m5022L1486L2820n7018R935J6063
180G551l2716L5074Q040p2445P4056l7967j5368O6993q5337N2889o81m4790O2450
193A7749l3497o565M4315n6306L1094K6581n8745P3088n0059r123N8816n5986
205a8638M1808j1841l5505L6160N459j8961J5649k5039p073M5092k8608K527o782
$$ plain form
218 -5752 -16976 1845 17365 -5396 -14296 1821 -23126 29627 1264 -21505 10461 -22026
230 -22026 18951 17314 -22995 861 1136 -8929 30673 -17180 -17626 20074 -25196 25019 -5195
243 -5195 -26853 13913 -12022 2809 5704 -20225 -6575 11715 -14023 7856 -8463 -15332 18000
256 18000 -9179 763 -2249 -4481 2814 9272 -8172 -4642 11546 -11379 17890 -6655 -10876
269 -10876 14358 -3495 4456 5112 -12877 2118 18216 -13152 12454 -8108 -9492 27616 -12298
282 -12298 5201 -1162 -8458 15749 5852 -9191 2345 -1437 -430 19424 -16339 205 663
295 663 -2672 13686 -9211 -6009 -2912 6077 -1279 2774 -12007 -4861 11632 -6441 5453 -10211
309 -10211 -3785 7573 4210 -4543 -1375 -2019 368 17077 -13097 3520 -592 -1910 16152 -8728
$$ packed form
218e752j1224J8821J5520k2761q900J6117k4947N2753k8363k2769L1966l2487
230b2026M0977j637m0309K3856K75j0065L9602m7853m46L7700m5270N0215l0214
243e195k1658M0766k5935J4831K895k5929J3650J8290k5738K1879j6319o869L3332
256A8000k7179R942l012k232P295O458j7444L530J6188k2925K9269k4545m221
269a0876K5234j7853P951O56j7989J4995J6098l1368K5606k0562j384L7108l9914
282a2298J7499o363p296K4207r897j5043J1536l782J007J9854l5763J6544M58
295F63l335J6358k2897L202L097Q989p356M053j4781P146J6493j8073J1894j5664
309a0211O426J1358l363q753L168o44K387J6709l0174J6617m112j318J8062k4880
$$ plain form
323 -8728 -3305 616 1677 3079 3361 -14622 1066 4226 -5769 7306 -17569 30 2557 -711
337 -711 -292 -9318 -2190 796 8176 -7522 -162 -4789 4350 8793 -4522 -429 -4340 8114 2173
352 2173 3176 -9337 -1468 5153 -2466 4738 -16541 -945 -552 -1096 -1640 -12842 -6370 -8 2958
367 2958 -7070 -1921 -11767 7047 6050 -3696 3840 -8660 12045 7649 5413 827 433 9082 9223
382 9223 8936 -3833 4413 1161 9681 1629 -4046 -2149 -4134 5918 -7515 -2644 -12206 -3160 -2005
397 -2005 -9290 -4680 -14963 -649 -6079 -6335 -7750 -7104 -3237 -79 -4762 -8933 3996 -6770 8883
412 8883 -3920 -6291 7237 -1433 11080 -830 -1808 2074 9981 8219 3773 -849 -708 14647
426 14647 6749 7306 -6454 1938 8106 7939 5759 -11393 745 -1954 9895 -58 -11835 -5885
$$ packed form
323h728N423L921J061J402K82j7983J5688L160r995J3075k4875J7599K527l268
337g11M19r026P128K986P380j5698P360m627R139M443j3315M093l911J2454n941
352B173J003j2513P869O621p619P204k1279J5596L93n44n44j1202O472O362K966
367B958j0028N149r846J8814r97r746P536j2500K0705m396k236m586l94Q649J41
382I223k87j2769Q246l252Q520q052n675J897j985J0052j3433M871r562R046J155
397b005p285M610j0283J4314n430k56j415O46L867L158m683m171J2929j0766J5653
412H883j2803k371J3528q670J2513j1910r78L882P907j762m446m622J41J5355
426A4647p898N57j3760Q392O168j67k180j7152J2138k699J1849r953j1777N950
$$ plain form
440 -5885 -6517 6878 26 -10396 -12199 -209 -405 7882 -6136 -12546 8041 -1694 13591 532
454 532 -4297 5814 4991 12879 4148 3613 -229 7423 7374 6725 -1470 -43 2294 -1955 7972 -8657
470 -8657 2056 -2490 -4656 2296 -4060 5403 -4298 1371 -1107 4551 10843 3334 1619 5130 7409
485 7409 9854 17417 -4881 6114 5016 5328 18044 -6649 -3857 -6177 4705 6784 -6788 -12311
499 -12311 -14115 -799 4760 -4527 -16534 -6377 -8161 11295 7681 -11668 2147 -2219 18084
512 18084 17240 6481 787 6268 24138 17523 15431 3063 3603 16515 20417 4168 4883 -1064
526 -1064 -3464 17989 -3664 -854 -6864 -10034 4452 -1695 -1038 -12137 -5522 -1013 -158 1563 -848
541 -848 -6115 2842 4406 -1200 15279 -4717 1472 5949 1443 14644 1523 535 -3274 6268 8603
$$ packed form
440e885o32J3395o852j0422j803J1990j96Q287j4018o410K0587r735J5285j3059
454E32m829J0111q23P888q731n35l842P652m9o49q195J427K337m249R927j6629
470h657J0713m546k166O952o356R463r701N669k478N658O292p509j715L511K279
485G409K445P563k2298J0995j098L12J2716k4693K792k320J0882K079j3572n523
499a2311j804J3316N559r287j2007J0157j784J9456l614j9349J3815m366K0303
512A8084q44j0759n694N481J7870o615k092j2368N40J2912L902j6249P15n947
526a064k400K1453k1653K810o010l170J4486o147O57j1099O615M509Q55J721k411
541h48n267Q957J564n606J6479j9996O189M477m506J3201j3121r88l809R542K335
$$ plain form
556 8603 3030 987 -6354 -2201 8717 8232 -4199 245 -11076 7961 16007 -2760 123 -9810
570 -9810 8323 13086 7924 -2260 -9751 6732 9982 9271 958 -8764 -6246 14349 4557 1596
584 1596 -4957 -16143 12370 5293 2898 -6770 -11025 4438 5978 7293 -5697 -5694 706 6715 5161
599 5161 5017 -6808 -2238 9279 383 10350 -5797 -2904 3905 2586 6659 -4163 1578 -3600
613 -3600 1873 4944 139 1002 -400 -4729 3595 8997 -4055 5270 -7726 430 10624 -1507
627 -1507 4129 -8269 -1440 3202 4389 1801 -8154 -7479 -277 5247 485 -4284 -15889 1359 3730
642 3730 1827 -1061 -15824 569 2619 7433 -793 -8594 -2453 2161 11355 2717 -4151 -5311 4689
657 4689 7495 9064 -4660 -6552 5878 1825 11665 -5199 -4873 1541 -30 8201 -2834 -3364 -2606
$$ packed form
556H603n573k043p341M153J0918m85j2431M444j1321J9037Q046j8767K883r933
570i810J8133M763n162j0184p491J6483L250p11q313r722K518K0595r792k961
584A596o553j1186K8513p077k395r668m255J5463J540J315j2990LO400O009j554
599E161j44j1825M570J1517q896R967j6147K893O809j319M073j0822N741n178
613c600N473L071m805Q63j402m329Q324N402j3052R325j2996Q156J0194j2131
627a507N636j2398O829M642J187k588r955O75P202N524m762m769j1605J7248K371
642C730j903k888j4763J6393K050M814q226p801O141M614R194q638o868j160J0000
657D689K806J569j3724j892J2430m053R840j6864L26O414j571Q231j1035n30P58
$$ plain form
672 -2606 679 2750 2711 -5206 -1801 261 -817 6064 -6329 1997 -1698 -915 3419 -3099 3356 -2845
688 -2845 -323 -1660 1721 1970 -494 -2332 -2805 2655 1158 3672 -6074 -199 -1363 2853 6125 -6907
704 -6907 204 -4170 4397 5210 -3345 -4339 -3451 3234 4266 113 -8749 -800 -1410 6051 767 -8352
720 -8352 -96 -4239 7686 920 -4230 -2879 -1329 5915 2943 -505 -5271 2728 3135 5687 -464
735 -464 -2994 1922 1636 6920 -3068 1398 -1816 2382 4571 -3424 1343 -3462 2204 881 -1025 -2630
751 -2630 -447 -547 109 -119 -5719 4333 -3153 2164 -1005 -4315 5054 -961 2778 -1468 -303 1786
767 1786 4789 705 -588 1334 -191 7246 -698 780 -2386 1643 4001 -378 127 -6515 2711
782 2711 16 791 -2900 -6539 16 -144 541 -4530 -3322 -3788 3737 -1132 -2365 -1470 -4716 6803
$$ packed form
672b606L285K071l9p917L405K062j078O881j2393Q326l695P83M334o518O455o201
688b845K522j337L381K49k464j838m73N460j497K514r746N875j164M216L272j3032
704f907P111m374Q567Q13q555r94Q88O685J032m153q862P949o10P461n284r119
720h352Q256m143J1925o766n150J351J550P244k972l448m766P999M07K552o151
735d64k530M916k86N284r988M466l214M198K189p995M767m805N666j323j906j605
751b630K183j00O56k28n600J0052p486N317l169l310R369o015L739m246J165K089
767A786L003m084j293J922j525P437p944J478l166M029K358m379N05o642R226
782B711k695P75l691l639O555j60O85n071J208m66P525m869j233Q95l246J1519
$$ plain form
798 6803 -1480 618 -1857 -1344 5008 1697 461 -2338 1824 1058 4895 -2336 -1230 371 -112 4515
814 4515 -4262 25 -2711 2377 1266 -2523 -1037 -3092 4109 -440 513 -2915 358 2495 2148 626
830 626 -2952 2907 126 5609 -2129 -1153 1618 -409 5690 -3608 -798 -1008 1376 1499 -1623 -3887
846 -3887 -1765 1911 -2172 973 -7213 -613 261 -1364 249 -6822 -184 -997 1741 -2235 -3325 -1511
862 -1511 288 3113 -2561 -475 -2647 3260 1539 1084 -1406 -1321 4714 -56 4428 -3650 771 3101
878 3101 957 2798 -3153 -123 778 2331 -2129 -795 -4024 365 1367 -4695 2 -6662 914
893 914 -870 -2945 -1513 -3941 1592 -58 767 -2649 1384 1377 3372 1929 -977 3566 1891 5978
909 5978 -676 1739 598 2952 4455 -2691 989 -3301 2094 1421 -3061 -3583 -3790 -581 175 -1328
$$ packed form
798F803q283K098k475N13O352l311j236k799M162p66L837p231J106J601m83M627
814D515q777M287k736N088j111l789J486k055P201m549R53l428L273K137l47j522
830F26l578N859k781N483p738R76K771k027O099r298K810k10K384J23l122k264
846c887K122L676m083L145q186O600Q74j625J613p071O638q13K738l976j090J814
862a511J799K825n674K086k172N907j721m55k490Q5O035m770M484q078M421K330
878C101k144J841n951L030R01J553m460J334l229M389J002o062M697o664P576
893I14j784k075J432k428N533j650Q25l416M033pJ995j443k906M543j675M087
909E978o654K415j141K354J503p146L680m290N395o73m482n22k07L209P56j503
$$ plain form
925 -1328 -7609 -418 -2281 2391 -106 -6325 1224 -1120 5827 590 -1624 -480 1883 5057 2142
940 2142 87 -3311 3144 1013 3831 -2750 -4029 469 -1039 2735 -5404 -2684 -3676 154 700 -4143
956 -4143 -587 -3427 1121 716 469 -1569 1985 472 2336 3807 -1511 5374 -308 3148 2116 426
972 426 4635 -501 1776 -1266 717 1457 863 -3439 -1914 -788 -684 3376 -5742 -877 -2711 1851
988 1851 3306 -2585 -1251 -4063 4673 2560 1152 -2656 -2745 3508 4936 1448 -3220 -1258 -1517 6648
1004 6648 45 -3252 -2407 -3650 6117 -241 -814 -5117 -2958 3863 2357 -128 -4348 -2287 920
1019 920 5697 -2240 -979 -2245 -647 5553 -1464 843 -3638 161 1362 1061 1102 -4013 496 -752
1035 -752 1798 238 -458 -2190 895 130 -197 3584 -3149 2126 -2247 1737 4144 -759 1217 -3506
$$ packed form
925a328o281P191j863M672k497o219P549k344O947n237k214J144K363L174k915
940B142k055l398O455k131K818o581j279M498j508L774q139K720r92L830N46m843
956d143L556k840M548m05k47k038L554j513J864J471n318O885n682L456j032j690
972D26M209n136K277l042J983P40n94m302J525J126J04M060r118M865j834M562
988A851J455n891J334k812Q736k113j408l808q9O253J428l488m668J962k59Q165
1004F648o603l297Q45j243R767o358n73m303K159O821j506k485m220K061L207
1019I20M777p937J261j266J598O200p017K307m481L799J201l01M1n115M509j248
1035g52K550j560o96j732L085p65l27L781o733N275m373L984K407m903J976m723
$$ plain form
1051 -3506 2369 3175 1904 -995 -2012 -1377 3050 3548 -2680 -662 -5674 3319 3510 -309 -2359 -6300
1067 -6300 2936 2712 3204 -4174 -4822 828 3636 3639 -2244 -3682 -2466 5356 1991 1611 -4332 -4159 4588
1084 4588 1410 3598 -5687 -3378 1380 2629 2696 -3948 -3394 -831 2994 459 553 -4603 -796 1708
1100 1708 -147 3356 -4712 39 -672 1453 2219 -2035 66 -1592 1635 339 1311 -738 -153 -1146
1116 -1146 858 3095 -418 1772 -4319 2376 2140 1603 1518 -4631 1336 920 3524 429 -2451 -2532 1135
1133 1135 3520 1376 -1088 -5904 2216 1653 3970 -1818 -6060 1173 878 5042 -1627 -3845 -2134
1148 -2134 2044 4027 503 -2155 -4024 2205 2290 3531 -3469 -2945 565 1353 4731 -4400 -1414 -1664
1164 -1664 1437 2596 -2076 -1832 -2674 1175 158 816 -2983 -770 -972 682 1740 -2978 1422 -2734
$$ packed form
1051c506N875Q06j271k899j017O35M427M98o228K018n012Q993J91l819k050l941
1067f300R236k24M92p378o48N650K808Ln883j438J216P822l365l80n943J73Q747
1084D588l178K188r285K309M758J249O7o644N54K563L825k535R4n156L807K504
1100A708j855L503q068M751p11K125P66m254K101j658L227j296R72k049N85r93
1116a146K004K237l513K190o091O695k36n37q5o149N967m16K604l095k880q1L667
1133A135K385k144k464m816Q120n63K317n788m242P233k95M164o669k218J711
1148b134M178J983l524k658j869O229Q5J241p000N24L510P88L378r131K986k50
1164a664L101J159m672K44q42L849j017O58l799K213k02J654J058m718M400m156
$$ plain form
1180 -2734 1882 811 -730 1954 -1294 774 -492 2026 689 1425 -1373 -8 1679 1267 2355
1195 2355 -3020 1074 -953 3021 1610 -2543 36 -2336 3265 1364 -345 -2967 -1165 1635 2268
1210 2268 359 -3994 -309 -299 4531 -934 -2325 -1027 -1129 4996 -638 -743 -2554 -154 2633 1356
1226 1356 -845 -3060 615 608 2976 -2415 -1476 -1510 589 2382 -2973 244 -2683 1398 824 -1397 -365
1243 -365 -1766 1255 174 652 -1693 785 -376 1283 314 -1499 2163 -1138 2605 -1764 -55 1218
1259 1218 -193 1226 -2166 128 -299 1568 -919 -889 -1442 159 1743 -1544 263 -3366 1887 557
1275 557 498 -293 -2964 2366 680 1982 -834 -729 882 2731 2075 -628 437 -523 4279 499 1088
1292 1088 -701 -346 3653 20 1432 -2337 522 1498 817 -235 -2100 66 -29 1629 -2245 -724
$$ packed form
1180b734M616j071j541K684l248K068j266K518j337P36k798J365J687m12J088
1195B355n375M094k027L974j411m153K579k372N601j901j709k622J802K800O33
1210B268j909m353L685J0M830n465j391J298j02O125n634j05j811K400K787j277
1226A356k201k215L675pK368n391R39l4K099J793n355L217k927M081n74k221J032
1243c65j401L021j081M78k345K478j161J659r69j813L662l301L743m369J709J273
1259A218j411J419l392K294m27J867k487L0n53J601J584l287J807l629N253j330
1275E57n9p91k671N330j686J302k816J05J611J849o56k703J065r60M802l780N89
1292A088j789L55L999l633J412l769K859R76o81j052j865K166r5J658l874J521
$$ plain form
1308 -724 -1990 727 638 -2297 -155 -2917 1955 -690 -635 -1107 -1376 1705 -103 280 -1825 1054 579
1325 579 2186 -365 -565 1414 206 3592 -1541 887 280 1558 2616 -948 552 -407 2454 949
1341 949 650 -1301 432 1690 715 1011 -2644 1668 91 2225 -95 -1869 1224 -124 2864 -964
1357 -964 -556 -391 1126 1481 -440 -822 -1172 2060 -420 1227 -2241 -577 1562 -194 1597 -2762
1373 -2762 584 496 1258 536 -1233 147 826 2206 -321 901 -986 2312 1279 344 833 -1277 3087
1390 3087 199 1486 -966 -598 1600 -58 698 -2049 -216 -371 937 -1491 -1269 -1219 -601 1437 -2907
1407 -2907 41 -2240 840 782 -1700 -86 -1764 1896 710 349 -1151 282 1129 1996 1000 -1568
1423 -1568 1387 210 3517 62 -672 509 228 3801 -536 222 -918 1101 2163 633 -646 -1298
$$ packed form
1308g24j266K717q9k935K142k762M872k645N5m72k69L081j808L83k105K879m75
1325E79J607k551k00J979j208L386n133K428o07J278J058l564J500r59K861j505
1341I49k99j951J733J258r75K96l655M312j577K134k320j774L093j348K988l828
1357i64M08J65J517L55j921l82l50L232k480J647l468J664K139j756J791m359
1373b762L346q8P62p22j769J380O79J380k527J222j887L298j033r35M89k110M364
1390C087k888J287k452L68K198j658P56k747J833j55J308k428K22N0O18K038m344
1407b907K948k281L080n8k482J614j678L660j186l61j500J433Q47Q67r96k568
1423a568K955j177L307l455p34J181k81L573m337P58j140K019J062j530j279o52
$$ plain form
1439 -1298 867 677 2049 -2376 -363 -653 804 1805 -2635 193 -1937 1253 197 -1617 -905 -1176
1455 -1176 233 -533 -225 -1935 351 -1242 538 -322 -1553 995 -1555 1317 -1565 58 666 -504
1471 -504 1006 -1446 787 426 1154 -755 -236 -409 1509 1301 -1449 289 -1815 2543 496 -367 -654
1488 -654 -2220 2396 661 581 -2013 -1514 839 2175 30 -1854 -1322 -580 3563 -777 -602 -2290 -303
1505 -303 3107 -266 551 -2655 -27 1610 1633 32 -1943 -616 1006 2706 -716 -64 -2096 1437
1521 1437 1900 -180 791 -2217 1710 208 1135 250 -1174 426 107 1111 -17 173 -1270 899
1537 899 -369 730 612 -1323 1248 -2205 1516 357 80 30 -1864 1079 703 1238 -1182 -893 -678
1554 -678 2002 1302 -297 -852 -2024 2795 839 1646 -1614 -1939 2002 1430 2681 -2017 -1460 575 2746
$$ packed form
1439a298K165j90J372m425K013k90J457J001m440K828k130L190j056j814P12k71
1455a176J409p66L08j710K286j593J780q60j231K548k550K872k882J623O08j170
1471e04J510k452K233l61P28j909N19j73J918k08k750J738k104M358k047q63k87
1488f54j566M616j735q0k594M99K353J336k145j884N32P42M143m340J75j688J987
1505c03L410l373Q17l206K628J637K3j601j975J327J622J700l422O52k032L533
1521A437M63k080R71l008L927j502R27q85j424J600l19J004j128J90j443K169
1537H99j268J099j18j935K571l453L721j159k77n0j894K943l76N35k420K89K15
1554f78K680p00j599n55j172M819j956Q07l260l25L941n72J251m698N57K035K171
$$ plain form
1571 2746 1892 -643 -1803 -211 3269 1220 1544 -2801 -251 1993 1555 2379 -2812 -397 736 2900
1587 2900 1762 -1163 -922 440 2531 1237 501 -1636 1034 690 1880 1140 -1710 1221 -846 2016
1603 2016 790 -513 -192 -717 1194 185 388 -780 133 -1067 728 183 142 45 -2525 1347 -365
1620 -365 1389 -530 -2113 283 335 2082 -222 -892 -1110 1323 1880 1458 -769 -1826 1353 1055 3460
1637 3460 -1410 -1436 521 1383 3605 -966 -1061 -864 2087 2414 635 -1394 -1257 1292 1804 2003 -2260
1654 -2260 -564 -591 1896 2087 -2173 -417 -1348 1952 934 -706 -1192 -1003 704 539 302 -1567 21
1671 21 -1031 1095 68 -970 207 -1679 1736 -261 370 -95 -594 481 -304 1067 204 808 -642
1688 -642 586 457 1683 482 -970 632 -835 2774 -261 -551 -483 -999 1925 -32 -408 -2208 -764
$$ packed form
1571B746q54k535j160J592L480k049L24m345K550K244m38Q24n191K415J133K164
1587B900j138k925K41J362K091j294p36k137K670l44J190p40k850K931k067K862
1603B016j226j303L21n25J911j009K03j168R13j200J795n45m1r7k570L872j712
1620c65J754j919j583K396N2J747k304o70k18K433N57m22k227j057L179k98K405
1637C460m870k6J957Q62K222m571r5J97K951L27j779k029J37K549N12J99m263
1654b260J696k7K487J91m260J756r31L300j018j640m86J89J707j65k37j869J588
1671B1j052K126j027j038J177j886L415j997O31m65m99J075p85J371q63O04j450
1688f42J228j29J226j201j452J602j467L609l035k90O8n16K924j957l76j800J444
$$ plain form
1705 -764 183 1101 -1136 -2396 -1247 -668 1948 -1704 -1081 -2020 -243 1958 -908 -360 -2212 601 1237
1722 1237 1058 -547 -1161 287 1342 2251 -570 410 -632 2363 1682 133 642 -820 2507 835
1738 835 934 47 -305 929 545 607 -727 378 -823 1032 -829 -219 -35 -1015 1033 -2068 -2 -1103
1756 -1103 -362 -328 -1534 -405 -711 495 -916 -486 -1402 480 72 -303 -212 -1379 1611 -103 1126
1773 1126 -823 -1066 1165 581 1501 -988 -21 426 1783 1010 205 -241 423 2336 365 1368 -1129
1790 -1129 970 1333 547 1028 -1506 768 348 1087 -173 -921 -326 198 712 -984 -393 -1605 1086
1807 1086 -445 -294 -654 -1283 1361 -602 714 -860 -21 827 589 690 -252 904 570 1781 -167
1824 -167 886 383 1186 1890 -614 1162 -623 1691 721 -155 137 -404 1245 168 207 -1229 82
$$ packed form
1705g64R47R18k237j260J149N79K616l652O23r39J777K201k866N48j852K813O36
1722A237j79j605o14J448J055R09k821R80j042K995o81j549N09j462L327j672
1738H35R9q87l52J234l84O2j334J105j201J855j861O10J84r80K048l101K066j101
1756a103P41L4j206J129l06J206j411M30r16J882m08l75R1j167K990j714J229
1773A126j949k43K231n84R20k489R67M47J357p73q05m46O64J913j971J003k497
1790a129K099L63p86M81k534K274m20P39j260p48N95N24N14j696N91j212K691
1807A086j531J51l60o29K644j963J316j574Q39Q48k38J01r42J156l34J211j948
1824a67J053n03Q03P04k504J776j785K314r70q76K92n41J649j077L9j436J311
$$ plain form
1841 82 40 711 -394 -1352 290 -697 1490 -1316 -669 -468 -472 1087 -1364 -364 -1176 437 125 -201 -1122
1860 -1122 -579 308 -88 608 -1913 637 -38 803 905 -952 1126 28 1876 346 330 398 987 1617
1878 1617 503 506 -358 1718 304 1139 -581 -305 1009 -619 1004 -1488 -213 -257 66 -62 -1426
1895 -1426 -505 -612 599 -860 -284 -1289 496 295 -881 199 -1605 1218 -156 48 -555 -853 919
1912 919 -264 419 -1159 -9 -199 817 -563 -873 -254 -521 1648 -1096 88 -1220 232 1210 -597
1929 -597 324 -1290 690 510 452 -834 -399 27 550 840 -1332 121 -987 1341 15 -809 -214 -1117
1947 -1117 1253 -475 -28 -825 -243 552 157 27 -909 483 -265 983 -694 59 137 -254 1199 -1024
1965 -1024 930 -475 477 337 -612 438 243 853 -371 267 -482 1213 251 -63 -67 -675 1670 -381
$$ packed form
1841H2m2O71j105r58J642r87K187k806O47K01mJ559k451J000q12J613l12l26r21
1860a122N43Q87l96O96k521K550o75Q41J02j857K078j098J848j530j6O8N89O30
1878A617j114Lq64K076j414Q35j720K76J314j628J623k492J275m4L23j28j364
1895a426R21j07J211j459N76j005J785k01j176J080j804K823j374K04o03k98J772
1912I19j183O83j578J150j90J016j380l10O19k67K169k744J184j308J452R78j807
1929e97R21j614J980j80n8j286M35M26N23K90k172J453j108K328j326q24N95r03
1947a117K370j728M47p97N82P95l95j30r36J392p48J248j677P53P8l91J453k223
1965a024J954j405R52j40r49J050j95O10j224O38p49J695r62l14mo08K345k051
$$ plain form
1983 -381 548 -847 -336 964 82 508 -1404 -268 -92 1048 -120 -895 -1033 49 1476 -494 247
2000 247 -1822 829 920 370 272 -1587 841 526 1468 -96 -716 -405 1087 1331 49 -149 -1238 1731
2018 1731 400 593 -433 -1109 1290 -60 1183 -586 -16 95 801 839 87 448 -201 1300 78
2035 78 1401 -23 707 1135 -25 1727 8 1509 -110 138 1026 549 1277 -385 24 -123 1365
2052 1365 423 327 -913 -529 1236 -180 1086 -1537 -346 159 617 918 -1494 -680 -446 1536 350
2069 350 -450 -1528 -100 1297 713 463 -1794 684 545 1845 835 -1095 657 352 2394 632
2085 632 14 -691 638 1701 1074 138 -916 1037 99 1689 -474 -825 167 -556 1488 -481 104
2102 104 -749 56 627 300 333 -558 427 -144 1230 -140 784 -53 -339 1193 -128 1473 -829 17
$$ packed form
1983c81R29j395N11J300q82M26j912J136J76J140j168p75j38J082J427j970P41
2000B47k069K651R1n50r8j859K428l15R42j564o20L11J492K44j282j98j089K969
2018A731j331J93j026o76K399j350J243j769N70J11P06L8p52L61o49J501j222
2035G8J323j424P30M28j160J752j719J501j619K48Q88m77P28j662M09j47J488
2052A365r42r6j240L84J765j416J266k623J191N05M58L01k412Q14K34J982j186
2069C50q00j078J428J397n84k50k257K478j39J300j010j930J752l05K042j762
2085F32o18p05J329J063o27r36j054J953r38J590k163l51R92p23K044j969N85
2102A04q53Q05N71l27L3q91R85n71J374j370R24q37k86J532j321J601k302Q46
$$ plain form
2120 17 33 379 1085 -499 -64 -737 906 452 669 -1090 -352 236 724 1774 -1310 6 -628 1371
2138 1371 1567 -630 -195 -754 1662 1134 468 -1115 -399 446 1061 717 -1786 -394 -1075 1304 -9
2155 -9 -1362 -1170 -1496 1143 -308 -427 -1734 -704 231 245 -98 -1023 -154 -417 1438 -35 498 -256 -36
2174 -36 1587 40 1349 -336 790 908 604 996 199 658 11 920 50 1021 -346 -176 -164 -307 1314
2193 1314 -869 46 -1272 -153 400 -378 -308 -1379 -210 -438 842 -1077 -868 -940 94 1111 -825
2210 -825 -214 -1660 878 647 226 -222 -1431 808 369 934 -549 -615 -158 868 762 -344 -170 -962
2228 -962 1629 47 272 -613 -608 1317 -66 666 -900 41 206 790 435 -401 77 -492 925 -354
2246 -354 388 -671 -53 285 -766 468 -1105 447 -588 -271 -163 -450 342 -389 77 -517 674 18
$$ packed form
2120A7J6L46P06j584M35o73J643m54K17j759P38N88M88J050l084J316o34J999
2138A371J96k197M35n59K416n28o66j583P16Q45O15l44k503J392o81K379j313
2155ij353J92l26K639j451j19j307J030R35J4l43r25Q69k63J855j473N33p54K20
2174c6J623j547J309j685J126J18l04L92p97M59o47R09q70R71j367J70J2j43J621
2193A314k183R15j318J119N53p78P0j071J169k28J280j919K09p2J034J017j936
2210h25O11j446K538k31m21m48j209K239m39N65j483o6M57J026j06j106J74p92
2228i62K591j582K25q85NJ925j383P32j566R41J65N84l55q36M78n69J417j279
2246c54P42j059O18L38j051J234j573J552j035L17J08k87P92p31M66n94J191o56
$$ plain form
2264 18 597 -185 26 1205 15 1414 -634 699 584 889 994 -354 327 -27 1290 -81 -127 -791
2282 -791 85 425 -279 123 -1726 538 -342 635 -463 -1035 137 -352 753 -690 -477 -618 266 324
2300 324 -293 -400 -957 694 -455 398 -1178 -504 340 -469 511 -1306 44 -264 507 -75 -302 89
2318 89 -49 914 -242 645 -399 995 547 183 718 -334 1368 -80 512 -385 41 481 -62 -45 -899
2337 -899 162 -453 357 -824 -696 -393 -483 464 -1310 12 -1035 191 199 -532 -202 -649 606 95 353
2356 353 -610 174 144 324 180 -781 407 -637 800 -562 -557 -324 -506 725 -717 -133 -981 180 -119
2375 -119 -206 -515 -809 269 -488 442 -1108 79 -290 -131 430 -1065 390 -427 535 -299 -341 -132 -129 715
2395 715 -321 217 -758 711 -208 192 -344 -747 716 -587 455 -921 -201 33 -94 83 -920 -55
$$ packed form
2264A8N79p82K11J179j190J399k048J333j15L05J05j348O81l54J317j371m6o64
2282g91Q76L40p04M02j849K264q80R77j098n72J172m89J105j443K13j41Q84N8
2300C24o17j07n57J651j149Q53j576O74Q44q09R80j817J350l08P71n82k27L91
2318H9j38R63j156Q87j044J394m48l64N35j052J702j448N92q97M26M40n43J7q54
2337h99J061o15Q10j181J28L03r0R47j774J322j047J226Qp31L30m47J255n11K58
2356C53r63P84l0J80j44r61J188j044J437j362NK33j82J231j442N84q48J161k99
2375a19q7l09k94J078p57R30j550J187l69J59N61j495J455q17R62q34m2K09LQ44
2395G15j036N38r75J469r19M00n36m03J463j303J042j376P20K34j27J77j003Q65
$$ plain form
2413 -55 -308 535 -507 -56 -404 79 624 -389 369 -1001 824 122 221 54 -595 793 172 580 -636
2432 -636 -40 -184 474 53 -705 -203 -826 800 -670 -271 -854 -625 472 -681 106 -1099 -81 -195
2450 -195 167 -286 -336 178 36 622 -528 375 -306 393 312 -413 535 -701 620 -342 209 -252 10 304
2470 304 -343 75 -529 679 -441 281 -642 -86 683 -128 777 -944 434 317 438 467 -329 361 102
2489 102 972 135 32 -627 723 674 127 121 -1139 815 139 761 -448 -704 488 109 1005 -446 -319
2508 -319 -567 642 293 18 -514 -868 522 -336 304 -1132 -467 67 -227 472 -923 -50 -481 569
2526 569 354 76 18 2 643 349 1078 -463 697 266 451 664 -99 875 -381 344 -147 240 200 -578
2546 -578 -339 -530 356 -459 -174 -1073 -73 132 5 317 -967 649 -154 1052 560 -350 141 413 1520
$$ packed form
2413e5k53Q43j042M51l48M83N45j013P58j370J825p02R9j67o49J388o21M08j216
2432f36N96j44O58m21p58N02o23J626j470L99n83K29J097j153P87j205J018j14
2450a95L62m53n0N14j42N86j150R03o81O99q1p25R48j236J321r62N51m61K62K94
2470C04o47M18o04J208j120P22r23N56P69q11R05j721J378j17J21K9p96O90k59
2489A02Q70q37j03o59J350m9n47oj260J954o76O22j209k56J192l79Q96j451J27
2508c19k48J209l49k75n32l54J390q58O40j436O65N34k94O99j395Q73m31J050
2526E69k15k78n8j6O41k94P29j541J160m31J85K13p63R74j256P25m91L87m0p78
2546e78K39j91Q86q15K85q99J000K05j27L12j284J616q03J206m92r10M91K72J107
$$ plain form
2565 1520 588 464 -610 767 737 1024 -45 -1041 422 -47 1087 -609 -652 -434 -280 867 -400 -308
2583 -308 -930 452 482 685 -355 -538 348 183 1278 -598 146 -178 381 891 -349 335 -786 382
2601 382 -74 115 -496 -628 -170 -236 249 -943 -16 -833 145 -110 -275 532 -723 380 -327 642 385
2620 385 -36 32 37 660 309 711 -470 544 294 863 746 -488 129 -668 1223 430 -131 -601 -588 970
2640 970 154 145 -1188 -136 92 716 -198 -782 -441 -431 1214 -506 1 -972 -338 787 135 107 -1122
2659 -1122 64 195 689 -123 -503 -251 -27 800 -440 284 -910 262 258 -16 316 -842 117 -279 388
2678 388 -165 -37 -95 -150 229 -249 458 -654 168 -613 243 362 -517 270 -825 681 37 54 -305 -588
$$ packed form
2565A520r32j24j074J377l0K87j069r96J463m69J134j696m3K18J54J147j267R2
2583c08o22J382L0K03j040j83Q86j65J095j876P44l24N59N10j240O84j121J168
2601C82m56J89o11j32M58o6M85j192R27q17R78k55j65Q07j255J103p07R69k57
2620C85m21O8NO23l51M02j181J014k50N69j17j234O17p97J891p93n61m70J3J558
2640I70q16rj333J052K28O24r14n84L41J0J645j720N07r73O34J125o52k8j229
2659a122J186J31M94q12l80K52K24Q27j240P24j194J172mk74L32j158R59l96O67
2678C88n53J28n8n5L79m78P07j112Q22p81Q56J19q79P87j095J506o44J7l59k83
$$ [...]
8191B28
##END NTUPLES=NMR FID
##END=
