##TITLE=1H_36-2024
 CDCl3
 8 sc, 
 8.5.2024
##JCAMPDX= 6.0         $$ Bruker NMR JCAMP-DX V2.0
##DATA TYPE= NMR FID
##DATA CLASS= NTUPLES
##ORIGIN= UXNMR, Bruker Analytische Messtechnik GmbH
##OWNER= root
$$ XWIN-NMR		Version 3.5
$$ Wed May  8 14:11:47 2024 Russian Standard Time (UT+4h)  she@DPX200
##.OBSERVE FREQUENCY= 200.1309
##.OBSERVE NUCLEUS= ^1H
##.DELAY= (6, 6)
##.ACQUISITION MODE= SIMULTANEOUS
##.ACQUISITION SCHEME= undefined
##.AVERAGES= 8
##.DIGITISER RES= 18
##SPECTROMETER/DATA SYSTEM= spect
##.PULSE SEQUENCE= zg30
##.SOLVENT NAME= CDCl3
##.SHIFT REFERENCE= (INTERNAL, CDCl3, 0, 15.7039)
##AUDIT TRAIL= $$ (NUMBER, WHEN, WHO, WHERE, WHAT)
$$ ##TITLE= Audit trail, XWIN-NMR		Version 3.5
$$ ##JCAMPDX= 5.01
$$ ##ORIGIN= Bruker BioSpin GmbH
$$ ##OWNER= she
$$ F:/spectra/data/she/nmr/H-F/1/audita.txt
$$ ##AUDIT TRAIL=  $$ (NUMBER, WHEN, WHO, WHERE, WHAT)
(   1,<2024-05-08 14:09:52.06 +0400>,<she>,<DPX200>,
      <created by zg, POWCHK disabled, PULCHK disabled
       configuration hash MD5:
       00 E9 B6 7A A2 85 ED C7 34 08 36 98 17 FE 4E 26
       data hash MD5: 16K
       2E FD 12 09 E7 6C 07 01 15 A2 F0 19 A6 1F 8C 3C>)
$$ ##END=
$$ 
$$ hash MD5
$$ E8 4D 67 8B F0 07 0B 29 D4 C5 C0 8C 08 56 E6 DD
##$RELAX= 
##$RELAX= 
##$RELAX= 
##$RELAX= 
##$RELAX= 
##$RELAX= 
$$ Bruker specific parameters
$$ --------------------------
##$DU= <F:/spectra>
##$EXPNO= 1
##$NAME= <H-F>
##$PROCNO= 1
##$TYPE= <nmr>
##$USER= <she>
##$AMP= (0..31)
100 100 100 100 100 100 100 100 100 100 100 100 100 100 100 100 100 100 
100 100 100 100 100 100 100 100 100 100 100 100 100 100 
##$AQSEQ= 0
##$AQ_mod= 1
##$AUNM= <au_zg>
##$AUTOPOS= <>
##$BF1= 200.13
##$BF2= 200.13
##$BF3= 200.13
##$BF4= 200.13
##$BF5= 200.13
##$BF6= 200.13
##$BF7= 200.13
##$BF8= 200.13
##$BYTORDA= 1
##$CFDGTYP= 0
##$CFRGTYP= 5
##$CHEMSTR= <none>
##$CNST= (0..31)
1 1 145 1 1 1 1 1 1 1 1 1 1 1 1 1 1 1 1 1 1 1 1 1 1 1 1 1 1 1 1 1 
##$CPDPRG= <>
##$CPDPRG1= <>
##$CPDPRG2= <>
##$CPDPRG3= <>
##$CPDPRG4= <mlev>
##$CPDPRG5= <mlev>
##$CPDPRG6= <mlev>
##$CPDPRG7= <mlev>
##$CPDPRG8= <mlev>
##$CPDPRGB= <>
##$CPDPRGT= <>
##$D= (0..31)
0 1.2 0 0 0 0 0 0 0 0.06 0 0.03 0 0 0 0 0.0002 0 0 0 0 0 0 0 0 0 0 0 0 
0 0 0 
##$DATE= 1715162991
##$DBL= (0..7)
120 120 120 120 120 120 120 120 
##$DBP= (0..7)
150 150 150 150 150 150 150 150 
##$DBP07= 0
##$DBPNAM0= <>
##$DBPNAM1= <>
##$DBPNAM2= <>
##$DBPNAM3= <>
##$DBPNAM4= <>
##$DBPNAM5= <>
##$DBPNAM6= <>
##$DBPNAM7= <>
##$DBPOAL= (0..7)
0.5 0.5 0.5 0.5 0.5 0.5 0.5 0.5 
##$DBPOFFS= (0..7)
0 0 0 0 0 0 0 0 
##$DE= 6
##$DECBNUC= <off>
##$DECIM= 32
##$DECNUC= <off>
##$DECSTAT= 4
##$DIGMOD= 1
##$DIGTYP= 9
##$DL= (0..7)
0 120 120 120 120 120 120 120 
##$DP= (0..7)
150 150 150 150 150 150 150 150 
##$DP07= 0
##$DPNAME0= <>
##$DPNAME1= <>
##$DPNAME2= <>
##$DPNAME3= <>
##$DPNAME4= <>
##$DPNAME5= <>
##$DPNAME6= <>
##$DPNAME7= <>
##$DPOAL= (0..7)
0.5 0.5 0.5 0.5 0.5 0.5 0.5 0.5 
##$DPOFFS= (0..7)
0 0 0 0 0 0 0 0 
##$DQDMODE= 0
##$DR= 18
##$DS= 0
##$DSLIST= <SSSSSSSSSSSSSSS>
$$ [...]
##$SUBNAM2= <"">
##$SUBNAM3= <"">
##$SUBNAM4= <"">
##$SUBNAM5= <"">
##$SUBNAM6= <"">
##$SUBNAM7= <"">
##$SUBNAM8= <"">
##$SUBNAM9= <"">
##$SW= 18.0517689322627
##$SWIBOX= (0..15)
0 0 2 0 0 0 0 0 0 0 0 0 0 0 0 0 
##$SW_h= 3612.71676300578
##$TD= 16384
##$TD0= 1
##$TE= 0
##$TE2= 300
##$TE3= 300
##$TEG= 300
##$TL= (0..7)
0 120 120 120 120 120 120 120 
##$TP= (0..7)
150 150 150 150 150 150 150 150 
##$TP07= 0
##$TPNAME0= <>
##$TPNAME1= <>
##$TPNAME2= <>
##$TPNAME3= <>
##$TPNAME4= <>
##$TPNAME5= <>
##$TPNAME6= <>
##$TPNAME7= <>
##$TPOAL= (0..7)
0.5 0.5 0.5 0.5 0.5 0.5 0.5 0.5 
##$TPOFFS= (0..7)
0 0 0 0 0 0 0 0 
##$TUNHIN= 0
##$TUNHOUT= 0
##$TUNXOUT= 0
##$USERA1= <user>
##$USERA2= <user>
##$USERA3= <user>
##$USERA4= <user>
##$USERA5= <user>
##$V9= 5
##$VALIST= <valist>
##$VCLIST= <CCCCCCCCCCCCCCC>
##$VD= 0
##$VDLIST= <DDDDDDDDDDDDDDD>
##$VPLIST= <PPPPPPPPPPPPPPP>
##$VTLIST= <TTTTTTTTTTTTTTT>
##$WBST= 1024
##$WBSW= 4
##$XGAIN= (0..3)
0 0 0 0 
##$XL= 0
##$YL= 0
##$YMAX_a= 304398
##$YMIN_a= -360081
##$ZGOPTNS= <>
##$ZL1= 120
##$ZL2= 120
##$ZL3= 120
##$ZL4= 120
##$ABSF1= 10
##$ABSF2= 0
##$ABSG= 5
##$ABSL= 3
##$ALPHA= 0
##$AQORDER= 0
##$ASSFAC= 0
##$ASSFACI= 0
##$ASSFACX= 0
##$ASSWID= 0
##$AUNMP= <proc_1d>
##$AZFE= 0.1
##$AZFW= 0.1
##$BCFW= 1
##$BC_mod= 2
##$BYTORDP= 1
##$COROFFS= 0
##$CY= 11.3945322036743
##$DATMOD= 1
##$DC= 2
##$DFILT= <>
##$DTYPP= 0
##$F1P= 15.6554695791079
##$F2P= 12.8336369535428
##$FCOR= 0.5
##$FTSIZE= 0
##$FT_mod= 4
##$GAMMA= 1
##$GB= 0.15
##$INTBC= 1
##$INTSCL= 1
##$ISEN= 128
##$LB= 0.24
##$LEV0= 0
##$LPBIN= 0
##$MAXI= 10000
##$MC2= 0
##$MEAN= 0
##$ME_mod= 0
##$MI= 1.114404
##$NCOEF= 0
##$NC_proc= 0
##$NLEV= 6
##$NOISF1= 3.799351
##$NOISF2= 2.8
##$NSP= 1
##$NTH_PI= 0
##$NZP= 0
##$OFFSET= 15.70392
##$PC= 1
##$PHC0= -25305.06
##$PHC1= 20.98749
##$PH_mod= 1
##$PKNL= yes
##$PPARMOD= 0
##$PSCAL= 0
##$PSIGN= 0
##$REVERSE= no
##$SF= 200.130013532006
##$SI= 16384
##$SIGF1= 3
##$SIGF2= 2
##$SINO= 400
##$SIOLD= 16384
##$SREGLST= <1H.CDCl3>
##$SSB= 0
##$STSI= 0
##$STSR= 0
##$SW_p= 3612.71676300578
##$SYMM= 0
##$S_DEV= 0
##$TDeff= 0
##$TDoff= 0
##$TI= <>
##$TILT= no
##$TM1= 0
##$TM2= 0
##$TOPLEV= 0
##$USERP1= <user>
##$USERP2= <user>
##$USERP3= <user>
##$USERP4= <user>
##$USERP5= <user>
##$WDW= 1
##$XDIM= 8192
##$YMAX_p= 0
##$YMIN_p= 0
$$ End of Bruker specific parameters
$$ ---------------------------------
##NTUPLES= NMR FID
##VAR_NAME=  TIME,          FID/REAL,        FID/IMAG
##SYMBOL=    X,             R,               I
##VAR_TYPE=  INDEPENDENT,   DEPENDENT,       DEPENDENT
##VAR_FORM=  AFFN,          ASDF,            ASDF
##VAR_DIM=   8192,          8192,            8192
##UNITS=     SECONDS,       ARBITRARY UNITS, ARBITRARY UNITS
##FACTOR=    0.0002768,     1,               1
##FIRST=     0,             0,               0
##LAST=      2.2672688,     0,               0
##MIN=       0,             -360081,         0
##MAX=       2.2672688,     304398,          0
$$ Real data points
##PAGE= N=1
##DATA TABLE= (X++(R..R)), XYDATA
$$ [...]
1889D51r57M71K29p52P61q84J474j134j17Q77j284J446j120L02N02j064J169p91
1907d21P00j60o43R96j324J328o67Q8K31o70J269r71J98M12p99O94p60O84k8k08
1927e1O94j268J491r80N23k0p93Q70n97Q71l56k48M52j213R57k26QL41r27J237
1947G65q11J77M61j059J180p57M88m22k04M80r84J204o83M8M02p93R19n61M42
1966B92l14n84J167j230J067m73k99P03p35P91p53M34j95m21J011q94P17n16l14
1985e46P93r11J081q73N1M97p69Q56o00L80l5l80R76j116J038o12n1N60r39J191
2005E91p96M21k25k29N20p49O59M6o45J022j012P21m16M0M58q45Q43r07Q16Ll25
2026iP41j073J100n49l02Q27r75Q74o31K30J28l15N85o33K82j87n4L81p65P28
$$ y = [451, -506, -35, 194, -558, 203, -681, 793, -341, -458, 419, -865, 581, -539, -237, 265, -799, 370, -421, 279, 119, -524, 472, -852, 476, -191, -103, 128, -542, 727, -244, -46, 366, -433, 261, -499, 185, 157, -51, 643, -625, 866, -114, 409, 389, -404, 466, -131, 740, 384, 136, 588, -625, 332, 106, 114, 455, -472, 765, -46, 131, 592, -467, 713, -44, 444, 22, -182, 298, -686, 518, -165, -117, 285, -508, 411, -150, 292, -22, -606, 561, -669, 398, -75, -374, 329, -406, 385, -368, 66, -129, -550, 461, -433, 284, -232, -546, 247, -664, 417, -456, -405, 92, -677, 179, -421, -41, -76, -456, 520, -596, 442, -170, -221, 339, -600, 591, -205, 216, -9, -238, 282, -467, 192, 238, -407, 615, -397, 324, -92, -52, 406, -439, 404, -503, 313, 316, -9, 732, -341, 759, 210, -92, 735, -240, 634, 3, 233, 361, 46, 631, -2, 280, 93, 39, 420, -345, 383]
2046C83p51K61N20p89R12p68L40p0l90P67q61M19k21J00N64j134R00m77N45l30
2066h0l81P37p33O49l27j44O21q91R36n19o5L67o31P28n08L60j27l22O33j110
2086h07J087n80L1N60p05Q50p32L30l3K7N21j132O48m61L94O86q76P77q12K63
2106C6M26r16J042q42N46l57n2N15n37O77m76J44l5m80Q03n30L23L8o07O73q76
2127d85R26o51L13N24q94P87m85m9M6k28N57m76L74k7n84N59p13M42j80L19R3
2148A68o14O07l63J38K13j94M89r59O81l04l92Q56r37N23l08K38J48m80N62o71
2168e99P19m79R4O47p72N51k73j50N94q04N44l22N95j54m57L65l26L20k58K8J85
2189D8l86N40l59mK97o94R58p03Q32n72l16N99k88K19k04L53j49l09Q03p03J52
$$ y = [383, -368, -107, 413, -376, 536, -232, 108, 38, -352, 415, -446, -27, -248, -148, 416, -718, 182, -295, 250, -80, -461, 276, -457, 192, -135, -279, 342, -549, 387, -132, -197, 170, -461, 267, -241, 119, -8, -330, 303, -807, 280, -300, -269, 291, -414, 436, -296, 34, 1, 28, 549, -583, 65, -396, -2, 684, -192, 585, -227, 36, 462, -454, 588, -254, 292, -65, -117, 398, -139, 538, 62, 206, 171, -309, 494, -36, 287, 325, -282, 391, -485, 441, -210, 103, 627, -267, 520, 35, -14, 32, -196, 361, -115, 259, 232, -352, 207, -506, -64, -244, 75, 168, -446, 161, -202, -64, 149, -45, 444, -515, 166, -138, -530, 326, -611, -88, -396, -158, -10, -490, 72, -599, 120, -359, -265, 382, -390, 161, -112, -262, 332, -472, 72, -250, 345, 191, -266, 99, -227, 93, -165, -137, 48, -338, 202, -157, -161, 136, -558, 400, -303, 529, -43, -359, 240, -48, 171, -33, 320, 171, -138, 665, -38, 114]
2210A14K40l08N59q07M85l59j53N11n18P40o36J00J06k92L73m06L92r7j6R9j93
2231f6M31p5k78o1l66O51k68O4k11j53P27r39P14k60O6K43q37R48m53J31J41m14
2253b65P74q72J88J11k45N91m74K27k46l2L46l20M30n57K41J30n24Q03o39M19
2273H6k42k93N47k82L93n15M26m1r8M64o53N49m80J12L15p13M64O9j37K42l08
2294i5M30m46N53n12q8Q89r11K42Ok1J60m97M79j00k1ml69P18l67P0K2k84N28
2317C82q07M79K8k22j4r3O15l07q4R9k22M08m39K09k41J80J21l09M77l67j17J02
2339a22l01O53k70jP2k68L42k83J57j86P1J89j67J38j87J55j5k50O23m39M50n67
2361b06j35O28l78N3m73O00J68n84O01m73Q8L81k66L70n36N12m14o1L43n11L33
$$ y = [114, 354, 46, 605, -202, 283, -76, -229, 282, -236, 504, -132, -32, 74, -218, 155, -251, 141, 44, 28, 127, -66, 365, 290, 12, -49, -415, 236, -32, 32, -179, -332, 395, -544, 170, -90, -24, 219, -618, 330, -123, 8, 149, -265, 509, -363, -175, -64, -309, 282, -192, 35, -211, -243, 103, -217, 213, -344, -103, 27, -497, 306, -333, 86, -156, -449, 98, -184, 209, -306, 120, 79, -19, 445, -208, 341, -139, -27, 288, -425, 39, 108, -29, 213, -95, 335, -111, 442, -70, -158, 731, -180, 62, 68, 47, 207, -290, 189, 89, 68, 64, -305, 413, 46, 116, 138, -146, 382, -425, 54, 82, -140, -154, -247, 368, 61, -23, 76, -146, 262, -177, 32, -209, -29, 92, -217, 260, -107, -224, -122, -423, 230, -40, -41, 31, -237, 105, -178, -21, -207, -136, 53, -114, 24, -163, -8, -23, -273, 350, -89, 361, -206, -341, 287, -91, -38, -511, 89, 257, -327, 274, -199, -111, 270, 4, 374, -162, 350, -64, -125, 218, -293, 40]
2382D0N2M8k9m07M45k72J33k7nL35n27N66m39J29L72m14M95o15J19K35k93N89
2404E30p63M64m59K34L1o2K63m93L53q2m48P92n85K28r4j41L69n91N64l8j27K32
2426A77l08K05l22l8J07J58J56n73O82l92l8K19j56L33m01J85J87l72M47o47M07
2447A6Pl55K72q8N95o63K11k8j42M66o98N53j66k45L66j61L36m16K73O4m45L87
2469A39j48K33m45l10N71j35M24k83k3K15m61L93j38N3K93n72N14m27K04P5l90
2490b18M42m38L11j00J06K46p07N07n26N81l29o6L35j71l2J89j19K84n68K61r5
2511a07J68l54L1M67l63N1N0K15n7n03M42j02O3rr1N39q46K47J82l02K16Pj0P4
2535Hj97L56o17M53n82K42N00j48r9j30L53j36j79K03k64K57O8J11j49k28L57
$$ y = [40, 92, 140, 111, -296, 149, -123, 10, -17, -22, 313, -214, 352, -87, 42, 414, 0, 495, -120, -1, 234, -59, 530, -233, 231, -228, 6, 37, -25, 238, -255, 98, 16, -432, 360, -225, 3, -91, -232, 137, -454, 110, 72, -55, 177, -131, 74, -248, -286, -179, -21, 135, -438, 244, -148, -186, 33, -123, 210, -191, -6, 181, -191, 256, -391, 16, 23, -332, -60, -148, 447, -216, -5, -33, -175, 291, -407, 146, -20, -265, 101, -60, 276, -140, 133, 197, -248, 139, -9, 224, -221, -531, 40, -95, 329, 46, 23, 238, -223, 170, 32, 85, 378, -194, 320, -107, 97, 172, -218, 224, -214, 97, -3, 103, 349, -358, 149, -377, 204, -125, -191, 144, -27, -59, 130, 11, 295, -273, -12, -107, 61, -293, -262, 205, -158, -107, -57, 158, 101, -402, 40, -62, 1, -8, -99, 440, -406, -159, 23, -279, -63, -56, -66, 8, -189, 167, -450, 3, -579, -337, 163, 15, -84, -214, 139, 3, -176, 27, -237, 20, 88, 199, 50, -178, 179]
2556A79k55R9O9j60K24l95L59O3l13O42o78K19q4%J1kJ00l27N38k39j08N05o02
2579a55L48k73J69J02l85N57p18K29L05m10M51l08J83o3J05j00l51O01j99J17
2599B05k07k91M64k26p2L44l66M57m41Q7ok44L12k85N40m29J05K42l91K14M5q2
2621b5J79k31J66m68N56j94j9J92l06K32K5l4P3l05N6J56K0j95p4M41m1q7j12
2644ER9j7r5L34k81J43k16j39M9j31M89m34L54j46J8Q5k78K77K0k16L02j98n8
2667c4O7j2O6J9M9l02M20l2l92M34k85j7q9M0K7k71N52q2j26J47l89K54R0j58
2691b4K38k21J78k33m3K76l75J43J43K31m23J23m7k49M45j37j16J73j62J48j03
2712c5L04l15L5J63k30J90j53j35J42p7K86l96K88P1l40J20J16j33J1j17M13j45
$$ y = [179, -76, 23, 92, -68, 156, -239, 120, 183, -130, 512, -166, 53, -31, -31, -20, -22, 78, -249, 289, 50, -58, 447, -155, 193, -80, 89, 191, -194, 363, -355, -126, 179, -231, 220, -88, 95, 32, 137, 37, -314, 287, 88, 205, -2, -293, 171, -55, -127, 217, -149, 308, -133, -46, -52, -296, 16, -269, 271, -158, -53, 189, -202, 12, 57, -25, 154, -77, 89, -379, 177, -17, -36, 156, -150, 82, 107, 73, 146, -159, -103, 53, 73, -122, -196, 245, 204, 117, 5, 104, 87, -8, 326, 45, 188, -28, -167, -118, -249, 240, -194, 160, 14, 32, 117, -161, 116, 136, -80, 222, 24, -34, 33, 21, 87, 106, 155, -147, 273, 241, -151, 283, -2, -19, -108, -68, -41, -312, 240, 158, 32, 179, -210, 44, 134, -24, 214, -7, 171, -62, -105, 171, -204, -61, 82, 313, -110, 13, -34, -283, 162, 25, -91, 82, -80, 68, -35, 269, -46, -11, 152, -78, 112, -41, -176, -34, -111, 175, -221, 67, 138, -202, -82, 34, -99, -88, -205, 208, 63]
2734F3O4j47R1p3qJ17k57K63m1J04j20j63J27J58k48l6LJ52j10K81R5k13K08l20
2758a0P7j23J65l5m81O64j25l4j06j69Q30p65K98k37k6K75j75Q4j99K07J28n42
2780b99M86k17j2J95l37L0M3N09m50J6K33jj40j93J52Q2k46N30o37M17r2k08J7
2803a22k38M87k43J39R2k84L92k88j29J93M5J52l60K69n4l57K28n6O44o78K48
2824H0k53j61K71k24M93j56m0J46j34o9K79l17K69k23n2K2M56k33l48K99l73M81
2846B13k36J50j20j11J75k70J39P5J53n4k86P1lk77O03j93K04j64n8K5n7M35l39
2869G5r4K59k75m1J34J60k42l9J88m10M21n75M84N8j27L5j17q1J90j03K81k32
2891e1K09n0m14M28k15L62l42J6k17K5K38j21J30jQ1P4o59O72l60N9K96m27K41
$$ y = [63, 127, -20, 71, -2, -10, 107, -150, 113, 72, 176, 56, -107, 20, 178, -70, -106, -103, 49, -61, 220, 315, 102, 310, -10, 67, -56, 109, 74, -407, 257, 132, 98, -8, -177, 653, -112, 186, -51, -77, 198, 23, 107, -92, 115, 243, -299, 187, -30, -42, 153, -184, -154, -111, 398, -52, -36, 197, 196, 56, -137, 15, 97, -149, 381, -256, 161, 69, -139, -122, -360, 127, -116, 23, 115, -169, 223, -65, -194, -1, 44, 196, -164, 105, 51, -306, -78, -134, 510, -168, 80, -173, -334, -63, -287, 206, 50, 10, 156, 22, -47, 232, -85, 184, -39, -91, -69, 387, 154, -194, 105, -268, 213, -23, 127, 7, -104, 71, -199, -60, 15, 168, 114, -172, -101, -104, -381, 222, 29, 233, 69, 11, 36, -21, 414, 75, -19, 240, -35, -76, 58, 218, -24, -63, 125, -285, 136, -439, 45, 103, -24, 11, -106, -187, 3, -100, 181, -51, 158, 108, -306, 122, -93, 269, -73, -57, -274, -249, -11, -132, -2, -3, 78, 152, -507, 165, -195, -136, 160, -267, -26]
2914b6j07L38l78L6O6l43K09P5o3N67l86L32m10M56m38m4J91m86Q01l76q2L37
2936B69m33J44l61M45j74K09O8l03L56m6p6o9J56r0n2j62K12k14J10M0n1J4k26
2959b34J31J64j35K4j55K77l21N21l01J36r5j05M19m80J19J06P7J39n99M29j54
2980c7K18m9N5j19k63M30j76j54J3l12O59k91j60M69k70j2k80J63r6O6Jm8L71
3003A78k51J81n2k85N63r1l11mJ33J38%k10N4k08K68j09J98k77L9K12m35L53K4
3026A08Nj4k63M91n92M47m18j0K33p6rJ36j99M27m63K73k69J95J07k29J54j94
3048a60K74k72K13rn7Oj11J50j9p5K71m65K62J42j45O4j65l8rl7K15oK97m90J48
3073a6J01m45L21l03N68j44j72K21l01L72k34Q1j22k64N23j98K8K1l88L06k83
$$ y = [-26, -133, 205, -173, -137, -71, -414, -205, -130, -193, 374, -12, 320, -90, 366, -72, -116, 75, -411, 390, 14, -68, 269, -164, -20, -381, 64, -110, 99, 167, -136, 220, 174, 98, 29, 185, 95, 43, -119, 93, -121, -11, 29, -22, -8, -234, -103, 61, -74, -50, -205, 72, -249, 272, -29, 107, 12, -93, 326, -154, -35, 71, 148, 287, -312, 117, -37, 181, 132, 187, 68, -195, 235, 59, -95, -82, -394, 265, -26, -186, 283, 13, 1, -279, -116, -212, -146, -145, -193, 178, -73, 108, 56, -229, 334, 243, -68, -72, 61, 199, 199, -11, 43, -165, 103, -6, 192, -85, -46, 166, -269, 84, 108, 113, 99, -164, 327, -265, 182, -236, -246, -13, -89, -98, 38, -161, 266, -197, 76, -193, 2, 109, -120, 34, -160, 114, -158, 55, 46, -11, -5, -116, 34, 15, -60, 211, -254, 8, 150, 5, 69, -96, -134, -143, -180, 35, 29, 326, -164, -16, 85, -360, -39, -342, 226, 82, -90, 131, -170, 202, -32, 49, -73, -337, 186, -12, 16, 37, -351, -45, -328]
3094c28M14r0L9P4l11K36l91K41l7l1N26m49K82j98k83O11n29K17j91K47m3j16
3116a10O2j8M4K63l28J59n4P5k54J28J21LL6j56K00J27m07J51Q5J82n48M3K58
3139F2J43k63m7mJ83j10n1j8j12J67M2J76l56N92n81J3J58j82N85m85J18k2j57
3162a49n0J25j93K71j48J71n44N97k97M11l12j91O55m49k5J56o6J85k19J71j64
3183f5j7K98m94N13l16RL20k26J68l27J78J15l58L48j24q2p6L01J82m60K04k05
3205a14J44Q3n6k9q8N45m13o8K43k76L55j90k14J84l44O99n34M88j85j98J02l93
3227b59N77k44m7j40j26L29l15K25K60k13j5n2Q7K27l15K79l88L61k25n6j13j59
3249c22L13k42L15j91j96M96n62N21k69r9L19k20J12l08M02N4l83M2jM57j41j63
$$ y = [-328, 86, -4, 35, 109, -202, 34, -357, -116, -153, -184, 342, -107, 175, -23, -306, 305, -224, -7, -198, 49, 6, -110, -48, -66, -22, 241, -87, 72, 18, 93, -161, -33, 88, 91, 127, -29, 171, 298, -109, 42, 127, 309, -239, -196, 62, 205, -58, -105, -109, 74, -36, -87, -105, -217, -50, -8, 168, -188, 404, -177, -164, -6, -188, 397, -88, 30, 8, -149, -199, -74, -267, 4, -144, 27, -517, 80, -217, 194, -118, -309, 346, -103, -128, 28, -38, 147, -72, 99, -65, -82, 216, -278, 235, -81, -72, 248, 22, 190, -137, 41, 156, -202, 146, 22, -60, -136, 165, 347, -113, 91, -114, 30, 113, 57, 28, -60, 485, 72, 4, 247, -29, 326, 136, -78, 106, -238, 461, -73, 415, 230, 32, 134, -259, 318, 74, 27, -113, -239, 90, -225, 0, 260, 47, 32, -20, 67, 294, -21, 258, -130, 231, 6, -50, -163, -322, -9, -251, 64, -127, -323, 173, -389, 132, -137, -236, 83, -137, -25, -333, 69, 123, -260, -218, -219, 238, 97, -66]
3271f6J34j84L57m02l2M35l37K06j03J33o0n09O26k69L47k29l8p5j66M74m60Q6
3293a32J60P8r6k13K94j01N5O6j50J97m42L57J64l13K73l24J96o5Q6L11m05K01
3315A97j17l6N6j23j2j5P0N8k74K18k06L19K8j31K64l35M25o08J66J24l19M05
3337A54l09j6J74j49J17j08L53n6j62j28O1L32l20J49j20k5J25q4K58j96k8p5
3359e3k18L07r9j6J51n63N94k59R8P7j85J50O7mk20L94p7k88M74l75k21M30l46
3382a82L61m35L09o1o1K60k89L44m87L10N7k86O63m97J93k29O0K97m43L27l47
3403a36j32L49n41P29l85K89J71n28K08j93N87o30j63M22o5N77q62M39j2l76N41
3424B89m67K47R6k06J27n62N27k64M57k46j83M90n93L08j81m9K91m65N55k72j64
$$ y = [-66, 68, -116, 241, -161, -193, 242, -95, 111, 8, 141, 81, -428, 198, -71, 276, 47, 9, -66, -232, 242, -218, -132, 28, 106, 10, -203, 91, -10, 45, 111, -39, 158, -284, 73, 237, -76, 197, -127, 69, 4, 90, 401, -4, 197, 80, 44, 100, -23, -35, -50, 20, 78, -196, 22, -184, 135, 163, 32, 296, -39, 386, -222, -56, 68, -251, 154, -155, -171, 3, -146, -29, -137, 216, 160, -2, -130, -69, 263, -57, 92, -28, -53, 72, -12, 246, 50, 22, -53, -271, 36, -63, -79, 72, -491, 103, -156, -58, 19, -166, -16, 51, 47, -173, 221, 144, -144, 330, -45, -266, 164, -182, 179, -256, 53, -8, -69, 191, -98, 246, -241, 69, 126, -160, 503, 6, 199, -30, 30, 327, -116, 211, -136, -268, 81, -460, 269, -116, 173, 344, -184, 24, -169, 418, -212, -375, 47, -18, 559, -303, 136, 124, -252, 289, -178, 69, 165, -41, 86, -476, 51, -213, 244, -2, -185, 305, -288, 20, -161, -210, 81, -384, 171, -101, -265]
3445b65M11l00R8p9K4P5K7l5j73P1R9j85K50k41N15l67J64J15m06M73k02N0j78
3468e9j2J60o4k94M8K31J23l79J44L32k33Q9l65M22k44L47j27l33M16k78L21l48
3490a03J05L43l92j1k38L79j87J86O0m63L72j44j14J64j95L57k78K86j58k08L17
3511G8k04M12k44l56L86r7J66k87K15k17j59L68O0p1J21k87J91m47K20K45k69
3532a76M25m06K05k49j50L11l03M15k30L35p8k50L74m74M74j05j30K96m78L46
3552A52k36K2K21o6l43J13L91q0k56M15m10M72l35o5J76m69O35j16k04J14l60
3573b29K01j08L68k99K2o9P4L00j44P2k16k6k15R1L12l56K36J66l62L20m11L80
3595A07J75k50K90o34M82j83l6L0j95L85l59r2K38o2L61k78M4M6l13K85j61Q2
$$ y = [-265, 146, -154, -56, -135, -111, -36, -9, -44, -217, -146, -47, -232, 18, -223, 292, -75, 89, 204, -202, 271, 69, 119, -59, -71, 89, 25, -269, -221, 10, 133, -246, -102, 230, -3, 86, -279, 143, -101, 246, 119, -214, 202, -76, 245, -103, 2, 345, -47, -58, -296, 83, -104, 82, 142, -321, 51, -93, -207, -43, -238, 119, -159, 127, -31, -239, 78, -126, 286, 42, -314, 72, -25, 141, -146, 69, -148, -307, 61, 121, 50, 171, -116, 75, -372, -152, 93, -176, 249, -157, 48, -201, -351, -40, -343, 72, -158, 177, 99, -151, 223, -251, 223, 118, -12, 284, -194, 152, -84, -62, 159, 93, -250, -137, 254, 174, -82, 333, -77, 395, 60, -5, 171, -298, 337, 221, 17, 131, -229, -28, -136, 232, -67, -45, -114, -40, 260, 116, 188, -28, -54, -269, -178, 134, -222, 14, 180, -182, 138, -273, 107, 282, 32, 322, -312, 170, -13, -49, -19, -214, 171, -188, -280, -42, -104, 257, -21, 23, 69, -244, 41, -120, -38]
3617c8k54r4L59j44L52k30L23j64l99N55m15J17J76k55K34l78M64k86m1M01n59
3638b76M80l07K54l86o0L66j70J29k46K79L64n95L33k79K76R7n09L37j67N8J33
3659A11k45L69m41L83q4k07N18o56M77q6k42K73n78N00q3K59j56j12j4q1L99l67
3681f3J40n9j21K85l85L22r2j06M40l98K51m51J70L25k34Jk07K80m55L35R5n47
3703d74N68J91m77M41m72K55r3j18P6j35L56q0O9R9l34N14p80L84ON4j11j19L61
3726A81m28K45j99j5K90l68K73q6J13j1j69J81J18k70L57j12n0r9N1j37K11L12
3748C88m34J75nk16K60l19K09k94K35J68k53N76p23N01r8p2N7k16L02n26N18J04
3770C37n75L02k51K35O6k17O72n36O7k59L18j01l5L38l70K75n07K37j1l39M64
$$ y = [-38, -292, -386, -27, -171, 181, -49, 274, 110, -289, 266, -149, -32, 144, -111, 123, -255, 209, -77, -118, 283, -276, 204, -103, 151, -235, -295, 71, -99, 30, -216, 63, 427, -168, 165, -114, 162, 259, -250, 87, -80, -22, 111, -134, 235, -206, 177, 93, -114, 404, -252, 225, 139, -103, 170, -408, 92, 9, 268, 112, 0, -14, -95, 304, -63, 77, 18, -103, 182, -203, 119, 27, -79, 361, -37, 214, -237, -67, 258, 24, 25, -182, 98, -357, -22, 73, -474, 94, 285, -192, 249, -223, 32, -61, -179, -103, -238, 118, 38, 107, 206, -128, 386, -394, -10, -4, 50, -61, -180, 181, -247, -2, -201, -216, 74, -294, -21, -107, 6, -5, -174, 7, 125, -145, 212, 100, 50, -49, 2, -135, 76, 388, -46, 129, 124, -92, 168, -151, 58, -236, -1, 167, -86, 490, -233, 268, 170, 98, 155, -61, 241, -285, 233, 337, -238, 64, -187, 48, 114, -103, 569, 33, 100, -159, 159, 58, 23, 361, -9, 266, -241, -4, -15, -354, 110]
3791A10r9l23L16k52K74j33K47m0k23L54l54K21k46k09M08l33K36J5n5J74l13
3812b25M08j80j6J80o10P66m99J81m8j20Q0k59M06L0j15J09l32P45n83J16J95
3833B29j75K76n58K07j18J38J92k17K49l59J54M8l10K33k28L72j39J10K41l61
3853a6J10N5r1j15j60M14j66J2r5k17J26N0J15k97K15K42l35K68k52J77j12k35
3875c07K16j22M61m02O4K10m99N36j68k77J69m5J68j78J13K13m20K63Po6k26L71
3897H1j21k09N26l13O2M8j45J18r1q1n5n8K93l81M33j47KL52n56K81r3nK40m17
3921b36M56k91J88k4Q1l5k07K17m72J77J75r4L92m74N1J19jJ95l24J73J16k76
3943i4R9k6J78k22M10j81k37M20m74K60NJ5j35l21M89j02J27j91l70M73l54L67
$$ y = [110, 11, -312, 4, -248, 26, -107, 140, 100, -123, 231, -123, 98, -148, -357, 51, -282, -46, -31, -86, 88, -225, 183, 3, -13, 167, -443, 323, -176, 5, -43, -163, -83, -342, 64, 94, -21, 88, -244, 501, -82, 34, 229, 54, 330, -228, -21, -139, -1, 191, -26, 223, -136, 18, 66, -244, -11, -239, 133, -6, 104, 345, -16, 94, 149, 58, -57, -217, 197, 31, 43, -52, -269, -143, -93, 22, -275, -60, 182, -153, 115, -137, 40, -72, -307, -91, -213, 248, -154, -90, 120, -379, 157, -11, -288, -119, -164, 4, -174, -61, 152, -268, -5, 2, -64, -290, 81, -40, -249, 277, -36, 26, 74, -71, 47, -44, -125, -180, -238, 55, -326, 107, -40, -38, 314, -242, 39, -54, -59, 181, -236, 220, -71, 117, 93, 174, 139, -68, 149, -323, -146, 29, -65, 327, -147, -96, 23, 22, 217, -107, 66, 182, -94, 5, -21, 157, -65, 345, 164, -73, 347, -127, 133, 138, 153, 18, -303, 186, 84, 211, 20, -350, 123, -231, 136]
3965A36j51j81K37k15J64J87m09K93l87O88o83J94J63j52J82l11N04l56M7KqM22
3987C66m09m8p8L46k05J1K71k97n3J43j59P7n7K95j81j43K13k69J56R9k79L83
4009A82j26J40k79K20N0k42N13m97K31k34j60N62m88K58j45J46nk97K14k00kN9
4031a00J18J34k69J12K25k99L31l18L12l48N1J75oK6j25j51J43k53J86L8K69l59
4053a08m2J29O2J79l48P1j86M3L00k52J92N1L7m9j94R9n8m5J48j47L35m62K51
4076FqKpl4k3R3j2J56j57j36L5J99l05l4M47n39M17Kk62O8J07k9k97K65L40m90
4102a96M96j50k05J68m80L85j63Q4O1r9L69l79J93j41J34l4r8K09l47N51l86K34
4124B06J6l71M53m14l0M50k69L15m01J69j93J19L04n16K31l4j67L43l42J50j9
$$ y = [136, -15, -196, 41, -174, -10, 177, -232, 61, -326, 362, -321, -127, 36, -116, 66, -245, 259, -97, -50, -48, -56, 366, -43, -91, -169, 177, -28, -17, 254, -43, -96, 47, -112, -35, -92, 203, 22, -121, 92, -177, -21, 78, -201, 182, 56, 196, -83, 137, 187, -55, 458, -39, 192, -42, -202, 360, -128, 130, -15, 131, 126, -171, 43, -157, -159, -100, 18, 152, -117, -5, 220, -79, 252, -66, 246, -102, -51, 124, 118, 144, 19, -132, 11, -242, -56, -18, 251, -108, -150, -21, 41, 220, -128, -57, -243, -200, 100, -152, 40, 91, 128, 79, -115, -16, -74, -119, 29, -118, 217, -245, 6, -2, 0, -7, -41, -64, 29, 17, 173, 16, -120, -85, 114, -191, -225, 222, -317, 100, 102, -160, -92, 15, -14, -311, -46, 294, -196, 300, 150, -55, 113, -367, 18, -145, -61, 0, -99, 270, -109, 84, -57, 77, 43, -55, 154, -193, 358, -28, 206, 222, -149, 304, -110, -140, 310, 41, 356, -45, 124, -69, 50, 354, -162, 69, 35, -132, 211, -131, 19, 0]
4145@P9n8m39O03j99m9m2ML90q35M62o3k55L54p6L49l19J55k60J15N7j83L65k24
4169f9k17L22k75L06J9j35m1K20Q2m70M01L3k09J51m95N81l04J94N4l36N20m12
4191h0L28j74k29M47l10O5l3l5J40j02J36j95NL74n00M62l55O9J34k50L39l46
4213a10J64k16K85Q1p0J93m96J69J31j42o6j15J97J51j40J6k68J50k30J37K51
4234G2j1R8l19P3J31n63P51m05M47j63l66N47m21L76j11k5j84o9L0j93M89m8m71
4257c35M52k75K00k91P0L61l93M51j98k89K45l81M67m06K12o2n2J53NJ06k12L03
4279A31r2j2J75n29J83J36oK05n75K34K78K42j66q8J60l86K26j27r2K38j87N1
4301ak15L5J24n4L52j64j82J33J10K93m08j23J3K36j05n1P5j73J32N2l45M73l21
$$ y = [0, 79, 21, -418, 185, -14, -63, -105, -101, 289, -546, -84, -147, -402, -48, -124, 225, -94, 61, -199, -84, -27, -210, 155, -69, -286, 36, -239, 67, 86, -49, -90, 130, 212, -258, 143, 176, -33, 118, -377, 204, -100, 94, 148, -188, 332, -80, 248, 74, -155, 292, -18, 47, 14, -21, 119, 17, 153, -42, -37, 337, -163, 299, -56, 13, 147, -103, 236, -110, 54, -162, 123, 204, 134, 327, -169, 0, 131, -11, -77, -192, 5, 156, 16, 32, -236, -86, -316, -179, 72, 61, 159, -160, -87, 44, -519, 232, -173, 274, 111, -255, 292, -129, 247, 136, 111, -73, -142, -112, -305, 184, 136, -335, 117, -158, 42, -249, -179, 182, -211, 240, 42, -247, -2, -383, 84, -322, -110, -172, -224, -71, -66, 40, -172, 131, 39, 27, 202, -327, -144, -8, -14, 191, -384, -150, 128, 370, 204, 116, 276, -110, 116, -11, -103, 135, -52, -1, -216, -181, -57, -111, 241, 77, -105, 28, 138, 431, 23, -100, -87, 149, 44, -7, 68, -105, 27, 79, -266, 207, -114]
4324a14K81q2n1J29m30K91j76M7Jj50O62n53k8J86K5jO0Ql29K05K27l69M22k58
4348CJ37k4l57M40l32R1j72q2K87k02K69J1k11qj54L33j81J60J63j84M7r0k3Q5
4372Fj63J46R2M8j84Q2j2j46L14lJ08k73J2o5k9J76l25J36K71j43L77n33KL14
4396B08k25N1j09J92j84K12oK0m9j90j6J26j39K02m0j3k0pR6l29K9p2J12J46l42
4421c47L79L5k39J95l41L49j51J38K6j70K98j76Q9m51L66L5j59J53l06L69q3m
4443Ej03l14Q29l63k5O3j16R1k42n5L57l57L20o1j22K68k42K26k25L04o7l76L43
4466A38k78M20k89n3j03K95p0J18l48K14R2j50k54M8N83j99k49J16K92m88K81
4487A16j42o2M78n48J11J74j21J80l25M25n13K84R9m6P3k15J1l8j27J80j28n6
$$ y = [-114, 167, 85, 34, 163, -267, 24, -152, -105, -104, -254, 408, -145, -173, 13, 38, 37, 97, 105, -224, -19, 208, -161, 261, 3, 140, 116, -241, 199, -133, -42, -214, -296, -9, -211, 58, 69, -142, -150, -304, 29, -152, 8, 171, -13, 34, -56, -79, 6, -157, -11, 81, 129, -55, 27, 15, -131, 183, 180, 288, 15, 27, -38, -67, 109, -216, -80, 191, 48, 425, -108, -106, 208, -17, 34, -75, 117, -67, 145, 139, 159, 110, -80, -96, 30, -109, 93, 53, 40, 20, 13, 109, -220, -191, -263, -151, -5, -347, 32, 67, -172, 23, -318, 31, -120, 18, 44, -126, 172, -4, 85, -366, 0, 35, -124, 29, -277, 92, 9, 5, -98, -412, 417, 54, 29, 92, -24, 67, -175, -230, 127, -230, 90, 29, -93, 175, -67, 159, -66, 238, 171, -205, 138, -140, 280, -9, -62, -165, 130, 60, 178, -170, 44, 136, -14, -268, -220, 363, 164, -85, 31, 323, -165, 116, -26, -88, 390, -158, -47, 127, 6, 186, -139, 286, -227, 57, 156, 110, 183, -32, -21, -59, -186, -6, -134, -190]
4509a90P4L24j08k86L35k04j4J32m78M71m34L99j44J07O4l71L12j91J86o8J76
4530I2k53Q3K52k26L3j46K0K92k40o6J69n2k9l15N42j90l22O67l70K21j7j21r9
4553g5j65L66j94J52k5k4J91K0k16p4l7R8l10L23k11K99j40k10L60k16J33r5J23
4576G3j24k93N17l76j8K05p7J36m2j09j7j02O07n76M90l40l19K89j67K55J42m12
4598b58L61QN1k56k71K96r1O0m0K66k17J48N5P0j10j88J05j22p2K48N8O0m37K71
4622eJ32j21q1k31J21J24j8J32J7K7j0k87M38l87J69l00J35L70k82k41L71l29
4644b56K59m2J91ll38P3K77j39j02K21m70K26K50l28J42n4J84j84J86J08j85k3
4666gJ80j68j01l9r6l1L66K1j83L18k83R4r9k83K42r9J66j07K65R3n02J28J28
$$ y = [-190, -116, 208, 100, -186, 149, -55, -69, 63, -415, 56, -378, 21, -123, -16, 48, -323, -11, -202, -16, -84, 92, -161, -78, 174, -52, -19, -165, -145, 147, -93, -159, 10, -42, -71, -386, 156, -34, -356, 311, -59, 162, 145, 24, -75, -240, 126, -68, 84, 59, 35, 226, 246, 30, -44, -81, 17, -293, 30, -181, 118, -22, -232, 128, -88, 45, -50, 73, -51, -344, 173, -203, -221, -16, -93, 43, 1, -108, -125, -227, 380, -196, 294, -46, -365, -76, -243, 12, 154, -258, 103, 111, 162, -94, -365, -69, -160, -100, -140, 126, -91, 57, 112, 182, 72, -116, -11, -133, -205, 43, 101, 161, -276, -5, 127, 6, -75, -306, -185, -61, -79, 53, 70, 97, 87, -200, 238, -149, 20, -280, -145, 225, -57, -298, 73, -256, 3, -39, 152, 149, -189, -116, 161, 22, -80, 141, -329, -103, 147, -181, -39, -93, 91, -93, 93, 201, 16, -7, 173, 5, -96, -135, -231, -262, 104, 125, -58, 260, -23, 71, -28, -311, -69, -168, -2, -109, 156, 249, -253, -125, 3]
4689CK65n47Q6L34n65M40m76L27J12J15j12K85k08Jp7j7o9L53k91l2O1l33M76
4712A31p0r9J65j58L8N0j57L48k28j1j86J54j62J25j3J45j64K73j98mJ7O5j79
4735a18K12o3qj70j8K84k81J52L02j30K3m10oK91M6J5l06K72j60L66l68J58m4
4758C9j89J61R7MJ56k18J96m53O5K69k1j52n5L01m0k58N70l72J36k04m8J33j32
4781a5n8J92l8J32l51L05j88J41k66M2K39j44o9N9Q5N7l45J48J87m16L76N3K41
4804C67m22J88m02J71n0J61j22p9L57j42j7j31m5K34J54l05J40L6M7j75q5K21
4826A01j34n4n1L2R6j87R8j09L06m56J26L25l59L40r9j8J44j72J45q6J65k7j21
4849EJ45m57L57M5q7J65k14K23k00o8R2j75J94j2M9o9j01M8j63K53j78L3J66k91
$$ y = [3, 268, -279, -193, 141, -424, 16, -460, -133, -21, 94, -18, 267, 59, 60, -17, -34, -103, 250, -41, -73, -12, -345, 131, 61, -38, 127, -31, 7, 57, -100, 248, 20, 9, -177, -23, -185, -60, -73, 72, -92, 181, -17, -21, -4, 61, -118, 94, 31, 23, -147, -165, 119, -162, -10, 292, 162, 185, -225, -231, 60, 106, 121, -185, 87, -73, 293, -75, 83, 39, -150, 11, 108, 112, 268, 50, 246, -207, -142, 127, 106, -46, -101, 200, 160, -98, 472, 100, 236, 32, -16, 117, -15, -73, 119, 81, 213, -138, 167, -21, 120, -146, -104, 135, -9, -78, -19, 66, 123, -222, -74, 113, -303, 73, 126, 367, -55, 133, -269, -98, -148, 13, -109, -188, 169, 27, 10, -121, -166, 68, 222, -83, 57, 93, 140, -35, -120, 101, -33, -87, -138, -106, -10, -197, -99, -208, 98, -358, -232, 93, -266, 74, -25, -43, 101, -71, 74, -12, 153, 126, 5, 150, -307, 50, 95, 8, 173, -41, 182, -18, -86, 6, -169, 25, 13, 62, -7, -108, -60, -223, 30, -148, -115, 51, -240]
4873b40K95j45j47J88m6J84k01L95r7k82L62m75J07J16k26K12Q2J84n13M46j45
4894E4j74j19L11J39j20j33k0o0L35j45j48J29l9J12j53R2l9n4O4j53J01l3j55
4917b08L04n79M67MlM6m9K00k38K73k60l6R7k65L42j30j54j30K10K39j01j54L41
4940B16MJ22n06L22j64j66M9L7J21j14J78K62n17K43j62J80m5J53j04j51K75k53
4962b0m2k8k80N07j99mK17k89L54j44j84K15j33n7kK29k65Q4J66q9jj10L43k92
4986b4R8j1n4M2K6M0j08N3Kl0j58J61K7l32k4L63k99J73J99k7o1n4j96J91K15
5011B12k13J19k4k10K12O4q1j18j20K05R0k90K92j30Q7j06j19J50K4J67P3m21
5033a37M6o6Q1j38N7M05l16P1q2k28J15Q8K71m69J59o7J52J36k51J72k2n1K16
$$ y = [-240, 55, -90, -237, -49, -95, 89, -112, 283, 186, -96, 266, -209, -102, 14, -212, 0, 82, 266, -247, 199, 54, -120, -239, 72, 211, 91, -42, -62, -122, 213, 68, -80, 49, 10, 122, -31, 61, 22, -32, 32, -121, -20, -53, -208, 96, -483, -16, -12, -15, 31, -18, 182, -56, 217, -43, -79, 18, -247, 95, -35, -189, -319, -109, 130, 29, -125, 216, 220, 342, -164, 158, -6, -172, -123, -86, 35, -79, 99, 361, -156, 87, -75, 105, 60, 213, 109, -42, 233, -20, -62, -90, -370, 137, -62, -66, 151, -138, 216, 72, -112, 103, -30, -87, -89, 140, -125, -41, 125, 36, 35, -75, 268, -24, 74, 63, 9, 51, 77, 117, 9, 62, 64, 34, -124, 37, 64, -268, -292, 71, -228, -55, 144, 117, 56, 2, -194, -3, 212, -1, 118, 94, -116, 96, 160, 79, -39, -159, 46, 136, -154, 138, 8, 95, -11, -130, 20, 44, 211, 284, -137, -91, -157, -76, -214, -157, 248, -68, 3, -79, -307, -192, -104, 167, -302, -143, -210, -58, 78, -173, -1, -23, -74, 142]
5056A42j48n4k10N44k86K9J64m48M96k25J32k88oK30k75Q9J67n6M0M7J6k4j57
5079h1j69K68J18m71L56k02j7M48k44l3J17k1l2J89k8j69m0k48L50J82m33M76
5101C16k08mj97K44j09j03J18J46k79J16j88J19k02P4L48o10M72j68J61j55J87
5122G8k1j01K58k72k2K36k69Q3M6n0J24J30j11m3j04L5j14L38m31M25o4p8m6L0
5146E7o7n3k2j37J54J74j05N0k93J74K11N4j43J30k04l6l57K80K6j9K14k54L38
5169A72m15L38N8k30K03j45J16l64K45K65l19J37k04J10m2j6K50l30j25K43o0
5190a13R3p8K44j96j31L14q8q6J82R2j31p0p9L8J72m6q6L17l65K01l43n6L42r0
5214C7J16k03P4J35k20L90m99K39j31K27k80J16J93P0k85J27k19k8K50r7q7P4
$$ y = [142, -6, -60, -270, 274, -12, 17, 181, -267, 229, 4, 136, -152, -158, 72, -203, -114, 53, -3, 37, 84, 100, 76, -81, -250, 18, 136, -335, 21, -181, -198, 250, 6, -27, 90, 69, 37, 226, 198, 29, -11, -259, 91, 273, -160, 316, 108, 104, -93, 151, 42, -61, 57, 203, -76, 40, -148, -29, -231, -157, 191, -419, 53, -115, 46, -109, 78, 57, -44, 214, -58, -80, 156, -113, -30, 16, -34, 90, 220, 109, 66, -38, -3, -117, 221, -210, 215, 151, 73, 27, 57, -10, -63, -85, -222, -68, 106, 1, 51, -242, -68, 143, 197, 54, 184, -20, -56, -413, -133, -107, -126, 88, -166, 172, -243, 95, 153, -77, 126, -19, 97, -267, -22, 243, -76, 61, -143, -33, -75, -91, 159, -171, -296, -53, -113, -20, -98, 146, -50, -181, 133, 45, -41, 141, 233, 102, 32, -47, -9, 163, 117, 31, 348, -17, 184, -159, -215, 127, 37, 153, -50, 24, 159, -61, 329, -170, 69, -62, 165, -115, 1, 194, 264, -21, 106, -113, -141, 109, 12, -75, -1]
5236ak10J73L12k92J96k30j28J34k12K02p2J30j02N2K43l07L14j17k2j19J56j02
5258bo3k99M43k6k97L5J08L01l91M20k30j87L07l41L43p0L5j85K74l51O1J38l09
5281b86N08j61j65J25o3O8l40K41L60l05j79K41p9L1J22j18L08j63r5j39N5J6
5303a8K93k59J1n5j34L46j06j02J6k1J24k88L73n2j13J27k90L51r2j60J33j70
5325h6J18K9j43J78L0m7k3j23K09l70L23k54N4j23J07M64l03k56k4K72j30l4K75
5348A43k77JK0n7L22m05K84n7J58o2r2k61J1L84J00j35J15l42J95j98q4J24o5
5371a78lO0o5J21j42l6K92q5r8J27m0J13j91j82L55p2M2j6J45K74l22L1k27mJ59
5396E8l30k3M22l35O28l59r3k08K21R6j49R6l8K04J46k16k75k1J62j73K31Q5k13
$$ y = [-1, -211, -38, 274, -18, 178, -52, -180, -46, -258, -56, -128, 2, -100, -48, 195, -112, 202, 85, 63, -56, 100, -2, -65, -364, 79, 53, -244, -209, -101, 200, -191, 229, -1, -188, 119, -222, 121, 51, 86, -99, 175, -176, -115, 23, -286, 222, 61, -104, 21, -42, 26, -314, -73, 287, -18, -197, 44, -35, -4, 118, 0, 308, 145, 50, -89, -34, -18, 275, 16, 27, -28, -162, 184, 78, -24, -8, -29, 95, -193, 180, 128, 15, 142, -148, 203, 111, -49, 84, -86, 32, 61, -82, 96, 126, 79, 56, -67, 142, -228, 95, -159, -105, -228, -121, 343, 40, -216, -240, 32, -98, -132, 143, -134, -133, -113, -170, 152, -253, 31, -26, 132, 70, -22, -283, -272, 112, 212, 77, 192, -150, 45, -153, -237, -113, -178, -181, -121, -186, -65, -207, -243, 49, -36, -134, -7, -47, 66, -125, -307, 48, -24, 18, 2, 147, 421, 99, 130, -97, -101, 58, -272, -295, 127, -208, 420, 61, -32, -240, -19, 77, -72, 24, -14, 190, 336, 120, -155, -176, -14, -187, 44, 129, -84]
5419h4K99j81o5L04j91L5j46J15j43N0R3j34J36o3r4K00k02K29l01J61N3j50J30
5442E1k33J95M0k21J50q1J61r2O5Q3m01K74K1J22j93k8J6K51j09j08L0R3q6j27
5466a27j67P7K9J6K21j88J13J06k83L90k82J02J59l69M71m76L80q9k01K07N1K6
5488A66j30l3J54q8l27L92n7l96M09r8P3J22j14j00K80l90P9j99N96k30k28K27
5510A08k76K76r7l6L0k9N8l5L4r4K90j79k50K79k8O1k93M1n9L20k39l0J94J0j06
5535e0J73o3j52K77l18J85j50q9M22m75OK72l5O8l21O7J72J79k83K06j95K30J20
5558B46k42J84k25j95L95L2l20L8m3K63j45j20O2j04L65n75M59j43k69L21no1
5580h2n4Q2Q4m2J20j88K01m04K17N5R1L14j34j49j9K2k20Q6qj2J96p5L7j5j02
$$ y = [-84, 215, 34, -31, 273, 82, 117, -29, 86, -57, -7, 86, -48, 88, 25, -69, 131, -71, 158, -143, 18, 71, -79, 51, -182, 13, 53, -168, -18, -99, 62, -30, 35, 118, -283, -9, 12, 134, -59, -87, -71, 180, 71, -37, -7, 86, 0, -127, -294, -217, -188, -172, 49, -139, -26, 80, -203, 187, -95, 7, 166, -203, 268, -208, 172, 83, -118, 89, 140, 166, 36, 3, 157, 69, -258, 134, 77, -319, 90, -8, 65, 187, 73, -27, 253, -137, -58, -257, 339, 109, -119, 108, -168, 108, 11, -25, 5, -24, 34, -1, 33, -61, 229, 50, -200, 79, 51, 112, -181, -140, -199, 121, -118, -148, 46, 56, -50, 123, 60, -92, 185, -133, 52, -98, -187, 235, -240, -234, 38, 3, 71, -250, -183, -11, 168, -115, 91, -104, 126, 246, 4, 188, -37, -232, 163, 195, -125, -87, -130, 133, -12, -132, -70, -174, 191, -384, 75, -68, -337, -16, -21, -82, -136, -54, 30, -12, 108, -80, 121, -283, -66, -11, 80, 394, 260, 111, 92, 114, -106, -20, -28, -40, 156, 81, 118, 103, 1]
5605AJ23m03P3J99j18J84q5j13J81j03J75k45J01p2J00L28j79l16j5K32K52m84
5627a84J93k3p6K04j27p6J38K95l35q5K75k2r1k00L86m01j34K51K00l24J06K99
5649B69Nl48Q8j56k6M07l53J99j13k7j66M1K24j87P1J42J69q9n7J46l70K20o2
5672B7r3P2k7K13Jl25K94l59K07K73m28r6K20L00j11j54K54k27j11J32J09m00
5694b29J72J71l26L43j36N2k38J5K13l5k02L77k28J4j13K32j0r0r6k61N73r8l03
5717b03L07J7j24j05PRJ39Q2j08L42k72Q8q4P4k84j15J09J25k47J35J11K14l22
5740a05L7K19j08nj70K21P1k03N4M1n9Q8j91L44o66O00M2j92j25j13J93O4Q7k45
5764a21QJ21q5L20k95m4L25k24L2K39j23l6n0Op8K27pk49L11l94K13R1j01jk37
$$ y = [1, 124, -279, -206, -7, -125, 59, -26, -139, 42, -61, 114, -131, -30, -102, -2, 326, 147, -169, -184, 48, 300, -184, 9, -14, -90, 114, -13, -89, 49, 344, 9, -76, 199, 177, 86, -114, 272, -129, -263, -12, 188, -136, -30, 269, 274, -74, 14, -142, -168, 239, -114, 85, -28, -55, -221, -180, 44, -143, -72, 70, 239, 150, 93, 239, -131, 89, 27, -66, 6, -21, 192, 193, -132, 162, -197, 10, 283, -145, -241, -21, 279, 168, 14, 268, 41, -70, 62, 171, -229, -57, 114, -212, 131, -5, 47, -191, -176, 37, 2, -200, 177, -51, -37, -150, 82, 72, -18, -114, -375, 198, 100, -203, 104, 121, -3, -108, -101, -92, 47, 129, 21, 363, 91, 179, 95, 169, -115, -230, -121, 4, -243, -108, 3, 217, -105, -68, 151, 43, 38, -132, 89, 160, -43, 11, 52, -7, 81, -110, 234, -432, 168, 210, 18, -107, -220, -27, 37, 124, -121, -113, 8, -77, 243, -52, -96, 229, 5, 37, 276, 153, 117, 67, 73, -5, 222, 215, -34, 277, -117, 96, 187, 86, 85, -152]
5789a52N5m5L67j75J13j22p5K5j33J78p0K44k76j93M98k14k14K13j26K70l26J28
5811c0o7j59M29j37k2n3q8K02j77N4J96o5K72n42N43k81l63K09N0K61l56K00k26
5834a50J09m5L08l61m2J64L98n78K80k22J12K1J56P6j66L4o2P0o9k12J97R3j26
5857a5j45J34J39j18q1J03m48N80q7k03j26J67J49j85K30k34k7L48j39KNK5L8
5880A12l28O7J56mJ57k15J43j79J13K2j72K34j91j2K1J35p6l49M97k86K75j86
5902f6J71n8J17M1m14J72N5p2k9j69K92m2p0J32j7P5n3n6L4l81L65j9L3N6Q7j00
5928H4j42P5J2J94l6l80RK65l12L02j73J84j51K04j55q9M1J21l8j43K65k66PJ16
5952fo5J33J07p6j92J84m7l3O7l20K50q6o5J64L5p7J58k29K11k7j90P5k5N0J18
$$ y = [-152, -97, -142, 225, 50, 163, 41, -34, -9, -142, 36, -34, 210, -66, -259, 239, 25, -189, 24, -102, 168, -158, -30, -97, -256, 173, 36, 14, -39, -127, 75, -102, -48, 148, 83, 355, -187, 356, 75, -288, -79, -29, 232, -124, 76, -150, -41, -86, 222, -139, -181, -17, 381, -197, 83, -139, -27, -6, 150, 226, 60, 94, 32, 102, 33, -179, 18, 111, -15, -160, -26, 113, -5, -86, 17, -431, 149, 62, -141, -267, -100, 49, -136, 94, -140, -167, 181, 42, 44, 49, 74, 112, -216, -149, 7, 3, 160, -55, 88, -91, 22, 44, -128, 106, -85, -97, -76, 59, -17, -366, 131, -155, 120, -66, 105, 47, 164, 205, -209, -37, 18, -54, -83, -252, 40, -2, -72, 60, 43, 118, 65, 9, 43, -338, 27, 8, 41, 97, 184, 84, -58, 17, 29, 223, 187, -193, -184, 81, -231, 71, -102, 82, -69, 135, -20, -109, -68, 53, 15, -128, 137, -129, -122, -6, -71, 62, 169, 93, -99, 85, 38, 5, 72, -248, 2, -84, -149, 15, 50, -27, 131, -98, 113, 86, -104, -29, -54, -4, 114]
5977A14o7K91m09j19J27M0j5J47j0k32J88J08k48J67p1R2J73j89k88M23j34J26
5999B14j76r9Pn3q2L20l19J24o1K67k68P4L8R9J52P2o08K78K51j15k7k51J98o1
6023b6K05k33j2K48k21j86J41p3L37k67n2Q0N7N7O2K37m78K93Lk41L3l5R9j30
6047a02J84l73J39K06Kj02o2N5K29p9k18j23J22J55Q7Qj04j17M01l35k33Q5J38
6070c7K03l14J12J44k50J26P9j66L1K97k81j6J82j82k1L1J42k34K96m53L62j55
6092a04J30k86M25o0n2p3p1P6j53L26j38J22l51L97k01k5J84j45K00j06j02J23
6114A16j33n9K85k09Q2r7J7J9j41L18j11q4J07j11m7L6j12J45M6j27j52KJ6L7
6138a57P8J80j65L14l17M3lk0k59L69Rl30L29j50J86j61j9o0Q8J2K47j56J54M
$$ y = [114, 47, 338, -71, -190, -63, -23, -38, 109, 99, -133, 55, 163, -85, 82, 11, 103, 276, 87, -201, 222, 88, 214, 38, -61, -54, -107, -189, 131, -188, -64, -125, 142, -126, -52, -14, 85, 237, 309, -299, -21, 230, 115, 88, -163, 35, -26, 179, -54, -66, 182, -39, -225, -84, -157, 180, -87, -139, -59, -2, 55, 117, 354, -124, 169, 172, -69, -36, -71, 28, -102, 82, -291, -152, 54, 56, -46, -108, -53, 176, 97, -121, -244, -122, 33, 120, 128, 24, -93, 308, -27, -260, -175, -37, 166, -148, -36, 108, -142, -16, 63, -103, -72, 225, -56, -72, 110, -72, -93, -62, 80, -154, 142, -311, 51, -104, 26, -260, 165, 105, 53, -20, -91, -15, -168, 158, 20, 142, -209, 188, -13, -38, 146, 1, 201, 95, -7, 116, -17, -76, 209, 0, 82, -15, 2, 21, -120, 198, 87, 3, 110, -1, -48, -12, -124, 21, 67, -60, -212, -210, -194, -157, -79, 101, -64, 250, -67, -24, -27, -47, -306, 63, 72, -258, 71, -79, 107, -54, -73, -133, -45, -33, 214, 58, 212, 216]
6162B16k25J5l7J0j30K18j87K01N7q1k03K13j05k4P6p3r9J06jN4q3K35r2M2j52
6187d9j53J99k03L06N3l79K00Lk8J11o2K45m31L31k14L8K6K00j48k71K01p4n8
6210a57L21j09j36j58L09q6j23rJ10L5j89L74l66J70j80R2J98J14k36%K88m29
6232a67J52j00L69k2k16j47N6J4J13n3j44K42J4k21K28m0k69K27p7M51o69L04
6254D5L3j79R0N6Q5k15K34k63J34L4p1J83k19J72l72K70L2J52k08R5j35K7K24
6277B04k72q5L99J07m37K87l42L06J19l85J17K4K6r8l2R9mL4O2l11J11J57M0K6
6301A52N7j6j43p9m1k6r3N9J84j4N1j61j8P6L3k05K11J45r7p6J9J46k50O5j78
6326a99M83j72j43K1J32R5k72K2j78K69l11N39j49j19O4k13J2K19j10j89M6J89
$$ y = [216, -9, 6, -31, -21, -151, 67, -120, 81, 138, 57, -146, 67, -38, -62, 14, -59, -158, -52, -53, 1, -82, 153, 61, 103, -49, -202, -3, -206, 100, 153, -226, -26, -23, -51, 60, -2, 243, -188, 143, -71, -33, -7, 193, 45, -226, -25, -99, -157, 164, 55, -81, -239, 70, -16, -139, -148, -38, -3, -192, 182, -184, -14, -194, -102, 96, 210, -26, -26, 262, -167, -15, -115, 254, 232, 16, -131, -75, -61, 52, -1, -145, 97, 111, -110, 118, 78, -191, 36, -41, 410, -259, 45, 78, -101, -11, 45, 130, -85, 149, -114, 20, 54, -17, 166, -53, 119, -253, 17, 49, 201, -7, 88, -47, -20, 204, -68, -153, 246, 353, -84, 203, -139, 167, 286, -99, 18, 42, 68, -30, -62, 37, 33, 67, 129, -182, -71, 86, 126, 152, 209, 193, 50, -29, -70, -96, -189, -130, 54, 40, 91, -70, -88, -12, 21, -184, 27, 172, 75, -1, 18, 164, -86, -21, -199, 284, 112, -31, -10, 122, 217, -55, -33, -211, 58, -253, 286, 137, 18, 82, -131, -119, 100, -10, -199, -153, 36]
6348C6J77j51o1R9K17o55L93j1J30p3r8J05m3m2K44l30K17o5K7n7k77L13k62J61
6372fK4p5Q9k02L55k94q8K77m42K28J49qr2n7L41J6j05k3k51L8J41o4K13k56K28
6397A36k36J06j07J94m29L08j80J82J69j90l37K69K71j43P0p6l3q7L8J4M6k85
6419c00J83J61l9J23q4j61J94r9J83k42j27L46r2M2j83n5J11k62Q7K84L54m10
6441A4q3J95m80M88j54Rn6R7k4j2K20j57j14nJ70K18N2m87J79k69J94m5J35k5
6465F0l57L26j69n1J05J54j55J02k34k9K83nj47J85k75M60k72K58l57j45N52m99
6487b10L15k95j0J40K9K6o3J78q4K70l93m5O4J14j28O2o0p9n1N04k62L3O5o9l9
6512A2j09N7K47l19J92j42j76K94k81J19J33n4r8O6R2j89J95J22r9j66J25k7k0
$$ y = [36, 213, 62, 1, 100, 317, -338, 55, 44, 174, 101, 3, 108, 65, 23, 267, -63, 154, 89, 116, 59, -218, 95, -167, -6, 18, -57, 32, -170, 185, -109, -197, 80, -362, -134, 15, 7, -85, -142, 199, 215, 110, 87, -164, -126, 15, -49, 164, -92, 136, -100, 6, -101, 93, -336, -28, -208, -26, 143, -47, -384, -115, 156, 13, 83, 7, -26, -113, -75, -61, -15, -300, -117, 44, 5, 128, 44, -117, 77, -22, 161, -81, -208, 138, 46, 88, -95, -150, -39, -301, -214, 70, 424, 14, -69, 126, -354, 134, -20, -11, -67, 30, 6, -6, 214, 57, -57, -62, 108, 326, 378, -109, 70, -199, -5, -50, 85, 60, -297, 29, -140, -191, -86, 68, -87, 15, -219, -248, 35, 30, -117, 68, -207, 253, -19, 239, -118, -263, 289, -210, 105, -190, -200, -60, -31, -5, -68, 110, 26, 296, -97, -142, -78, 36, -92, -30, -90, -169, -220, 284, 22, 55, 120, 51, 12, -97, -40, 207, -112, 80, -62, -238, 56, -225, -106, 27, -27, -125, -59, 33, -156, 39, 161, 62, -104, 21, -6, -26]
6535b6p6J05J01m2j72N0L2k0K48k04p9L6j72L27J54l3l32K64j59J55j27M9n6j27
6559a04J11m8m4K67j69M7J6K1j08M2n1j87J18J48J30j80M8j98K66n3J9k3j3L9
6583I4j08j24M3J59N0mr9n7J04j63r2J91J70l58N5M20k73M9L34l86j25o7k8j01
6607c16j1L30J56r3mn0K22l34Q0J04j28J04Q0k13j8J83L3R5n1k27o7M11l66l3
6631a13J75Q7j25J2J62j24k68P8J38n4L4J23rk09L2M8J44j50J92O4j32p8J44k6
6655A45J02j50l82K05j00J84L7O5r1Q0j63L3L9J78j77j9j15K57K0j77P5j32j35
6678b21K76rj49K41j40K19N1Q1j34l55K88m09K91k31R2Q6kN1k6J52J7j36q2j56
6702b05K19K58k00J55k91L75k62p3Q4n4RK0K23k14l26j1K32o5J69k08K18j09M9
$$ y = [-26, -102, 3, 104, 62, -110, -60, -28, -48, 200, -4, -83, -47, -219, 108, 262, 229, -103, 161, 2, 157, 30, 79, 23, -104, 7, -41, -85, 182, 13, 60, 76, 97, -11, 31, -20, -207, -89, 59, 189, 9, 57, -141, 125, 72, 91, 68, 55, 94, -14, -138, -95, 64, 114, 110, 11, -46, 58, -105, -197, -6, 164, -194, -139, 281, 8, 57, 391, 5, -120, -187, -215, -316, -327, 3, 159, 66, 62, 12, 234, -100, -20, 84, -44, 60, 140, -73, -91, 92, 125, 220, 169, -58, -125, 286, -80, -113, 62, 149, 24, 36, 198, 74, -194, -116, 22, -32, 2, 125, 116, -93, -61, -13, 131, -19, 173, 237, 105, 27, 171, 145, 247, 97, -285, -80, -180, 4, 41, 106, 15, 95, -68, -35, 4, 182, 5, -14, -129, 128, 148, -29, 46, -86, -221, 55, 46, -103, 138, -2, 217, 268, 349, 215, -140, 148, -261, 30, -201, -109, -23, -25, 26, 0, 152, 169, 33, -49, -205, 14, 272, 72, 227, -64, 311, 49, -24, 60, 6, 15, 35, 258, 44, -282, -293, -61, -126, 43, -165, 53, -56, -7]
6725gl2j05K20lP5j37j16Q4k5koJ37j86j24K07m6j71N8J81J5l38O40m17j3K99
6750A88m96L93P0m07J47K42j96J21P0Q6j54k71L04k37K92j10j59P5k82M87q6k51
6772a74J28K03l55J42N1J83j43j79K32m26P9j67K45M52l46M7L8m0R0Q3j78j95
6794b30L99j37j60K70m49L74j19J71l56K7K79n9Qj33J88j40K40k08j06J34n2J70
6816A11j71O8P2k6R5k09M3k1l4k19K13K27R8p3n9J4k33J87k00M1K47k28K55l99
6840b01M30j7l24M18m36K58q4K42l52N4K83k78M8K1m0N9n7q2K04k37N7q0N9k18
6864b73M40J07k08L25k67n7k61M07k88L2N1O5l03J23n8L1J98r4m6k9N0j15L07
6887A37k70L77j18p0J87k11L4j96J3L43q9J81l27N3m0N2K10l70K31J62m15L84
$$ y = [-7, -39, -144, 76, 73, 148, 11, -105, -21, -46, -48, -54, 83, -103, -227, -20, -66, -237, -179, 2, 17, -321, 319, -98, -111, 188, -308, 85, 155, -252, -105, 137, -59, 62, 132, 218, 64, -207, 97, -140, 152, 42, -117, -42, -324, 163, 77, -174, -46, 157, -198, -56, -5, 178, 35, -144, 88, -338, -259, -426, -181, 271, -75, -28, 10, -30, 60, 143, -35, -230, 169, 32, -128, 142, -307, 67, -52, 119, -237, -210, 69, 10, 18, -115, 73, -67, 173, -35, -141, -7, -59, 111, -60, 8, 80, 54, 149, -60, -17, -38, -72, -291, -78, 149, 247, 174, 115, 129, -104, 83, -117, -76, 171, -57, 198, -201, 229, 212, -112, 306, -130, 128, 44, 286, -66, -12, 271, -7, 41, 62, 22, 81, 24, -58, 146, -91, -34, -114, -55, -273, 167, 274, 66, 391, 124, 67, -194, 213, -75, -43, 8, 73, -230, -107, -165, -134, 64, -30, -76, -105, -55, -170, 137, -133, 244, 126, 56, 243, 32, 66, -130, -117, 226, 137, 318, -9, 44, 4, 56, 266, -104, 127, 289, -126, 258]
6909B58l44J17J2j81K70k8Q2k65Q7J59j0q5k85m9K34J22j39R6j90Q9K06K3j56
6932B3Q0j49j24J61j39L61k30K00k66J31L5j27L33l95L1O7M7J65l86L21r6q3R1
6955E1n0J08l12L41k92K11L4o1N6J67k80R2j03J70n3j12K36k32O5k08J25n9M4
6978f2j37M0J60K54l14p0O4J36RL6Rl44J01j10K91j71J9J14o0J12n3r8J9M9M49
7003D43m90j61O6L6J48K19j29k27J30J66j09oj64K11j67k1Q6O0j24J35L6j38K60
7026B60l26J9L66l46j91J62P8OO1k2j79K97l74Q3L9RR9l19K84j57K14k12L17k33
7050f5j85K96j74J92p4L8O0j65M6q7L46l1k76L6J06j5kK29j82Rj95j1J37J5L08
7075C56l51J19j05o3j96L83o1j25j22R3Q7K11l02P5mj81L43J1r5j16o2Q7j25J97
$$ y = [258, -86, 31, 43, -138, 132, 104, 186, -79, 8, 167, 157, 72, -213, -262, -28, 94, -45, 51, -139, -50, 156, 179, 23, 103, -46, -170, -9, -148, 213, -17, 183, -83, 48, 83, -44, 289, -106, -75, -8, 39, 204, -182, 139, 43, -40, 51, 1, 109, -203, 138, -154, 57, 91, 30, 86, 253, -27, 65, -38, 132, 79, -33, 203, -29, 36, -172, -47, -106, -62, -199, -159, 1, 255, -59, -129, -65, 71, 80, 116, 125, -219, -118, -228, 63, -108, -89, 25, -35, 77, 24, -74, -55, -6, 443, -47, -208, -142, -106, 42, 261, 132, -95, 35, 201, 92, 86, -78, 133, -34, -55, 31, 91, -33, 102, 138, 0, 260, -66, -47, 319, -27, -218, -56, 22, 28, 89, 67, -112, 185, -189, -106, -67, -58, 41, -278, 6, -151, 63, -149, 168, -65, -250, 46, -128, 64, -10, 28, 88, -77, -31, -118, 228, 197, -79, -43, 63, 48, 46, 275, 93, 102, -93, -104, 33, 48, 356, 5, 124, 19, -44, -240, 143, 82, -43, -165, -72, 15, 226, -76, -1, -5, -186, 157, 168, 73, -43, -105, -18, -143, 54]
7099E4J50k77K19j92L44j9k00k28K39%n9j51OQK10J19l09j10K37P2l32K99n1j40
7123a11J86k35K76l32J21K99n01K91NP3J83o32N03k04J59p7R2j96K00J40k41k3
7145b4O0o7Kj25J76M3j84L05l25Qo2K07j13K7P1J07l4j63k68L37j9j8ol68M55
7170B2M1k86%K33m53M85j32J29j46K73q1k19R8k20M21j99p6o7N1L46k10K1Q8R3
7194B12J6l21J38j07L3J41J7m16K65M4j55M13k01K9l55J1L48mJ94o94K89P5k47
7217b75q1M61j55J30n8J19k34M7q8J34l6n0M3K37p0k65J64J28o1K56k90k3P5M5
7241A53l54L40j13K06k25m3Q9k34MJ82jK23j33Pj06J56j56j16J23m21P85k93q3
7264a0N7Q0Rp3M1j05J5N4k59N20m90K28q8k7R5q0P8J07j44J52j80K5K4K26q2j56
$$ y = [54, 204, -73, 146, -46, 298, 279, 79, -149, 90, 90, 31, -120, -114, -106, 104, 223, -86, -196, 41, 113, -219, 80, 29, -111, 75, -160, 116, -216, -95, 204, -297, -6, -1, 72, 255, -377, 126, -78, 81, 4, 96, -100, 100, 240, -1, -24, 36, -31, -29, -154, 22, 65, -119, 186, -139, -131, -193, 14, -99, -72, -1, 106, 72, -91, -359, -22, -41, -59, -65, -433, 22, 63, -223, -223, 10, -443, 42, -90, 39, -107, 166, 85, -134, -36, -256, 165, -34, -110, -177, -126, 220, 10, 31, 119, 212, 228, -93, 45, -62, -29, 112, 129, -287, -22, 22, -133, 280, 79, 108, -247, -236, 112, 108, 302, -392, -103, -28, -275, -356, 105, -50, 80, 22, 141, -93, -46, -134, 0, -36, -86, -43, 194, 124, -141, 23, 151, 90, 346, 56, 33, 108, 153, -201, 139, 26, 232, 7, -36, 53, -181, -177, 5, 4, 227, 94, 101, -5, 151, -5, -121, 2, -419, 366, 73, -10, 47, 127, 136, 63, 104, -1, 14, 68, -191, 329, -161, 67, -21, -48, 47, -33, 45, 152, 8, 160, -20, 5, 29, 255, 173, 17]
7290A7J11k4J25j46J4j03P3qj22J47L2k76K51k20K05m87J78K61R2K10m87j25M45
7313A63k80J62K0j20J45m04N27k87K2R0r0m9Q5Q0j3k53P0j06L33m8J74k98o1l9
7337a77L42r1j16M7Q1l19L35j65K7p0r4J39j25M16j66P3K4m03K3L16J73o8k01
7360An1l13N53j52o6K39j37k63Q8R5n0L7L3jp1J5O1o0J55j32M1j44K66k12J32
7385F4j17l9q8K20J31r7km5j31K74l21K63k73K81l8O9j19j84J33N7N4k0k0Mk45
7410a89K17m0m2k1o4K47j66P1l5q7R3k00L20p9k72L50m8j54K38Q4n36J91L00m54
7434b76N8L36J0O6l25N6q8J5J35N9j31J5K25J28n55L20k57J12J58j23p2q6M24
7457B04j22k58K56O4Pl4L7k82J71N6j15P1j80P1J64l15M00m05j40M40k18K19k2
$$ y = [17, 128, 104, 229, 83, 97, -6, 67, 59, -63, 84, 116, -160, 91, -129, 76, -411, -233, 28, 120, 330, -157, -282, 163, -117, 45, 65, -55, 90, -314, 213, -74, -52, 38, -52, -101, -16, 64, 51, -202, -132, -238, 95, 47, 221, -77, -138, -177, 165, 74, -42, 5, 86, -233, 102, -63, -36, -106, -200, -61, -186, 230, 64, 137, 161, -242, -219, 97, 270, 202, 1, -50, -363, 190, 38, -28, 211, 74, -189, -101, -6, -56, -19, 14, 13, -58, -43, 18, -42, 113, -19, 22, -122, 144, -68, 64, -53, -92, -180, 40, 171, 74, 72, 27, -104, 170, -151, 112, -161, 120, 82, 151, 32, -152, -19, 38, 92, 72, 52, 56, -189, 28, -12, -54, -75, -139, 108, -58, 13, -22, -109, -16, -216, 104, 25, -247, 103, 55, -99, 139, 223, -313, -122, 178, -276, -218, 118, 128, 194, -131, -75, -163, -148, -13, 46, -85, -70, 155, 283, -272, 48, -209, -97, 61, -62, -134, -220, 204, 82, -176, 80, 144, 151, 117, 154, -128, 43, 99, -16, 55, -125, -54, 110, -205, 195, -210, -350, 90, -128, 91, 69]
7480F9j51K97k16K33j81k00K33j82J35K21j87m0p3l9j4K75ok34J63k57J82Q8k13
7503i7K33j26K6J9N2k67N9L16l35L42k19oJ07p9K21l11K95j89j67K93j85L7m4
7526b5L32K1m79K74k61K63j84K35k19J84j29m3k19L09j06K05l22L89j58j98L08
7547A77l28K04j62K11j06r0r7L69k48J13l0l5K44J0n26K11j4J08J89o1l4j80k19
7570b94L78j20q1k4j6M18k75j38kJ08o0j4K97J26p4l57L3J24R0l38J05J98p8O7
7594G3N1l8q4J80l40K66j8j35M14l01K9p6K67j39k55L20n37L79j43kK39k71K53
7617A32k62l03M57L04k82J55M0j18j9j51j56J16J84r8j77M41J04o48L62q2j93
7638a94L46j23j45K50k4k49J33J4k03P9L19k94J38j66K40j11J27P3k0l21r2J03
$$ y = [69, -82, 215, -1, 232, 51, -149, 84, -98, 37, 258, 71, 31, -42, -81, -95, 180, 174, -60, 103, -154, 28, 116, -97, 136, 10, 36, 55, 107, -160, -101, 215, -120, 222, 3, -3, 104, 25, 246, -65, 230, 41, -126, 167, -18, 19, -25, 307, 328, -151, 123, -138, 125, -59, 176, -43, 141, 12, -31, -250, 59, -47, 158, -164, 225, 67, -131, 177, -151, 53, -109, 102, -4, -94, -191, 178, -70, 43, 13, -22, 222, 232, -294, -83, -97, 11, 200, 139, 105, -75, -294, 84, -36, -117, -141, -157, 261, -14, -152, -154, -46, -106, -120, 177, 303, 229, -128, -95, 29, 119, -219, -114, 84, 6, 73, 124, 86, 2, 182, -158, 108, 90, -45, 369, 68, 97, 21, 288, 149, -106, 214, -323, 56, -87, -89, 150, -121, 132, -130, -433, 24, 328, 46, 201, 241, 123, 104, -47, -203, -87, 97, -1, -178, 263, 367, -281, 81, -1, -194, 152, 29, -116, 134, 110, -139, -6, 8, -195, -116, 203, -91, 47, -119, 121, 10, 137, 210, 190, -131, -223, -120]
7660a20L35j53k33J12M3k0r0K23k28j0PMJ48j82n7j58J63L26k0j66M6j32K90k7
7684A01j03j49l3J71n1J39k71J05J25j02K65j09j27nL01l43m5J58l30J88J71k24
7706a68N6J48n3L37k97k7j46J71p5L67m35P3m8L5J74k50j6K02J25k51N8k7m5M68
7730C76o81K92o2Q3j1p4%K85j8j50m2nJ44j39Kn5K2L5J26k20mJ28k4J18J56k78
7756Dj5j5J89j19k04K59k83L22P6k99P8j36J57k4j29K46j77k4J26Q9o8k02J77
7779B8j67L4J95j9l5r1r5L0J64P7k5J50j67j23K54j14n3Nn2m5n2l2J07N0K8P4
7805A26j75J43q3j42L6j29L04q6L5R9m30J53L69j46l08M04k09J34J11k19r2J89
7827H4mJ36q9j20JO1M9m8jp3m4J24k58j6L32j38j07j18L49p3r3J52pN2j48Q6L3
$$ y = [-120, 215, 62, -171, -59, -16, -36, -126, 97, -131, -141, -134, -130, 18, -164, -221, -379, -216, 110, 90, -76, -30, -162, 128, 101, -2, -151, -184, -13, -64, 75, -196, -91, 34, -68, 197, 88, -39, -44, 257, -86, -131, 27, -303, -115, 56, -168, -112, 36, -17, 320, 23, -4, -150, 21, -54, 313, -122, -49, -97, -62, 112, -138, -154, 48, 173, -78, -20, -47, -92, 376, -305, -13, -75, 8, -3, -77, -77, 208, 190, 40, -2, -7, 137, -2, 0, -55, -33, 2, 128, -92, -96, 32, 8, 126, 282, 4, -11, -26, 163, 44, -160, 99, -184, 138, 214, -85, -7, -143, 14, -10, -139, 107, -70, -94, 32, 121, 53, -149, 28, -139, -105, 90, 71, 36, -55, -150, -120, 44, 121, 96, 246, 79, -44, 210, 96, 43, 48, -4, -49, -101, -133, -26, 24, 52, 126, -49, 94, 11, -131, -95, -224, 80, -6, 29, 128, -302, -149, 220, 74, -234, 170, -39, 95, 206, -13, -105, 84, 80, 216, 127, 7, 8, 69, 118, 70, 69, -4, -48, 76, -182, -198, 134, -4, -111, -229, 120, 47, -46, 106, 99, 151, 3, 89, 122]
7854A22j39J21j12K12j38l21K13K41K4l09O1P0k07M01j01lP4l08L07l89J28J36
7876H3k85j16K23J45l4j39K17m3l9J27m72L94rR8o7k71J41K6J68m34N4J64O1M06
7900C98j51L2k15j86J0L65k31j14K66j42n9L1j54K77j39P8P3Lj83j31L81k64q1
7923a36K47q0K11k70rK87l17M5M1m4l7k0k03L67j91K29k02m9J19J28J38l57p0
7946a73K75j39K9J8J13l21K66l91M19n7k95O6L5L30l66K45k88J51J88j65rl5J05
7969Aj61P1J45j02J47l9o8R5P4j08J60m21J90O9K7Rj26j10J19P7lk9J19J4J74
7994C24l81J49o5j65L56k90J2l7O8J5J3N0J42l25K46j81o5J69n2K2l3Q7Lm0J0
8019C2k3L66l14k0j28J2K30m68M73k24Q7J97j37p0p9J43j58J47j48OJ35L1j07
$$ y = [122, -17, 104, -8, 204, 66, -255, -42, 199, 223, -86, -25, 45, -162, 239, 138, 135, 209, -99, 208, -181, -53, 83, -202, -318, -95, 50, 16, -123, 94, 51, 12, 139, -333, 61, 52, 150, 83, -188, -47, -21, 147, -287, -233, -69, -8, 398, 247, 279, 64, -122, -112, 253, 22, -92, 174, 32, -27, 4, -150, 127, -12, 66, 139, 142, -41, -172, 209, -55, -136, 111, 31, 242, -28, -37, 250, -67, -22, 19, -25, -62, -82, -285, 82, -109, 120, -82, -131, -12, 116, 254, -103, -173, 102, -37, -8, 10, 123, -198, 68, -323, 96, 39, -256, -190, -155, 175, -191, 54, -234, -83, 105, -60, -69, -104, 1, -160, -89, 56, -46, 101, 62, -6, 89, 163, 55, 215, -206, -16, 53, 80, 89, -37, -147, -28, 49, 46, 17, 136, 150, 324, -57, 92, 27, -138, 218, -72, -60, -97, -29, -14, -1, 49, 191, -134, 112, -69, -134, 35, -17, 5, -28, 59, 62, 22, 32, 9, 375, 61, 41, -87, -75, 155, -313, 160, -64, 23, 220, 83, 13, -66, 77, -81, 66, -82, -76, 59, 90, -17]
8042a7J11J17j04l09K41n1k63L25j97L68k66Q4r9MK05k82L74m44J57Lk05M15k24
8065e7K6j09K19l32J93l6L48o35N04l40M37r9m8k72J17M8l0Q5NJ2j71K28j46q6
8089a39M16j80rJ12l26P8M2P2J54k15m8K92j86K9k45L01l03J80J15j76l4nK71
8112A96j25j76J89L1K03m97N0L26q8j62j3K15l1j95K21J11k58j36L66l19J65N9
8134A32j99J07J0m0Lk27J22O0Kl2M3J7k91P2K61n5O7j71K08m9k84N97k59j33J63
8159A24j16J4j65J12o8J69j22j19L67j6l6k12J64O0l32K01j02P3K37j03O6q8k56
8182a48M62m29R5J88q1K80j06j45k22
$$ y = [-17, 94, 211, 107, -202, 39, -12, -275, 50, -147, 221, -45, 39, -60, -56, 149, -133, 241, -203, -46, -43, -248, 167, -57, -31, -140, 79, -253, -60, -96, 252, -383, 121, -219, 218, 119, 71, -201, -84, -36, -66, 19, 24, 36, -135, 93, -53, -139, 277, 97, 88, 200, -126, -48, -6, 66, 220, 5, -43, 249, 63, 92, -153, 148, -155, 25, 140, -36, -70, -75, 196, 71, -105, 84, 115, 318, -179, -129, 197, 109, -53, -66, 149, 118, -77, 144, 255, -3, -139, 227, -92, 73, 132, -67, 40, 50, 10, 13, -214, -92, -32, -30, -62, -19, -2, -293, -221, 40, -15, 52, -119, 89, 40, -244, 353, 94, -39, 124, 8, 22, -143, -31, -99, 70, -52, -171, 196, 180, 144, -68, 96, 156, -176, 25, -77, -4, 233, 130, 196, 108, -148, 314, -115, -20, 168, 87, 367, 261, 116, -106]
8191a06
$$ Imaginary data points
##PAGE= N=2
##DATA TABLE= (X++(I..I)), XYDATA
0@%%%%%%%%Qj6J6j6K4l2M0m8N6p2Q8j10J34j60J92k24K64l12L61m17M81n54O34
31C37p22Q24r36J057j191J340j504J684j880K095k330K584k863L170l504L868
47B029m267M703n179N703o284O927p639Q431r320J0327j1476J2803j4355J6195
61H598j8418K1169k4673K9314l5778M5446o1640R5330k76586L18880J34103n78884
73c43139N70087k19187k77955N16450k35875k74703N36525l04871k02329M61477
83B26480k93847l2032L31323m18137J03027K96566k97030J4103K00416k30547
93i9678N7547K06535k93387J15448J89998l65034K00004J42559k90703J96954
103F0243J4437k58546K93039Q877l17995L25273p1584k59820M21227k39455j36703
$$ y = [0, 0, 0, 0, 0, 0, 0, 0, 0, 8, -8, 8, -8, 16, -16, 24, -24, 32, -40, 48, -62, 72, -88, 104, -120, 144, -168, 193, -224, 257, -297, 337, -385, 439, -497, 560, -631, 709, -795, 889, -991, 1104, -1226, 1358, -1505, 1665, -1839, 2029, -2238, 2465, -2714, 2989, -3295, 3632, -4007, 4424, -4896, 5431, -6045, 6758, -7597, 8598, -9820, 11349, -13324, 15990, -19788, 25658, -35982, 59348, -217238, 101642, 235745, -343139, 226948, 7761, -270194, 246256, 10381, -264322, 272203, -32668, -234997, 226480, -67367, -99399, 231924, -186213, -83186, 213380, -83650, -69547, 130869, -99678, -42131, 164404, -128983, -13535, 176463, -188571, 11433, 153992, -136711, 60243, 74680, -183866, 109173, 118050, -199945, 125328, 53744, -206076, 215151, -24304, -161007]
114a61007M04573l63318R889L46938l60423P2390K43660l69407J66174K26184
124B15653m15231K33883J22009l80097L30349j136k94567L02745o6032k04409
134a56833K61999m8302k03891K47558o5978j95771K97964j18352j59930K67874
144A26338j48892q8342K42991j50732j03860K55416j64447r1178K92726k48465
154g8445j0222K61732l10373J07184J87128k99327J42079J11215k53706J80157
164C7422O7090k69825K32138P573k40965K82464j00047j46699K60373j68864m8634
175h7974K08718j56877l4878J66528j39444r462J70185j88449L1967J51400j98416
186h6702Q2687R0485j62014P9510O3385j39305P6954Q9989j89561J01649Q3408
$$ y = [-161007, 243566, -119752, -109863, 237075, -123348, -50958, 192702, -176705, -10531, 215653, -199578, 34305, 156314, -223783, 106566, 105430, -189137, 113608, 47576, -156833, 105166, 56864, -147027, 100531, 34553, -161218, 136746, 18394, -141536, 126338, -22554, -110896, 132095, -18637, -122497, 132919, -31528, -122706, 170020, -78445, -88667, 173065, -137308, -30124, 157004, -142323, -244, 110971, -142735, 37422, 104512, -165313, 66825, 74398, -166567, 115897, 15850, -130849, 129524, -39340, -87974, 120744, -36133, -71011, 95517, -43927, -53389, 116796, -71653, -39686, 111714, -86702, -4015, 86470, -75544, 3966, 67351, -71954, 5000, 94989, -94572, 7077, 90485]
197I0485k00952J70981r63j80022J99759m5384j32257J83711o0867j25364J91950
208I1077q6650r7383K25300j72356m3276K12482j95323M3529J26326j89293P7169
219h398R2990j56019P4778P9101j73704J01679N9995j60528J44651k1337j30130
230i6922J51891l3712p8177J01572l6559p8369J17242k6922r1009J40310q5367
241a6022n9130J56112j06268j1570J00708j12728J0992J08642j02339l316J05909
252G0990j41593N1267J05726j66027R7235K8696j39786J31993R52j02719R6394
263C3128j7663r0931J26202k1953j01198J33833p7966m6026J45533j05904q378
274c1323Q3483r1901J9678Q0419p9324p611P8263r6890L5326Q2555j24049N7600
$$ y = [90485, -110467, 60514, 59551, -120471, 79288, 33904, -98353, 85358, 24491, -100873, 91077, 4427, -92956, 132344, -40012, -83288, 129194, -66129, -22600, 103726, -85567, -8398, 84592, -71427, 3351, 82452, -91252, 10427, 70422, -90106, 54545, 33208, -96922, 54969, 21257, -56920, 44652, 8093, -70276, 46966, 20044, -70965, 69345, -16022, -75152, 80960, -25308, -36878, 63830, -48898, -37906, 70736, -31603, -34919, 70990, -70603, -19336, 86390, -79637, 17598, 46294, -93492, 38501, 39453, -63266, 33128, 15465, -75466, 50736, 28783, -72415, 61418, -16548, -62574, 82959, -22945, -31323, 52160, -39741, -20063, 60356, -18968, -26579, 51684, -45206, -9880, 72675, -51374, 6226]
286F226L0958r3474Q4691J0825p9405N0563J7073p5521P8200J2428j04497J01136
298C9203k9771o3206J20121o9074l6262Q2441n8681j0756Q0553o3709k9737R1651
310E2773q4090J3452Q7579j19797M7027M3069r0020P0244J2020p3572M7283J8938
322B4906o8174O4479J0600q9609Q6985k2571n3042R4133n5858k5838O2908m0051
334a1132j3411N7259l8041l1748P3957n7212m867P5827q7749K5293M3620o8276
346c6480M0687K2900n7667K4179L4187o3834M1829K9434q6325P1417m917o0335
358d4925Q3370l7398l4117N9475k8926k2662N5850k9135l5955P1930n0828q856
370b2177P1505p8155K1350L9069n8605L4245J7662m4859J6933K9488m9595K8308
$$ y = [6226, 37184, -56290, 28401, 39226, -40179, 10384, 27457, -48064, 30136, 42564, -61933, 39203, 9432, -53774, 66347, -2727, -38989, 43452, -15229, -25985, 54568, -9141, -38878, 52773, -31317, -17865, 69714, -50083, -3056, 40013, -50007, 20237, 32257, -41315, 5968, 24906, -43268, 21211, 31811, -57798, 29187, 6616, -46426, 47707, -8151, -33989, 28919, -11132, -24543, 32716, -5325, -37073, 36884, -20328, -25195, 50632, -37117, -11824, 31796, -36480, 4207, 27107, -30560, -6381, 27806, -36028, 5801, 35235, -51090, 20327, 15410, -44925, 38445, 1047, -33070, 26405, -2521, -25183, 30667, 1532, -34423, 37507, -13321, -22177, 49328, -28827, -7477, 31592, -27013, 7232, 24894, -19965, -3032, 26456, -23139, 5169]
382E169K8952p1197N2250K676m8407O1172k5008k9967M2252j0123k6339L9227
394B0657j1005m1860O2844l2260k2695O6755o2046N346M3373m7243J8579K2387
406B2832m2811R732L8977m8992J8431L0270o6251M9659M533m7346N4354k3148
418B40k5808L8206p497k1047K7100r891l1296N4072k4106k3886M9468m4544O701
431a2288L2738l2463O433J6741k3952j774L9678l7116r48L6043n3848L5881J7899
444B3024n0224L7272n237k6141L2635K166l3603K6891J497l5603N3976k2659k9110
457b5116N1043m0977P326L4032l6409N481J4599j8096M939K7363l4572J032K9586
470B0231l7802K7933O312l4201K6208n155j1509J6709N306k5599Q488J6931k9853
$$ y = [5169, 34121, -37076, 15174, 17850, -30557, 30615, 5607, -24360, 17892, 7769, -18570, 20657, 9652, -32208, 30636, -1624, -24319, 42436, -19610, -14264, 29109, -18134, 445, 22832, -19979, -10247, 28730, -20262, -1831, 28439, -37812, 11847, 16380, -30966, 23388, 240, -25568, 12638, 5141, -15906, 11194, 1303, -29993, 24079, -27, -23913, 25555, -18989, -12288, 20450, -12013, -5580, 11161, -12791, -14565, 25113, -12003, -12951, 23092, -30756, 5125, 23024, -27200, 10072, 4835, -21306, 11329, 13495, -20108, 6783, 8280, -27323, 26653, 3994, -25116, 25927, -15050, -7724, 26308, -10101, -4620, 9979, -8117, -3178, 24185, -10387, -9355, 20231, -17571, 10362, 16674, -17527, 8681, 3526, -7983, 8726, 14032, -11567, -3079, 13852, -16001]
483a6001L4709r741l4374M4030j9628q538K8445k1829q518K2270j2289r836L7554
496B6254l6075q534M2506m1779K3459J1098m2604L2566J35j9911J9029J576k2356
509a4636J4699P395k4232L2662j4965k2737L4441j8113K539J0506j5169J358P890
522A638L29j2967K1412j2157j5268K9891k1588P043J3461k6796J1467J1629j2635
535d541p5J6054k2684O281K1094l5885K9913Q09l4348L7257j4488p819K3693j9875
549d614n124K0095q857j0967K5666k1085m277K6596l0242J8394P511k5592J6754
562D258j809k221L295J887r220K47J5710j9810J2747L802j9509J6421l898l207
576a307O978r78j3026P765J2959k3110K0038n934k0232L3857k1750r57K0161k4539
$$ y = [-16001, 18708, 8967, -25407, 18623, -1005, -9543, 18902, -2927, -11445, 10825, -1464, -11300, 26254, -9821, -18355, 24151, -17628, 5831, 16929, -25675, 6891, 7026, -12885, 6144, 7720, -14636, 63, 7458, -16774, 15888, 923, -21814, 12627, -5486, -2947, 7559, -7610, -6252, 1638, 1967, -11000, 10412, -1745, -17013, 12878, -8710, -1667, 11794, -15002, -3535, 8094, -4541, -4616, 11438, -11246, -4965, 16129, -19756, 10157, 10966, -23382, 13875, -613, -8432, 15261, -4614, -9738, 10357, 1500, -9467, 16199, -4886, -9163, 17433, -12809, 5585, 13096, -12496, 4258, 2449, 228, 3523, 5410, -3810, -3563, 12147, -7663, 5084, 8886, -10623, 5798, 1900, -1307, 5671, 4693, -8333, -568, 12391, -10719, 9319, 3385, -16847, 17010, -4740, -5697, 14464, -10075]
590a0075O427J0904j1208K417J1194k1921P560J9036k8155K0658l127k1035K8561
603A1236j4505j676J1556j2130O46N239K356q615J0117p797o447J9526j4239L279
617a454L552q870N614J989K262j0547J0773n050q028K3631k1524M675J1189k0776
631a2564J7271J230j2210P190K371j0341J0653O343k3495K1122n877j2887K8416
644A7222k3043J972J3398j7438J1388K900q113P9O373p231L041J0231j9006J0830
658B603J544r040J4057r938J45N48J691J075l887R302j5341P900O449j3844J5431
673H695r547n148J0039l230k405M190j191j1732J7688o181q907K0229k3695Q481
687b714J2047j9122J4822m046q799Q427J728o082L840K911j4193J5422k342r561
$$ y = [-10075, -3648, 7256, -3952, -1535, 9659, -12262, -4702, 14334, -13821, 6837, 3710, -17325, 11236, -3269, -4945, 6611, -5519, -4873, 366, 2722, -5893, 4224, -3573, -10020, 9506, -4733, -1454, 2098, -6772, -1158, 831, 3093, -7454, 3319, -1731, -9759, 13872, -7652, -2977, 8212, -12564, 4707, 5937, -6273, 917, 3288, -7053, 3600, 9943, -13552, 7570, 1693, -11194, 17222, -5821, -3849, 9549, -7889, 3499, 6399, -1714, -1635, 4738, -2493, 548, 10779, -8227, 2603, 4147, -4893, 9164, -774, -629, -81, 1610, 2685, -1202, 8100, -7241, 659, 7108, -6736, 8695, -852, -6000, 4039, 809, -1596, 2594, 1403, -10329, 7359, 1178, -7729, 12500, -11195, -2714, 9333, -9789, 5033, 987, -7812, 615, 2343, -3739, 101, 3012, -11181, 4241, 1899, -7662]
701g662J5271j5350M876O304p071M916l462K250n173O664O37p807J0840j1245
715f012L150P699p973L928j491o52j679P649m659m688J3491j7304R579O612j6060
730h410J5788p949m678J0762m540j987L396l42p871J2857n333o673J4888j6193
744f285O785O057j1011J0310n810j315J868K071p30l152O215r716O921K811q794
759c775Q917o817L38K431O16K00m130N841r904Q262L212j1726J2786j0386K83
774c852R296p843K429J62k277j682P973m316m311R881j4572R540M904j2285J1224
789D271q232k83O796l133j16j503K293n282P666r30o659R159r720M498M674n560
805b061L501m982L536j480L681j3p734R679p971L641N480r118N869k936PK650
$$ y = [-7662, 7609, -7741, -2865, 3439, -3632, 1284, -2178, 72, -5101, 1563, 2200, -5607, 5233, -6012, -2862, 4837, -3136, 792, -699, -1351, -3030, 4619, -40, -4728, 8763, -8541, 1038, 7650, -8410, 7378, -571, -5249, 5513, 973, -1014, 2382, 2040, -5831, 7026, 1693, -4980, 9908, -6285, 500, 6557, -4454, 5856, 46, -1269, 599, 2670, 1940, -1212, 5003, -4713, 2208, 5019, -3775, 5142, -1675, -1337, 1094, 1710, 1910, -2220, 3621, -6283, 1979, 5191, -6535, 6251, -4135, -3852, 5444, -2399, 30, 192, -2085, -3767, 4206, -110, -4421, 5460, -9112, 428, 5332, -6953, 4271, -3961, -4244, 2552, -581, -697, -2200, 93, -5189, 2477, 1547, -5112, 4047, -5673, -1175, 3499, -2061, 1440, -3542, -6, -1486, 2195, 2182, -5552, 4127, -3844, -203, 5277, -3841, 2028, -908, -901, 1749]
821A749J373l326l329P913q002P310L51j0634J2147p123R10O308p301K308q76
836b22J466j446M084k760n096R976q693N053J686q956Q488m454J539J148j517
851B96M60l700O677n283K801Q18p122Q539m379Q22J588l858K534k011M704n558
867b672L194N11p065J1038p588J224L808q096P159j816m17m10P05p03j967O932
883C837q114M253J505p597J0393o298O15K444m546M138j738K359l415J942P51
898E29m285Q009o548J826J976m432N550l352J812k043M67K335m643P432o562J684
914b45L528o794P484l798l17J738j744J355j569M026n867L333J372n836R154p574
930a754J360L673o317N926k619N02n07m50J247k473N332n780K134J799n462P096
$$ y = [1749, 3122, -204, -3533, 4380, -3622, 3688, 4039, -6595, 5552, -1571, -661, 5647, -1654, 654, -222, 1244, -202, 3882, 1122, -3974, 6002, -2691, 2362, 4048, -4908, 3580, -874, 665, 1813, 296, 756, -2944, 3733, -1550, 1251, 2069, -5053, 3486, -893, -71, 1517, -2341, 193, -1818, 2886, -2672, 522, 1033, -6032, 5006, -2582, -1358, 2450, -5646, 1513, -303, -720, -1130, -425, -1128, -3095, 3837, -4277, -24, 1481, -6116, 4277, -2021, -1406, 1038, -3508, 630, -1108, 1251, -2164, -222, 529, -3756, 4253, -2295, -469, 1507, -2925, 2625, -727, 1085, -958, -491, 1844, -2799, 4633, -1929, -245, 3283, -3511, 3973, 175, -142, 1596, -148, 1207, -362, 3664, -2203, 1130, 2502, -3334, 5820, -1754, -394, 3279, -3038, 2888, 269, 771, 264, -186, 1061, -1412, 3920, -1860, 274, 2073, -3389, 3707]
946C707m789J619K41l056L989l570M337m124M78K389n247P326m531R5J803l372
962b705L586j815K023l186J012J357m089P973o659Q43L014o177P959l791p10Q85
978d80j811K794j480K934m612K148R52l784P453o074J218J176l469O169m032K119
994A221k388l83L568l609M913m325Q8K004k913N123l366P99j522L90L379l759
1010g80M526n803J572M070o385O893m496m88K693k719L557j749L49k823J970J642
1026B029l329M993o270K337K777m994O401n279J085N88j645L516k989K082l091
1041a789Q64K609l536M156m943K389M68j512L196m599L980l129R49L183n669N008
1057A625l600J74L775m401L272k442Q94l21O60R79l099M040l970K368J693n122
$$ y = [3707, -1082, 537, 778, -2278, 1711, -1859, 2478, -1646, -1168, 1221, -4026, 3300, -1231, -1136, 667, -2705, 881, -934, 1089, -2097, -1085, 272, -3817, 4156, -2503, -1660, 1354, -4823, 3136, -655, -1365, -480, -2291, 503, -977, 1957, -2655, -507, 445, -3339, 4114, -1960, -742, 434, -3035, 3134, -898, 1221, -1167, -1550, 2018, -1591, 3322, -1003, -915, 1089, -1824, 3299, -67, 732, -790, -400, 2979, -780, 3746, -2057, -485, 3585, -2800, 4093, -403, -891, 1802, -917, 2640, 891, 1240, -1583, 387, 2029, -1300, 3693, -2577, -240, 2537, -2457, 3944, -1335, -250, 338, -1307, 2209, -780, 1302, -1789, -925, 1684, -1852, 2304, -2639, -250, 218, -1294, 1902, -2697, 1283, -1846, -897, 2286, -3383, 1625, -1975, -1801, 1974, -2427, 845, -1597, -703, -1024, -364, 615, -2484, 1556, -2414, -46, 1647, -3475]
1073c475N830m047J020K420l654L519l236J967r84P85J097l432M056l141J959
1088F84Q14l271M124l830K887o69j696L438m463M154k402p1L037m766M144k054
1104F0O59L94j304J612k644L675l467J287J900m882N887m001N42K943n189M580
1120B052k614P86M67r21J354k607L189l062J753Q53l512M468m134K008N42k464
1136a842L656l900K762j082n48K477l828K941k007N17J643k592K496k730K488
1151D51j411K00K324m946N122l115O04K644m827L917k105O43J614j918R73j918
1167a748K920k069J187J347m266M412l205J817J871m311L868l199K430K93j927
1182e80K035l278L268j347P00J117l514L032k270K366n31j655K114l568M273j801
$$ y = [-3475, 2355, -1692, -672, 1748, -1906, 1613, -1623, 344, -640, 145, 1242, -2190, 1866, -1275, 684, 1498, -1773, 2351, -1479, 1408, 739, -957, 2481, -1982, 2172, -230, -301, 2736, -2030, 2114, 60, 719, 1113, -191, 1421, -1223, 2452, -1015, 272, 2172, -2710, 3177, -824, -282, 2661, -2528, 2052, -562, 224, 691, -230, 1124, -1483, 1706, -1356, 397, 1250, -2262, 2206, -1928, 80, 622, -1842, 1814, -2086, 676, -406, -954, 1523, -2305, 636, -1371, -854, 789, -1803, 693, -2037, 451, -960, -760, 1564, -3382, 1740, -1375, -771, 1873, -2954, 963, -1142, -499, 1115, -803, 170, -1748, 1172, -897, 290, 1637, -2629, 1783, -1422, 395, 2266, -2045, 1823, -1376, 1054, 1347, -580, 1455, -1823, 1445, 98, 798, 1915, -1599, 1433, -837, 1529, 998, -657, 1457, -2111, 2162, 361]
1198C61n24K450m593L920j113m27J765l184K112j209K228j619j76P45l049M657
1214B344k706J92J737m433M261k161J110O36k942K674k400L124j609m82J095k682
1230b242L577k280R37N4k501L401k901L056j309j838L157l688L833j333j086J636
1246D73k660K995j679J137p69r90K085k766L902k590n6K326m058M380k244l8J579
1263A027k796L015j629J154p84o90J983k520L025k456O87J234k619L260k489J484
1279H86j18j564K934l159K678j249q95K099k568K442j612L80M99j412K415k613
1295h57K099j026o85K289l585L434j936j19J906k696K472k002J063k19j262K292
1311A168k796K648j535j46J774l077L319k151L53J141k380K832k590J681m71j110
$$ y = [361, -163, 2287, -2306, 1614, 501, 74, 1839, -1345, 767, -442, 1786, 167, -9, 736, -2313, 2344, -362, -170, 1567, -2866, 1395, -766, 344, 980, -1962, 712, -1688, 1436, -173, -655, 440, -2242, 1335, -945, -8, 46, -2455, 946, -1955, 1101, -208, -2046, 1111, -2577, 1256, -77, -1163, 473, -2187, 808, -871, 266, -503, -1493, 592, -2174, 1728, -862, -918, 1408, -2650, 1730, -514, -552, 1027, -1769, 1246, -383, 771, -13, -703, 1280, -1240, 1785, -671, 16, 1250, -1369, 1891, -598, 886, 768, -796, 2138, -1021, 1657, 408, -487, 1612, -956, 1486, -126, 254, 753, -659, 1756, -857, 1242, 216, -469, 1820, -1765, 1669, -267, -386, 1520, -1176, 1296, -706, 357, 138, -1124, 1168, -1628, 1020, -515, -661, 1113, -1964, 1355, -796, -443, 698, -1682, 1150, -1440, 241, -230, -1340]
1327a340K184k730K703j566K17P42j695K436k080J269k38j080K185k572K548j450
1343d67o34K209k817K883j630o0O76j103K065k217K074j318l14K287l069K951
1359A516k020j07J752k117K681k048O09j05o26K296k549J989j537r5J794k054
1375f21K087k043J042K81j386K845k823J510q14o96K703k930K110j652q8J768
1391A293j664J842k599J170j15n80K308l126K315j426r4K172k788K134j796M06
1407e48J051j317J661k337J715r79Q9J801k596J900j669O53J488k145K175k680
1423a738J471K19j039K243k777J539o68J98J461k007J438j724J318O03j166J654
1439A025k654K029n97m77K064k937K120r01p6J439j622J564j709J363l86o53J503
$$ y = [-1340, 844, -1886, 817, -749, -532, 210, -1485, 951, -1129, 140, -98, -1178, 1007, -1565, 983, -467, -1101, 1108, -1709, 1174, -456, -516, 160, -943, 1122, -1095, 979, -339, -653, 1634, -1435, 1516, -504, -611, 1141, -976, 1705, -343, 266, 161, -465, 1831, -718, 1271, -266, -361, 1433, -621, 1466, -577, 465, 746, -640, 2205, -618, 892, 78, -618, 2085, -845, 1265, -387, -475, 1293, -371, 1471, -1128, 42, -73, -653, 1655, -1471, 844, -582, -676, 1496, -1292, 842, -954, -548, 503, -814, 847, -1490, 225, -754, -665, 1136, -1460, 440, -1229, -576, 912, -1233, 942, -1738, -267, -48, -1087, 1156, -1621, -82, -750, -552, 909, -1098, 340, -1384, -66, 537, -629, 1025, -1629, 400, -197, -674, 1390, -1547, 573, -328, -404, 1035, -587, 977, -732, 631, 245, -408, 1095]
1456A095k314K261j047j1J701k775K628j997R61N17j552K080k336J737l61r39
1472c52J410k011K068j355K69O06j116J727k282J629k23j083J908k384K025r52
1488a16m87J563j815J472j175N19M77j130J706k198J393k49p92J836k185J644
1504D63j321K48J081j591J855j821Q55K56j073J866k098J568j036Q4J608k200
1520a256J936j461M51N48j205J829k261J688l41m98J293j896J523q04L69O75j196
1537f06J665k250J603j03q56J744k306J887p67k28J453j866J311r34Q19K92j061
1554b03J184j791J725m63o86J465k009K009j374M42M55j416J656j468J047l32
1570B41j111J691j982J634m85j89Q50j713J780r57O96oj554J995j850J356p9j019
$$ y = [1095, -1219, 1042, -5, -16, 1685, -1090, 1538, -459, 502, 1019, -533, 1547, -789, 948, 587, -352, 1058, -953, 1115, -240, 29, 635, -481, 1246, -1036, 593, 370, -713, 1195, -1189, 836, -116, -603, 960, -855, 617, -558, -39, 438, -692, 1014, -1184, 209, -40, -832, 1004, -1181, 463, -858, -610, 471, -1120, 735, -1086, -231, 25, -1048, 818, -1280, 288, -748, -664, 944, -1256, 680, -781, -330, 218, -987, 842, -1419, 269, -72, -570, 723, -1173, 350, -454, -85, 590, -606, 1059, -1191, 412, 309, -547, 1197, -1109, 778, 11, -217, 1236, -630, 681, -253, 566, 858, -203, 981, -810, 915, 452, -234, 1231, -778, 1231, -143, 299, 754, -662, 994, -474, 573, 241, -870, 821, -1161, 473, -12, -201, 649, -1064, 716, -241, 455, 449, -1105, 890, -960, 396, 317, -702]
1588g02J498k020J620n20n34Q26j317J638j001Q69k69j223J589j445J462o45r15
1605a089J357j466J570r02M59L04j538J843j082Q79o73m15J232j321J677r73N
1622a33L91j204J790j308R67l52q68J423j077J175q15j48Q99j328J655j117L46
1639B96j35p51J569j436J156l83o66J406j481J280j143M43O38j027J560j621P26
1656D31l25m87J058j296J389q92k9R32j576J509j218K73P46j163J604j581R23
1673B98k24o99J329j677J348m60j07N02j437J888j627J022J03j140J514j672J387
1690C48o20k99R03j144J322j110K90L79j085J508j168Q75m25m30J180j619J443
1707C48n48J65M43j366J429j000Q40k38q71J561j288Q14m33k37O46j072J693j358
$$ y = [-702, 796, -1224, 396, -124, -658, 168, -1149, 489, -512, 357, 88, -1135, 454, -991, 471, -174, -1089, 268, -1198, 372, -530, -71, 233, -1305, 538, -544, 335, -338, -753, 479, -842, 835, -138, -133, 258, -946, 844, -464, 503, 151, -717, 706, -371, 804, -11, -159, 740, -588, 1067, -50, 296, 161, -590, 979, -457, 699, 316, -350, 1056, -425, 855, -288, 155, 793, -234, 1326, -295, 431, 106, -381, 677, -619, 770, -122, -151, 781, -795, 714, -504, -231, 515, -648, 956, -625, 298, 74, -625, 704, -973, 375, -85, -192, 310, -1127, 761, -866, 156, 259, -881, 633, -1039, 348, -272, -571, 332, -812, 510, -600, -310, 69, -1016, 492, -676, 199, -226, -656, 524, -1095, 348, -200, -35, 408, -958, 471, -529, 311, 73, -798, 763, -525, 289, -144, -381, 265, -807, 886, -472]
1725d72O84J82o58J230j338P74j26q33J351j080J143o04k26K77r32J707j408O24
1743B95K7o87J285j409J098n22k00O95j232J481j254N39J40q66J587j461O53n6
1761A13n22J083j377Q56m17J56N21j104J136j087M94N19r36J459j294J24m3j00
1779d19O46q43R70r65M72M45j192J443j113M90mm94J100j230J042j002K34R19
1797D99j317J596j503Q08N8o01J276j304R16n04j29R22j327J194j117L72O77p50
1815b34R97j276Q66qn22Q65j425J258m26k86P43r30R26q56N31L76q06R61r32M47
1835B69k38J52K27q40J334j237O11L06r02R98j133P85O6n36N53r25J040n39j04
1854a13P28j316J343j197N94Q9r77J303j235J204m49l46Q64j460J536j125K97
$$ y = [-472, 212, 394, -264, 966, -372, 402, 276, -557, 794, -286, 857, 253, 27, 304, -628, 1079, -329, 295, 322, -365, 920, -489, 609, 87, -113, 582, -650, 831, -423, 116, 256, -610, 977, -484, 169, 113, -409, 674, -703, 153, -264, -108, 413, -691, 445, -642, -148, 371, -565, 894, -400, -276, -319, -419, 227, -616, 354, -611, -139, 306, -886, 557, -556, -66, -70, -564, 536, -694, 348, -654, -420, 499, -818, 778, -725, 83, 141, -460, 816, -488, 428, -76, -205, 717, -610, 584, -533, -161, 516, -234, 763, -513, 353, 345, -177, 688, -737, 521, 95, -191, 552, -378, 548, -308, 223, 599, -207, 754, -178, 269, 31, 183, 410, -430, 904, -333, 278, 584, -318, 680, -453, 332, 398, -138, 415, -510, 530, -9, -113, 615, -701, 642, -555, 39, 128, -849, 454, -781, 423, -26, -372, 492, -968, 568, -557, -260]
1871b60N19j070J275j298Q16j32j36O59j316J502q57J99L30j007J369j098N08
1888CK8l04P59j086J087o45j07O59r98R72p91P15K01q08J133j321N24Pk53J160
1908I35j249J016q20J3N91j096J181p99L81L87n31N00q67R02n03j11P17j317J432
1927G62j014M35K31n35P47j269J050j39L7M19j105P83p15L11N39j160J217j214
1945f20P83q3n10P02q62Q90l00q9L06n97K02l52L37J29o42J013r87P71Q7l83O07
1966D02j021P86m28J99L06o84R52q94N50Rm83N16o49R10o88j69O29r22R29m04
1986a54L4L18n58Q48q97P83j38n44O39p97Q99n75K97M26r13Q91q77N98J82p55
2006b93P81o00O42m91k78Q81p29P53p03L76k3o31J037j217P05j19k66N54q40R59
$$ y = [-260, 259, -811, 464, -834, -18, -150, -286, 373, -943, 559, -298, -99, 231, -776, 593, -505, 3, 31, -273, 486, -600, 487, -158, -265, 394, -604, 368, -423, 292, 493, -315, 818, -503, 21, 28, -225, 935, -314, 702, -118, -105, 486, -610, 571, -228, 153, 540, 9, 509, -358, 544, 41, -70, 647, -670, 762, -252, 183, 414, -121, 626, -643, 407, 268, 305, 724, -381, 402, -313, -2, 537, -623, 594, -620, 163, 80, -430, 272, -590, 300, 0, -89, 217, -380, -178, -530, -193, -64, -706, 307, -680, 91, 178, -205, 402, -619, 167, -261, -62, 244, -440, 512, -382, 168, 177, -306, 210, -439, 471, -217, -386, 243, -679, 250, -154, -120, 198, -360, 488, -409, 374, 236, -308, 331, -466, 433, -142, 155, 581, -332, 559, -318, 280, 462, -293, 488, -112, 530, 39, -239, 642, -87, 666, -37, 339, 316, -315, 722, -495, 210, 91, -175, 379, -461, 498]
2026D98m96j74O10p94Q24p23J32J59l42O81p70N97m17j49Q20r30P83o65L12N3
2046Io49J069r01N83l1m30Q36r78P44m42k02O62r66Q30l12K5K20l10N15o68Q42
2067D46n86j81P50q24P83r25K16N23o04Q96p81M70O0m50P03p17Q45p70O7N94q53
2088c38O17j90K22j78o53J288r20O02n03jN88m81O46r11L18K9k40O42o16J3R8
2109C2j62Q03j170R11l44j57L61o69J026p32N12l46k03N77o16M79n65K24K46p76
2129e69J091r34P3N53n70O90o15K95n80J11P88r25R60j033O94N0o86Q98q56N09
2149e6r2k79O08m96L66l43O7N03p12P20l15J40J92m86N55p14K80K22k29N18r53
2170e04R80p15L14N0o41R67o38M24J75o52O28o46M51j13K2J18l81P86q75N28M6
$$ y = [498, 2, -172, 438, -356, 468, -255, -123, 36, -306, 375, -395, 202, -215, -364, 456, -474, 309, -356, -44, 9, -640, 429, -472, 111, 80, -350, 486, -492, 252, -190, -392, 270, -696, 134, -178, -153, 67, -243, 272, -396, 446, -140, -321, 429, -395, 388, -537, -321, 202, -402, 494, -287, 183, 243, -207, 496, -221, 624, -146, -79, 515, -338, 279, 89, 311, 133, -520, 768, -152, 450, -53, -54, 534, 53, 699, -212, 106, 135, -105, 537, -79, -66, 32, -130, 673, -497, 414, 70, -87, 274, -395, 631, -101, 411, 65, -138, 439, -177, 302, -263, -39, 207, -569, 522, -412, -339, 214, -356, 334, -281, 14, -566, -455, 333, -592, 368, -665, 29, 79, -607, 291, -565, -56, -148, -427, 181, -315, 51, -292, -225, 278, -434, 286, -29, 111, 303, -183, 372, -342, -62, 160, -69, 449, -504, 476, -239, 75, 125, -516, 451, -187, 237, 412, -240, 388, -258, 193, 80, 102, 220, -161, 625, -250, 278, 324]
2191C24n16Q21q28O91m40j47O15q90P80p82N43O5p10R35n83K62q9j49L42m24K37
2212E7l24K17M95q47P67n84N16R3o55N14n51M29l52J40J48m84N49l43L35o9k27
2233a76M98p44L53K77l47J69l11O81m61k71L18m74Q28n94L02O6j93M54n88M51
2253B38m05J67K08l55M17o08K15M87o73O65n56J25L97l90L53l90O05o64K96J40
2273B72o97R01p29L55Q9m08M57n87P11j21o14P14q08P65l46p9O08o85N10q44N16
2294b0J82k29J89l26O70m99k16M68n46Q06q03M81j6n33L89k70N80j16m11M90n53
2315b83M93n38K44K05o91Q50n71L39L3m45N42o99K63K24J6J7l86Q01k59O5j45
2336G5n07N62l02J20O5j90M64o94P01k22K11q3n27N71l45L04K5n13L19k27N79
$$ y = [324, -192, 629, -199, 492, 52, -95, 520, -370, 410, -372, 171, 236, -474, 461, -122, 140, 51, -98, 244, -180, 57, -267, -50, 445, -402, 365, -219, 297, 390, -265, 249, -302, 127, -225, -85, 63, -421, 128, -215, 120, 51, -176, 322, -422, -69, 208, -139, 30, -281, 400, -61, -332, -14, -488, 340, -254, 48, 114, -79, 375, -213, 238, -167, 0, 208, -147, 270, -338, -123, 364, -309, 356, -200, -75, 322, -68, 285, -105, 500, -164, 132, 272, -425, 476, -253, 102, 191, -217, 240, -347, 364, 243, -371, 343, -465, 300, -46, -125, 483, -202, 308, -536, -20, 162, -67, 122, -204, 466, -33, -249, 219, -327, 479, -324, 157, 141, -392, -3, -273, 307, 191, -220, 270, -283, 210, -328, -84, 121, -570, 280, -291, 48, 81, -364, 178, -521, -258, -34, -18, -1, -387, 414, 155, 220, 75, -432, 130, -172, -52, 13, -177, 287, -407, 294, 72, 283, 200, -327, 244, -101, 203, 228, -285, 34, -193, 386]
2357C86o69K85L97p44N01j41J91n5j58L79n21O89m27jL24m76N71o20R9L92o33
2378b31N49k50K8j69j1N00o31N29n68L04J08n33P44m04N65m35l74M59k85J38K
2399C5m29N97n75N51o7k50O5j14N04o29M36j55l37M50m30M76l92K73J70l44J76
2420A1j29j92L10j59O22q13L95l3l8J25n80Q11j37k04o4k06M39l63L92j82k21
2441b16O66o02M73l11R2K0k38J54k9J82Kk80L47l18L81k47J82j04k88K94J8l58
2463a80K60n02P99l52L07q5l69J32k11L19L3m9O9m96Q98q51M45p2m25M72k78K84
2485A48k24P9K86o42L27o6l4K43j94K69l36K22p6k50M56m32N09m17p7M98m65K83
2507A07j76l15M22k63L91k24K32k20j74L00k81K60j05j96J94J25j3k39K04k09
$$ y = [386, -283, 2, 399, -345, 156, 15, 206, 151, -7, 372, -149, 540, 113, 112, 436, -40, 531, -89, 10, 402, -231, 318, 68, 96, -73, -84, 416, -215, 314, -254, 50, 158, -375, 369, -35, 530, 95, -279, 180, -105, 33, 35, -394, 203, -372, 179, 112, -138, -73, -187, 317, -312, 124, -31, -368, 82, -348, 128, -264, 9, 179, -165, 11, -118, -310, 0, -159, 463, -350, 45, 12, -26, 99, -481, 330, 193, -11, -75, -281, 158, -205, 187, 5, -216, 450, -152, 321, 10, 102, 122, -116, 38, 9, 191, 193, -87, 260, -58, 323, 76, 258, 154, -134, 160, 178, -180, 80, -422, 377, 25, 332, 247, -122, 10, -201, 118, 151, 102, 171, -325, 573, -278, 167, 95, -330, 142, -136, 148, -76, 3, 289, -353, -26, -92, -126, 117, -77, 192, -144, 78, 2, -248, 208, -224, 285, -132, -209, 289, -176, 107, -69, -384, 38, -225, 166, -58, 174, -46, -220, 80, -201, 59, -46, -242, -48, 77, 64, -175, 29, -180]
2527a80j1K03j23K58r2R6j41o2K48k42J01M20o13L37n42L54l4r4K41l00J19K85
2549B28k61K30j56K23j52k01LJ91K34k32J27j73k15J78l27J50n5J56q4K3M36n44
2571b21J33l9J01K15l55K40k17J22O8k31K08k61J07K79j41J48k78J81N3l75N22
2592B59n02L54j43o0L32l19N5j50K11j98J03L24m43P7J6M8j36J07K34m6q8J67
2614B02k89J31j43K05k49m9N14n28N58l46N6J58m40M62l23J06j84R3L06l59L35
2635B16n3j60O7j12J99k92J31K06k93M02l33j00R5m0L67n50M64k51K04N8j54O3
2657A34n4J11p0j36L75m27K63k37j77K76j52J56k62J34L4m2K56j93N3k55m2O70
2679D15n34L01l88L7J53m81P15l43N3P0j88J07J15J59j47K2P4l99N93n77L67j3
$$ y = [-180, -191, 12, -111, 147, 55, 151, 10, -52, 196, -46, 55, 475, -138, 199, -343, 11, -23, -117, 124, -176, -57, 228, -33, 197, 41, 264, 112, -89, -86, 105, 339, 107, 234, 61, -154, 24, -303, -153, -208, -52, -136, -113, 323, -221, -88, -127, -26, 189, -166, 74, -143, -21, 47, -184, 24, -237, -130, 149, 8, 156, -122, 59, 112, -263, 259, -243, 111, -32, -92, 240, -79, -24, -174, 37, -161, -58, 266, -177, -100, -84, -36, -172, -65, 169, 123, 35, 202, -87, 44, -99, 106, -143, -192, 322, -206, 352, 6, 62, 220, -220, 242, -81, 25, -159, -66, 240, -119, 216, 163, 3, 70, -42, 157, -135, -4, 202, -91, 311, -22, -122, -27, -67, 300, -250, 214, -37, 167, 225, 71, 134, 80, 191, 121, -15, 360, -67, 196, -41, -218, 58, -94, 62, -200, -66, -32, -74, 182, -11, 42, -213, -255, 415, -119, 182, -206, -169, -16, -497, 218, -125, -72, -2, -190, -83, 32, 191, 44, 66, 140, -259, 334, -243, 124, 111]
2701A11k07J64m53J01J90KJ94j29K60j60p2K26l71L79k78P5q4k7J74l9L7K2j59
2724d4K22j26J71j58P3l9j7L4k06M4K0k30M38k61R5K8p7J12j28K56m78K99K88
2747C16m57K55k08L41k71p9K74l94K99j75J97K13m34J61l71M61l0k52K00j46J07
2768GK0m8K89n58N01j30j37J05j07K24k65L42n31M82l2l47K51l22J29L36j95L31
2790C45n93J56K64k04K59k77K5O8k04K76k49J34pJ77m8j61L27o90O43j69k58L65
2812A79m20M48m2j95j8k20N92m10J45m9PJ43m8J68l22k20L15q4J04L1m9k81j36
2835c62O25l0m12j20N0L28LO6p0j6j10L7l0n5J75L3k28pj03M35k94j71N5k25L56
2860g0j8j03j02q5N46m45M99r1k79K24m64O02m32K77m3m4J55l02K18j17o8J08
$$ y = [111, -96, 68, -385, -284, -94, -92, 102, -27, 233, 73, 1, 227, -144, 235, -43, 32, -52, -79, 95, 56, 93, 115, -44, 178, 52, 223, 65, 138, 99, 82, 116, -90, -46, -26, -256, 182, -79, 16, 44, -33, 79, -49, 207, -271, 28, 316, -141, 114, -94, 247, -24, -103, 171, -223, 76, -99, 98, 311, -123, 38, -333, 128, 98, -154, 46, -100, 7, 27, -21, 268, -290, 211, 81, -56, 49, -58, 166, -99, 243, -288, 194, 162, -185, 66, -256, -127, 209, 14, 345, -248, -92, 172, -32, 227, -50, -25, 43, -161, 115, -134, 0, -7, 170, 122, -39, 288, -402, 241, 72, -186, 179, -241, 207, 165, -30, -48, -268, 324, -86, 59, 10, 17, 160, 112, 280, -42, -262, 53, -31, 73, 104, 55, -226, -362, 263, 233, -179, -299, -249, 79, 82, 148, 78, 62, -48, -11, -41, -96, 79, 112, -116, -123, -226, 209, -85, -256, -201, -426, -70, -88, -191, -293, -378, 168, -277, 222, 131, -148, 76, -388, 214, -218, 59, 16, -28, 127, -175, 43, -74, -142, -34]
2882c4q0K28j80J2J96l47J23J50l90N38m96M92l31L02Rk01Ln3N68o34J21J50j08
2905C8J2k3k5J43k44L39j59j48J18M1K02l64j6J18l32J48J78n3J08P6J47o5p1
2928A68l50J60M9Kj9N1N2l88K20K99j61O2j10N4o1k42L81j47K5j96J65j4J6j5
2952AM4L6l06L83j12k94K02m30M17P5r1L16k63M4R8l59K76k02J24q3J19j07k39
2975c51N30k35J60mn3J66k03L0j31j95L32j97K21N2K12l15k09L70l68K20R9m15
2997b84M45j71K24k01j70M90m58K25P1m09M49q1L05n75jK68l64L85k10J95J6j45
3019DP9j87K06j88K26J74l77L84m97K69j4QL56n18K69q5j32n4j55J28K21n0j70
3042a03j73J80l5Q8j64P3R8m8K85m70L24P8n27L25Q2j16j8j24L63n46P47l19j32
$$ y = [-34, -114, 114, -66, -54, 142, -205, -82, 68, -322, 216, -280, 212, -119, 183, 192, -9, -6, -59, 509, -125, -4, 146, 38, 50, 27, 2, 145, -99, 240, 81, -67, 51, 92, 294, -70, -86, 32, -300, -152, 26, -27, 81, 157, 304, 239, 168, -182, -22, 27, 29, 10, 61, 113, -275, -55, 244, 83, 145, 35, 89, 28, -214, 167, 20, 45, -151, 14, 0, 16, 1, 45, 81, -225, 158, 46, -248, -46, -476, -59, 16, -75, 241, -22, 22, 120, -239, 37, -165, -41, -124, -5, -112, -351, 179, -56, 104, 100, 47, 213, 10, 40, -91, -286, 46, -151, 70, 122, 334, 19, -190, 180, -188, 32, 131, -284, 161, -10, 214, 13, -157, 333, -125, 100, 171, -238, 211, 130, 435, -140, -141, 127, -237, 148, -62, 133, 149, 4, 83, -104, 102, -86, 140, 314, -63, 321, -176, 93, 79, 87, 443, -75, 194, 109, -23, -77, -232, -104, 117, 67, -103, -276, -96, -131, -43, -207, -134, -36, -84, 201, -269, 55, 133, -394, -69, 13, -103, -121, -245, 118, -428, 319, 0, -132]
3065a32k37K82J97j86K35n0j78K41m14J50J76j40l4P0K1j27oP4J28J95l07K91
3087B49k54J37K12k35J74n73R6K11J58J14j93k69M97m98K54j68J13j34k8J2K87
3108A62j6m31K10J83k81K70k78L88j12l41L11j31L59l56J95J20l70L59m48L64
3128A57N8l40L72m17M51l80n1R4k11L25k13M23k82k65L01l37L20K6k88K69l71
3149c59M21N4m7j60j13J62j91J53K28m26L34j12P2P6m96Q80q20N03j34k55L50
3170A20j08J85j51J84J07m31J00k1K12j03q9L69o36L92k11J89K18n75L79m79M90
3191A41k42J80K15o31P53l78k5J00n7k5k8J76j49r4J98l34J80k18l1L73k54L68
3213B18n50K88K41l23N13m76J44j09k99M79k23P4k83L13K22l93M00k66N0j28n9
$$ y = [-132, -369, -87, 110, -76, 159, 109, -69, 172, -242, -92, 84, -56, -90, -20, 1, -126, -132, -58, 70, 265, -42, 249, -5, 132, 344, 109, 283, -290, -194, 17, 175, 289, 96, -173, 324, -174, 80, -88, 25, -109, -137, -125, 162, 146, -285, -75, 108, -173, 97, -181, 207, 95, -246, 65, -66, 293, -63, 132, 252, -118, 241, -207, 157, 215, -125, 247, -170, 281, -99, -150, -56, -267, 58, -155, 268, -14, -279, 22, -315, 5, 31, -257, 12, -359, 62, 116, 69, -91, -204, -42, -233, -80, 148, -278, 56, -56, 16, 92, -404, 476, -344, 159, 25, -230, 120, 12, 197, 46, 230, 337, -94, 6, -15, 197, 94, 5, 374, -262, 130, -81, 108, 326, -249, 130, -349, 141, -101, 79, 294, -337, 416, 38, 13, 113, 56, 31, 3, 179, 30, -64, 134, -200, -20, -238, -269, 104, -150, 218, -332, -44, 197, -126, 387, -89, 55, -54, -353, 126, -97, -23, -306, 7, 229, -164, 236, -30, 20, -108, -167]
3234a67K12l42K51j16q1M37o00L27K9J78k21q3L21k1J47l62O1J43k95K65m9J20
3256A54O7l54K07k96L09q3K2P5m89M52q0j41K14j52Q9K7qJ40m04P31p85L70r1
3279b6l30N01k10J45j61q7K06j35K20k98J17O1n3J76k75J64R4q6N25p84M74l45
3301a07n8L5l6M42m39J25J41k19L09m40L10ml9M3k05K48m01K57J67l13J11l41
3323d14O00j79j11K59m06L04k01o4J88M7K0k01j40K95r2M9k1M83n02l1M40m76
3345a53M35m86J62N3j71M46k07L3p9j01N7r6M60k91j20L03m20P5J6P6J6R1N8l08
3369a51M81l52p0K14m21M49l63L09K60n93N56p76N46j53p8N05l63K64l41J69r8
3390fj99L97l46M83k07r9L2j39J98k28J37m4l0J05m44K84K51j04J95n56L22r1
$$ y = [-167, 45, -297, -46, -162, -243, 194, -406, -79, -50, 128, -93, -176, 145, 124, 271, -91, -30, 113, -182, 83, 34, 154, 221, -133, 74, -222, 87, 4, 26, 101, -388, 64, -16, -157, 57, -95, -6, 21, 13, 153, -251, 480, -305, 65, -26, -356, 145, -65, 80, -81, -168, 38, -97, 123, -175, -58, 3, -50, 126, -149, 15, 109, 23, 548, -236, 238, -107, -165, -130, -166, 276, -163, -38, 103, -116, 193, -247, 63, 59, 20, 63, -142, 106, -295, -38, 129, -184, -73, -414, 186, 7, -104, 155, -251, 53, -148, -212, -24, 23, 43, -158, -298, -3, -95, -46, -67, 416, -86, -117, 323, -153, 282, -204, -42, 11, -160, 286, 79, 112, 33, -68, -11, -107, 353, 62, -58, 245, -175, -100, -84, -8, 8, 99, 157, -151, 330, -22, -92, 122, -299, 150, -213, 96, 356, -237, 319, -457, 89, -64, -142, 363, 0, 264, -77, 92, -6, -205, 192, -154, 329, 122, 23, 55, -84, 114, -114, 23, -21, -51, 54, -390, -106, 145, 41, 236, -320, 2, -89]
3412h9o1J04k13M34l80J92M20p02N58l73K08o4k89L56q3K50o09M07Mk69N04m79
3434a74J48l9k0L08n27M58k86L3L67l01K79n31J87p4M0L58l98M89k05l21K84n08
3456d33N42j75J35K3m1L32n40J12L75l43M15o07M81j74j99K22k47J83m06N96o4
3477A87l42L13k34L82k52j63L48m35L93l77O0K45l91L26r4j21L07k57K40m48O72
3498C59k58k13M36p84N03k12qJ40r9L07n58J59M6MO3r7L08l43J70K18j82K75p40
3521e06M43J10l67K50M7J64j09m3J52m94N06N9m80N19n53L43k84M48j42j95K90
3542A58k53M59m86l7L56n48M54n8L3n0j36M37m20K93j65P4J14j49J06k70J28m1
3564aN2J13n51N46K9j68J33k45K14j01J63J21l88L13k06Qj02k30O61p15M70j26
$$ y = [-89, -150, -46, -259, 175, -205, -13, 407, -295, 263, -110, 98, 34, -255, 101, 18, 268, -341, 66, 70, -199, 305, -174, -26, -65, -85, 223, -304, 154, -132, -99, 268, -33, 246, -285, -98, -172, -132, 226, -172, 317, 112, -209, 75, -433, 109, -66, 69, 92, 51, 383, -157, -45, 330, -13, 402, -205, 276, 102, -97, 125, -122, 61, -345, 251, 187, -155, 158, -76, 306, 54, -109, 239, -196, 197, -180, -120, 125, -266, 60, -34, -155, 152, -105, 135, -313, 359, 101, -112, 324, -460, 43, -169, -177, -37, -136, 171, -387, -228, -182, -178, -115, -212, 96, -247, -77, 141, -41, 234, -506, -63, 47, -320, -70, -23, 141, 32, -11, 141, -353, 153, 212, -268, 251, -302, 41, -243, 205, 63, -132, 158, -95, 364, -122, -159, 197, -351, 103, 45, 78, 28, -108, 329, -91, 202, 37, 111, 225, 76, 182, -88, 40, -1, 51, 164, -387, 159, 188, 20, 153, -92, 122, 21, 184, 305, -83, 230, 24, 32, -70, -300, 361, -354, 116, -10]
3586a0j24K98n41L64m9J68m4m5J04k77J24P8m01N59m67L97k06rJ08k66L62n95
3608d72K89J34M4K19n30M66k00L9o9j37M79m26l9L79m89P50l17J5j94K01J73n11
3630a96M28j72P6m3m10O14m52L26r4l51L46m76O93l08j68N86m18K81l82M8J02
3651C0k49M56j45j32J48n69O19l14K28k40J95M01n49L58j99J22l57K11M46n69
3671a09L53m21M3J45o4K36j71n0K1l7N17o62L58l77J14K01k10L7l26K64K93k34
3693g9o2N0k11J65j85O37m34J73q6rJ42n38N51l35J94K12l20J56k62K23Jo0J07
3716C0k76N16l02JJ32j95K66l32L00m2j03k8j72N3J8n0J36p1L13k86Q2j35r3K95
3740E7n4J74n1p6J70k92L11m19N9K98l09L79o21J39M87k67K31m65K38K06k56J40
$$ y = [-10, -134, 164, -377, -13, -62, 106, 62, 17, 121, -156, -32, 46, -355, 204, -263, 134, -72, -81, 27, -239, 123, -472, -183, -49, -5, 214, -316, 150, -50, -11, -80, -217, 262, -164, -203, 176, -313, 437, 120, 135, -59, 142, 315, -196, 232, 60, 136, 93, -317, 297, -155, 171, 77, -274, 72, -404, 289, -19, -187, 399, -19, 262, -120, -72, 30, -219, 237, 92, -40, 108, -461, 158, -156, 72, -168, 27, 428, -121, 237, 38, 160, -197, 14, 460, -109, 244, -177, -134, 11, -53, 183, 12, -38, -17, -54, 463, -199, 159, -218, -104, 97, -113, -76, -402, -138, 155, -79, -141, -91, -302, -137, -322, 315, -119, 54, -32, -41, 101, -437, 114, -221, -27, 185, -135, 21, -241, -18, -17, -77, 30, -246, 270, -32, -31, 101, -94, 172, -160, 140, 98, -5, -33, -205, -152, -134, -184, -48, -119, 194, -92, -10, -145, -238, 57, 3, 177, 126, 50, 220, -72, 239, -180, -121, 177, -132, 247, -374, -235, 252, -15, 216, -249, -11, 195, -61, 79]
3762G9k95J75j97M73j88l35N38o41L24J90l55K88j03J45r8l8K39n92K89omp8L48
3785A58k41k09L64l15n8N35l70K04j61j1K72m45M16l79J36Q8k89M56j36K92k60
3806D7j80L70k98L69l59l8J28k10K36j66M68l61n5R7k28J65r1P8K11k02L41o06
3828b84K16L0OM01o29N89l55J34Q1j56j8r5J52j47k36L51j70K03J65j42l1l59
3850b94K44J1J5K20n18M85k32k4R3oM9n73N89n1k66J99q5M73l56k3M9l13O96o53
3874b71J19jo8K22p3K23n81M97m0m47Q20n27K96k04r7K31j90N15m23L4k13L2N63
3897D17n53J25J89j62K60l75L03k73J03J37q6J09k51k22N98m60K70l95M61Mk76
3918g7K05l56L55J22l62L58m84M47j02R5k53K28jl41J43j09K53K4k30K28k92J5
$$ y = [79, -216, -41, -238, 235, 47, -288, 250, -391, -67, 123, -232, 56, -47, 98, 0, -38, 201, -391, -102, -108, -112, -190, 158, -83, -292, 72, -243, -301, 234, -136, 68, -93, -104, 168, -277, 139, -240, -104, -16, -305, 151, 15, 307, 47, -133, 237, -61, 308, -51, -89, 39, -171, 65, -101, 367, 6, -49, 48, -180, -15, -106, -28, 183, -19, 322, -284, -68, -38, -32, 369, -260, 329, -26, 108, 189, 33, 15, -80, 72, -75, -311, 40, -130, 73, 238, 96, 65, -294, -50, -39, -24, 196, -322, 163, -69, -93, 0, -6, 43, -530, 59, 8, -258, -59, -144, 329, -27, -50, -1, -314, 382, -271, -152, -153, -221, 1, -72, 151, -430, 67, 27, -420, 400, -127, 169, -35, -132, 99, -91, 424, 1, 35, -178, -146, 417, -136, -11, 178, 16, 276, -99, 204, -69, 34, 171, 85, 194, -57, -279, 319, -141, 129, -266, 195, 199, -77, 128, -228, 127, 249, -113, 245, -239, 208, 106, 201, -52, 176, 175, -166, -23, -132, 121, 145, -85, 143, -149, -134]
3940a34L00j81K55n19M39j66j74K62k59K58n3l11L30j64K14k13M3J68oK56m33
3961h8J93o8j52J35j50K26j7k65L71k25Q1p0K48k47J43m0j4K4p3L9P4m33L73K20
3985B85m9l20L3Q6m13M36p2J91m3k81M4p6K45K21m68K78k21L08k64M1K97k34K56
4008B80l71K09j1n2J35j07l94K64p3K69j74J17n5K4K3k25K91k82M5k01K94K20
4030B26l70K09j1k00J92O7L27k04l69J92n84N55j97K24k58NL17n16N00p5j48J33
4052A5l20M40l52J98R5m17N59l28L9j95J33K54j92K82k90K01r7j53L20l78M8k51
4074c89L72K33k21J69o3Qk13N5J51j27J99j46k36K64qJ99n3m38P91n33K06l88
4096a68K07L59k96q5j56K27j13q6L02l30K91j93j8K79l07O7J2j41R6k0j55J14
$$ y = [-134, 166, -15, 240, -279, 160, -6, -180, 82, -177, 81, 28, -283, 47, -117, 97, -116, -73, 95, 89, 345, -88, 105, 37, -115, 20, -130, 96, 79, -186, 185, -40, 41, -29, 219, -28, 115, 75, 61, 85, 12, 51, 125, -308, 65, 285, 236, -84, -51, 35, -378, 58, -14, 177, 134, -147, -103, -179, 66, 287, -181, 97, -124, 184, -80, -39, 258, 24, 280, -91, 118, 107, 55, 190, 83, -311, -47, -120, 149, -25, 92, 37, 61, 84, -141, 150, -132, -87, -288, 6, 226, -144, 65, 54, -146, 46, 113, 440, 236, -133, 59, -525, 30, -167, 57, -201, -196, 121, -395, 105, 30, -118, 15, -305, 135, -217, -19, 76, -341, 218, -110, -71, -266, -133, 121, -71, 211, -79, 122, 25, -128, 192, -186, -138, -389, -17, 216, -5, 164, 101, 109, -104, -49, 102, -25, 174, 28, -208, 56, 48, 247, 194, -244, 547, 14, 220, -168, 39, 398, 102, 17, -139, 88, -25, -111, 191, -139, 152, -41, -59, 220, -87, -20, -8, -149, -53, -73, -228, -114]
4118a14K69n7k44N9l00M52k36l0O90p99N7J79J0K61m06M46m99M02p5m9L3j97M20
4141B72n47M40j17j75M28l74J25o7K66k92j62M85m54L89k00j36L98k81k14L65
4161A49l61K88m3J05l81L67j20j26K99k97J13J15m55N62J32k76R4l40J93J4K38
4182B70k96j54N13o08J09K39l4q1NK88l57j02L04k0J56n00K90L6J47O2l65M42
4204C44m36J21j46L27m04j4K33J91m5j48j63J44q8N2L30l11o9J4K71l77J55j08
4226a27j66O07k93j94Q0n0J61j97L39l22k9J63l59O31m31P2K76l48O00o31M32
4247B14l38jJ78o0J88l12jL35j8j74j78K33Q8k48J27k52J28K53j81L19l41O2O1
4270H2O0J36k45J49j28q6N9j99J21L50m63J55k68M48Q3j16j58j86K35j49R7P9
$$ y = [-114, 155, 98, -146, -87, -387, 65, -171, -201, 489, -310, -253, -74, -64, 197, -209, 237, -262, 140, 65, 16, 49, -148, 272, -275, 165, 48, -127, 301, -73, 52, -15, 251, -41, -203, 282, -172, 217, 17, -119, 279, -2, -216, 149, -212, 76, 33, 138, -243, 124, 4, -122, 177, -120, -7, 108, -347, 215, 347, 71, 165, -175, 18, 32, 270, -26, -180, 333, -275, -166, 73, 39, -42, -37, 251, -106, -208, 96, 76, 232, -268, 22, 58, 205, 267, -98, 344, -92, 29, -117, 210, -194, -208, 25, 216, 171, 23, -140, 4, -84, -32, 298, -13, -82, -68, 203, -174, -19, -127, -293, 314, 21, -173, -93, -143, 18, -179, 160, -162, -191, -28, -387, 244, -187, -115, 161, -187, 413, -218, 214, -124, -125, 53, -7, 181, -131, -132, 203, 185, 11, -167, 66, 154, -94, 33, -219, -91, 162, -19, 300, -41, 21, 82, 142, 278, 33, 182, 54, -32, 27, -172, -51, 299, -164, -9, -277, 171, 254, 138, -20, -206, 29, -120, -23, 56]
4292E6J52k11p6K63k18J20j05K47j69k4r6j40L17m59n0J33L10j3m16K86J32l04
4314b65N01j44j7J47k65K12o06O44l52J09ml90N27j60j21J43j02L11j15O5o5j13
4336f0K00k24jk6J39J90k51J45j70J33P5k15J97n5k9l30K88j47K46K50l89m8N01
4359D19n79M43k24J9N7j49M4j83K54k97K75p9N3Q8k64r6K81j55L49k90j08J65
4381B3j32M5j85M11l22J13N9q4J14o2r5L26n20N63n19M65k77j45L76l31N33l71
4403a5l9K01l35L48j84J44m9k21L11k98K99j0j81O4j97J32q6q8pM86j40m55K63
4426e7l0j63O01n88N79n82K38k44J21J19k09L83n4m9j17o2L17l63K16J19n69N69
4448A75l49J54J5L6q5P3k13J76l37N32k14K82j69k15L26j44Q8k35L03m16J67K86
$$ y = [56, 208, -3, -79, 184, -34, 86, -19, 228, 59, 35, -61, -201, 116, -343, -393, -260, 50, 37, -379, -93, 39, -265, 236, 92, 75, 222, -43, 169, -437, 207, -145, -36, -40, -430, 97, -63, -184, -41, -143, 168, 53, 118, 53, -60, 140, -84, -85, -111, 28, 218, -33, 112, -58, 75, 150, -65, 132, 77, 48, -282, 6, -141, 105, 355, -34, -82, 419, -160, 283, 59, 78, 135, -14, 30, -153, 101, -196, 79, 0, 53, 141, -123, -219, 62, -93, 256, -34, -142, 23, -109, -64, -249, 162, -160, -47, 12, -72, 42, -20, -115, 211, -309, 254, -265, 200, -77, -222, 154, -177, 356, -15, -54, 147, -188, 160, -24, 120, 71, -150, 161, -137, 162, 152, -29, 35, -162, -30, -116, -204, -211, 275, 135, -320, -57, -87, -250, 351, -237, 342, -240, -2, -246, -125, -6, -215, 168, 114, 65, -52, -114, 203, -160, 56, 175, -394, 175, -174, -20, -5, 31, -54, 19, -194, -18, -355, 177, -37, 245, 76, -139, 187, 43, 131, -104, 199, -217, -50, 236]
4470B36k20K52n89L88P9l42N56k30j48J75m16K42N7j79j14K67K14m65L95J56j26
4491A88P7l53R1l04L67j55j47L15l29L54k3K22ok30L44l96K25p3k88J6j21K18
4513ho7p9L10l34mK01R2j4q8J36l02J15O0Q4k9k06K40K1j94L41k39K40k85L12
4537C03j04l23Q2PM67o49K78J01l66O55n11j09L65k56J46k86K78J18l67M55k55
4558B9K17m03K72p3M5j71J14j29o3K52M1o6j67K5P8K8k98M77l06J31%mj1l2K97
4583B83l89j78K20p7L61j31m03K15j77L03j31K35J62m10kO7K31o3l76M01l3J7
4605A25j65M5j56p9J64q9J74O4k64J65k03J95J54K3j99L7K08l59L08r2j35k17
4627b96K52Q0lQ5j88r3R9j01J08r7n0j1N5K30K60m09K81k96m1l6L42l04L14j33
$$ y = [236, 16, 268, -321, 67, 146, -196, 360, 130, -18, 157, -259, -17, 40, -139, -253, 14, 228, -237, 158, 314, 188, 265, -88, 3, -301, 66, -89, -236, 79, -250, 104, 81, 303, 297, 67, 411, 15, 240, 167, -121, -105, -226, -8, -75, -154, 156, -178, -182, 19, 111, 97, 9, 145, -157, -42, 18, 102, 73, -133, 107, 128, -66, 275, 36, 276, -9, 303, 199, -124, -42, -35, 432, -217, 61, 162, -204, 451, -60, -169, 196, -60, 86, -200, 78, 196, -171, 284, 29, 246, -157, 115, 42, 87, -84, 30, -99, -162, 90, 131, 65, -102, -77, 1, 29, -269, 208, -98, 33, 33, 29, 18, -14, 283, -106, -284, -64, -141, 220, 89, -314, -99, -276, 27, -104, 131, 293, -117, -119, -52, 179, 116, -260, 141, 108, 125, -40, 5, -151, -230, -66, -155, 19, 83, -181, -16, -219, -24, 130, 153, -46, -9, 199, -160, 148, 56, -79, -296, -44, 36, 33, 118, -70, -163, -64, -165, -57, -154, -204, -215, -160, 70, 330, -79, 202, -94, -135, -171, 171, -133, 181, 48]
4651D8R6R3n9k82J43j76L79l30o0M6j0o3JL42j52j10J93j18J60n2q9k5J1J11k8
4676F9r3J25m60L62j15O5K36l41K69k23K0J5j84O90m83J29K5J09J88k99pk81K58
4699G4j27R8J81m11L8J19J76k62k08N05J2j95m0jK32k74L02l32J84k64q0O60n91
4722b04M37j74J69o0k15J24r2j34K65k18L53j56J04j6k88L51l23jj54L11J85l43
4744g9J91j76k0K00j66J67k36K09q5q9RJ37K7m02L45L24o00K11j72L46k47J82
4766G6k7j49J60j82M1J28k19Q3n4J27j09j6P8J49k0j67J97j02j21J02N5M0j42
4789g2J5k91M83o9N7k75O1n0L2l7K19o1j42L69p5k26Q3l1J77k92NL57l60K80k60
4814a03K23l7J9q3o9L9N2l2r1P4K66L6j01l77L24K58l23k23N4L8K31j97J06O7
$$ y = [48, 144, 237, 178, -104, 39, -137, 242, -88, -148, -102, -112, -175, -174, 168, 16, -94, 99, -19, 141, 89, 0, -25, -14, 97, 69, -24, 101, -359, 3, -112, -47, 189, -152, 117, -106, -86, -71, -255, 435, -48, 81, 106, 215, 403, 104, 97, -184, 74, -53, 45, 226, -185, -147, -28, 148, -114, -322, 183, 195, 0, -40, -41, 191, -83, 219, -113, 71, -193, -273, 387, -204, 233, 59, 228, 168, -47, 77, -15, -149, 116, -102, 251, 95, 199, 183, -105, 246, -77, -78, -232, 79, 264, -79, 112, -64, -84, 116, -50, 117, -119, 90, 5, -84, -75, 62, 89, -313, 32, 356, -244, -33, -205, 141, -106, 76, 49, -100, 60, -122, -81, 47, -172, -89, -143, -16, -125, -141, -63, 86, 66, -101, 96, -6, -127, -25, 30, 70, -72, -57, -348, 135, 66, 123, -152, -91, -141, -109, -146, 73, 12, -130, 239, 164, -62, 21, -10, 167, -125, -120, 237, -123, 157, -103, 120, 83, 102, 19, -50, -11, 41, 9, -82, -8, 258, 294, 193, -184, 140, 398, 75, -148, -94, -56, 175, -22, 84, 151]
4838A51j74j24N0J51l29r2N28L7k16l9M8j44R2J04k21K13l0L7k43kM31m00O6J44
4862C8j95J46j36O4j21K53K63o26L78j46K06J60o64K90O3L9O5q6J10k75L77l14
4884a11p3k3K9O9K2M6n7J32K59m85L69k64K56k40K33o1j54K62l5k73J49j74O8
4907e6j32L39l09J01L77n14K37m1J8J25k44K19j50j54K64j80K03k08j3K76k10
4928e2Q1k52p7M66p9j7L9k48J42r7L94m69J58J65Nl67P0L82n71L56q4J77k71j23
4952b72J65J54l9Q5k67o5K57k2q6N2Kn0o7OL89J10n95K60l35K20l6J23J64j83
4976c0mj28R7J50j87K80k72R9j2n7K37j5r3j05n5K29j02J2J13j9l7o0o5j5K73
5001B34N6l55M4j23J99j42M5Q0m4J54j65j17N4R0k14K01L82m03K5Q4j66K46j98
$$ y = [151, -23, -147, -97, 54, -275, -367, 161, 198, -18, -57, -9, -153, -61, 43, -178, 35, 5, 42, -201, -203, 228, -172, -106, 38, -157, -11, -147, -83, -204, 49, 312, -314, 64, -82, 124, 284, -380, -90, -27, 12, 77, -9, 101, -174, 203, -111, -184, -207, -178, -109, -87, -41, -98, 34, 293, -192, 177, -87, 169, -71, 162, 101, -53, 209, 174, -99, 50, -124, -56, -188, 151, -158, -57, 320, -194, 43, 2, 20, 145, -99, 120, -30, -184, 80, -100, 103, -105, -118, 158, -52, 29, -223, -300, 166, 87, 70, 109, -139, 3, -94, 300, -169, -11, 154, 159, -208, -138, 244, -327, 29, -55, 122, -149, -272, -107, 47, 8, 93, -174, -239, 18, -4, -90, -38, -36, -86, -153, -147, 242, 352, -243, 17, -318, -98, -134, -11, 153, -30, -34, -162, -65, 85, -102, 178, -94, 5, -7, -64, 173, 158, 65, -40, -95, 134, 32, 44, 157, 138, 101, 41, -24, -39, 234, 290, -65, -21, -144, 55, -87, -42, 38, -6, 148, -17, -134, -80, 10, -204, -3, 379, -24, 1, 85, -81, 165, -33]
5024c3L9K5k72K80N1R0M1k10K12l58R9j85Q5L18l26K79j84l3j6M3J87J2k64J07
5048a3K19l80K38J16k65L0Q6j32K16J24n54M38k06j68M45n07J36R6J42j60K46
5069A47j03j11P1k04K18jj83M22m53K53k35R6K34k67J16l35K27qJ81l45N2R8J12
5092a8J17Q3l60K05J61k98J81k5O9k81K09k04J6q5K04J70m99L85R2K8L83n72q1
5115a20o7L72m7l38J42L1l7K69k50P8j67N1J11r7qJ81k09P4J87j47l60K42K14
5138A05R5j39k7o1k9R3j94K2K03n8J56l49J36o7J51L1M7r6J59j92K24l78K14j81
5162a35L19k47k0K09Rj01k81KL24Pj69L24k17J12l73J08K5K42q3j53J82j99K84
5185A69r2j29J18R0j52k9K31m8l73M24k22k44J63J30j45Q3m2j6K46l61J01J87
$$ y = [-33, 6, 31, -241, 39, 90, 180, 221, 11, 223, -135, -36, -221, -136, 182, -144, 135, -49, -82, -98, -55, 132, 144, -120, -13, 206, -174, 64, 180, -85, -55, 31, -101, 115, 239, -315, 123, -83, -251, 194, -313, -177, -81, 61, -99, 147, 44, -67, 4, -200, 18, 17, -166, 256, -197, 56, -179, -83, 151, -116, 0, -335, -108, -116, 65, -280, -228, -130, -18, 99, 182, -178, 27, 188, -110, 71, 46, 115, -166, 43, -161, -145, -230, -26, 144, -355, 30, 122, 150, 533, -39, -120, -187, 185, 138, -200, -58, -27, -64, 205, -45, 33, -134, -83, 28, -69, -77, 104, -105, -31, 156, 9, -351, -109, 105, 200, 61, 34, -27, -56, 37, -157, -135, 68, 10, 166, -183, -47, -114, 37, 68, 115, 19, 178, -14, 210, -168, 46, -135, 184, -63, -83, 126, 135, 34, -247, -245, 79, 86, -83, 241, 24, 136, -237, -129, -104, 138, 55, -98, 84, -115, 169, 77, -52, 66, 156, 4, -25, 206, 158, -215, 209, -13, -257, -94, 36, -109, -26, -68, -84, 162, -199, -98, 89]
5207H9p3J49j81R7K1j18j01pK93l45L11J45n76L11Q8l0m6m0o5j28L77k32r8J22
5231c7j05N8j1J8K44m20J46p0J32q5R5R2j62L49l05q5J34k08K23J84l14J42j56
5254a41J98k15O8K18m01L34L10l47j1k51L06m01J87K7K94O7m69J86J1K57k90L5
5276b8ML2j48K44j93K39k67p6k6K01R5j41P1j42J87J0k46J97j3j03k0p5J92k03
5300b09K42l7n3p9j07J88p0k07K68m1l0k0l0P2L59k78L43j81l92J92R5j00M5J97
5324A67k03P5j81K01k03K28j95K72Q6m00J97k67k23L85j67J55k3o4J89k40J38
5345g3j6J53pQ7k60k1L10o5K3j91j28Oo2L72k18O4J62j03k86K71L3j86J07L14
5369B86o33M37j36J06J55k23j12L2R1L7j0K9J10Kl21q9K07j23N4M0Q3L1k78L85
$$ y = [89, 16, 165, -16, 81, 102, -16, -117, -124, 169, -176, 135, 280, -296, 15, 103, 73, 27, -13, -78, -206, 171, -61, -159, -37, -142, -84, -95, -77, 167, -253, -107, -177, -45, -130, -35, 57, -105, 244, -61, -146, -12, -220, 3, 187, -127, 15, -141, 57, -158, -90, 128, -273, 61, 371, 24, 13, -238, 68, -333, -146, -119, 175, 242, -227, -41, -30, 227, -63, -28, -24, 8, -140, 104, -89, 150, -117, -193, -219, -18, 77, -64, 7, -135, 52, 62, -184, 13, 0, -103, -123, -198, -6, -209, 33, -4, -57, -136, -243, -55, -125, -332, -64, -105, -135, -155, -185, -113, 246, -32, 311, 130, -262, -70, 25, -75, -30, 167, -36, 39, -142, 59, -144, 84, -111, 161, 247, -153, 44, -223, -446, -61, -228, -73, -96, -160, 29, -211, -73, -89, 64, 57, 144, -116, -137, 173, 108, 131, -60, -188, -182, -244, 128, -90, -26, 136, 33, -253, 18, 51, -135, -28, 286, -347, 90, -46, 60, 215, -8, -120, -88, 3, 40, 30, 59, 169, 171, -150, -239, -32, -155, -101, -61, 22, 53, -225, 160]
5393A60m1j85M12l24j35N9k32j3N5L02j53q2N9K55o9QK6k53L27j64l0J24j61K47
5417A92L5m94J63J31j73P6J77J80k72N2o3k01K31q7R5j03P9k70L43k74J92K70
5439B79r8k86J05q9L70k85n3N3J75R2m99L96k09p2K05j17K09j56M3j04K3R7L2
5462A11L4k7j84O2j81J29J81j01N4j53O9m7l13N11j08j17Q4M73o43O6J02k7q1
$$ y = [160, 119, -66, 346, 22, -113, -54, -286, -299, -244, 58, -95, -177, -118, 137, 68, 76, 102, -151, 176, 12, -18, 106, -55, 192, 227, -267, -104, 27, -146, -70, 107, 287, 15, 67, 4, -197, 34, -53, 42, -61, 18, -252, 91, -183, 9, 279, 181, -105, 0, -89, 281, -4, -57, -4, 171, 263, -236, 160, -49, -121, 84, -33, 176, 20, 63, -41, -18, 79, 111, 145, 118, -66, -4, -185, -56, 125, 24, 78, -75, -6, -53, -366, 145, 37, -80, 4, 477, -166, -100, 2, -25, -106]
$$ [...]
8191A08
##END NTUPLES=NMR FID
##END=
