##TITLE=1H_36-2021
 CDCl3, 8 sc, 
 26.04.2021
##JCAMPDX= 6.0         $$ Bruker NMR JCAMP-DX V2.0
##DATA TYPE= NMR FID
##DATA CLASS= NTUPLES
##ORIGIN= UXNMR, Bruker Analytische Messtechnik GmbH
##OWNER= root
$$ XWIN-NMR		Version 3.5
$$ Mon Apr 26 14:04:31 2021 Russian Standard Time (UT+4h)  she@DPX200
##.OBSERVE FREQUENCY= 200.131506
##.OBSERVE NUCLEUS= ^1H
##.DELAY= (6, 6)
##.ACQUISITION MODE= SIMULTANEOUS
##.ACQUISITION SCHEME= undefined
##.AVERAGES= 8
##.DIGITISER RES= 18
##SPECTROMETER/DATA SYSTEM= spect
##.PULSE SEQUENCE= zg30
##.SOLVENT NAME= CDCl3
##.SHIFT REFERENCE= (INTERNAL, CDCl3, 0, 15.7039)
##AUDIT TRAIL= $$ (NUMBER, WHEN, WHO, WHERE, WHAT)
$$ ##TITLE= Audit trail, XWIN-NMR		Version 3.5
$$ ##JCAMPDX= 5.01
$$ ##ORIGIN= Bruker BioSpin GmbH
$$ ##OWNER= she
$$ F:/spectra/data/she/nmr/H-F/1/audita.txt
$$ ##AUDIT TRAIL=  $$ (NUMBER, WHEN, WHO, WHERE, WHAT)
(   1,<2021-04-26 14:03:41.53 +0400>,<she>,<DPX200>,
      <created by zg, POWCHK disabled, PULCHK disabled
       configuration hash MD5:
       00 E9 B6 7A A2 85 ED C7 34 08 36 98 17 FE 4E 26
       data hash MD5: 16K
       8F AE 12 69 D4 1E DE 38 E5 20 B6 CE 54 08 2B B5>)
$$ ##END=
$$ 
$$ hash MD5
$$ 91 E3 93 35 3A A5 5A 9B 5E 55 74 FC 5E 49 15 AC
##$RELAX= 
##$RELAX= 
##$RELAX= 
##$RELAX= 
##$RELAX= 
##$RELAX= 
$$ Bruker specific parameters
$$ --------------------------
##$DU= <F:/spectra>
##$EXPNO= 1
##$NAME= <H-F>
##$PROCNO= 1
##$TYPE= <nmr>
##$USER= <she>
##$AMP= (0..31)
100 100 100 100 100 100 100 100 100 100 100 100 100 100 100 100 100 100 
100 100 100 100 100 100 100 100 100 100 100 100 100 100 
##$AQSEQ= 0
##$AQ_mod= 1
##$AUNM= <au_zg>
##$AUTOPOS= <>
##$BF1= 200.13
##$BF2= 200.13
##$BF3= 200.13
##$BF4= 200.13
##$BF5= 200.13
##$BF6= 200.13
##$BF7= 200.13
##$BF8= 200.13
##$BYTORDA= 1
##$CFDGTYP= 0
##$CFRGTYP= 5
##$CHEMSTR= <none>
##$CNST= (0..31)
1 1 145 1 1 1 1 1 1 1 1 1 1 1 1 1 1 1 1 1 1 1 1 1 1 1 1 1 1 1 1 1 
##$CPDPRG= <>
##$CPDPRG1= <>
##$CPDPRG2= <>
##$CPDPRG3= <>
##$CPDPRG4= <mlev>
##$CPDPRG5= <mlev>
##$CPDPRG6= <mlev>
##$CPDPRG7= <mlev>
##$CPDPRG8= <mlev>
##$CPDPRGB= <>
##$CPDPRGT= <>
##$D= (0..31)
0 1.2 0 0 0 0 0 0 0 0.06 0 0.03 0 0 0 0 0.0002 0 0 0 0 0 0 0 0 0 0 0 0 
0 0 0 
##$DATE= 1619431420
##$DBL= (0..7)
120 120 120 120 120 120 120 120 
##$DBP= (0..7)
150 150 150 150 150 150 150 150 
##$DBP07= 0
##$DBPNAM0= <>
##$DBPNAM1= <>
##$DBPNAM2= <>
##$DBPNAM3= <>
##$DBPNAM4= <>
##$DBPNAM5= <>
##$DBPNAM6= <>
##$DBPNAM7= <>
##$DBPOAL= (0..7)
0.5 0.5 0.5 0.5 0.5 0.5 0.5 0.5 
##$DBPOFFS= (0..7)
0 0 0 0 0 0 0 0 
##$DE= 6
##$DECBNUC= <off>
##$DECIM= 32
##$DECNUC= <off>
##$DECSTAT= 4
##$DIGMOD= 1
##$DIGTYP= 9
##$DL= (0..7)
0 120 120 120 120 120 120 120 
##$DP= (0..7)
150 150 150 150 150 150 150 150 
##$DP07= 0
##$DPNAME0= <>
##$DPNAME1= <>
##$DPNAME2= <>
##$DPNAME3= <>
##$DPNAME4= <>
##$DPNAME5= <>
##$DPNAME6= <>
##$DPNAME7= <>
##$DPOAL= (0..7)
0.5 0.5 0.5 0.5 0.5 0.5 0.5 0.5 
##$DPOFFS= (0..7)
0 0 0 0 0 0 0 0 
##$DQDMODE= 0
##$DR= 18
##$DS= 0
##$DSLIST= <SSSSSSSSSSSSSSS>
$$ [...]
##$SUBNAM2= <"">
##$SUBNAM3= <"">
##$SUBNAM4= <"">
##$SUBNAM5= <"">
##$SUBNAM6= <"">
##$SUBNAM7= <"">
##$SUBNAM8= <"">
##$SUBNAM9= <"">
##$SW= 16.9725357007746
##$SWIBOX= (0..15)
0 0 2 0 0 0 0 0 0 0 0 0 0 0 0 0 
##$SW_h= 3396.73913043478
##$TD= 16384
##$TD0= 1
##$TE= 0
##$TE2= 300
##$TE3= 300
##$TEG= 300
##$TL= (0..7)
0 120 120 120 120 120 120 120 
##$TP= (0..7)
150 150 150 150 150 150 150 150 
##$TP07= 0
##$TPNAME0= <>
##$TPNAME1= <>
##$TPNAME2= <>
##$TPNAME3= <>
##$TPNAME4= <>
##$TPNAME5= <>
##$TPNAME6= <>
##$TPNAME7= <>
##$TPOAL= (0..7)
0.5 0.5 0.5 0.5 0.5 0.5 0.5 0.5 
##$TPOFFS= (0..7)
0 0 0 0 0 0 0 0 
##$TUNHIN= 0
##$TUNHOUT= 0
##$TUNXOUT= 0
##$USERA1= <user>
##$USERA2= <user>
##$USERA3= <user>
##$USERA4= <user>
##$USERA5= <user>
##$V9= 5
##$VALIST= <valist>
##$VCLIST= <CCCCCCCCCCCCCCC>
##$VD= 0
##$VDLIST= <DDDDDDDDDDDDDDD>
##$VPLIST= <PPPPPPPPPPPPPPP>
##$VTLIST= <TTTTTTTTTTTTTTT>
##$WBST= 1024
##$WBSW= 4
##$XGAIN= (0..3)
0 0 0 0 
##$XL= 0
##$YL= 0
##$YMAX_a= 141248
##$YMIN_a= -72185
##$ZGOPTNS= <>
##$ZL1= 120
##$ZL2= 120
##$ZL3= 120
##$ZL4= 120
##$ABSF1= 10
##$ABSF2= 0
##$ABSG= 5
##$ABSL= 3
##$ALPHA= 0
##$AQORDER= 0
##$ASSFAC= 0
##$ASSFACI= 0
##$ASSFACX= 0
##$ASSWID= 0
##$AUNMP= <proc_1d>
##$AZFE= 0.1
##$AZFW= 0.1
##$BCFW= 1
##$BC_mod= 2
##$BYTORDP= 1
##$COROFFS= 0
##$CY= 11.3945322036743
##$DATMOD= 1
##$DC= 2
##$DFILT= <>
##$DTYPP= 0
##$F1P= 15.9154993809931
##$F2P= -4.1035820241983
##$FCOR= 0.5
##$FTSIZE= 0
##$FT_mod= 4
##$GAMMA= 1
##$GB= 0.15
##$INTBC= 1
##$INTSCL= 1
##$ISEN= 128
##$LB= 0.24
##$LEV0= 0
##$LPBIN= 0
##$MAXI= 10000
##$MC2= 0
##$MEAN= 0
##$ME_mod= 0
##$MI= 1.114404
##$NCOEF= 0
##$NC_proc= 0
##$NLEV= 6
##$NOISF1= 3.799351
##$NOISF2= 2.8
##$NSP= 1
##$NTH_PI= 0
##$NZP= 0
##$OFFSET= 15.70392
##$PC= 1
##$PHC0= -11119.87
##$PHC1= 12.20095
##$PH_mod= 1
##$PKNL= yes
##$PPARMOD= 0
##$PSCAL= 0
##$PSIGN= 0
##$REVERSE= no
##$SF= 200.130013532006
##$SI= 16384
##$SIGF1= 3
##$SIGF2= 2
##$SINO= 400
##$SIOLD= 16384
##$SREGLST= <1H.CDCl3>
##$SSB= 0
##$STSI= 0
##$STSR= 0
##$SW_p= 3612.71676300578
##$SYMM= 0
##$S_DEV= 0
##$TDeff= 0
##$TDoff= 0
##$TI= <>
##$TILT= no
##$TM1= 0
##$TM2= 0
##$TOPLEV= 0
##$USERP1= <user>
##$USERP2= <user>
##$USERP3= <user>
##$USERP4= <user>
##$USERP5= <user>
##$WDW= 1
##$XDIM= 8192
##$YMAX_p= 0
##$YMIN_p= 0
$$ End of Bruker specific parameters
$$ ---------------------------------
##NTUPLES= NMR FID
##VAR_NAME=  TIME,          FID/REAL,        FID/IMAG
##SYMBOL=    X,             R,               I
##VAR_TYPE=  INDEPENDENT,   DEPENDENT,       DEPENDENT
##VAR_FORM=  AFFN,          ASDF,            ASDF
##VAR_DIM=   8192,          8192,            8192
##UNITS=     SECONDS,       ARBITRARY UNITS, ARBITRARY UNITS
##FACTOR=    0.0002944,     1,               1
##FIRST=     0,             0,               0
##LAST=      2.4114304,     0,               0
##MIN=       0,             -72185,          0
##MAX=       2.4114304,     141248,          0
$$ Real data points
##PAGE= N=1
##DATA TABLE= (X++(R..R)), XYDATA
0@%%%%%%%%%%%%%%qJ6j6J6j6J6k4L2l7M5m8N6p2Q0q8J04j20J36j55J79k00K24
36A20k54K83l17L54l93M36m82N37n94O54p25Q01q82R72j070J177j298J432j581
55h30J752j945K164k420K721l082L526m082M801n780P195r421J3447k2976Q6384
70G1454O9620j37045O7101P0118p2737j6261O9184n4909k4242P4178l9168q6320
82i027Q8173L2017j21041R584R5643o8444n3863O9675j1616n8273N2273M696p5564
95d5767M4870N9631r1877j8580J01194l2203p8473O4174K7991o8490J9998L9085
107B1553n8359L418O3676n5036m5345Q5414P31q8237M2239N9007o4132j0186O1834
120A6577k8410k6412N9693j1222n2478O0427L3055p6330J5397P5855m5114l8491
$$ y = [0, 0, 0, 0, 0, 0, 0, 0, 0, 0, 0, 0, 0, 0, 0, -8, 8, -8, 8, -8, 8, -16, 16, -21, 24, -24, 32, -40, 40, -48, 56, -64, 72, -83, 96, -104, 120, -134, 149, -168, 186, -207, 229, -253, 284, -310, 344, -381, 420, -462, 510, -560, 617, -681, 751, -830, 922, -1023, 1141, -1279, 1442, -1640, 1886, -2196, 2605, -3175, 4020, -5401, 8046, -14930, 71454, 141074, 4029, 71130, 141248, 68511, 52250, 121434, 66525, 42283, 116461, 77293, -9027, 79146, 111163, -9878, -294, 95349, 26905, -26958, 42717, 31101, -27172, 25101, 29797, -45767, -897, 58734, -33143, -51723, 49471, 17268, -61205, 2969, 30960, -37530, -17532, 21553, -36806, -33388, 30288, -24748, -70093, 15321, 16052, -72185, -29946, 29061, -35071, -45257, 16577, -11833, -38245, 21448, 10226, -42252, 18175, 51230, -25100, -9703, 66152, 21038, -17453]
132a7453O4209k10m9780L7573J8218n4169K1640M4486n8562j8145O8821k3743
144C2885n9730M8189K2739n9085J1761L8964m2861r438M9307k9866l7581N5282
156B0566M832o3020K8294M2813n2863j1042N1271k5865l3370M4627k281m9119
168d5157L3168K7233n6051L449N2633l6055l0355N2375k869m5551L4792K4191
180A1803m6259J1837M4953l5702j6745N3680j0403m0428M1873J8737m7546J6437
192B237L9270l8285j2266M7274j7248l6693L9149R192m6631J8452L0598m2300
204g251n823M2947k5633l0457M2087K686m5493K3000K8687m0464k204L9712k5025
217c231k1364M1096o639l8515L2430K0419m5549N472M1321k8950k2363L9270n504
$$ y = [-17453, 46756, 46546, -3234, 34339, 52557, -1612, 20028, 64514, 5952, -12193, 56628, 32885, -26845, 21344, 44083, -15002, -3241, 35723, -7138, -16576, 32731, 2865, -34716, 20566, 25398, -37622, -9328, 33485, -19378, -30420, 20851, -5014, -38384, 6243, 3962, -45157, -11989, 15244, -40807, -37358, 15275, -20780, -51135, 1240, -1629, -47180, -12388, 11803, -34456, -22619, 22334, -13368, -30113, 23567, 13164, -27264, 14609, 33346, -14200, 2237, 41507, 3222, -9044, 38230, 20982, -15711, 23438, 32630, -14001, 4451, 35049, -7251, -13074, 29873, 4240, -26217, 15870, 18556, -26937, -3937, 24750, -15714, -17918, 21794, -3231, -24595, 16501, 9862, -28653, 3777, 24196, -21353, -15881, 25440, -3510, -25873, 13397, 7893]
230G893l3124K8413J0814l8912J6077L1183l7393j1048M5077j2751l5886L1904
242B247J5283l5737J1539K5367k8835j237L4400k2248k2569L9728L120m1522J8691
255a773L0092l2298q158L1996j5085j7471K8792n884k9572K7585J5689m0320M129
268a2278L8602k3441k3913L2537K111k7949J8247J0704k8090J2251K4168l1399
280h450r161L9700j0516l5020K6316J7676l2105K905K3221k0756m998K5675j7389
293b902j9020L2717K592l7847J5713K9282k8227j1568K9486p387j7871K1410r62
306E416k2957K1178J3653l3244L640L3984j9680k3599K8755N246k6589J1539J2460
319I802k2106O346J9208k4368q346L2928r470l0549K3543J7014k9196Q71K3369
$$ y = [7893, -25231, 3182, 13996, -24916, -8839, 22344, -15049, -26097, 18980, 6229, -29657, 2247, 17530, -18207, -6668, 18699, -10136, -11373, 23027, 779, -21790, 17938, 21058, -20464, -1773, 28319, -3979, -12137, 19859, 4774, -12697, 16095, 10211, -19361, 8224, 23913, -16407, -12278, 26324, 2883, -21030, 11507, 13618, -14331, 3916, 14620, -13470, -1219, 22949, -8450, -17611, 22089, 11573, -23447, 2869, 20545, -11560, -8655, 14566, -6190, -11188, 14487, -2902, -21922, 10795, 13387, -24460, -8747, 20535, -7692, -19260, 10226, 2839, -15032, 6378, 5416, -17541, 3637, 17290, -15954, -12314, 21670, 1990, -21609, 7146, 12392, -14197, -2658, 9802, -12304, -5958, 13250, -11118, -19464, 13464, 3994, -26555, -3012, 14002, -15194, -14323, 9046]
332I046j5431p089K1863j1027j5560K6629K774l0820J4533K5361k5394j0270K7586
345A2201o057j8337J7743K024k0078J4588J1342k6656K665K7179j7966j9544K5383
358D487L758k4636R929J2928j8613K284J7040j7613p573K5263p292k3690J9589
371d139J3253k5367J098K1114j3641q965J8715o627j4684J9049L463k3929J0832
384i828J9588k1043p671K4132n729j6670J6186M823j7736J0280J2387j9440O83
397a0038K2278j2719j4590K1482K833k0613R803J2916j7007l48J6893j2425r226
410a0761J9537l555j8871J4239J0191k0627J644J7680j2761r033J7588l823j5369
423a3921J3985O071j9239N807J5614j5931o271J9011o183j4693J4747M467j8002
$$ y = [9046, -6385, -13474, 8389, -2638, -18198, 8431, 11205, -19615, -5082, 20279, -5115, -15385, 12201, 6144, -12193, 5550, 7574, -12504, 2084, 13426, -13230, -10565, 16614, -1352, -20896, 4487, 8245, -16391, -6462, 6466, -12147, -9863, 7177, -10436, -18009, 7254, -38, -23728, -4139, 9114, -16253, -15155, 5959, -7682, -16647, 2068, -4559, -19243, -194, 3269, -20660, -9828, 9760, -11283, -18954, 5178, -551, -17221, -1035, 3788, -13948, -3668, 8719, -10721, -10038, 12240, -479, -15069, 6413, 9246, -11367, -1564, 11352, -5655, -6003, 10890, -1535, -10761, 8776, 5221, -13650, 589, 10780, -9847, -8203, 9477, -3284, -12317, 5271, 1448, -13921, 64, 6135, -13104, -7297, 8317, -7614, -13885, 5126, -1057, -15750, -1003, 3464, -14538]
436a4538O875J3206j5944l420J8103q314j2684J6629J811j7114R975J1290j6275
449a0400j18J7875r524j0650J7298J026j5915J0917R418j5539K740J5030j1814
462C44o592J7435l152j5394J2430Q296j6779K057J4103j1614n622J4686n754j1706
476g262J3688K817j7227O457J3207j4701n452J6047n055j1873J1905J542j3612
489i519Q529P865j5564O85J5863r739j1635J5730K086j5327O940Q655j2102J470
503f063J1391j0572m450J5677m100j3979J1975Q755j5351R41J3309q110n243J1695
517E875l780q602J1916J826j4397O807J2191j2932n179J4754k934j1102R288K767
531F498j0535O158O216j2418J345J3301q929r993J3828K523j4235M633Q945r773
$$ y = [-14538, -7663, 5543, -10401, -13821, 4282, -4032, -16716, -87, 1724, -15390, -5415, 5875, -10400, -10518, 7357, -2167, -12817, 4481, 5507, -10408, 509, 9927, -5612, -2872, 12158, 344, -6248, 11187, 8035, -7359, 5071, 13367, -3412, -1355, 12748, 1134, -4488, 10198, 4444, -7262, 6426, 9243, -7984, -1527, 11680, -3021, -8473, 7574, 2519, -9354, 2551, 4093, -9519, -990, 6875, -8689, -8004, 7859, -1880, -13515, 2215, 4301, -11026, -4086, 4569, -7533, -6063, 5328, -5244, -9694, 5983, 1883, -12096, -121, 8634, -6717, -5776, 7533, -577, -5820, 5875, 2095, -6507, 5409, 7235, -7162, -355, 11836, -1096, -6275, 8479, 5545, -5557, 3731, 6498, -4037, 2121, 8337, -4081, -2736, 10565, 1636, -8357, 5471, 7994, -6241, -1608, 7337, -2436]
545b436p44Q954q084l851J2225m432j1884J0296P074j4217m10J2599o627o587
559h124R671k216p621R074J275j1808O013J0267j1546m787J3520j836j0880P804
573a194M330r101L806N964r412O45J1084p436q122J2218K365j2757M139Q939q528
588c060j881Q633n509m087R963k758r853Q990N977j2261J9J1594o052o780R040
603A975n42p862O924K230j0021M654Q233r896l931J1849k235j0102P505M364r042
618e897K391O403q038m56R411n904o404J0012J550j0758L912Q173p963k242Q421
633B611m232m980Q379j219q280O736M750j0020M58R611n699n780Q526m0p881O009
649a051L197q481K790P263p333l209R629k124q086O933L651q585K438O867p359
$$ y = [-2436, -3180, 5774, -2310, -6161, 6064, 1632, -10252, 44, 7118, -7099, -7509, 5090, -1537, -8124, 1547, -669, -8290, 784, 2059, -9749, -3736, 6531, -5015, -9802, 3718, 1882, -8998, -1194, 3136, -5965, -2159, 3805, -5607, -4962, 6122, -1314, -9436, 2782, 5147, -7610, -3471, 5468, -3060, -4941, 3692, -1817, -5904, 4059, 1301, -8552, 438, 6415, -5846, -5827, 5767, -285, -7065, 1975, 1433, -6429, 495, 2725, -7296, -2642, 5591, -4305, -8236, 3613, 1378, -8724, -1219, 3145, -5897, -3506, 2897, -5141, -5597, 3814, -2090, -8494, 1518, 3068, -7690, -3778, 4395, -3568, -5810, 2611, -1621, -6601, 1778, 559, -7721, -985, 3765, -6255, -5797, 3814, -1885, -7665, 861, 821, -7060, -1051, 2146, -6335, -3545, 3718, -3615, -6824, 2805, 681, -7405, -472, 3179, -5406, -2968, 3899, -3460]
664c460j647Q478m099n834P737J280q428L690O319p462j628Q192l850n314P626
679A600K35p510M978M499p577J43P714m704m253P724m89p326N319L915p594R20
695b406O870n330l294P083j399o160N223K713p757K267O469o475k549P831k279
710H07n897N590J986o394K592M816n950q01P331l836n126P255Q86p404L125N036
726D016n944p95N916l615l364O191r16o378M905L738p573N69O796l951l718N817
742A694l53m863M210K076o012K388N733n941k429P687j687o048N020K341n510
757a694J497L814m491o63N784l566m577O619Q56p230K799N057n316j266N067k333
773C57k840N091r87n189M816L098o918O97O443l730l798M969J87m287L018J437
$$ y = [-3460, -5107, 3371, -728, -6562, 1175, 2455, -5973, -2283, 4036, -3426, -5054, 3138, -712, -6026, 1600, 1835, -5675, -697, 3802, -3775, -3632, 4082, -622, -4875, 2849, 2360, -4966, 353, 4268, -3326, -2406, 4464, -866, -4160, 2923, 1524, -4636, 587, 3300, -4457, -2190, 4279, -2196, -4745, 3086, 807, -5090, 500, 2486, -3908, -1316, 3500, -2450, -3251, 4080, 244, -4882, 2373, 3259, -4145, -1020, 4016, -1928, -2723, 3193, -422, -3786, 2405, 1489, -4889, 16, 3754, -3819, -3250, 3546, -405, -4123, 1694, 1341, -3522, 688, 2764, -3248, -860, 4873, -1068, -3497, 4190, 2503, -3545, 1475, 3816, -1694, -197, 3617, -874, -1537, 4247, 681, -3896, 2723, 3579, -3651, -852, 4205, -1111, -2377, 2690, 357, -2483, 2608, 1621, -3568, 1248, 4346, -2572, -1875, 4568, 838, -2960, 2009, 2196, -2091, 927, 2364]
789B364m769J975L976n354j737O631j977n541L993K671m941P76L482l365o36M437
805A985k811l305N469R42o193K784M633m410j472M626j267l062L985l11m145L637
821A085K472n628N82N470l283l624M660N73m280K337J802l690J194L416l962j404
837b280N420j228n028L904K572m520K12L641k662j139L710k000l008M374N16n371
853b887K036L885m185j559M421j229l093K942M15l779K650K034m307L09M646k855
869e56k948M335O74l794K113K044l380P31L362k986j315M379r22m232L398K146
885C049m068M67L424k736j328L554j353k616L223Q29m134J791L132l517j045L859
901B531j166k619K665P01l278J682K419l491l00L579j873k521L570n8l712K198
$$ y = [2364, -2405, -430, 3546, -1808, -3545, 3086, 1109, -4432, -439, 2232, -2709, -1933, 1549, -1816, -2452, 1985, -826, -4131, 1338, 2280, -3913, -1129, 3504, -906, -2378, 2248, 981, -2081, 1904, 1593, -2552, 1085, 3557, -2071, -1489, 3981, 698, -2926, 1734, 2307, -1973, 364, 2166, -1524, -330, 3086, -876, -2280, 3140, 1912, -3116, 788, 3360, -1160, -948, 2693, 31, -1108, 2602, 602, -2406, 1968, 2484, -2887, -851, 3034, -1151, -2710, 1711, 482, -2611, 331, 746, -3033, -383, 1651, -2656, -2347, 2299, -556, -3504, 831, 1505, -2289, -176, 1868, -1512, -781, 2581, -405, -1720, 2659, 1737, -2495, 903, 3049, -1019, -552, 2872, 136, -1192, 2362, 1009, -1607, 1616, 2445, -1689, 102, 3234, -283, -1328, 2531, 1365, -1254, 1411, 2112, -1166, 516, 2935, -556, -856, 2723, 850, -1671, 1899, 1841, -1871, 327]
917C27K028l414R4L143k137j856L507n32l109K492J608l527Q28L042k692j054
933a252L432p37k815K704J099k964R90K490k625p23L390j629k282L135K66l151
949f72J398K145k623n00K661j103j915K550k7k809J945J450l043K26L038k020
965G01j619K857j5k738J578J409k604N75K322k380r04L003j006k560K264J258
981B141k837N24K083j976m18K288j165j821K671L17k955J625K217k357n95K427
997B169o30j814K040K80k129J617J083k790M76K844j948j774K573L84k569J004
1013H16J334j890J66J807k109o87K640p68k481K196R92k552J50K163j457r11J902
1030A311r42j229K091R6k723J440J864k620m64K333m22j856J529L13j616J080
$$ y = [327, 2355, -1059, -965, 2178, 41, -1815, 1692, 1160, -1949, 543, 2151, -1376, -548, 2494, -198, -1252, 2180, 1443, -1372, 1332, 2431, -533, 457, 2947, 322, -401, 2989, 1360, -922, 2213, 2479, -672, 726, 2871, 248, -252, 2409, 1306, -609, 1941, 1914, -895, 1050, 2500, -543, -317, 2721, 701, -918, 1939, 1924, -814, 764, 2173, -431, 144, 2466, 86, -818, 2185, 1179, -1381, 883, 2141, -696, -172, 1911, -65, -483, 1805, 640, -1181, 1490, 1807, -1148, 477, 2694, 337, -258, 2169, 1539, -275, 1765, 2045, -84, 1533, 2616, -174, 302, 3146, 1198, -576, 1997, 2381, -188, 816, 2150, 260, 426, 2233, 124, -563, 2077, 1309, -1172, 1024, 2016, -536, -386, 1777, 320, -591, 1311, 369, -860, 1231, 1327, -1396, 44, 1908, -712, -1176, 1157, 735, -1121, 408, 721, -895, 185]
1046A85J004k125L63K438j809j428K430L4k048J124J305j501J02J385j213o10
1062c64K304q35k028J813J069k256J80J878j127r53J252q8j226J350L7k000J257
1079B63J517k127n36K145n60j666J210N52j290N68Q14j534J92J875j537j160K025
1096G51J87k015O32J429j303k41J179j005o20J595n73j611J737O64k000K93J463
1113E62q57q71J608j95j276J170M13j576P90J343j670l16J789m89j477J405L20
1130F73j191N01R24j218k39J734j174j036J829Q4j629P13J115j324p1J224q17
1147I8p34J520j44j338J206N07j711N27J065q49o75J289o6j272R10M12j313K65
1165c03J314j484l03J535o17j040J193O5j156M07Q34j075k10J361o69r67J296
$$ y = [185, 1189, -936, -573, 1865, 56, -1372, 1058, 1092, -956, 168, 1473, -28, 74, 1459, 246, -364, 1940, 1105, -923, 890, 1959, -297, -117, 1761, 634, -319, 933, 845, -381, 969, 1006, -994, 263, 1780, -347, -883, 1262, 702, -964, 246, 798, -492, 76, 890, -644, -452, 1423, -114, -1274, 751, 938, -1077, -445, 984, -319, -560, 619, -386, -1006, 589, 16, -1595, 142, 806, -1194, -901, 562, -295, -1166, 442, 247, -1029, 141, 554, -1022, -232, 1111, -559, -875, 914, 425, -1052, 353, 673, -518, -17, 907, -311, -550, 1184, 10, -1026, 803, 887, -742, -29, 1086, -238, -309, 915, 98, -636, 884, 740, -598, 608, 1115, -596, -69, 996, 147, -528, 761, 695, -577, 333, 745, -568, -303, 1011, -473, -776, 759, 142, -898, 295, 360, -796, -389, 445, -630, -840, 521, -148, -1115, 181]
1182A81r7j096O27P49j192M8J292q93p55J237J87j366Q76P77j332K32J012p70
1200b83l35J116l48r62R93M16j014O3J160p32l03J032k70q20R43O4j041O49R32
1219A260j087k84J197n14p76P19J98r59M34M33r96J62P94o64o95J094Kj196M30
1238d48O76q71JO40n05k81P21k47o97P15L53r12j60J226o99n28Q08j85o45N70
1258d68K32r08N57O13p48l10J119j47q51O99J64n76L64M30m79P4P19o20l27R74
1278E11o3q46L60O86o00k84N88l69k48P02l66o67O58L96j048mJ064p20n25O36
1298a39n8n34L60R5n78L98M52p09k50Q78j97q22N41L49o68J04M34l33j50O47o14
1319g94l29Q99j12q94N31N04n45j90O37k45k76O05j58l55N72K65o75k4R57n74
$$ y = [181, 84, -1012, -385, 364, -828, -780, 512, -381, -1136, 101, 288, -1078, -202, 575, -757, -525, 487, -283, -618, 498, 150, -812, 181, 597, -417, -354, 806, 74, -229, 803, 533, -287, 656, 720, -321, 328, 1260, 173, -111, 1086, 572, -204, 515, 713, -246, 188, 621, -375, -213, 581, -83, -778, 316, 318, -878, -448, 228, -643, -642, -2, -507, -788, -67, -314, -1011, -296, 57, -855, -1015, 211, -488, -1016, -208, -393, -1038, -468, -236, -1144, -587, 26, -722, -1032, 87, -60, -911, -212, -48, -624, -260, 170, -309, -235, 484, -136, -463, 511, 448, -398, -38, 648, 48, -236, 352, -17, -265, 437, 71, -596, 62, 458, -590, -594, 470, -250, -775, -139, -197, -731, -371, -276, -854, -456, -4, -713, -963, -85, -282, -1104, -563, -214, -882, -778, -344, -677, -827, -180, -794, -1123, -224, -336, -1230, -699, -195, -740, -930, -293, -538, -814, -209, -367, -722, -150, 115, -560, -584, 373, -201]
1339b01n18P11K32p01L86R8n75L30L76m81k38O15n8p36N72K76n94j7M59l27k7
1360d18N43o18k58P01M5p98N53L35n46l3M54k00k59L79l2l70J90K44n09J75N81
1381A59l18n43O82K6l87J95J69l57RM67m69p0O66r1o29N45J21k89k1M36m83Q8
1403i4L70k82k03J70J82m40J87K15l04j17L70j60k22M78j65n16M27K33m67J80
1423a58K88k26k06L58k9k95L47J01n37K08M64k99l14M02m4k77K27K19l39J34L67
1444C91l52p7K77r9j88J91J37k11J08K53l67K56P2j50k58K78K10n55K52K92n06
1465d6J29J32j78n6J56r0j21K50M6m65J24M63m47j32M15j88j66K29Q4k87K05J74
1487B31l45o0M20l34p2J86K12n40J12L14j29JK62k24q5L92k05j95Q6P1k07j48
$$ y = [-201, -719, -8, 224, -477, -91, 7, -568, -238, 138, -343, -581, 34, -24, -760, -188, 88, -506, -523, -64, -391, -418, 125, -493, -751, -50, -5, -803, -250, 85, -461, -494, -40, -240, -499, -120, -152, -522, -332, -88, -597, -422, 159, -159, -702, -20, 6, -381, -186, -17, -374, -365, 102, -367, -437, 229, 138, -491, 54, 175, -114, -135, 301, -182, -94, 276, -6, -209, -39, 143, -297, -110, 105, -199, -316, 54, -106, -328, 150, -15, -531, -104, 129, -338, -158, 130, -96, -302, 56, 27, -268, 79, 180, -357, -149, 315, 16, -298, 104, 60, -217, 10, 229, -110, 24, 391, 39, -38, 239, 140, -48, 143, 280, 69, 177, 430, 63, 319, 391, 241, -17, 261, 471, -84, 168, 460, -46, 83, 215, 37, -19, 137, 47, -74, 176, 222, -243, -119, 344, -103, -235, 180, -8, -174, 55, 139, -148, 57, 231, -114, -174, 246, -88, -160, 26, 238, -302, -190, 124, -5, -4, 258, 34, -51, 341, 136, -59, 27, 98, -109, -257]
1509b57N41j68k74K74J47l07K53Q0l42J84K56j9l80J16K01l69K41Q6k59L07q7
1530B24j21p7L33j38k19P3L52l89j58L34k24M4R1r1m4J22K4k17L3K93l97k2J33
1553d1R6q6o8J40r4K52j99j98K20K12n7k95L0K83k65P3Mk5O8K4k19k6K44j64k5
1578a16J05K65l02L3K26q2L4O2k62O3J83j29J20r6P8P0k03K38o4KJ00j20k0j0
1602A75j1m9j16J38K4Q1J0o9j63K23%J32k77K37k06m1K44j31o5k3K99m35q0R2
1626a1N5l5O0j83J71k6K7j15P6l1M7j93L66j31L7n9RN0m3J58j25N3o1o8M7j3J00
1653A62j37J03N9j16J12R6j7j52J71J10k51N5k5j57K17J7J9j80K18q1j49J44J61
1676C79j91j09K4K34m2l4j52NJ46j24p0J02rn3N0q9j4O3j16J37n9k0l1j74JJ61
$$ y = [-257, 284, 116, -158, 116, 263, -44, 209, 289, -53, 131, 387, 368, -12, 104, 305, -64, 177, 263, 4, 311, 224, 103, 26, 359, 221, 2, 75, 427, 38, -120, 214, -10, 34, 125, 34, -10, 112, 136, -81, -48, 245, -152, -174, -41, 55, -31, -99, 41, -53, 199, 0, -198, 22, 234, 177, -118, -88, 195, -70, 3, 7, -18, 50, 74, -145, -171, 73, -91, -116, -11, 254, -48, -15, 211, 129, 163, 225, -37, 26, 209, 80, 200, 104, 182, 252, 49, 287, 223, 225, 325, 205, 185, 175, 164, 115, -1, 137, 161, 242, 252, 183, 20, 243, 243, 375, 98, 335, 129, 88, 332, 201, 136, 113, 412, -23, -103, -11, 44, 9, 69, -114, 57, 31, 58, -57, 19, -12, 35, -158, 208, 77, 114, 55, 64, 114, 71, 229, 104, 157, 96, 28, 75, 62, 162, 25, 128, 187, 71, 183, 279, 262, 110, 281, 391, 140, 195, 170, 13, 230, 247, 266, 86, 304, 223, 74, 218, 379, 188, 79, 103, 337, 295, 261, 109, 114, 260, 136, 66, 168, 159, 106, 156, 67, 53, 116, 0, 137, 78, 58, 27, -147, -146, 15]
1702A5j63J02J52j84Lp4K59m1j21M2j56M3K32n1j34Q4k5L7Kr1O4m2J53p4r8K44
1728A78k28J4J38r4Q3o9Q5K5j00Q6j2j06j34N8K11q3m1j58L7K19J16j69LQ3j50
1753hj26K2J04m2Q0r6J10j23J03j33j9j8J26j32o2K9J04J9N2j30J06k01K03n6
1777h8Pk8M9j05J24j74j35J80J2J43q5q1k03J98J50r9q1P5q5l1J83j29M2M8k5
1802a38k6P3J6j12J11m0Nj33J49R2J07k59K01l00nK54k30J79O1jn6j28j14J07
1826a87J05n1n2J41Q3j50O4jk29K43r5j2N4j12P3P4L6j57J69j44j6k0P0l7k8M
1852a75K9j02O9J18k12L21k76oJ2L7j5J33kl8j7p7J79p6p2P0L6j8n2pK69j83m2
1879i7R9j23J29Q5j46R2j31K8o1K19p8r4J6l2J67q9n7R6q1K35k75J83j05L6jr9
$$ y = [15, -148, -46, 106, -78, -75, -149, 110, 69, -52, -10, -166, -123, 109, 58, -76, 8, -17, 20, 22, -69, -5, -47, 106, 32, -66, 178, -50, -36, 102, 8, 91, 22, 107, 132, 32, 118, 106, 0, -134, -76, 135, 52, 11, -147, -110, 109, 225, 56, 59, 142, -8, -134, -112, -8, -50, 30, -66, 44, -79, 24, -109, -128, -146, -20, -152, -214, -185, -81, -62, -10, -140, -34, -235, -32, -88, -81, -109, -60, -165, -41, -215, -350, -170, -158, -15, -100, -181, -384, -186, -36, -135, -216, -141, -226, -257, -74, -203, -161, -113, -138, -164, -91, -75, -187, -76, -116, -111, -244, -95, -3, 104, -155, 46, -254, -259, -5, -235, -56, 5, 4, -52, -180, -294, -187, -82, -133, -185, -44, 39, -111, -47, -48, -277, -34, -129, -141, -87, -199, -126, -52, -16, -173, -4, -148, -164, -184, -114, -151, -179, -175, -146, -248, -179, -61, -273, 48, -228, -234, -222, -185, -200, -67, -69, -107, -124, -201, -22, -98, -170, -100, -64, -82, -134, -141, 128, -55, -97, 2, -121, 8, 93, -53, 39, -92, -64, -125, 94, 16, -78, -62, -94, 73, -16, -73, 23, -58, 177, -98, 85, -20, 16, 15, -84]
1905h4J49p3k1M4Rk0j0p1lr4K33j10m8J05jO0n2k3Lm7o4J1L1K2q1R6q2n4K49j17
1935d3K3j05N7J0j6P8j01L4m6O8k7L8K4n5P7q7M9P0n5Q1j55j06K45q2N9K0Q5j24
1963A6m0j00K80j11O0j22k0J81j49OPO8r5O1Rp8J01J04j33%kR9l4j83R5J18k27
1990h9N4n7J96j59K1j9PN0K3n8m8QRR2j88J38k8r8J68j55j09J84N6R1k47O7M3
2017d8K4j25J05j01M5R7N8n5K6M2n1N8K3j6o0K2k9l8j2P8n3Q4k0j5k2k5j1J14
2045I5o1m7R7j57Q7j26K07j67L0P8q2J09M7l6j9J48j57Q9m1j0L9l0q5n7O9o8L6
2072a2M3j20K87j94Q2P8k22J4K15j40k00K06J05j53PoL3M9J07j89J9j5n8O1K0
2097A7J34l0j09LO3k0k04J68J32l6j6Q8j17K48j50m3j15K3J6p3J35j0q3J10n6
$$ y = [-84, 65, -8, -29, 15, 24, 4, -6, -77, -80, -174, 59, -51, -99, 6, 5, 65, 13, -10, -7, -54, -118, -107, -76, -54, -135, -39, -121, -175, 74, -43, -20, -125, -68, -58, -74, 4, -97, -63, -109, -41, -68, -30, -6, -61, 16, -71, -22, 48, -7, 74, -81, -187, 58, -24, 35, 55, 140, 16, -24, -124, 156, 45, 105, -17, -37, 144, -5, 1, 8, 76, -19, 42, 51, -27, 74, 178, 45, 45, 43, 142, 108, -75, 20, 138, -89, -35, -92, 104, -55, -34, -53, -46, 4, 27, -31, -79, -71, -62, 30, -158, -20, -48, -146, 22, -133, -242, -58, -2, 89, -158, -91, -48, -24, -149, -44, -145, -100, -3, 55, 0, 26, 68, 17, 75, 98, 82, 22, 44, 15, -23, -35, 43, -10, 74, 54, 39, 17, -8, -19, 95, 34, -13, 84, -73, 14, -112, 95, -72, -42, 36, -46, 63, 110, 74, 55, 203, 46, 135, 94, 84, 123, 93, 8, -49, 20, -48, -12, 31, -89, 198, 4, 86, 164, -58, -44, 171, 31, -169, 37, 142, -11, -4, -10, 23, 72, 179, -10, 9, -6, -64, -3, 17, 151, 121, 12, 15, 78, 58, -146, 22, 154, 118, 102, 190, 73, 321, 171, 128, 13, 36, 52, -21, 114, 104, 21, 131, 75]
2122G5p6R2mJ1Pk6N5j29J05n6M0M6r1J37o9j63L9J06oM6j04M3J4MK4l0J35j98
2150B7R4Lk06J36J9r7J7k1K8mJ01J72j85O2oj69m9J99oo0K1M6j02j27Q9J48R5
2177B25k01P3r4k0KJ02L6r3O8P4r7k9J3J16j07J15j93J36j2j26J51j07%J12K7
2202A71r9r5K07R6k20J05p3M9J0p4n3J57n2k8l3n9K2j4j0j31Q1J44o0J03j24N7
2228G7j24J48n9L8q1P5q8j26J50M2N8j41K40k06j74J81n4J96k12R3k58K31PL5
2252D8N3k3j22P4J45l09M5J09o0K9j1R3M1m8%j21P7k4J62p8n8q2j7l6Q9K13j32
2279E7k4l9Qj1O6j19R5q2Q1J51k14N9N0p7P2j71N0P6j55O9K1K13q9j09J01k04
2305a25P9k10J97M0J4M7k6q4J31r2j51J02Ljm0K3J68j05j52O0r5K00j8Lj24O8
$$ y = [75, -1, 91, 87, 98, 105, 79, 134, 5, 110, 54, 94, 140, 49, 186, 117, -46, -7, 99, 93, 139, 35, 78, 92, 96, 120, 90, 225, 27, 121, 124, -82, 54, 73, -24, -7, -28, 0, -4, 97, 269, 84, 146, 140, -29, -78, 121, 115, 55, 76, 122, 20, -107, -18, 130, 225, 24, 97, 3, -17, -15, 87, 123, 30, 98, 172, 75, 46, 59, 175, 68, 183, -10, 126, 114, -12, 139, 32, 32, 144, 171, 72, -23, 184, 280, 60, 165, 92, 141, 151, 77, 24, 181, 129, 101, 68, 9, 31, 17, 7, -124, -43, 101, 41, 144, 20, 77, -47, 101, 42, 80, -1, 74, -14, -140, 10, 52, 110, -31, 209, 3, -171, 10, -44, 152, -60, 33, -225, 6, 13, 48, 101, 78, -44, 30, 175, -134, -89, 20, -40, -11, -22, 71, 112, 64, 64, -57, 20, -4, 158, 80, 22, -60, -77, -113, -24, 189, 57, 33, -6, 2, -9, 57, -62, 33, -49, 32, 183, -31, 28, 78, 1, 73, -98, -48, 28, -127, -58, -37, 176, 87, -22, 79, -125, -46, -256, -59, -19, -5, 42, 16, -68, 63, -29, -180, -78, -75, -76, -116, -93, 75, -30, -182, -122, -217, -17, -35, -32, -156, -88]
2331h8K05j9j75j6J70k06J42N2j73J68l3N2K4L5j96O0oK4P3k4k1l6K5J87j97j40
2357a13J64j1mj30K13j34P1K9j23P3J1j17N1l1Q9O4m2n7q8l0K53k45n9J38j75
2382b03J43J1J29J00k19j0M5j5J13j51r2J89J0q4j6J30j55M3K8n7R5l2p5k7K08
2407A08q4R1j37m6J05n3n2K9P3m4P6j42M8P9j3k6j15M1K90m2k45J32q3M6Lk1o8
2434e0NK0O5r1p6J85q7Q8q8J3M0l3O8j62RJ22o1Qj60J58P4L2j86rK0q3L52j72
2462Al5r0J70j99J68j39J40j6n6o6P1j5N2kj13p3J81l1NJ24j13Q2q9R8j26j7Q8
2489@J05k24L3k1R6P6o8q7J07J31l17K10k9P1k4m4plj52K08N1j11k9p8K30j84
2515f0o0J13j15K07J10k26O8j02L7pQ4k5J1l5n7n5M8l9K15j49J26j23o4Q6J3%
$$ y = [-88, 117, 98, -77, -93, 77, -129, 13, 65, -108, 60, 27, 79, 103, 138, -58, 2, -4, 20, 93, 69, 48, 12, 37, 224, 27, -113, 51, 40, 36, -94, 119, -15, 56, 85, -38, 35, 46, -71, -20, -51, 38, 102, 60, 3, -85, -115, 138, -107, -166, -28, -203, -60, -49, 80, 180, -39, -49, -4, -19, 94, -57, -149, 40, 50, -34, -50, 80, -75, -32, -4, -61, 34, 2, -73, -100, 108, 24, 115, -22, -68, 37, -16, -68, -39, 34, -10, 66, -76, -28, 51, 38, 12, -103, -62, 228, 186, -59, 73, -10, 36, 39, 18, -50, -45, -25, 40, -51, -127, 58, -29, 59, -29, -16, 24, -9, 59, -103, -94, 28, -33, -25, -185, -27, 47, 79, -107, -116, -96, -179, 173, 1, -34, -124, 46, -153, 15, -124, 16, 0, -56, -122, -51, -66, -14, -16, -129, -202, -21, -52, -47, 77, -36, 46, -43, 55, -71, -88, 0, 105, -119, -86, -107, -11, 65, -3, -90, 17, 148, -169, 41, 12, 83, 59, 15, 8, 5, -147, 61, 112, 1, -28, -106, 124, -60, -120, -7, -122, 85, 195, -31, 37, -65, -28, -35, 49, 24, 35, 0, -57, -112, -64, -103, 112, -37, 89, -34, -98, -12, 1, 1]
2541Ak38K99l8k42J72P5J0j87K06k2j00M6l0J4j6J13m8j63K7M6R6j64J37Q2o9
2566Gj17J05k0l0J57j98J89o2N7j15N5Ko0o0n7J03J74L3m8j27L7m5K5J23j92m3
2592a07J03p8J9J33k74K66j42r9K13j05L9k02Q7N1M0M5k6J07m9n8N2P0j87P9n8
2617h1P0j3R4k1n2j40K27n8L3j22K1J27j86J00L1k4J09k36Q2j67J03Q3Q1l1r1
2642f1K05k07J5J11j77K9Q5K02j85Rj73J16k3Q0J1M4M7j8p3N0j47J01J2k8j70
2667a45O9L5M7j29L04o6j30M0k23K61j08KL3J45j04p9L5j62K62j54O4K7p4R6n3
2692gJ48j10M4j20J7J79k70J62j24K78j65k3k8j48J15J41n3j22J05N3mP7j54m
2716a3K4l1k2n8k8J04J39k64J35J38p5J7j33Q4N3l2R2j08Pj24M9L7J54j16J76
$$ y = [1, -237, 62, 24, -218, -46, 29, 39, -148, 58, 36, -64, -18, -48, -34, -50, 63, 15, -148, -121, -75, 21, -143, -6, 76, 7, -110, -5, -25, -55, 102, -96, 93, 31, 88, -27, 28, 30, -30, -90, -147, -44, 130, 163, 115, -12, 25, -20, 5, 128, -64, -107, -4, -82, -63, 70, -204, 62, -80, -179, 34, -71, -32, -234, -147, -96, -56, -11, -37, 70, 21, -37, 15, 85, -102, -23, -81, -11, -24, 70, 49, -3, -143, 84, 26, 59, -63, -42, 85, -101, -1, 30, 6, 115, -121, -39, -206, -103, -20, 61, 30, -61, 144, -63, -48, 63, -114, -85, 0, 202, 17, 26, -147, -31, -54, 26, 37, 81, 128, 110, 37, 87, -60, 41, 53, 25, -145, -76, -41, 6, -123, 181, 115, -15, 25, -198, 63, -45, -43, -10, 135, 31, -48, -13, -175, 87, -67, -3, 24, -50, 46, -7, 141, 31, 75, -45, -28, 151, -119, 43, -81, 197, 32, 9, -19, -167, -52, 89, 36, -86, 19, 72, 68, 145, -9, -13, 11, -20, -42, -100, -128, -24, 115, -149, -14, 124, 49, 66, -67, 17, 70, 38, 130, 22, 29, -95, -46, -9, 145, 29, 205]
2741B05k46O1j05L4J24m0j89L33k19K08j38N4j01m4J39p6J2m6J0P7Q3j49J7j69
2765a65J98j5m7q3P1K2O3k79K75p8q7J53k04J78j24J4J30o0l5O0J47m4j25p9P4
2790d0J05Q8j54K2Q2r6j51J36L2Qn1q7J10J45l49K35o8P5n0j7K9o9J07Lq0N6Q8
2817A09O1k31j19K31m9M8J9j18J5P9j05J14nqq1qK1N3n6K06n0j24m3r5J25p6P0
2844a7J77j87m7P7O0j75rJ15j17J08j12O9O3j01J94j60J93p4j81K70n1j66J39
2867F8k05O2rJ43p7j14J08j41P3L9J46n6j7P2q9J0m5pK9J67k80K06K0q5q9R6N0
2894G5p4J6j98O9J20M5N1o6j14J19J7j2K7j45OQ9n2J3R1m6J58j15n4M7r7k2l8
2921i0P3J2l5J50n5k4j11k2Q7j95J85km6L8l0O8P6J13j92J09p8n7N2j54kJ20n8
$$ y = [205, -41, 20, -85, -51, 73, 33, -156, 177, -42, 166, 28, 82, -19, -63, 76, 0, 12, -34, -24, 53, 136, -13, 4, -165, 33, 18, -29, -112, -41, -19, 44, -235, 40, -38, -125, 28, -176, 2, -122, -108, 22, -38, -73, -13, 134, 90, -35, -114, -40, 65, 153, -1, 21, 103, 7, -144, -8, 24, 32, -19, -106, 4, 149, -200, 35, -33, 42, -8, -25, 4, -65, 42, 45, -35, 21, 109, 170, -61, -180, 51, 2, 50, 69, -49, -34, 45, -60, 54, 49, 41, -40, -48, -27, 26, -30, 176, 126, 2, -41, -136, -11, -87, -17, 160, -27, -74, 3, 63, -112, -121, -6, -123, -15, -127, -58, 5, -96, 98, -62, 131, 57, -124, 146, 95, -71, 68, -137, -75, -84, 59, -18, -132, -24, -165, -92, -53, 93, 37, 20, 92, 3, 13, -32, -39, -10, 157, -123, 83, 103, 18, -71, 25, 75, 1, 17, -181, -112, 8, 53, 104, 38, -76, 43, 60, 48, 75, -70, -64, 25, -27, -14, 77, 31, 189, 74, 20, 67, -30, -52, -90, -17, -5, -40, 110, 55, 31, -80, -102, -15, -210, -25, -27, -73, -35, -65, 3, 79, 192, 0, 109, 31, -26, 26, -128, -130, -10, -68]
2948f8qJ52o8P5j88P3L8N7m9j11J24k9M1r9J46n7j24Q2J53k25K7m1J50j1q2j5
2974e7K47j51l7r9K8nJ91o1r4K07k37O6Q8Q4j56p9q2K33j59J01J1L9j29O3r1n5
3000a34l9L14j41q5J1kL3Nno1J34j64J36k7J29q7R3r3J8J40k12K1j2L0l6mk2J37
3028G7j14O2j14J28J6j19M8p3Q6K4Q8p5k08K04j4J2j06M3J24J06k93J73k16K0
3052a21J42o7J9j05J02k3n7R7op7J69K3j9j26o7J65j6j03J73n2k1k8J6l4po4K07
3079A20k58N7OO3K1J15l6k05J9K1P0k6R1q0l0J03j0nj31N3P2q2J8J10J07o6o8
3106D9j01P9p6J7K08l69K36j13K47k00R3q3p4J37j05K7m0j34K41j74J23L1k13
3129a94J56l8K1J78j67LJ17r0pK6j1P4p5o1J23j58OK22j46R8l3j20q5K17j29N6
$$ y = [-68, -76, 76, 8, 83, -105, -32, 6, 63, 14, -97, 27, -2, 39, -60, 86, 29, -95, -13, 140, -85, -58, -99, 51, 40, -42, -57, 190, 39, 2, -97, -69, -74, 117, 56, -38, 169, -68, -2, 86, 170, 14, -65, -147, 86, -73, 28, 39, 78, -51, 12, -79, -134, -173, 141, 0, -85, -74, -76, -43, -38, -43, -104, 30, -134, 2, -25, 104, 17, 110, 17, 35, 175, -37, -16, -28, 2, -34, -38, -60, 77, -37, 25, -89, 39, 55, -64, -16, -89, -3, 21, 109, 34, -174, 30, 16, 28, -78, -35, 89, 195, -98, 75, -141, -121, 21, -46, -27, -132, -30, -53, -110, -13, -19, -96, 73, 96, 77, -49, -116, 49, 33, -70, 103, 51, 30, 2, 18, -16, -23, -87, 120, -138, -81, -75, -12, 9, 124, 88, -117, -98, -77, -7, -33, 58, -22, -52, 51, 41, 36, -95, -42, 30, -52, -34, 76, 183, 117, 49, -52, 27, -49, -32, 176, -193, 43, -70, 177, -23, 70, -13, -87, 50, -55, -28, -68, -202, 39, -135, -12, 19, -194, -38, -76, -55, 123, -44, -41, 76, -14, -21, 5, -6, 68, -7, -68, 55, -103, -97, 125, -21, 77, 44, -76, -161, 56, -73, -17]
3155a7N0K7Lj37J15j9P2k37J55N0r8j3J96m4k10Q0MJ3L0P4Q3k40q7n8J83J4M2
3182C1o5P1j31Q3M2O6p6J2K0j8r4m7P6r3J22o6K03o5L0j31J1l2M9M2j14J24p6
3209b6lP7o4J9K1j31J14N9m9j08n1K06k9j01j7M2K0k3Q9r0j27K07k36R8J30O0
3235H7k1m2P7j36J27P0k04R4j16J33L0j19r8J03Q8q7J22j30J04j05J02J9j01J02
3259I9j62K04j64N3l5j37P9Q9r3J18k6j47Q6o8K0L17k21J4M2j82N3rl8J12K8J6
3285D8J75l07J11j4n8j17M2J54j29J61n2K3mj85J15L6rJ67o1j42L0q3J76j37P1
3310A1Lk9J8J3n0R4O1k79K13k10R9k50L35M4K3j07P5p5J47j49lM7j15M7O1P0k75
3337a81J32l3K6J64j08k9o5P0K0J16k14p9M4K72j40L4J38j45K7L0k4j12J25r9
$$ y = [-17, 33, 60, 63, -74, 41, 22, 94, -143, 12, 62, -36, -49, 147, 103, -107, -27, -23, -10, 20, 94, 177, -63, -150, -208, -25, -11, 31, -34, 37, -94, -11, 31, 97, 21, 33, 53, 35, -59, -106, -30, -123, -1, -67, 136, 71, 101, -30, -19, -51, -2, 40, -74, 50, -26, -29, 48, -16, 3, 24, -107, 7, 66, 17, -91, -142, 64, 35, -66, -83, -41, -21, -44, 45, -45, -172, 35, -201, -103, 27, 87, 66, 24, 101, -35, 92, 162, -42, 52, -64, 69, 99, -20, -118, -15, 73, -14, 108, -22, 82, -23, 79, 98, -3, 99, -63, 141, -23, 30, -5, -142, -63, 26, -67, 51, 25, -122, -36, -104, -84, 233, 12, 26, 68, -114, -61, -70, -108, 4, 32, 48, 223, -84, 27, 13, -45, -162, -120, 34, -95, 66, 14, 37, 33, -152, -37, -1, -10, 157, 96, -46, -16, -99, 77, -60, 11, 14, -15, 3, 16, -34, 60, 121, -158, 55, -155, -56, -306, 29, 73, 96, -11, 64, -11, 136, -13, -16, 31, -84, -37, 24, 94, -181, -49, -82, -56, 108, 0, -29, -94, -24, -4, 112, -102, -181, -137, 135, -5, 29, 167, 22, 49, 79, 55, -57, 68, -31]
3361c1j1M4k4L3j13J03L2j3K9k2L7j08P3j32J14J7p2L9j8Q1p9J05k16J20L8l0
3387dn0J11k3OK04l23K53k03P2j86J17j7O6j26K27k06O4MN5N0q1N3j6m5L3r6J84
3414A23j63o2J40j04J72j15J57k32K5Q0L4NJ18o0j48o2J10n5j07N0R7n7J63j02
3438GlM8J29J2l08J69P6r1L9k1q9N1j40J37N6p4O3k06J31J12l71L24o1N7j09J62
3464A00j76K39j83Rm2r0P9J92j73N2J6j4Nq5M6J42k8j33mm5N7J08j19J48K6k44
3490a17J00J34r5j31L10o9r9KL0l9Rn0Q0j45J3O0N7j16J29J0j32J11j04k2Pj5
3516h2M3o3rk4L8K01J6j51Q7n9J29k27O4o2J61j04k7J16j40O3M6p1R6Q3j02K2
3542D4J01q8P9j07m3K4k3j9J26j31J01j28l6O2J49J0j11k18J56R1J4m1RM7m6P4
$$ y = [-31, -42, 2, -22, 11, -102, 1, 33, 20, 49, 27, 64, -44, 29, -103, 11, 28, -44, -5, -23, 58, -21, 84, -132, -12, 26, -4, -54, 57, 34, 40, 244, -79, 174, -29, 43, -143, -26, -43, 23, -103, 124, -82, -18, -14, 41, 91, 10, 63, 47, 2, 35, -61, 123, -40, -102, 38, -66, 106, -9, 148, -84, -59, 21, 55, 60, 178, 118, -30, -92, 18, -37, -144, -94, 3, -54, 109, 7, 4, 52, 181, 193, -115, 54, 130, 39, 78, 57, -32, 19, -121, 16, 72, -2, 61, -145, -14, 98, -273, 51, -10, 47, -62, 100, -76, 163, -20, -11, -53, -143, -64, 128, -45, 7, 23, 9, 14, -71, -25, 117, 89, -44, -48, -93, -36, 72, -47, 101, 127, -117, -17, 117, 22, -109, 201, 132, 33, 35, 65, 26, 35, -15, 65, -80, -67, -7, 50, -66, 63, 73, -59, 52, -52, -74, -67, -82, -39, -102, -111, -135, -97, 104, 120, -31, 56, -3, 126, -101, -37, -99, 62, -42, -69, 47, -93, -30, 16, -55, 41, 124, 22, 44, 145, 57, 136, 29, -14, 10, -13, -32, 94, -37, 64, -64, -100, -38, 111, 121, 10, -208, -52, 39, 53, 12, 21, 68, 22, 96]
3568I6k4k20O7J16Q7j50L4J2j11K66j62Nj4M8o5p6R0j60K49k10J57qQ2j21k5Q9
3594E2n8q9K10NM9j14j32M2j7P0P7q5j26N2J15j04O1mO3K6k8r4L4N9j89R5j13
3621a43O4O8m1q9J53j3P9p3M2K3j30kJ96j86R7n4o4P3NJ6K4Kj84K13q2J04pqj13
3650c0J81r7R4j05k5j56K18j16Oj06J20R0k5J8k00J39j00N5J5j2M6K6J01k22L9
3675d6J01p1Jj78J19j08P6J83m4mk3Q4j10K7J1J5l2l5J9P9J2p6m8J01m7L1n8O8
3703D7j66O9J54j36Q0LJ24k40j3K18k37J48J3k6r9oO6M3j08R1q8O6mP8j13p0J58
3730E2q8J49j32J92m5k29Q0K7j32J31j74K03lo7K15j14mk9K7R8l07Q1J12n9N6
3755D0j31N2p0p5K09P9k28K06l4L8k16R5L7O8Jp5J03j11J23j88k2K45N4j93K4
$$ y = [96, 72, -148, -81, 35, 122, -28, 6, 18, -93, 173, 11, 16, 2, 50, -15, -91, -1, -161, 88, -122, 35, 27, 109, -12, -37, 52, -6, -95, 115, 120, 169, 55, -77, -35, -52, 18, 95, 10, -116, -64, 51, -53, 8, 4, 67, 93, 65, -29, 5, 64, -125, -30, -143, -79, -11, -52, -141, 12, -1, 78, 5, 47, 70, -60, -62, 134, -52, 45, -9, -73, 0, 5, 21, 45, 47, -137, 76, -6, 98, 91, 83, -30, 151, 54, 148, 43, 18, -138, 80, -36, -30, -136, -16, 74, 49, 67, -133, 6, -94, -39, -24, -36, 10, 36, 137, -85, -46, 55, -16, -15, -193, -74, -182, -106, 77, 33, 29, 6, 90, -20, 7, 18, 33, 1, -34, -15, 64, 76, 0, -48, 53, 6, 37, -21, 47, -119, -50, 104, -32, 48, 51, 175, -65, -78, 140, -97, 51, 64, 38, -61, -67, -1, 42, -66, 25, -63, 3, -1, 77, -36, -106, 52, -36, 113, -19, 173, 128, -101, -21, 6, -126, 5, -169, 34, 31, -36, 179, 65, 61, 32, 59, 157, -150, -69, 43, -16, 40, -91, -39, -109, -184, 25, 104, -124, 82, 48, 86, -130, -35, 2, 70, 71, -4, 99, -12, 111, -77, -99, 146, 200, 7, 31]
3780C1o4K7RN7N0k62J82J9l6J1J36l5j88J18k15J49l4K9O0K7j06R8J7N3j34PJ14
3807A20j51J2j24J79J3j1n0K4mj78J62j02P9R3m6j38K13r2j39J32j2J8R9m2m0
3832A5j09O0k4K1l2M6J43o5m8NN9k51K23q8r5J52j4j2m8n2O5K6l1P1j61K70o8
3859E8j23N0j87J7K30Ln3P8j24K47k34rJ33p7M9J7j42O4K7Q7j54J66q8j44J81
3884G2j54l0K77j37O1j09MQ4j33R9m3j02J20l5J9j12J23N4L5j23j0J48p9M2j27
3909e6j17K36o2o0O0J14r3J22k15J11j21N0P4J2q4P0r7mR9N8j45J02J5j13J12
3934F8K2o5Nko9M0N6j53K10q5o9J88n9j90J50l9K2k0j16O5P0N9k09J99l2p8J58
3961A26j38j63O8N6M7j46K23p5m5J58k32K9o1J37k0Q3P3j6M9l5n1j24j6kM1rJ42
$$ y = [31, -33, -6, 3, 60, 110, -152, 30, 49, 13, 24, 160, 125, -63, 55, -160, -11, -45, -16, 44, 71, -35, 63, 80, 133, -1, 6, 120, -31, -19, -143, 36, 49, 38, -12, 12, 8, -170, -8, -110, -31, 62, 16, -122, 91, -1, -140, -8, -20, -2, 97, 55, 15, -94, -34, -58, -37, -69, -23, 120, 55, 7, 12, 71, -180, 43, -45, -140, 12, -2, -14, -62, -114, -49, -23, -54, 17, -144, 126, 58, -65, -15, -202, -185, 45, 48, -5, 73, -51, 196, -38, -47, 86, 9, 58, 75, -67, -3, 24, 111, -43, 123, 35, -109, 72, -82, -112, 165, 28, 89, -20, -16, 68, -65, 34, -9, -111, 9, -26, -7, -119, 4, 58, 93, -30, -40, 108, 29, 71, -56, -173, 63, 1, -59, 1, 115, 22, 144, -71, 40, -81, -31, 43, 55, -29, 41, -56, -60, 39, 97, -48, 54, 69, -44, 68, 90, 25, 30, 28, -41, -1, 55, -98, 112, 27, -42, 146, 87, -103, 47, 8, 30, 10, -106, -41, 29, 88, -121, 78, 46, -32, 126, -12, -175, -107, -51, -4, -150, 73, -2, -47, 111, -121, -92, -153, -16, -36, 47, 120, 104, 153, 118, 67, -57, -73, -75, -34, -43, 99]
3988I9j53R0k3L0o5P6n0j59K11r8m1J29k23K46J6j21N8j12k2J24Q8j57M4NL7p
4014B2o6L9R1j56j35L29j62P0K9q2O3p5Q8O5k23O5O1rr7K36k29N8k6J37p3Ml7
4041a3o8M6k4J2j22R3J98r0j7j48J35J6rOK9j19q3J79J3r5K2N6n6K4p9J82j16
4068b8k7K4r3K49n0P0k75J84j9o3l6J02j11k6J13k2k36J99J11r5q3J35p3n0K11
4093A11p9p4J46j80K2J01k31J46Qp8J44r8J07oO4l4q5P6j04q2J27k46K67J0r8
4118f6K0J85K2j71q8K84l36K07p6N8J1P5k01M1Q1j33L03l82J93J63k61K33k19
4141e7K64j95m1L2k0J94k39N9q4M3O9p9K03j78n2K00j74Q1L9J17l33J68k26J60
4165d9k8O0K01j98l4Q9p9rO4q5O7j7k2J19qj09j18J42p3J19q7j6J32k23J47M9
$$ y = [99, -54, 36, 13, 43, -22, 54, 4, -155, 56, -42, -83, 46, -177, 69, 85, -36, 22, -90, -112, 12, 100, -57, -13, -8, 29, 22, -44, -5, 86, -70, -205, 124, -38, 32, 61, -21, 42, -33, 55, 120, -103, -38, 23, 14, -83, 153, -76, -18, -44, 93, 20, 24, -13, -81, -35, -59, -47, -169, -76, 122, 32, 15, -133, 2, 18, 9, 15, 44, -75, -158, 21, 34, -61, -39, 17, -39, -15, -94, 88, -28, -55, -31, -124, 125, 75, 145, -130, 54, 35, -28, -64, 38, -73, -99, 14, -8, -244, -45, 66, -29, -112, 23, -50, -100, 111, 32, -42, 104, -76, -54, 47, -184, -38, -30, -108, 36, -62, 45, 39, 103, 69, -16, 60, -44, -126, 1, -245, 22, 32, -66, -46, 139, 161, -10, -98, 186, -150, 57, -19, 39, 50, 125, -76, -35, 46, -87, 216, -166, 27, 190, -71, 162, -57, 207, 12, -29, 3, -17, 177, -62, -3, -87, -44, 25, -54, 149, -29, -81, 119, -55, 26, 65, 182, -151, 17, -209, -49, -77, -17, 184, -14, -48, 41, -38, -47, 17, -68, -1, -18, -40, 79, 71, -38, -156, -14, -87, 32, -55, -71, 61, -162, -15, 34]
4191C4j62N3O5l1J42r4j18J98j1j87J95j50J32l9L5j61K0k5J14K8j8j86K59j34
4215d1P6oj26J22M8p0P0j46N4L6j38J35r6m8K8J32p2J20rl0K6o3J58k17K6J98
4241A67k86J70j15R2J5j53p1P8K18j61K8M7P4j08R5L5o4j07Q4n9j71J84J22k49
4265a35J50m7q0Q9O6j61J59n6q0RM5Q9p6m1J70j72N6m5n0K50j66N6p2R2L8k4m5
4292A9P0j82J56O2j14j5l5K3J99k53J57Oq4n9qR9rJ95l11J22m4M2k24J21Q1k0
4318fj18J70J15j07j6j97NJ58M6M9j00N1j28J51m9p4M8k99J97J74q6j10J61j44
4342a09Q1k8K41k88Q1J16Rk13L4J23r9JnM2jJ14j27p4N1K2J03j32J28p2J10p5
4368C3j28J58Pj00J10k14rJ5n5L17r1O4j40J58k45N5J08P0r6n3m4O2k5O4L8RN
$$ y = [34, -128, -75, -10, -41, 101, 7, -111, 87, 76, -111, 84, -66, 66, 27, 62, -99, -79, -104, 10, 38, 20, -166, 93, -41, 35, 29, -97, 25, 73, 3, 73, -73, -19, 17, -121, 14, -82, -130, -102, 30, -42, 78, 69, 39, 65, 2, 160, -57, -31, 167, -119, 51, -64, 28, 43, -110, -181, -103, 115, -46, -18, 29, 103, -5, 90, 125, 61, -46, 38, -21, -192, -8, 114, -135, 15, -32, -112, -23, 43, -118, 41, -15, -95, -86, -41, 48, -28, -69, 101, -71, -15, -60, -110, 140, -26, 30, -42, 50, 88, 64, 19, 89, -93, 63, 125, 11, -4, -39, -16, 183, -70, 87, 93, 9, -50, -58, 41, 32, 227, -84, 38, -6, 36, -188, -67, 14, -6, -124, 46, 161, 54, 38, -159, -154, 4, 50, 99, -1, 50, -78, 73, 24, -50, -2, -301, -104, 70, -16, -126, 35, -109, -28, -56, 185, -103, -22, 94, 103, -110, -76, 47, -52, -51, -56, -14, -15, 99, -28, -102, -51, -29, 74, -58, 70, -2, 108, 33, -95, 63, 70, -30, 80, -134, -143, -128, -183, 134, 43, 107, -33, 125, -120, -65, 43, 113, 17, -36, -80, -18, -43, 21, 59, 68, 73]
4395G3Pj29k9K6K9J17j65J17Lj56J72Nj30m0J52j20N6N4j68l7K16M0m1k0n7N5
4421C0L8n9l7k6J16m3k0Q2j64L3J23j18Qm4N8J5j44P8Q1L6L3Q6j46n7m2J60m1
4448C6r9O1N3j01n7M6K22j37Q2l7L4j24o2J6Pn9k6J43j25J38n9M7m0kM4kJ25r3
4476C1n4M1n2l1Q0j5j9J78j62R4j98J6qJ84m0K3N9k45J89O6j48l1O1j66M4k3R9
4503b7N5P7O9k30J63j54J8L8q7p3Q1m6K37p0r7o6R9J8O3l4l3J9k6L2m5j04J27
4530DR6o9j25J12j9N1O1p4n2M8m2J45q5j34O9l0L8M9n3K9L4L0M9j72J05j81O9
4557d7J9N2q4N0k0M7N2j43O6K44j81K2q0J25j85J99kk17P0j12J8Q7l7J65j09R0
4583H9n0M6p5R7l2o9J50j49j16J61k7n4M2m5N0j59J05r6O0K7J89k5%j71O0p0J1
$$ y = [73, 80, -49, -78, -52, -23, 94, -71, 46, 49, -107, 65, 70, -60, -100, 52, -68, -12, 42, -126, -163, 53, 93, 52, 32, -25, 30, 68, 9, -28, -54, 62, 19, -1, 81, -83, -50, 73, -45, -37, -81, -23, -8, -152, -74, 7, 43, 76, 162, 16, -41, -83, 77, 36, -63, -2, 51, -50, -107, -61, 161, 24, 106, 69, 103, -21, -83, -67, -60, -119, -145, -2, -127, 11, -48, -1, -41, -43, 1, -1, 124, 31, -23, 18, -34, -65, 15, 0, -19, 159, -3, 91, -107, -91, -99, 85, 45, 68, 127, -118, 71, 137, -11, -42, 19, -147, -103, -126, -27, 28, 105, 174, -56, 107, -47, -29, 9, -78, -151, -70, -116, 121, 51, -46, -112, -13, 5, 68, 34, 1, 20, -6, 26, -19, -123, 4, 100, 31, -94, 18, -1, 50, 111, 37, -15, 33, -9, 136, 51, -83, -14, -44, -6, 43, -10, 19, 53, 83, 132, -40, 65, -116, -47, -28, 24, -60, -10, -30, 17, 69, -74, -8, 236, 55, 77, -3, 122, -63, 136, 134, -83, -13, -125, -107, -20, -57, 108, -1, 89, 39, 85, 10, 107, 75, 6, 156, 7, -109, 52, 25, -29, 13, -32, 18, -141, -36, -132, -72, -45, 144, 119, 119, -52, 8, -62, -51]
4610e1Q4n6j69K18q6J24o7j23K04J6J2j16o6O4N6r2k8J12J54k33O3n9j0M2K4k9
4636a2O1q7j93J23K2nQ4P8m2J56j37p5j55J19O7J7o9J07j49O5J01L5j48j0K4j6
4662c9j5R2o5PJ1p9Q5J7r2Q3P2p8R4k83J67J03k15P5R9n7N5J70j92J6Q2o8n6M9
4690C8J30j37n0Q9r9J32j14p3J42k46J61K19l57K37r4Q6j63M8Q6p8J94k33N9R9
4714G6J7j07N6j42J52r1k8M0M4j71P4J44k5j49K54j2j91J11n6o0J02r0J43p9L5
4739D7K1k27J97k9J15j67N9l0k0j21K28on8NJ07K7j13J46n6k23J49R6j72n5J23
4764D3k7Pr1nJ47j15R5N1Q2j91p0L8r8K4P3j7J18m1%o7M2N9l0J0J73k41J11L5
4792A15k39J13J31o0j41R8q4jK26l3j13q8J9l0P4O3J2q5O7k0n0K6k1O8L1j06J7
$$ y = [-51, 33, -23, -192, 26, -60, 64, -3, -126, 78, 94, 106, -10, -76, -12, 44, -48, -76, 36, 190, -43, 20, -39, -49, -7, 17, -12, 49, -38, -231, -108, -86, -91, -7, 71, 29, 185, 48, -27, -182, -63, 4, 21, -48, 59, -90, -25, 76, 111, -37, -47, -23, -39, -54, 38, -27, -20, -9, -88, -3, 14, -78, 5, 77, -1, 93, -190, -23, 80, -135, -60, 39, -18, 37, 207, 15, 31, 113, 45, -11, 38, 168, 31, -19, 70, -29, 103, -11, -84, 58, -188, -27, 192, -165, 72, -22, 64, -99, -51, 35, -43, 151, -82, -23, 76, 93, -14, 42, -100, 52, -39, -67, -27, 17, -154, -80, 64, 39, -110, 144, 132, -59, 52, -4, -64, 38, -52, 91, 12, 47, 68, -159, 38, 9, 124, -43, 16, -14, -34, -155, 73, 67, 9, 14, 121, 148, 35, 181, 125, -98, 51, 147, -25, -80, 43, 16, 23, -68, -73, 74, -41, 54, 105, 187, -4, -74, -36, -134, -110, -37, -54, 64, 23, 23, -44, -2, 57, 27, 37, 210, -31, 80, 115, -124, -11, 120, 60, -81, 17, -67, -68, 158, 125, 12, -76, -57, -87, -13, 50, 62, -23, 44, 24, -26, 0, -21, 47, 78, -28, -11]
4819a1J5K8j6m2M6j71L46j86n5J69j24j0N0j13K2r2J64l2J32p0k7m5L9j05K27
4844A39r9o3J27k31J78q1o4K60r3o0J26n1k33J75J19k13J00kr1M3N2J59j70J37
4868A64j18j90P0J99p8l65K23J51R6k45nK35k60K12j09J69q1r5J09l5n4m4J33
4891H2j14j00J15K2%j19K38j4k40P3n3J04nR0r4j0M4m3l8J68j41r3j0Q8K8p0Q7
4918el9L0j95K39O4K7k8j06o7k4J65J64j43j31M0kO0qj2R7j19Qq2M6J05j1j00
4945b7Q5o5Q7j87j9M8ojO1K1Q6k22K51p0j30K2K36r4p8j40K03j43J45j6R3j22
4971A8k8j4q0k3J61M1p1n4J2O0J38k55J17M4p3J54k39J81Q4p9J8j40q3J78j28
4996f1N6M4J33j57Q0j61j18J92p4KJ6P7J3m6l8J22k09J70j30Q2k00K89r3m0j3
$$ y = [-11, 4, 32, 16, -26, 20, -151, 195, 9, -46, 123, -1, -11, 39, -74, -52, -144, 20, -12, 120, 50, 23, -22, 17, -88, 139, 40, -23, 104, -127, 51, -30, -94, 166, 73, 13, 139, 88, -145, 30, 149, -64, 36, 34, -57, -14, 38, 197, 27, 164, 46, -144, -74, 125, 47, -318, -95, 56, 152, -93, -98, 137, -123, 89, -20, 149, 68, -27, 82, 47, -7, -51, 82, -32, -132, -17, 5, 5, -114, 124, 110, -130, -57, -110, -6, -11, 79, -15, -25, 19, -24, -62, 106, -35, -128, -138, -50, -22, -92, -5, -44, -14, -209, 30, 94, 121, 93, -13, -80, -104, 61, 225, 82, -49, -9, -11, 49, 41, 29, 126, 7, 15, -67, -21, 84, 73, -27, 58, -7, 80, -107, -126, -78, -84, -85, -24, -3, 83, -139, 112, 42, -88, -66, 170, 76, -2, -142, 61, -82, 63, 47, 140, 18, -10, -24, -104, -127, 34, 75, 4, -50, -38, 22, 160, -95, 22, 66, -7, 147, -92, 89, 173, 94, 112, -28, -111, 67, -61, -5, 39, 172, 15, 95, -66, -184, 8, -66, -64, -48, 29, 42, -4, -42, 80, -129, 41, -89, -7, -207, 82, -11, -51, -64]
5021f4M7O4k2j1o9l4J41l3N0j22N8m4J52k01J11p4j14J15M4j1n0k9J35J48j99
5046a2K7j95J00J48N0r1q3J56o3j67J64n9j22K44p1j1j5q8R5j01Q1rK4j11l6K60
5072A15j29k4l6J07Q0q2r0n5J16J5q7j6L3J30r3J39lO7k41Q6rN5J17j67r7k7J33
5099C7M0Jp6Q7l6j02j41K14N5j39m9J87k34K58p4O3r1l0J7K2r8M3L4K8R1j25j5
5126c3J3j56K79n3j69k0J64j33J60k6o6M8J9mj20J53j2n1p5J2J66j6q8M0P8L3
5152A43j10r9J34q0%L1j03O0m8M6K6m4O5k2M5M4l9l2r5K40j39O7l12K40j37J53
5178C4r2j1Q1n6J11j01O6L8o0j1m6J18j5m8L8Pk72K60j13M8Nq8J71L9j25n5o4
5205a41P3J45j90O2Rk7J67j03N2K5p9K1j6r8Q5J11r3N8p7L9j1L6m4p3m2J74q3
$$ y = [-64, -17, 47, 25, 14, -55, -89, 52, 19, 69, -53, 5, -39, 113, -88, 23, -51, -165, -50, -6, -17, -67, -96, 39, 187, -12, 15, -180, -80, 68, 118, 27, -56, 100, 37, -130, 34, -25, -147, 97, 26, 15, 0, -88, 7, -94, -13, -22, 2, -109, -145, 115, -14, -38, -74, 33, 113, 31, -59, -114, 2, 17, -70, -86, -53, 77, -16, 123, 120, 187, -54, 32, 23, 78, 195, 28, -69, -96, 37, 77, 78, 2, 89, 53, -49, -190, 24, 79, -60, -109, 78, -156, 102, 28, 91, 0, -30, -13, 9, -89, -46, -12, 16, 107, -18, -33, -20, -176, 103, 50, -119, -139, 25, -108, 52, 26, -40, 8, 27, 23, -97, 56, 44, -7, -82, -70, 96, 80, -8, 32, 110, 143, 33, -66, 68, -12, -12, 19, -84, -24, -72, -26, 0, -44, 21, -1, 44, 88, 49, 17, -78, 162, 23, 90, -222, 18, -119, 34, -58, -69, 12, -44, 67, -34, 32, 70, 10, -1, -47, 71, 56, 8, 46, 53, -219, 41, -72, -24, -19, -107, 64, 103, -22, -77, -141, -68, 77, -113, -51, -42, -69, 98, -5, 47, 72, -7, 14, -2, -100, -15, 96, 3, 61, -16, 23, 12, 48, 4, -69, -111, 63, -20]
5232b0j15J48OJ1L5Nj03J15k24J66J02k51N1K24j68J40j81O4J12j62J2j6J27k25
5256a47K74q8j84J46M3j44J55o5J27j91QJ28N3l5j32JO0m8JJ7jJ53j51k7P9r5
5282f3o1J69p6J68j85R0k82K04O1n7PJ5p1J74j07m7J49j32K8R2Ln6j07pK25l6
5308I8k78K2M5R7j99K75Rnp8j99K19P1P2j81n3RP8j37J09q1M6m2Q3O1j25q0K47
5335H3j10k04K21M2J0p0J02j28L3N7r4J03Oj54J32Qn8r9K38j40J09M3j01j78J69
5360B0N0k93K01J22K4l50K08O8L0j62J72k27K28j17nP2J0l7j60K57k08J68J2k50
5384a67K15o5O8Llj4L5K7k26J01M7o3m1J95j89l0k3M6N4R5j87q1J91k1j11J69
5410B5j2m6R0j66K59j66Qj2J05j37J21p3M6n0on0M7Q0k1j15R8l2on1N7Mj95R8
$$ y = [-20, -135, 13, 19, 30, 65, 70, -33, 82, -142, 24, 126, -125, -74, 150, -18, 122, -59, 5, 117, -45, -33, -49, 78, -147, 127, 39, -145, 1, 44, -100, 55, -10, 117, -74, -66, 62, 115, 80, -52, -51, 9, -39, -38, -21, -22, 131, -20, -47, 32, -63, -124, 45, -31, 137, -48, 42, -240, -36, 25, -32, -25, -10, -81, 93, -14, -61, 88, -44, -16, 76, 79, 23, -84, -91, 134, 98, -180, -158, -113, -16, -215, 60, 69, 64, -14, -213, 6, 77, 149, -32, -85, -76, 2, -135, -26, -107, -61, -103, -20, 41, -84, -164, 83, -27, -231, -10, 32, 42, -28, 74, -54, -21, 36, -58, 45, 51, -103, 29, 37, -21, -120, 118, -22, 87, 130, 29, -149, 20, 70, -223, -22, 100, 124, -226, -18, 50, 80, -82, 90, -137, 91, -26, -31, 41, 51, 14, -146, 111, -97, 71, 83, -167, 48, -17, 51, 54, 51, 37, 72, 99, -127, -26, 21, -42, -83, 112, -77, -107, -130, -84, -30, 65, -122, -203, -12, -33, -144, 25, 13, -33, 57, -109, 150, -16, -8, -20, 85, -52, 69, -4, 42, -8, -14, -64, -17, 63, 42, -73, 25, -7, -13, -64, -7, -3, -198, -100]
5438a00l2J79j79R7Pq8K0p0J44p8R7J40r6O4k16J53p9MQ1q0Q2j30J88j11k9J21
5464H9j00l5J01o6J31N2j36j23K27k49J35Lr1k0J59o6j05K03k52J94ko7N0j7J4
5489B9K4K04l39N5P5j02J54j98M6k9J43k2K4j91J52j15J80j03O8j31O8r1n8L00
5513A43j92K30m4j17J95k00P0o5j4j31L5J34j9K3J8p4J0PP1q0q3N6qJ01r5J5p1
5540h5Q2j16N3K03k28J21p3N4n7J91j40o2K5lokK20r6o4qn2Q8K5r0K7K7j06oK10
5569A32K8j61j38J51Rj07J35k7K4R2n6Q7q0j95J90r3OMq6MO7j21J06J4K7j56R4
5596e0p8Q1J3Q0j14J53q1q5J5rJ54l3M5j42K5L4K1j58J22j20J29L1K1k1p1J25
5622H7l1k12J49j51O7R9M8J6o1Kj15K76k94m6J26j00K07M0j25j89J74k0K09k40
$$ y = [-100, -132, 47, -132, -35, -28, -116, -96, -166, -22, -100, -3, 137, 41, 105, -111, 42, -37, -33, 48, -32, 50, -80, 108, -3, -32, 89, -11, -46, 55, -11, 120, 172, 36, -87, 140, -109, 26, 29, -62, -82, 77, 11, -94, 109, -143, 51, 49, -18, 32, 15, 29, 53, 257, -82, -27, 48, -54, 100, -98, -52, -81, 62, 40, 64, -127, 25, -90, 90, -13, 55, -76, -8, -99, -157, 143, -49, 181, 137, 20, 215, 15, 85, 20, 6, -125, -90, 44, 25, 48, 66, -8, 2, 9, 80, 0, -83, -27, -35, 66, -29, -14, -85, -3, -119, -66, 137, -91, 30, -43, 11, -46, 145, 5, -57, -32, -35, -41, -43, 177, 81, 17, 9, -43, 45, 70, -20, 7, 34, -72, -78, 132, 160, -1, -139, 12, 21, -86, 49, 22, 46, 138, 82, 169, 89, -106, 84, -9, -3, 1, -85, -81, -14, -135, -29, -15, 12, -144, -50, -128, -47, -34, 46, -68, 85, 4, -81, -66, -75, 79, 46, 91, -51, -26, 8, 29, -129, -7, -127, 2, 33, 54, 33, -38, 87, 56, -156, -7, -158, -91, 8, 56, 72, 11, 13, -102, 174, -120, -166, -40, -140, 67, 107, -18, -207, -33, -53, 156, -84]
5646h4K34r1n9K8j26K20j97R7rq5k6J29J1o1P4N2l8n3K5k9r9J41m9j3J63k9j16
5673A0Q2m3o3K2J36k77J37J12j84J64j31O5l7k6J32K6j04l2J30k01K9J19n6j9
5697iM4j02l1j65K90p2J11P6j46p9N9Q1o0J2o7P9o4K02j16q3J5L9p9Q5j3l6J00
5724G1k10N6p9JJ84l5p5J17p3J13k4J4K9j74J25ro3j04N7J51qj57K22O3l39R6
5750e1O7M5Q8k35N1O9m9m7J28Kj1Q8j62J2j34R1K8O6k9l5Q2n6k3M3R2k51N0j4
5778i5K8j5J19K9j37L2q5J35j9M5j31J01K03m08K76j71o2J59j97J62rM5o2J9n0
5803h8K31k60k1Q2J56l5j50J39l2kj27P2M7M5j26O9k6q9K30r9P0N8L3j40R5m6
5829H6k17J97n1r4m4K04k0j81K29j09J49j12L7m8M6Q2j25j65J71J7j60J96j15
$$ y = [-84, 150, 59, 0, 28, -98, 122, -75, 22, 13, -72, -98, 31, 42, -19, 55, 107, 69, 16, 41, 12, -87, 54, 5, -8, 155, 126, 10, 92, 49, -14, 8, 144, -133, 4, 116, -68, 96, -35, 30, -7, -33, 99, 125, 21, -11, 119, -82, -53, 66, 10, -9, 35, -67, -98, -263, 27, -45, 66, 142, -4, -83, -24, 57, -3, 9, -58, 21, -43, 159, 43, -40, -25, 14, -65, 20, 7, -29, 71, -139, -83, -162, -161, 23, -12, -87, 30, -43, 70, 46, 60, 89, -85, 40, 31, -32, -136, -79, 72, 64, -93, 129, 192, -147, -51, 16, 61, 149, -86, -35, 34, -15, -62, 66, 68, 57, 145, -17, -5, -139, -48, -20, 46, 17, -18, 64, 8, -15, 28, 120, -131, -81, -95, -67, -82, 37, 66, -71, -39, -124, 11, -8, 37, -94, 7, 210, -198, 78, -93, -155, 4, -193, -31, -40, 5, -57, -38, -88, 143, -117, -138, -56, 100, 65, -85, 54, 22, 20, -107, -35, 12, 57, -69, 0, -26, -115, 115, 16, 86, 144, 177, 37, 132, 86, -131, 66, 15, -79, -123, 81, 61, -120, 109, 0, 149, 37, 74, 26, 72, 154, 29, -136, 35, 52, -108, 88, -27]
5852b7N8j49J77P3p9N6j33P8M2j17J48n0l0k5j3p5l8R4J29j94P5j5l8Q3RN6O0
5879A55j54K21k47R3m7MJ2Pr5M4j9m3qO8N5l8j52J24l3K6N5p7J26j62N1r1L44
5906B19k27N4n1N5n3Q6j12N0K6k35J73J26j11j04R6J2j2J62l42P5K35j36M2K20
5930B48j26r0j6j4M7M4j05r9k6L02l3j25j31J54J13j36M0j27JRJ82J5j16P0k09
5955a28K96l45O8J13K6J2p4JR4j02P2J36k04P6J1j28K42j86J17n0o8J29k07J68
5979F9m3J01j4oj50Q8j42J04J22j71n3O2k2J48q6L0L9p5j1J03j35J40q9J27o1
6004G5L2j08J56n0o7O5J6j43J1N6l3m1N8O6k6l9J7r0J2Q1j02np7K02K7M1j91J35
6032G8j44K4R9j9o0j33J62j40K36Lo3p0p5J38Rk0o1N9Om5M1J6K1p1Q7j42R2k6
$$ y = [-27, 31, -118, 59, 132, 53, 109, -24, 54, 96, -21, 127, 77, 47, 22, 9, -66, -104, -10, 119, -75, 0, -15, -53, 30, 39, 95, 155, 1, 222, -25, 68, 21, 25, 37, 44, -51, -7, -26, -69, -77, -9, 46, 8, -144, -20, -53, -27, 28, -49, 77, -85, -34, -125, 219, -8, 46, -5, 50, -3, 83, -29, 21, 47, -188, -15, 111, 0, -104, -8, 4, -8, 154, -188, -113, 122, -14, 28, 248, 122, 32, 16, 2, 49, 93, -12, -111, -137, 165, 132, 7, -124, 30, 143, 7, 47, -80, -79, -70, 112, 127, 11, 81, -128, 168, -177, -109, 4, 30, 42, -32, -31, 63, -39, 33, 169, -35, 41, 52, -76, 166, -20, 97, 47, -21, 108, -99, 69, 26, 127, 113, 107, -43, 45, -97, 7, 129, -42, -95, -33, -55, 93, 7, 37, 76, 1, -10, 93, -42, 98, 9, 136, 75, 107, -1, 155, 105, 38, 103, 119, -24, -13, 43, 10, -31, 27, 93, 67, 28, 45, -45, -33, 48, -54, -59, -136, 66, 93, 134, -57, 78, -66, -42, 57, 38, -22, -155, 7, -133, 103, 106, 43, -27, -102, 36, 45, 25, -36, 23, 29, -16, 25, 41, 62, -9, 78, -64, 28, 2]
6060Bj14J92j5n9j05J24O3Jl29J73K1K7L5q3R1Q2j05L0O6j17J80k16p7N3J54j97
6086a23J32O2q7J14j86J50p4j7O6N1Q9J3j55j4m2P5l1j23R0O8rL6j38m7J65j31
6112f6Q9n2k3M5Q1n1o4J97j11N3l3r0J7j3JM3j78J40M2J25k35J16J22k27J90j28
6138a0Oj33R3Q1k9l5L9jL8mm5O6r8O5n7k6r3J97k05J47Q7n8%O6J92l65M3O6M4
6167G1M7r4o9R9k04K37J00j68j70q1L29Mo7J44j52k5J0o1J90j30p4P9j50K64j66
6192c7Q0p9N7l6qK6O5Lm0L6j48J61q6j92J29m6N8J5J47j06j38J22M9J11j18j02
6218g7J16k4J54r7J1l2j54j9P2J05K8j19j38J52JJ5J6J16k16N9M6n9r7k4K0J89
6244D4j45j07K41M7k9K8n9j09JL3K5O0k8m0L4l3J3r7J29j13K17j0j00p0J23k2
$$ y = [2, -112, 80, 65, 6, -99, 25, 88, 89, -240, -67, -46, -19, 16, -67, 24, 106, 1, 31, 97, -20, 160, -56, -133, -80, 74, -123, 9, 71, -16, 98, -88, 62, -12, -29, 37, 88, 177, 190, 35, 21, -21, 54, 23, -100, -10, 58, 49, 85, -53, -100, 65, -66, 23, -29, -52, -7, 74, 23, -41, 156, 45, 98, 65, -25, -8, -21, -20, 23, -155, -15, 27, 152, -83, 33, 155, -72, 118, -10, -4, -137, -44, 37, 8, -27, 12, 11, 49, 45, 0, 66, -32, 33, -24, -50, -143, 54, -151, -4, 83, 25, 25, 91, 283, -82, -39, 27, 71, 118, 24, -45, 54, -150, 87, 187, 19, -151, -232, 97, 101, 34, 178, 26, 1, 11, -50, 140, 10, -64, 15, -135, 129, -37, 43, -36, 21, -15, -23, 3, 68, 71, 31, 67, -81, 80, -6, -198, -69, -115, -57, -42, 105, -1, -139, -17, 32, 143, 25, -77, 39, 15, 169, 72, 83, 51, -103, -122, -50, 55, 83, -36, -174, -22, -21, -6, 10, 126, -90, -31, 15, -44, -141, -165, -145, 44, -101, -208, 33, 80, 51, 79, 20, -89, -88, -55, -30, 30, 2, -38, -4, -37, -24, -121, 8, -105, 112, 102, 2, -68, 55, 33]
6270C3J71o2o6n2j64J03l7n1M5R9K4n5j05K0o1N0J45Mn4J21j30J50q0j01Q8m1
6296fP9J03j44m2r3R6l2RrnjP4J0k3J09n1N9p9q6L5P4q6P0n2j10J32j10rJ13q6
6326f1L9k7P1j06J64j97J12N3K1J61k05J0Jj20J19Q5j81J13l5K4j1j14j03K2K01
6351C6K0J02k44J94j72Q0L0n6R0o6j5o6lm6J58r0J3j98J49K43k20J28r5L0j00
6376i8J24ll5LPQ9j01N5j08K34k54N7J83j82N0P8k7o5j7m5K3L0oJ80q6p6N0O3
6404A23j52K1j63K02k19J24L4J91j16m9pr5kR7N1j43Q6L6l5J1l5J8N6NM2M4N9
6431A84k25J63k51J04K6L7k07K25k06J21j45K00j6lQ1j32Q2J82j26k15J9J27J25
6454A50q3n2l5K2j5J60Ok70j1Q1Ol2J46p4m1Oj85J47N8J16j39o6j02K32r3J38
$$ y = [33, 204, 142, 76, 24, -140, -37, -74, -125, -80, 19, 43, -12, -117, -97, -158, -108, 37, 41, -13, 108, -22, 128, 48, -53, 35, -6, 73, 176, 32, -10, -103, -7, -39, -30, -39, -44, -45, 29, 39, 16, 125, 74, 133, 54, -32, 3, 77, -9, 61, 9, -101, 31, -79, -88, 25, -61, -22, -49, 22, -84, 80, -117, -5, 48, 69, 230, 25, 35, 36, -84, 35, 120, -61, 52, 17, 41, 30, -84, -187, -165, 36, 56, 158, -86, 108, -64, 16, 46, -10, 80, 14, -1, -67, -70, -116, 42, -48, -35, -233, -84, 159, -61, 67, -28, 2, -98, 26, 23, -12, -9, -2, 87, -14, 41, -67, 167, -87, -30, 153, -29, 21, 99, 72, 7, -10, -55, -32, -2, -8, 172, 86, 10, 60, 123, -29, -8, -171, 31, -188, -64, -30, 161, 45, -4, -11, -106, -108, -11, 40, -103, -17, 19, -16, -5, -40, -22, 34, 39, 81, 125, 184, -41, 122, -129, -25, 1, 38, -169, 56, -150, -29, -174, 26, 10, 7, 88, -44, 38, 220, 94, -121, -102, 25, 150, 67, 15, -20, 2, -13, 147, 153, -117, -128, -47, -41, -73, 73, -1, -42, -36, -221, -74, -16, 100, -39, -105, -207, 25, -68, 70]
6480G0j31J65j83j19K44p7N5o7O4j01J62j84L0J60j30K26r6o2l7L2J17r5P5j02
6504A6p8J81j11q1K16qj56N9LR0l03J15oj36K28mm4N7r2j3J37k2Kj4p0J30j05
6531iK00j42p7O9J38m3rk12K30j06p2R2Q8n6j30jJ3J7j3J31M9k11j39J47O7J8
6557C9m7m3M1J1k3l7qn4R4nJ05K4q7j19J68j26n6K37j05P5j42J2P7r2j7J79J4
6584A15r0J3K7M4n3j45K21j23j08J05n3k3Q1k82M02j00J21p8q3l9Q3O3k84K52
6608F6m4Q5j65Q1M8o8K9Q3p0J09k32J19J12j72j9M7jk0j1p2K09j77P4N1j25M7
6634a6PL8q3L7j38J38L9PpN4n4K20l94%j0M7p5K51j24N1J9r6K57j81N1L2n5p7
6662f2J04o0m3j9J46K4q3J07j32Mm8J31KK6j18n4O6Qj19J66p3j10J25oj01J41
$$ y = [70, -61, 104, -79, -198, 46, -31, 24, -43, 21, -80, 82, -102, -72, 88, -42, 184, 88, 26, -11, 21, 138, 43, 118, 16, -62, 119, 8, -73, 143, 135, -21, 38, 41, 131, -172, -57, -63, -199, 29, 25, -19, 38, -54, -67, 70, 48, 50, 36, -34, 96, -9, 191, 49, -28, 41, 179, 136, 127, -85, 145, 39, -33, 59, 147, 91, -39, -40, -27, -10, -23, 108, 157, -54, -193, -46, 21, 39, -8, -51, -10, 1, -22, -59, -67, -121, -27, -32, 73, 97, 10, -109, 59, -67, -123, 114, 9, 84, -58, -46, 31, -61, -78, 101, 115, 25, 38, 65, 109, 56, -89, 132, 9, -99, 6, -47, -70, 11, -271, 131, 31, 152, 74, -9, -48, 35, 98, -186, 66, 22, 107, -58, 23, 71, 3, 32, 115, 45, 154, -78, 41, 153, -19, -38, 9, 8, -12, -23, -95, 114, -63, 11, 62, -63, -16, -9, 29, -54, -17, -155, -17, 22, 29, 22, 76, 22, 242, -152, -152, -162, -115, -190, 61, -63, -12, 7, -89, 168, -13, 38, 70, 15, -62, 42, -18, -61, -80, 66, 90, 7, 114, -18, -14, -62, 69, 71, 97, -21, -75, -9, -1, -120, 46, -27, -137, -12, -18, -119, 22]
6688B2p4pj19R2J4J8K9L8KK7q0j8R9O7j52m9j02L19k40J87L8j44J0M8P0k25J47
6715A7J01j79J8n9J33n9q3R0o9P5J02k98K11o0J81j09j41J71j28K07j13J4J52
6738A74k56L7J2J29J23k80K24r2m2J5lj65J46n8k9R2l0K2k4lr0J00J64j23Q9k99
6764a67L13p4k9N4j37k0J36m4o2J73k01J07l3J04n2j27k8M8Q1n4l2N4N5n1p2%
6790e8K1K2k7p2oR0J41m9q1J0J58j53j8J6j39P8O8O2J9j76J36JN8m3j13j4J05
6817C6j12O0K8j2J07k42J82R4j08R1o7n9R9r0l5R8k1qj59P4J9l8K01r9j7j2K13
6844B23k61P0M7j64R3rp8J6K7J2j0j21K44q5L9N6j95K4O3o6J20k22J74L9o1J09
6870H4m7m3J18j9k1o3k7J30j81k8J47m8j13K4J31J57j77j13P3N0M9J6j18K4q2
$$ y = [22, -52, -59, -178, -86, -72, -54, -25, 13, 15, 42, -38, -56, 43, 110, -42, -91, -193, 126, -114, 73, 111, -33, -23, 25, 95, -130, 17, 118, -61, -43, -102, 31, -28, -111, -21, -90, -15, 87, -211, 0, -60, 121, 12, -129, 42, -86, 121, 8, 22, 174, -82, -45, -33, 96, 219, -61, 163, 71, 29, 44, 41, -124, 22, -36, -65, 27, -3, 19, -5, -8, -98, 2, 166, 43, 132, -167, 146, 72, 43, 97, -40, -60, 76, 32, -30, 143, -58, 49, 16, 120, 68, -59, -87, -39, 42, -12, -44, 10, 65, 14, -58, -58, -37, -15, -42, -114, -120, -30, 111, 62, -19, -9, 149, -4, -22, -6, -145, -67, 1, 63, 82, -94, 42, 43, 101, 58, -55, -69, 36, -76, -16, 12, 0, 107, -135, 47, 141, 33, 124, 57, -2, 97, 7, -28, 70, 49, 41, -118, -44, -25, -63, 138, 39, 22, 10, 223, -38, 32, 79, -85, 8, -1, -79, -63, -36, -24, -34, -155, 89, 4, 43, 99, -96, -72, -9, -75, 45, -177, -3, 36, -25, 84, 37, -6, 112, 93, 72, 9, -18, 112, -69, -97, 50, 2, -111, -87, 44, 201, 24, -89, -16, 34, 83, 99, -19, 5, -77]
6895g7L4mL1K5Pj7M5j62J11R2j11k4J39j94Q5j3J13k06J11j7J31j04K2m0O2p5
6921c6K4L0j6J31j99K41k46k6N9J40j89R8j06%mJ14qk10J50M3J20j29p5J25km8
6947a9K46j61j05ML9q8L5J0j02Q5r8K64j66J4p7R9j92K37J49l17J10L5P1j20J79
6972A32j31L5R4j76K6L5P6r9k8M8m2J81j30m2p2J11j2qj6o8K40r5n1J16j61P2
6998C5j17J64r1J18m2M3K9o0j10l0L07j52k54K5K05m6K11m06K80J9o1k6n8k2J44
7023A05j40p0J28J8KQ8j48l1j24J17N1m5M8n3L2J07j01P1l2O3k38Q3J33j76L9
7048g3Q0K1j35K7J63j08Q0L5m6r3J50j58J17N2m1K8j21m4K01j33J7J0j09J78k13
7073a15J29J86k27m8J73k6j02Q6M2L0j76NJ07j41J04L0j02J63j47m6J16j11j6
$$ y = [-77, -43, -47, -16, 9, 16, -1, 44, -118, -7, 85, -26, -50, 89, -105, -20, -33, 80, -126, -15, -32, 99, -5, 17, -23, 39, -36, -12, 18, 2, 133, -66, 175, -71, -97, -38, 102, -87, 11, -95, -95, -99, 15, 7, -203, -53, -10, 110, -19, -94, 31, 29, -19, 227, 66, -39, -35, 4, -84, -49, -39, -141, -56, -154, 110, -56, -42, -119, -20, -212, 25, 174, -143, -33, 2, 73, -47, 132, 1, 36, 130, -46, -20, 15, 91, -8, -36, 12, -30, 151, 21, -21, -93, 18, 6, -2, -18, -86, 154, 59, 8, 124, -37, 35, -82, 82, -9, 109, 67, 110, 139, 79, -31, -61, 246, 94, -160, -135, 70, 24, 235, -171, 109, 128, 67, 41, -17, -39, 105, -35, -105, 23, 41, 43, 131, -17, -48, -172, -55, -4, -49, -1, -54, -22, 85, -16, 55, 23, 86, -152, -69, 64, -112, -73, 7, 28, -107, -80, 83, -25, 55, 90, 44, -49, 101, -57, 60, 112, 71, 99, -22, -66, 135, 2, 19, 29, -80, 98, -115, 14, 200, -27, -75, 98, 72, -30, 56, 98, 128, -48, -43, 64, -77, 27, 57, -45, 118, -29, -75, 41, -70, -86]
7096h6J80j44oL12r9j21j16N3J15n6k2R6p8J06k01k5J96r9J0R1j28jj43J15K7
7121b4n8J71l8j45%J59k22O9j7J52l8l5L0l9J22q4q8R2Q9j55J3r3K38o6N5j55
7147f7M3j44K06j36J29m1K7j39J06l6J31Ok02K07jJ08k54ML6N9m8O7j32J25k2
7172C2q2J60k36K54j28l7n3J65j11l6o0J23O2r8M0j37K36j84Q2kQ2l1q5J6l5j05
7198a68K48k13J40k1O6r5J0q9J46R2j05L5o8o1j28K54J23j75O8j5l6n8o0J10K5
7223B5L2P4p9O7kk6j4k8n3M6o9J90k23j55K57r1R9j15K7q5J03J05r7m6Q2O6j14
7250b4J1QL8n9r6PJ21RJ5N1k8j03J30K3k32K67k06Q3n4jk7J19q9JM8J1J04j53
7278b6mJ09N3j53J2p5L2m6R8K5K8j57J10n7P4qp5P8j64J42j42K27o4r4L8K9J3
$$ y = [-86, 94, -50, -56, 256, 157, 36, -80, -27, 88, 32, 10, 106, 28, 134, -67, -92, 104, 5, 15, 106, -22, -23, -166, -51, -24, -82, 89, 51, -94, -94, 65, -157, -88, -105, 47, 9, -26, 4, -35, 87, 3, -85, 7, 96, -59, -46, -139, 99, 33, 88, -67, -24, -168, 38, -98, 31, -10, 17, -122, -16, -52, 79, 85, -117, 90, 89, 197, -57, -53, -17, 42, -6, 61, -71, 54, 32, -50, 110, -126, 128, 0, -37, -90, 75, -36, -72, -132, -9, 53, -45, -5, -142, 94, -90, -8, -10, 72, 41, -44, -28, -63, -168, 80, -133, 7, -14, 52, -43, -33, -122, 24, 116, 11, 46, -22, -83, -211, 43, 166, -9, 59, 44, 8, -50, -110, 0, 25, 57, 131, 52, 119, 117, 91, 77, 49, -4, 42, -27, 163, -60, -215, 42, -49, 50, -65, -38, -123, -20, 85, -12, -58, 24, 90, -24, -13, -5, 33, -26, -122, -115, 6, 15, 30, 81, 53, -50, 80, 103, -129, 138, -68, 15, -39, -40, -67, 52, -37, -36, 12, 23, 127, -26, -30, 79, 132, -21, -9, -84, -52, -98, 0, 25, 53, -104, 6, -51, 23, 15, -60, 18, -146, -4, -146, 81, 17, -77, -39, -10, 3]
7305Cp8m1K2O1l8M2n8K83k05Q5k6p2J9Q2o0j7j6R3j47J38k0l6k0l3Q6r3J42p4
7333B2J26m8k29J77q7M0j29J25J6L8j60J29J04n3j81p5K52r2K7n2R3j85J64M0
7357F2r4J76j16k00J27o9J50j0n1N3mO1k60J91P1n3q3Q4o4L4N1m4J01j07q4J03
7383B5J4j62N7O2p8j6o1J03QJ3oQ0q4J49j37P5Pj61P9J62O4j54K5o7lm9p3K06
7411G8n0l2j30J90k61K21R4J9k46N9J8K1K1J29j08J2L5j16P7j6j4p6j8J54j04
7436d3P7J39j36K7o7m3J19q7l9J76r5o5R0m0O6k06J07J7o9J06QL5p9j14N8P6k1
7463cK0J22j22N4j29J22J2n0p9k9J7R8n6LJ06j56k5L40j56j37R3j10L3Q0j36m0
7489a28K2K39n0j16p6J00J2K0m3J8Q5q5o7M4J46k76K02R7j05j19N3J0O8m6k3L8
$$ y = [3, -75, -116, -94, -33, -71, -29, -87, 196, -9, 76, 50, -22, -3, 79, 19, 2, -14, 79, -68, 70, 50, 14, -6, -39, 47, -46, 96, 22, 148, 100, -129, 48, -39, 1, -128, -3, 13, 51, -109, 20, 124, 71, -110, -185, 67, -25, 2, -50, 43, -142, 22, 62, -32, 144, 28, -172, -45, -114, 36, 26, -25, 28, 24, 85, -175, 16, 87, 34, -49, 35, -29, 5, 56, 12, 113, 6, -78, 25, 39, -123, -66, -4, -82, -98, -159, -56, -48, -35, -41, 39, -45, 104, -33, 42, 49, -112, -33, 129, 193, 39, 64, -3, -6, -55, -128, 78, 28, -4, -134, 56, -205, 16, 110, 129, -117, -58, -40, -19, 2, 131, 23, 35, 70, -46, 31, 15, 1, -75, -93, 61, -43, 34, 173, 37, 64, -3, -46, 73, -14, -53, 123, 28, -37, 53, 13, 79, -127, -20, -3, -72, 34, 42, 77, -2, -116, -58, 18, -3, 17, 139, 17, 71, -58, 64, 76, 26, -53, -82, -65, 33, -23, -20, 86, -70, -95, 245, 89, -48, 45, -65, -32, 48, -88, -128, -106, 133, 83, -33, -109, -9, 3, 23, -20, -2, 83, -2, -69, -25, 121, -155, 47, 144, 39, -80, -27, -17, 51, 5, -18, 20]
7515B0k7l3N1J5m1q8O9J0L7R3j14R0j07M9q8j6kN3J23j54m8Q1o4q9M1J22K8O1
7543G2j13j9j5k0J23j25PJ89j30J44Mj18j67K26p7r9K48Mj39j67J46M3Jj8k6J45
7569A19k94L04j33mK7L4j92J78o9K4J5m5P4L1K1n9Pp8M1p8P3j43J10K24j70J8
7595C5M8p0k1J6K54m35J12j20P7R8JM0J00r5L6O4j49P8p1J18j37J2m0P6o5M3p7
7622g2R2r1JJ53K8r2p9J70k68J14J8q0J38j19KJ74j16N5k03O0J17J78j05k7m5
7647CmJ50k39N3J6P1n7J5J01o1k07J75n3j5J4L3O2jk8m1R1m1k22L01m6K1l09L13
7675I5k1j62L5O5r4%Lj9o5J16nJ75q9n1J41j51OPM4j17J33j04J12o9R2r5M2o6
7703d2O5l6j66J31J32p9L1J45k7j77K1r7J4O9O0k26J50Jj7m0J59j68Q6N6q9K56
$$ y = [20, -7, -40, 11, 26, -15, -103, -34, -24, 13, 106, -8, 82, -25, 24, -64, -80, -82, -29, 94, -60, -108, -27, -91, -180, -139, -17, 11, 72, -41, -60, -75, -95, 28, -97, -90, 99, -31, 113, 117, -1, -168, 58, -19, -118, 130, 134, -5, -172, -26, 17, 18, 0, -26, 119, -175, 129, -4, -8, 19, 53, -139, 39, -30, -6, 9, -36, 38, 69, 90, 31, 38, -40, 1, -77, -4, -147, -37, 187, 17, 35, 83, 13, -8, 8, 262, -173, -61, -181, -104, -6, -5, 35, 135, 40, 76, 140, -9, 69, -2, 116, -21, -9, -49, 27, -38, 5, -72, 20, -71, -70, 83, 111, 19, -60, 110, -158, -44, -26, -106, 32, -87, -85, 89, -27, 28, -175, -115, 2, 180, 75, 48, 3, -1, 149, -90, -37, -21, 50, -7, 8, 109, 48, -159, 16, -37, -52, -38, -5, 57, 56, 28, -13, 78, 37, -185, 116, 70, 91, -218, 95, 74, -88, -53, 12, -82, -82, -79, -98, -163, -47, -52, 123, 34, -17, 124, -27, -21, -14, 30, -87, 46, -58, 54, -15, 77, -18, 24, -42, 23, -13, -179, -48, 84, 5, 36, 181, 154, -23, -2, -99, -85, -16, 44, -182, -32, -31, -48, -88, 71, -97, -11, 45, -44, 212]
7729B12l10J92r8J3O8o9m3K5r7J24p3J41j30j7J54j23J20j40Om2J24k6K6q6J15
7754F6j52L9j2j06L01k04M7L2J4J58j75J2q6M2K10k13q6N3j10K18R7j78L1rN3
7779D2J01q0k8K9K8k84J61j9J12l1J16r6k69J61J23pm1K4j34n5K88k2j24p9N8
7804b6L0j44O3P2k7J09k9o1J9q1R3j3m1L6P5q0K2o2P5J9p4r9J10O7J09l20J27
7831c1NJ33j10j6J23j32l3j1J03o8Q6j52K39k65N8O7Nj4R5j03M1R1k90K93j09
7856Eq8k0J85r1l3J2j18J88J2j3o2k6J0P9j03J07k4l0kP5j01j6J31j2j75L66k4
7883B32k94mj5l5N9PO1Nr6K87k04k8M8q6R0j01L6j3j51L20k5o8p8K00j47k3j34
7910a57J95J60k47NR9RM1j10j51K05l9k5O1m4J54k9j84l8J05po1O7j1P9n9j40
$$ y = [212, -98, 94, -4, 9, 77, 8, -35, -10, -107, 17, -56, 85, -45, -62, 92, -31, 89, -51, -45, -87, 37, 11, 37, -49, 66, -86, -47, -59, -165, 136, -68, -21, 11, 25, 183, 8, 20, -66, -24, 186, -27, -113, -60, -170, 48, 145, -33, -2, -11, 42, 143, 63, 35, 64, 92, -192, -31, -50, 62, 31, 147, 51, -218, -57, 66, 59, 18, 42, -92, -147, 141, 119, -5, -84, -26, 4, -140, -77, -5, -32, 77, 48, -13, 6, -75, 18, 5, -36, 0, 75, -5, 17, -45, 30, 49, -25, -124, -14, 53, 162, -158, -31, -26, 107, -3, -19, 104, -28, -61, -72, 31, -37, 49, -103, 136, -129, -71, -4, 1, -13, 82, -21, 20, 111, -179, 114, 5, -83, -103, 82, -9, -42, -30, -148, 40, 52, 39, -23, -49, -39, 40, -63, 44, 20, -10, -12, 63, -38, -54, 77, 65, -110, 256, 232, -62, -66, -81, -116, -57, -50, 11, 16, -80, 207, 3, -25, 23, -63, 27, -74, -38, -51, -202, 118, 93, 25, -53, 147, 0, -23, -157, 38, 198, -49, -44, 55, 64, 105, -5, -156, 49, 10, -15, 46, 2, 156, 127, -57, -95, 10, 3, -58, 9, -2, 77, 18, -122]
7936a22P9N1M6q3J8P8q7J42j42J86j84l7r9K23j31Q7O3q8P6M3j68J79k61J13j3
7961c1j1J21j24J16j31K1j19J64Oj6N7p0J6J00j10k4n5R7p2o1J56jk0m7N2n2R3
7988E5L0l6n7l3O0j18Q0J2K4J2Nj55J50nn7J51k3j76J16n8R4jr8k15K20k1J7J25
8016I8j75J60N8j80j3J7M9K00j95Rnj15R7j77L9K70p9l1J5q6j6M8q9k5K81j57
8042bp4J43j58P2p7M5O4o8J59l12J87O2q0J26j89Q8k9J03j16O1m4J29j54J57J6
8067A09k7q5M6n3r9qJ23P0j39M9N3n0k9Q1o9j00J73j42l1O7J23p9QJ87j66o0p6
8094a24K76q9k64J71lo3J47m1m5j4N1L3J9J20k9j74O4P3j18n5N7o5J72k27K21
8119I3j33R6J9j77Q0Q1j02p5K74r3j2Pj00LL4PL1j0L9j7j06J14k7j31J00q9KJ2
$$ y = [-122, -43, 8, 54, -29, -11, 67, -20, 122, -20, 166, -18, -55, -154, 69, -62, 25, 88, 0, 76, 119, -49, 130, -131, -18, -31, -42, 79, -45, 71, -60, -39, -158, 6, 12, -4, 53, -17, -1, 99, -11, -35, -90, 7, -65, -126, 30, 29, 9, -38, 14, -38, 55, 85, 49, -8, -41, 19, -99, -19, -7, 17, 29, 34, -121, 29, 24, -33, 118, 95, -81, 35, -23, 71, 70, -28, -243, -23, -44, -27, 98, -77, 83, 141, -39, -52, -35, 14, 214, 19, 28, 23, -92, 5, -172, -133, 137, 58, 27, 42, -44, -60, -12, -101, -126, 155, -2, -76, 67, -91, -19, -96, -51, 13, -55, 104, -208, -21, 41, -39, 87, -102, -14, -43, 60, -56, 5, -39, 90, -64, 93, 109, 82, -3, 43, -10, -109, -117, 6, 76, -63, -14, 39, -11, -40, 41, -28, -128, 45, -97, -128, -61, 62, -17, -9, 178, 12, -48, -124, 152, 63, -201, -30, -33, -96, 51, 10, -35, -49, 2, 35, 54, 174, 145, -29, 35, 108, -10, -65, -8, -73, 99, -128, 93, -40, 56, 75, -102, -22, 59, -43, -118, 156, 63, 51, 58, -42, -39, -5, 2, 33, 23, 62, 45, -61, 53, 26, -105, -5, -94, -92, -80]
8147h0K58k20Q0j7J6m8r4J33k14K69j47J79p2O4j48J10j22O8j20N3J75j20l9O3
8171B7n8P4j13J39j15k9J37P9o9j84Q0M6J08j02M8J13q9j77J0J72
$$ y = [-80, 178, -42, 38, 21, 37, -11, -105, 28, -186, 83, -64, 115, 43, 107, -41, 69, -53, 15, -105, -52, 123, 3, -36, 27, -31, 43, -70, 69, -46, -75, 62, 141, 72, -112, -32, 14, 122, 20, 68, 181, 92, -85, -75, 97]
8191I7
$$ Imaginary data points
##PAGE= N=2
##DATA TABLE= (X++(I..I)), XYDATA
0@%%%%%%%%%%%%%%qJ6j6J6j6K4l2L2m0M8n6O6p4Q8j04J20j36J54j78K04k29K57
36A36k90L28l68M10m57N07n64O28o94P65q45R33j029J134j249J376j518J675j847
55i69K041k261K514k804L142l544M029m631N398o413P835r985J3662k1690P4695
70F1019l1507p333J12383r0594m3532O2830k2530o0046O6256j5063q6394N9440
82D929O2210j14109j1004J10337m1302p8870P5368K0467o5421L5115L6127o7089
94c3242K2811P2836o9036m0545J03172o722r2828N2012N5909o9823k025N7368
106D9887m0873j8503O6351k8677n6325P5271K7174q9017K4314P9249n3911l3036
118A904O8808q687m4787M8155R452n8992L7392M5121p2665j0730P8195l4372o1971
$$ y = [0, 0, 0, 0, 0, 0, 0, 0, 0, 0, 0, 0, 0, 0, 0, -8, 8, -8, 8, -8, 16, -16, 16, -24, 24, -32, 34, -40, 48, -56, 64, -72, 82, -96, 108, -121, 136, -154, 174, -194, 216, -241, 266, -298, 330, -364, 401, -444, 489, -540, 594, -655, 721, -797, 878, -969, 1072, -1189, 1325, -1479, 1663, -1881, 2148, -2483, 2915, -3498, 4337, -5648, 8014, -13676, 61019, 29512, 22179, 134562, 43968, 436, 63266, 40736, -19310, 46946, 31883, -54511, 4929, 67139, -46970, -57974, 52363, 11061, -67809, 7559, 28026, -37395, -2280, 33847, -33242, -10431, 62405, -6631, -47176, 55996, 49274, -43554, 8458, 64367, -5456, -7481, 49887, 9014, -9489, 56862, 28185, -28140, 47131, 74305, -14712, 9602, 88851, 34940, 1904, 70712, 62025, 17238, 65393, 74845, 15853, 53245, 98366, 25701, 14971, 93166, 58794, -3177]
131c177N5654J6037o3324J7698L2605n1846j667M9389m4730l5660O4713m782o9199
144c8289L6941M1500n7567n613N1036k9729k5958M8928j0926m6314M4414K2681
156C1104o2665J2289N5320m3210k8058N4641q107m4197L7492J6557m9137J9543
168h428M1189m5721j1451N8689j9324m2032M8614J5608m9799K1714L8177m1703
180E533n205M9266k4457l2359M7501K989n0408K7016L0157m8532k507M4119l1068
193A2045k8877M3224m562m6098K8077K2520m6812L642L9729l3223j9638M4633
205A4660j1019l8818L5603J7441m5714J1077L9457l3345j5940M2955j2188l2060
217b7891L5511P902m1938K0396L0989m0815p804M5410j8122l3428L6030Q879l8558
$$ y = [-3177, 52477, 68514, 5190, 22888, 55493, 3647, 1980, 51369, 6639, -29021, 35692, 30910, -38289, -1348, 40152, -17415, -23028, 28008, -1721, -27679, 21249, 10323, -35991, 8423, 31104, -31561, -19272, 36048, -7162, -35220, 19421, 11314, -32883, 4609, 21166, -27971, -8428, 32761, -12960, -24411, 34278, 14954, -27078, 21536, 37144, -12655, 9059, 47236, 5533, 328, 49594, 25137, -7222, 40279, 43268, -7140, 19876, 50033, 1501, -1006, 43113, 12045, -16832, 26392, 21830, -24268, 3809, 26329, -20483, -16841, 22888, -10335, -29973, 14660, 3641, -35177, 426, 17867, -27847, -16770, 22687, -10658, -26598, 16357, 4169, -27891, 7620, 15522, -26416, -6020, 24969, -15846, -23650, 21760, 3638, -29790, 6240, 15119, -23439]
230b3439J8237K3914l5607L017L7442k7504k1854M3637o17m1729K4241K6951l5448
243h759j629L2829k1683j4184L3762j1212l0449L2291J3290m2825P710L7244k7360
256i75k0099L3563m396k6427K3153O105l1285J7420K3793l5575o090M1169j4200
269F156l2655K9485J3545l2089Q930K0684k4906N14K7794k2987j7989L7237q57
282A2862l9087J9039K7365l0742p636K9163j2680j4850K4846o256k3715K6721
294E030J1813l6819P369L5230k2794k1182L0677J936k4715J5590R223k3461J1318
307g85J9221k8628n524L4990j2563l0210K5432J4478k9611L513K0488j8211l371
320a0781K2190j6156j4640L0359j61l2916J7584K4893k7155q014K7916q588j5922
$$ y = [-23439, -5202, 18712, -16895, -13878, 23564, -3940, -25794, 17843, 17226, -24503, -262, 26689, -8759, -10388, 22441, 758, -13426, 20336, 9124, -21325, 10966, 24256, -18569, -10859, 26385, -975, -21074, 12489, 8093, -18334, 4819, 10924, -20361, -2941, 20852, -14723, -20813, 20356, 6156, -26499, 2986, 16531, -15558, -6628, 14056, -10850, -10336, 17458, -5529, -23518, 13719, 12862, -26225, -7186, 20179, -10563, -18199, 10964, -1716, -16566, 8280, 2024, -21691, 5030, 16843, -19976, -12607, 22623, -171, -21353, 9324, 11260, -13455, 2135, 11358, -12103, -785, 18436, -10192, -15716, 19274, 6711, -23499, 1933, 16411, -13200, -9687, 10801, -7410, -10781, 11409, -4747, -19387, 10972, 10811, -22105, -4521, 20372, -6783, -14797, 13119, 4531, -11391]
333a1391K0309j801k0001J9851R825l0415N851K9126k1254j8762K7345J588k4811
346a4540J2351J0510k0634O026J6532k2240n287K7986j0793k4521K2470J1949
358I809k6387L565K0022j5433n783J9336j0351j2827K2317L32k5276J4149J9314
371A2787k3371n869K4322q023j5424J7495J252j7523J3616R930k2328L674K3421
384A3959j6566j3850K3893R84k1287J1795J1393j7979K873J6171j5781o547K1832
397A0890p203j9779J7744Q787k2713L606J7212j4632p452J7415o453j4544J6423
410f99K980k0622R239J5020j8554m496K0016p815j4037J6118K817j7619R208J1684
424C240j7524q7J8531j1526j1414J8598K07j7760J1261J0166j7095J510J6802
$$ y = [-11391, 8918, 7117, -12884, 6967, 16792, -13623, -7772, 21354, 100, -18662, 8683, 10271, -14540, -2189, 8321, -12313, -6287, 10245, -11995, -17282, 10704, -89, -24610, -2140, 9809, -16578, -13013, 7009, -8424, -14207, 5129, -5222, -18049, 4268, 4600, -20676, -6527, 12787, -10584, -16453, 7869, -154, -15578, 1917, 3169, -14354, -738, 9192, -13136, -9462, 13959, -2607, -16457, 7436, 8420, -12867, -1072, 10321, -7658, -4785, 11386, -4395, -10942, 10890, 3687, -16092, 1652, 10439, -12274, -8668, 8544, -6088, -13540, 3875, -2578, -17122, -699, 2281, -18341, -9102, 5918, -12636, -17132, 2884, -4931, -18968, -2850, -33, -17652, -8444, 3240, -14284, -14371, 4160, -7366, -18780, -182, 25, -17735, -6474, 3692, -13403, -11893, 4909]
437D909j1869q462J8380k372j5749J3635P994j7400M708J5526j3605n656J8330
450H369m758j4645J4462O221j7715N313J3268j4101l702J5975p931j1736J5040
463D060J578j7685P813J2425j6083l410J6202p905j0686J3864m64j4115J0057
476d349P842j6594J883J6168j1176r929J6269L15j4869R289P391j3872M151J1735
490D254j2538l610J6843n194j4105J3770P300j5852L048J2821r933l229J2965
503F540o267q168J4047N72j5157Q468J2170j4267l850J5321m816j0034J0843O37
517F039j0750Q471N380j3998K473J3809j0374r162J4219J351j3777O110P213j0646
531c642J809Q754r814k850J3299n284j2165J1828O346j4772J086J2085p921m884
$$ y = [4909, -6960, -15422, 2958, 586, -15163, -1528, 6466, -10934, -6226, 9300, -4305, -9961, 8369, 3611, -11034, 3428, 9649, -8066, -2753, 10515, -3586, -7288, 8687, 756, -10980, 4060, 5638, -12047, -4234, 8191, -7892, -11302, 4900, -3005, -13691, 173, -291, -14406, -4349, 3493, -13101, -11218, 4950, -6226, -16155, 114, 429, -14440, -5151, 2240, -11632, -7481, 4254, -8284, -11894, 4949, -245, -14350, -580, 6720, -9132, -6084, 6737, -3196, -6425, 6540, 273, -7895, 6152, 6724, -8433, 35, 12205, -2062, -5912, 9409, 4593, -5441, 5402, 6039, -4711, 3760, 9140, -4858, -2385, 11424, 1050, -8112, 6107, 7458, -6319, -209, 7004, -3642, -1833, 6921, -2893, -5743, 7556, 2272, -9893, 1935, 8281, -6491, -5405, 6680, -1241, -6125]
545f125R964l960o917J0671L14j3033P746J0347j2814l902J4288l208r917Q846
559B300K563r057N981M930j0595K576J1482q836p606J3151J572j2817N335Q031
573I010r164o5Q170p236k703J0940m619r918J0048N600j3039R21J1265o632n728
588c150R147k152p013Q430P38j0679O287Q045j1088l239J2515l415r895Q229K918
603E678q911L941N239r035J236R578p462o473J1509P02j1425N146P628q793r63
618b405Q442n646l648R166k784q439Q425M153j0932J128R877o514n081Q741j373
633C110p215O742J916q980M241O891q787k182J0129k984q294P633K938q792L464
648a70O032p841k33Q483n393n421Q847O36r360M690O168q407n25Q080n102m531
$$ y = [-6125, 3839, -121, -7038, 3633, 3947, -9086, -1340, 9007, -3807, -7709, 6579, 3371, -6546, 2300, 4863, -4194, 1787, 6717, -3878, -1302, 10180, 1344, -6262, 6889, 8461, -4356, 979, 9010, -154, -219, 7951, 715, -1988, 8952, 4333, -5585, 4463, 10063, -2976, -2055, 9210, 2578, -3150, 5997, 3845, -3168, 5262, 6000, -4679, 1608, 9653, -1435, -4674, 7841, 4426, -5469, 2760, 5678, -3233, 708, 5947, -3088, -1852, 7726, 264, -6209, 5300, 6002, -5423, -277, 7351, -1442, -2405, 6037, 391, -3257, 5909, 3125, -5314, 3111, 7264, -3668, -2540, 7337, 823, -4258, 4483, 3110, -4105, 2637, 4553, -4427, -186, 6705, -2082, -4264, 5865, 2881, -5413, 2220, 5158, -3634, -170, 5862, -1979, -2212, 6271, 878, -4543, 4304, 4940, -4420, 270, 6438, -1969, -2494, 5586, 484, -4047]
664d047Q055j244p441O117L825q722J369P678n781m000Q205j285p304O286L196
679D907q271K428O529o470k415Q020k544o348O347K006p929L055N831p137j544
694c535P796l701n391O654J071p217L560M820p027r9P592m948m464P622R9p353
710d521M470M199o481M84O020m420l291P161j611o529N834L117p758J438O309
725D421m988k882O028j293n100N284J503o656K908N581o396j774P533k081n457
740c369N184J777n407K441L862n571J27O279m468m122P155J33p175L410M311n616
756a049o61N184l427k731N767j669n626N381K585o957J035O502m332l181N505
771B326o23m289M014J172n393L014M212o091j260O891k226n605M824J776n070
$$ y = [-4047, 4008, 2764, -4677, 1440, 5265, -3457, -2088, 5590, -191, -4191, 4014, 2729, -4575, 1711, 4907, -3364, -936, 5593, -877, -3292, 4728, 2184, -4164, 2183, 4189, -3740, -685, 5146, -1991, -3535, 4261, 560, -4831, 1823, 2894, -4323, -763, 4057, -2970, -3069, 4523, -425, -4889, 2733, 2832, -4521, -51, 4148, -2333, -1849, 4171, -249, -3540, 3621, 2010, -4519, 1315, 4432, -3326, -1888, 4421, -567, -3449, 2579, 1286, -3814, 1470, 2973, -3683, -775, 4806, -1590, -3364, 4169, 2088, -3369, 1815, 3592, -1815, 626, 4488, -1083, -956, 5323, 855, -3267, 3888, 4021, -3154, 256, 4567, -1049, -1710, 3474, 47, -2684, 3083, 1414, -4212, 1169, 3754, -3203, -2168, 4334, 2, -3179, 2326, 1703, -2586, 1428, 2600, -2793, 221, 4433, -1658, -2918, 3973, 1747, -3858, 966, 2742, -2328]
786b328J453L185m288J44M796l844l201O205j3o191L275M261m609j029M556k105
802B67j859M138j098m005M544K108o040J004N663l788l124M797q4m059K849J156
818B469m182K015L256m819j085N579j794n003M064K309m709P06L511l332n39L958
834B404k759k765N114o7n353K711L680m215j383M206j605k586L360m85l653L169
850b27J605m852O74M793l197k983M638R6m059K708J602l302J125L317l608j018
866b688N008j654l895L643J846m251J050L223k967j072L656j932k343L574L32
881A530m551K343K926l929r16M089j654k525L082J24l540K435J892l975N84L597
897A512k675k221L916r1l521K135J732l402P60K666k724j265L880j219l155K967
$$ y = [-2328, -875, 2310, -1978, -1834, 2962, -882, -4083, 2122, 2109, -4082, -807, 3454, -1155, -2184, 2372, 267, -1592, 2546, 1448, -2557, 1987, 4095, -1945, -941, 4722, 934, -2190, 2607, 2523, -1536, 1313, 2469, -1713, 302, 3558, -1261, -2346, 3233, 1439, -3564, 500, 2809, -1900, -1194, 2317, -1015, -1554, 2404, -355, -3120, 1994, 1927, -3426, -715, 2965, -1250, -2633, 1573, -32, -2618, 742, 257, -3396, -227, 1378, -3474, -2800, 1993, -1204, -4187, 451, 547, -3512, -804, 798, -2504, -1379, 1938, -1670, -2688, 2320, 666, -3229, 414, 2260, -1991, -941, 2282, -685, -1757, 1899, -33, -2376, 1198, 1530, -3021, -678, 2248, -1681, -2597, 1492, -162, -2687, 395, 519, -3021, -586, 1306, -2669, -2085, 1512, -1163, -3384, 532, 441, -3080, -945, 787, -2615, -1855, 811, -1913, -3178, 702, -517, -3672, -705]
913g05J174l687J004K929k620j115L424j254k578L288N89l515J927K455l164l67
929b215L569j763j983L167L7l244J879K059l066m9K990k013j736L101n32k937
945b736K283J457l391N88K955k390j415K926m23k441K029Q02k744J038K344k553
961a671p50L244j062k632K448J036k786Q26K071k240l94K615j546j670K717L31
977E37l121J920J968k750l63K638j070j449K186j03j948J835J367l130O65K738
993A920k204j439K902k48k279J612Q86k054M87J664j992q07K900j211k491K322
1009c2R56k566M72J946j688o01K006j055j329K368j93k726J855J943k658n82K601
1026G17p53j649J779J12j583J419Q65k642P52K465k019j143K576K6k175J223J082
$$ y = [-705, 469, -3218, -2214, 715, -1905, -3020, 404, -850, -3428, -140, 449, -3066, -1139, 1316, -1848, -2215, 1354, -409, -2392, 775, 812, -2432, -553, 1506, -1560, -1609, 1381, -632, -2368, 733, 201, -2736, -453, 1004, -2387, -1799, 1156, -1234, -2649, 277, -146, -2587, -558, 244, -2500, -1462, 882, -1671, -2421, 823, -239, -2871, -423, 613, -2173, -1347, 724, -1516, -1910, 705, -841, -2511, 206, 537, -2584, -664, 1304, -1446, -1809, 829, -241, -1690, 496, 393, -1555, 280, 1647, -1483, -818, 1920, -284, -1723, 1179, 931, -1348, 264, 1150, -904, -417, 1247, -745, -1552, 1348, 137, -2354, -32, 924, -1642, -1170, 776, -912, -1513, 493, -562, -1891, 477, 284, -2442, -587, 1356, -1302, -1884, 717, -36, -1685, 94, 206, -1377, 42, 907, -1735, -983, 1482, -537, -1680, 896, 922, -1253, -30, 1052]
1043A052j642K00J564j674l06K652j072k148K279R10k458K13J990j179p16J587
1059A252p73j180J841j48k270J563J421k441l04K200q33j497J541L6j316Q60Q30
1076G82j998N83J869j657j336K497k33j908J246R07j588j6J572j337n10J950q11
1093A2j618J885P99k269M13J664j370n40J401l84q23J162L16j903J337J137j864
1110f45q5J924p11j352J137N23j360P00Q86j456M00J495j382r64J941k34j666
1127h49R28R69j457J23J138q75m94J507o53j265J613M01j775L86J359j071l97
1144d12J119l08j088J168K37j480Q58R32j458k84J586p05j122J159K11j304N92
1161b99Q35j196j30J375p85q92J590j33j234P31Q03j242K00J027o72n83J153o3
$$ y = [1052, -590, -390, 1174, -500, -806, 1846, 774, -1374, 905, 1815, -643, -430, 1560, 381, -335, 1252, 479, -701, 1140, 992, -1278, 285, 1706, -735, -1039, 1161, 328, -1169, 372, 408, -908, -48, 782, -1216, -633, 1236, -421, -1757, 740, 507, -1401, -155, 752, -836, -852, 720, -617, -1127, 823, 12, -1606, 279, 1078, -1191, -778, 886, -484, -1024, 377, -7, -830, 332, 648, -1255, 82, 1219, -645, -730, 1194, 483, -869, 268, 791, -569, 131, 1017, -439, -39, 1456, 74, -890, 1051, 817, -849, 79, 1048, -409, -286, 852, -23, -517, 990, 337, -928, 685, 1086, -689, -303, 1056, -15, -412, 707, 399, -689, 479, 716, -764, 94, 1026, -432, -716, 870, 165, -957, 202, 413, -891, -299, 536, -660, -790, 585, -200, -1092, 498, 365, -869, -138, 665, -577, -377, 650, -22, -605, 548, 485]
1179D85j228R32O65j306K68J069r55j68J115l71r56J056L94j259M56J113r72k80
1197E8J076o15o01J305p8r97N86Q27j280j82J271n56q62J139n9r25O59K19j098
1216a13L13Q68p81p53J238Jj244O36N57j006J54P36q53k12R02m40p04R80M19j246
1236e48J92J066p55l93R30j86n73Q98j09q12N81N88r07k37J153j69j044J111J21
1255I07p67O32k6n22L17P70o86l37P91J12q58M02O97n86j41M71l21j81P06m90
1275H90o93Q40K78r97r2Q86n83n41O40m6n86N62k02o52M92N58r16j62J086m29
1295C33p87N16K79o40M02N18p06J93L97m66l44Q83p4r82N37P01p22r2O96m50j71
1316B1O59k50m27P16J28q37J28O23j76n56O55r4k86K88Q8m72K76M02o03l03Q05
$$ y = [485, -743, 189, 854, -452, -184, 885, -70, -238, 877, 506, -450, 606, 1000, -259, 197, 1310, 338, 58, 1134, 519, -82, 1223, 1145, 148, 734, 1561, 281, 99, 1370, 814, -48, 1091, 1032, 107, 766, 985, -113, 200, 1068, 287, -466, 772, 773, -471, 165, 722, -284, -130, 606, -247, -459, 443, 3, -701, 279, 698, -548, -356, 710, -45, -438, 492, 306, -267, 631, 522, -290, 291, 879, -28, -265, 888, 719, -325, 786, 907, 140, 772, 746, 224, 541, 1311, 625, 288, 1079, 1191, 333, 735, 1432, 846, 705, 1176, 855, 674, 1380, 890, 197, 1037, 1315, 318, 226, 1112, 529, -12, 628, 582, -4, 558, 356, -296, 196, 754, -162, -324, 762, 333, -454, 62, 341, -299, 103, 621, -85, 108, 505, 39, -305, 578, 504, -478, 59, 760, 38, -54, 642, 192, 21, 680, 430, 3, 719, 847, 10, 138, 761, 585, 29, 684, 590, 304, 592, 680, 208, 484, 886, 283, -20, 785]
1337G85k27p10P36K9n93L2L22k22q5M07n11m00Q10m5p49L92M79n96j02M62k67
1358e3j08M25p7m29M37O6n99K97N61o59o7L15J26m91L08M9m17L97J79n50K6O59
1380C95k98o08Q14l4m41M5M93l57J5M72l71k12L97r4m25L05L38m02k56M24l88
1401a88R4L5J61n80M53J66l75M5K52j64k71N08j39l44K57J14m34L42M47l92k09
1422b22L86j73j81K82L30m96K14K09m47NM58j28l49K43K02l90J72L31l89J1L50
1443D18m89j18M88j84k35Q6L75l76p5L07k26k4L27j83k07J43J77l65n6L35k08
1464i0k32M05n4l83L41j9j20l3J28j93j7L92j60j89L12m7k70K42J24l62J50K65
1486A90p9j68K27J42n51M06J41k82N3J30k33j1J79j36j14K94j4j18L8K65k07l88
$$ y = [785, 558, -152, 584, 613, 20, 52, 374, 152, 67, 474, -37, -437, 373, 328, -421, -29, 450, -146, -248, 214, -53, -161, 264, 187, -242, 195, 261, -338, -41, 520, -139, -206, 109, 235, -256, 52, 101, -316, 81, 260, -290, -264, 395, 97, -511, 303, 269, -172, -127, 366, 9, 24, 496, 125, -87, 310, 216, -209, 96, 434, 32, -224, 200, -188, -94, -59, 102, -478, -25, 141, -234, -189, 63, -101, -372, 136, -3, -347, -90, 24, -410, -68, 379, -13, -222, 164, -9, -190, 92, 422, -74, 140, 349, -98, -93, 365, 237, -112, 131, 333, -57, 115, 446, 57, 68, 418, -71, -189, 299, 115, -120, -34, 341, -35, -110, 197, -29, -53, 274, 91, -116, 27, 204, -161, -217, 118, -90, -322, 83, 29, -354, -13, -32, -152, -185, -57, -250, -267, 125, -35, -224, 88, 41, -229, 13, 137, -225, -75, 190, 111, -57, 170, 312, -239, 167, 308, 26, 79, 209, -24, -35, 144, 8, -106, 188, 174, 56, 94, 359, 152, -236]
1508b36L78J9k09L38r9j67J71p6l7k39M48k60j26J19J19j76l2J25j91K57j26k61
1530b61K28O2j9k35J26Lj31O8q6J99j26L1J68j78K5J54k18JK70l29r5M78j45k7
1554c7J3l7j91K32O3j57N3N2k21p9L69n1j75J08q9m0M1J38o8p4kQ5k11K96J07
1579A25j58K2J53j6l57L25j90j6K81n3k21J97lo0j80K2J38j23NK27l48R8L4j05
1603b03n0N5M2j01J5K60j44j46J25j92m7K89m7j04l2J23j52l8J88j84R9J9o1j30
1627d16L46kk92J00l2M3L0R8l8j74M07j16j98J86M2p2R8l4r8Nj33K26j56L2L27
1652A79k07P1J42j79N7j23l7J00J23j43J3O6K3r2jj0J17p6k8K6j43M7q1k14R0
1677b80J99QQl6Qk42K30M7j91K1J16j06J15j5o3r2qJ34m9L7P9p8M2M1Rn2L0Q7
$$ y = [-236, 142, 161, -48, 290, 191, 24, 195, 119, 82, -157, 291, 31, -95, 24, 143, -33, -65, 60, -131, 126, 0, -261, -33, 29, 10, -225, -99, -96, -227, -159, -245, -46, -172, -141, 27, -151, -126, 28, -190, -189, 81, -248, -343, 135, -10, -37, -24, -61, -252, -20, 43, -114, -61, -9, -230, -309, 60, 9, -166, -58, -147, -187, -146, -8, -76, -150, -152, -67, -278, 18, 125, -33, -11, 142, 126, -231, 94, -96, -112, 169, 116, -105, 92, 89, 29, -151, -129, 9, -114, -109, 118, -230, -132, -98, -203, -253, -198, -156, -257, -242, 18, -126, -272, -147, -339, -386, -97, -144, -248, -280, -157, -309, -347, -159, -343, -244, -225, -286, -416, -70, -72, -364, -264, -296, -253, -223, -125, -163, -337, 70, -46, -244, -58, -16, -88, 10, -24, -122, -117, -250, -24, -180, -148, 179, -28, 43, 185, 6, 63, -60, -97, 3, 126, -17, -4, 62, 85, -7, -8, -18, 99, 23, -5, 21, -122, -75, -156, -370, -280, -81, -73, -65, -101, -93, -335, -105, -58, -249, -228, -112, -218, -103, -118, -181, -273, -281, -147, -196, -159, -80, -158, -116, -75, -66, -118, -88, -1]
1705ap3m5N8J45j41j9J63m5K37k28j17K10o9j90J2K52o7P3j06J84k99J41Q6k63
1729a02M6K39j31O0Pk5j33L8J99k97J53q7R0kMj23l6J04J21k18Q3J5n1J43l6r5
1755c4J23j33J37l61P2K34p6p4j0J20O2j58J0J23r0J19j8j41J37j94J48K1j70
1778a53J52j7l2K2j7O0qP0k7j78K76j54N3m6J90k66m0O5o7j2KL57k64OL3L9J3
1805E7J4Pj39J63j68j03K2R9j39J58j01Q5j58J08J42j43m5L7M7K1o2j53K13n8
1829i6Q5j89O8R4J08l1j49m1J42j82M4J32j55K3J97k91R0J25o8k48j2J8K54p4
1853a56j24K46k44K25K6j15L1J54j16J50k41J47pm3K53k59J20o3j20Q8N6j43M2
1876i3K11k42Q0O7j4n3l5L4K7o4J77j62J7P9m4N0M9j56l2R9J2j12Q0m6P3M5p6
$$ y = [-1, -74, -119, -61, 84, -57, -76, 87, 42, 279, 51, -66, 144, 75, -115, -103, 149, 82, 155, 49, 233, -66, 75, 161, -102, -56, 183, 52, 112, 119, 94, -39, -1, 198, -99, 54, -33, 57, 55, 59, -64, -100, 4, 125, -93, -10, 5, -46, 97, 61, -34, 89, -44, 93, -268, -196, 38, -38, -112, -122, -2, 60, -98, -88, 35, -55, 64, 46, -95, 42, -152, -4, 17, -153, -1, -18, -50, -28, -45, 15, 7, 77, 50, -128, 148, -6, 47, 1, 191, -75, -115, -50, -117, -129, -127, 230, -34, -28, 5, 44, 57, 71, 78, -61, 102, -66, -169, -147, -48, -187, -29, -130, -45, -203, -95, 47, -96, -141, -104, -57, -36, -98, -251, -38, -96, -11, -200, -132, -38, 70, 39, -110, -151, -9, -191, -147, -15, -170, -147, 50, -241, -151, -26, -94, -342, -354, -336, -82, -156, -280, -34, -278, -53, -27, -142, -111, 43, -73, 77, -164, -17, -24, -67, 186, -73, 47, -16, -136, -48, 8, -135, -93, 118, -124, -44, 23, 9, -44, -79, -45, -18, -82, 95, -67, -50, 29, -15, 35, 84, -72, -104, -5, 7, -105, -25, -71, 2, 47, -29]
1903b9j0r3L7k4j29J55Q8N4k38L4J08j38k0J56n4j47K40k84K23J78q7k08Q6K7
1927g5NO5Q4k29J23L6k39K78j41P6J2l9r2Q9K04k66J40k2J07m6j15k3L1J40qM8
1953A43j47O7J59k38M3L8Mj47J37j9M0Jj22J04J15Jr8n9p9O7Q5n2J15r5p5k2J74
1980A40r5Qj41J21jL6q1o1K27p1n4m3m5%J82l40K37p3Q1j98K6J77P2j97K1K04
2006A32j22L2o9P3q5j20K20o9Kj1n9R3K9k7K3m0O2j09M9R2j63J24q6L9O7J11j69
2033A9j9J06j25j11J67q3kP9LM4j91K69k15J4J20k7Ml6j53J88j13L5P7j79n1J06
2059g4J20p8n9Lk1L6l4J17P0n2P6j89J48j36l8R8j05p8L2O7R0j17O7O5L7J5q5
2086b5Mk8L6m9Q4O1j07J9n4K05p0J1p1r1K81k26j56K37q9J5J0O7P1k59J32oK0
$$ y = [-29, -39, -132, -95, -119, -248, -93, -5, 49, -189, -155, -47, -185, -205, -49, -103, -250, -10, -294, -71, 107, 20, -188, -102, -75, -70, -5, 79, -150, -27, 9, -230, 48, -93, -17, -5, -44, -136, -47, 157, -109, 31, 9, 116, 70, -45, -68, -37, 103, 95, 143, -4, 63, 222, -16, 27, 65, 69, -78, 59, 40, 80, 81, -41, 63, 178, 179, 81, 22, -57, 10, 95, 43, 158, 63, -12, -34, 140, 45, 53, -88, 33, 32, 68, -13, -74, 153, 82, 28, -15, -60, -60, 122, -218, 19, -54, 27, -171, -145, 32, 104, -93, -72, 132, 10, 42, -27, 46, -39, -159, 61, -8, -6, -17, -76, 17, 46, 19, 42, 2, 64, -45, 4, 96, -67, 57, -29, 10, 77, 188, 19, 0, 106, -19, -130, 37, -46, -48, 31, 34, 78, -113, 156, -59, -45, 75, 48, 52, 16, -137, 51, -62, -27, 50, -129, -180, -74, 46, -32, -91, -88, -109, -73, -107, 10, 80, 28, 104, -85, 63, -73, -111, -13, -118, -196, -164, -97, -7, -124, -57, 8, 45, 60, -25, -21, -49, -13, -62, 22, 83, -24, -5, -59, 146, 76, 87, 16, -75, 206, -20, -176, 61, -28, -13, -3, 64, 135, -124, 8, 2, 22]
2113B2Q6j10j54L01j84J71j12J91k95P5M8j00J53q5M3O7k13R0k3j21K84l4j21
2136b1lj6K6J57j50lL6K2j01n4R3Qq4J94k26Q5Q6O3j81O5j80K63o8o8MJ72l0q0
2164IN0l3Np9J07j1R0j5m9j68K67p2K9k15R8J06o3lj12J08J52j55q2J15j49J26
2190E6o4J03J24Pk87MJ92j81K92j97j71K06rl0%L0j9k7J21j31Ol8Q8j7mN8m1j35
2218f4l6J14poP4j65J47q8M0K9mK8m9J79j40J50j40q9mO5J14j29LKl8L4L5n1J28
2247A32j01J95j34l03J42O0J08Pj45K23l0o8k04K96n3k23J65m0K83j92L6j12j04
2270f2O7n8J09r4J1K5J83j99rJ98j38r3n7J28N8o1R9o8J00k20Q0j9R5j20K76k97
2296f6M5M4j14mn6K29n4j66K9J14N0j29J74k76J19j0J11O8q1o5N7J27k48KM5J78
$$ y = [22, 108, -2, -156, 145, -39, 132, 20, 211, -84, -9, 39, -61, 92, 7, 50, 117, -96, -6, -29, -150, 134, 100, -21, -24, -40, -14, 143, -7, -10, 26, 48, -53, -107, -14, -6, -90, 104, -122, -37, 49, 112, -69, -4, -184, 79, 11, -57, -53, 119, 89, 9, 59, 26, 31, -48, 59, 48, 138, 123, 74, -94, 173, 101, 130, -85, 13, 119, 56, 53, -59, 49, 201, 46, -36, 79, -70, 56, -8, 95, 219, 226, -61, -57, 135, -46, 246, 49, -122, 84, 75, 45, 45, 75, 56, 29, 150, 19, 25, -13, 75, 58, 54, 112, 71, -64, -100, 14, 7, 1, 75, -90, 57, -31, 9, 38, 34, 62, 13, 192, 52, 202, 62, -27, -31, 34, 148, 19, 22, 24, -14, 20, 55, 4, 132, 31, 226, 92, -211, -69, -9, 99, 106, -39, 184, 154, 86, -118, 178, 125, -98, 67, 27, 310, 118, 154, 42, -62, 5, -53, 56, -38, -27, -2, 181, -18, -27, 171, 33, -60, -117, 11, 69, 8, 107, 39, 139, -81, -1, -20, 75, -45, 231, -66, -21, 23, -91, -95, -151, 78, 24, -142, -113, 1, 51, -78, 96, -180, -61, -71, 40, 108, 27, -38, 19, 146, -102, -100, -55, 123]
2322A23j02k8N0l3J04r9J02j12P2j01J05j14J0R2j39L3O7j8Q3o7J06j61O6L4L
2347G6J5l9j29n9J54m1j1J9l3K39k57M8L7j50N1J12j33jK9N6n0J18qo4k7n4Q5
2374a7l3O7P5r6j1O3O0j95J20n8KjON1j00n2J12n0N4J0J44k00O8N0j65J74k04
2401a26J35P7n6n6J3l8K23j81J17j14K1JN0j12N7o3K5J22m5P1j32j64J97L6P0
2426A28J1q3j15P9j81R8N9n7j24P7M1m1N3j52J55M2M9j17M9N3j34J27j2l0N9q4
2452e0O1r6J05N6j05R6k8j58J99j05r9M3J00m0j19J14M0k7J7l8J47p6j31J58j93
2477a29R9P7k0n3R0k5j07J99k7P9l29K19k5q9M7l0L09k06o8J4j74K43Pj34mK00
2503A63r4j74O5L8Qj2M6j99J1L5J20lr2J20M5p7K6N7p7L5k26qK22j18L0j5j3M9
$$ y = [123, 21, -7, 43, 10, 114, 15, 117, 5, 77, -24, 81, -33, -23, 69, -70, -37, 30, 12, 95, 28, 134, -27, 39, 73, 76, 91, 52, -77, -136, 18, -23, -34, -15, -48, 191, -66, -18, 19, -131, -80, 32, -101, -102, -73, -17, -67, 51, 43, -21, -48, -102, -17, -50, 17, 92, -4, -15, 48, 108, -87, 33, -25, -23, -24, -18, 33, -67, -119, -7, -57, -3, 7, 151, -49, 19, 69, -96, 78, -126, 9, 86, 30, -26, -13, -51, 172, -9, 108, -6, 15, 16, 66, -46, 11, -52, -27, 95, 50, 121, -11, -175, 22, 58, 128, 139, 56, -59, 20, -161, -63, -4, -61, -185, -108, -67, -108, -55, -207, -52, -10, 39, -78, -29, 24, -110, 17, 5, -25, 34, -50, 11, -85, 20, 76, -29, 67, 39, -119, 80, -25, -124, -81, 19, -21, -140, -26, 14, -13, 4, -34, 113, 37, -94, 64, -129, -30, 47, 27, -26, 64, 39, -68, 131, 104, 183, -146, 73, 48, -41, 6, -24, 285, 79, 11, 25, -149, 94, 101, -33, -37, 163, 69, -105, -40, -2, 6, -6, 40, -159, -148, -113, 7, 4, -88, 32, 77, 0, 26, 83, 6, 41, -185, -193, 29, -89, -59, -74, -87, -38]
2531c8M8j9m5rj00K9J82j33J29j16J04O7k61J48P0p3l1J18j10J65n1j65J75m7
2555C7j4r7j32K61J82k42j10K01k7J10j01q8o2K04o5m6j66R4n0J4J59n6Pk3l2
2580d2o4J55j17J1K9lJ04m8k54J61J01j19K8P2k32K24j00L2n5R3K4n3N4l6P4k23
2606a84J71M5j26K7K02j21n9J17n6j20lJ30M7k3N3n9m2N0j2J4K3j2j37mK17j50
2632a2j17O1J01Q6p9J28k35Q3q0kN5m2O3J05Qj65J53j17n8R2o7J41r6l3JJ11j07
2659b2j65J84J4k1MJ04p2q9L1jN8j61J11L2n3K88k47j1m1j22J48nO5r4N3J03n2
2686C9M6Nk43M1R0q7J32Q3j15K2J38l5j57k8K27k47P5J07k7Qj14N4j33nJ8RJ6
2713h1J54J02k10QK9J02k7Lj71L5R5j02KJ09k2M0j30o7J50j38Q8K5q6Q3M7o2l9
$$ y = [-38, 10, -9, -54, -63, -163, -134, 48, -85, 44, -72, 32, 99, -162, -14, 56, -17, -48, 70, -40, 125, 74, -91, 84, 37, 23, -74, -206, 55, 237, -5, -115, 86, 59, 169, 68, -20, -82, 122, 57, 11, -155, -61, -111, -97, 62, 6, 13, -10, -42, -106, 49, -68, -57, -28, -31, 73, 25, -229, -68, 33, -86, -58, 14, -218, 6, -94, -62, -117, -24, 0, -53, 1, -35, 39, -184, -13, 32, -94, -67, 135, 14, -45, 72, 16, -104, -107, 23, 70, 47, 100, 41, -1, 49, 37, 51, 74, 62, -75, -79, 138, -12, -129, -68, 33, 119, 40, 168, -67, 16, -64, -66, -11, -53, 10, 115, 123, -42, 111, -6, -64, 28, -39, 102, 6, -27, -26, 85, -22, -187, -3, 11, -10, -6, 98, 26, -63, -32, -33, 25, -136, -25, 7, -46, 242, -5, -16, -57, -179, -31, -36, 29, -65, -12, 91, 39, 85, 90, -153, -112, -22, -109, 23, 106, -9, 13, 151, 116, -41, -69, 158, -89, -14, 93, 66, 74, -40, 14, -119, -124, -106, -97, -81, 73, 175, -35, -27, 2, 104, 77, 80, -91, -56, 39, -63, -61, 48, 26, 66, -64, -131, 19, -119, -31, -6, -92, -9, 38, -24, -63]
2740f3J16m8O1p1q1m7K67j11J9N9j53n2R3k20Q4J24j20Q8J48q9K4R1j39J27j3
2765I4r3L7pn4jm7N0O2p1J44l2n5OQ6p3O5K4o6m1R4j59R8j52M9J09j50J10l5J23
2794A15k18o2J28o1K70q7M5n4n5QJ11k07J15p5J70k05J83k25P2J16k32J4J92n6
2818Bm2jL8J1j19R4m6M4Rk7q6L4P4j16Q0J3N0O4q6m3j34J48Q6R2k37K71j95R8
2846G6l2q5O4m5Q4j44Q3K74j09j99NR2Pr3o6P8k9j02J23k5jR2K2j61J53k34L16
2873A44j53K5K7k1J48k19O5j80Q7J18j54K6J48Q9p7mj9n3M8nJ23k02o2J0J02O7
2899G8K0j16j22Q7M2j4n9K8N4J86j55j1l9K8M4j79J03J08P3j21q7J01o5mN1m7
2925a6J34j52p8KJ31j54J2O1J04q3MJ18k01N1K58j95P4j11O8j35l8J27J95k08
$$ y = [-63, 53, 5, 66, -5, -86, -133, 134, 23, 42, 101, -52, -104, -11, -231, -147, -23, -143, -55, 93, 4, 28, 119, -20, 107, 94, 1, 38, 31, -23, -24, -71, -21, 41, -30, 114, 82, 27, 33, 119, 46, 111, 135, 69, 28, 122, -37, 61, -91, -42, 67, -83, 27, -8, 115, -103, -165, -37, -98, 172, 85, 130, 76, 21, 29, 140, -67, 48, -27, 143, -62, 121, -104, -32, 84, -148, -134, 58, 2, -40, -41, -3, 8, -111, -17, -63, -19, -10, -37, -123, -89, -15, -131, -51, -38, 12, 76, -10, -53, -187, -39, 47, 139, -98, 173, -22, 76, 44, -41, 23, -22, 62, -82, 1, 275, 166, -33, -28, 64, 71, -22, -88, -10, -39, -141, -18, -43, -44, 48, 70, -91, 62, -172, 144, -9, 16, 43, 22, 170, -49, 16, -164, -77, 41, -113, -87, 61, 150, 73, 69, 50, -3, 45, 40, 163, -39, -101, -91, 11, 78, 98, -18, -140, -53, -11, -25, -84, -56, -2, 184, 29, 18, -21, 7, 51, -128, -25, 83, 156, 35, -52, 49, -16, -20, 31, -16, 118, -34, -112, -110, 21, -133, -121, -60, 44, -39, -35, 83, -118, -67, 191, -4, 70, -41, 27, -108, -146, -19, 176, -32]
2949c2j26K46r5J48j27l2mPN1l2M0J6M8n8o3jJ83k27J15j21N2J12j76J11k4j49
2975a38Q6l6J31K4j82R5K3R1l5j29oj5J52j85K33j86N6J30o2p8j3p0m7J12J2P5
3001C8R1j81J74n6k02J71k02L13k53J90j07j3Oo3K62j31l2j75K37k9N2P8j35k9
3025Dn5P3m9J48j30k2O5N3K3j43j07K7O3j55K87j35j3J37o7oj9R8l2L7j90J51
3051D3KNj10R4r4M4J4M6P7j09p9L3o5l2K46k84K10k05K17q7K6J12J2q5l4K0j2
3078EJ23j55o3N0QJ22m5k4nm9J26k16K11N2j53K0L3K5pK2k9j38J55k4r4Q2M2m9
3106B5L6jm2j72J77j29J17j2o5R0r3J15Rl2j4L9Q0j67j39J45J7L3N1j44M0k2O5
3133Gr6J65j63M4M7j0o5j01M0R0j76K83j66K70q4q2Q3k40O5O7On5M9R9M6r2Q0
$$ y = [-32, -158, 88, -7, 141, 14, -18, -22, -15, 36, 4, 44, 60, 108, 50, -13, -14, 169, -58, 57, -64, -12, 100, -76, 35, 11, -138, -52, -88, 43, 67, -115, -20, 3, 94, 59, -70, -76, -91, 61, -124, 109, -77, -21, 109, 47, -31, -44, -114, -161, -49, -37, 38, 129, -52, 122, 66, -136, 35, -167, 146, -107, 83, -24, -37, -31, -94, 168, 37, 5, -170, 67, 38, 90, 168, 33, 4, -51, 22, -27, 121, -9, -31, 34, 87, 110, -33, -140, -113, -50, -205, 82, -53, -66, 71, 4, -2, -21, 77, 45, 82, -108, 43, 45, 50, -60, 34, -60, -16, -2, 44, 121, 12, -67, -34, -99, -131, 115, -169, 41, -164, 53, -34, -8, 104, 116, 31, -3, 17, 5, 128, -27, -90, -40, -32, 90, 45, 21, 16, -33, 93, -123, 88, 140, -13, 7, 40, 65, 58, 80, 51, -87, 68, 44, -50, 32, 74, 25, 61, 60, 18, -154, 23, -106, 11, -1, -66, 24, -69, 46, 55, 23, 9, 48, 128, -39, -178, -33, -16, 17, 68, -76, -36, -58, 7, -89, 76, -87, -43, 4, -6, -71, -172, -132, -42, -218, 65, -101, 169, 85, 3, 86, -154, -89, -22, -16, -71, -22, 77, 123, 31, 111]
3160A11Rp9J51n5k77N0L2O6n8l5J89q1j5nK0N7k70M0J47J06o2j36J43O3j23K7
3186A5l9K8J6j58K35O4n0k2r8k2R7m5r4QL6J18p0L0K4j2n1q8J41j17P7j24Q4j26
3214a43J53J46r1l5j47l9J79O8n3k01K58k5k18l5L17k31K3J58j86J12oP0o1j46
3238a33J4J17m6j2L7Pm3Q6m3O3j6j4L9l1O3o2j77K26jk81K37j24J33l6L3m6j3
3265b3k8P0q4lR8j61O7J55r2N8j6l6q5J11L4j62J13j2Q0j38M5p2j8N2J25p6J26
3292A28j35J06j33J43o1N4n3j87P1K16l01J45j70J80J8j67K59k15J06n2J28k28
3314a48J92O1k51J18j27J69R3k55Q9m6J93J5J5q9Q0k42J89q9L5J08j32J05j68
3337h5M9J53r0n4L6j04r4J81R0p0L0q8L0M5n2K3Rj9QQ9k04N2R7o5J6n1K51k77
$$ y = [111, 120, 41, 192, 137, -140, -90, -58, 8, -50, -85, 104, 23, 8, 3, 23, 80, -190, -150, -3, 103, 41, -95, 48, 111, -12, 15, -24, 4, 20, -138, 97, 161, 111, 89, -9, -31, 66, 21, -73, -65, -29, 89, 19, 49, 73, 61, 10, -78, 63, -54, 23, -101, -17, -143, 10, 156, 65, 30, -117, -156, 23, 91, 38, -163, 95, 70, -148, -183, 134, -97, -74, 84, -102, 10, 4, 74, 13, -133, -119, -2, -48, -60, -23, -16, -59, 27, -16, 47, 31, 17, 56, 25, 88, 26, -151, 75, 74, -207, 30, -94, 39, 3, 36, -10, -23, -51, 19, -65, -68, 30, -131, -64, 91, -1, 57, 41, 5, -80, 31, 65, -97, 16, 4, 84, -54, -9, -81, -99, -47, 78, 2, 128, -7, 99, -34, 109, 48, 102, 49, -138, -67, 149, -152, -7, -177, 3, 21, -146, 113, -102, 4, -48, 80, -148, 44, 105, -146, -28, -155, 14, 107, -148, -59, -105, 88, 103, 118, 29, 109, -133, 56, -33, 2, 110, -22, 83, -85, -36, 117, 27, -27, 9, -95, -189, -8, 82, 12, 42, -46, -16, 29, -23, 0, 9, -10, -2, 87, -117, -65, 32, -33, -17, -68, 183, -94]
3365i4J70p7N6j84K02o8j83J49N5j27J20O2j11J39N0n7k34J33P6j31K76j24Ml3
3389F9k9J74l04K06j82K03k44R2n7k5K32j15P8k07J0J52N4m3n8J9q6O6J60p6l3
3414E6n7J2j17K11n7M3o9n6MK0j5l2R9L7q3j27N3J32o3J00J28k84J06j65j2R2
3440d4o4R3jL6k7L9J01l5R7l50J20J9k5J85n2l5k67K82j75Q0J9j30J86O8lj33
3466a6R6n4J4j32K97l61J48q7K22l06J69N9k11J79j69K47k4pr3N7j72J08r9J76
3490D1M0n8k21J87o7J42j2j5m5J58m5j58o2j1lL3R6oJ13k03LM5k5R0lN4o6J46
3518A48j35p7q8J56K6j74L48j00K7j35J3j00J86J31k95K4j1R3M9j64J29K8n6r1
3542f8P7p0k6N9p2J61J6j51M5L0j30J35O0J3k10K43k65J30Qm8k6J37pj70N6L1
$$ y = [-94, 76, -1, 55, -129, 73, 5, -178, -29, 26, -101, 19, 81, -30, 109, 159, 102, -132, 1, 77, -54, 222, 98, 102, 69, 40, 214, -90, 116, -66, 137, -107, -15, -72, -97, 135, 20, 98, -109, -99, 53, 107, 64, 6, 25, -61, 5, 165, 89, 56, -1, 11, -106, 105, 48, 91, 22, -34, -30, -10, -25, -57, 42, 79, -4, -131, -78, 54, -9, 91, 219, -65, 41, -124, -136, -44, -108, -15, -16, 20, -7, 32, 133, 98, 195, -155, -35, -16, -41, 144, 92, 57, -210, 72, -103, -23, -4, -134, 52, 120, 117, -16, 80, 26, 40, -92, 205, -156, -8, -95, 127, -179, -10, 49, -162, 17, -152, 95, 71, 64, -29, 28, -144, -36, -135, 41, 81, 23, -198, -11, -78, 64, 52, 37, -8, 150, 105, -53, -115, -126, -129, -96, 0, -6, 107, -96, -93, -48, -73, 17, 14, 68, 2, 148, 13, -64, -152, 4, 30, -144, 204, 104, 131, -4, 9, -91, 95, 226, -69, -45, -56, 37, 86, -78, 51, 79, 23, -68, 9, -61, -87, -28, -100, 61, 77, -74, -29, 1, -129, 6, 66, 79, -131, 112, -153, -23, -15, -63, -89, 48, 41, -129, -73, -42]
3568d2kQ5r6L1K5J14k02R5L6l7o8J57n3N2k31j6J72J6k5j7n9K7J60j93N7n2R0
3595B4p6Q3O1J8j15jn3j29L16k02J01k9J39l01K84m2j74J44L4j7j28Q3j57J19
3619a8N9m9mN4j9j22M3K01j16j68J04R1R3k6j52R3L0j35Q3j88J3P6J5n2J99R7
3645B02j99j08o1Q5J30L7j40J57j57j24J81n0O2m1K2J2j82L45j81R8j67L9j25
3668a65P6m3J72m4L5k2o8O8O1j32K0r6J62o6M3j49J91M1j61LR9k3R1k05J92j64
3694h4J66P2j60q2P9jK01j46mj31P8j14J43J01o4K5Lq3o4P8L4j81P8ro1K38j74
3721f2N5j06J08k6M0L0j35J4m5J53p4J31j27L8j31N0L1j16J20J78k4j58K5pM7
3746Il7k0Q1N6p9j71J16J29q6k5p7J63m5o5LK8o7J42j25J49k00L07j42j44K1Q
$$ y = [-42, -44, 41, -55, -24, 1, 115, -87, 8, 44, 7, -61, 96, 43, 95, -136, -152, 20, 36, 11, -6, -65, -38, 122, -71, -14, -66, 24, -52, 31, 92, 110, -5, -6, -59, -188, 128, -74, 27, -2, 137, -164, 120, 78, -96, 48, 82, 65, -63, 20, -137, -18, 41, -8, -12, 42, 23, -99, -56, 145, 29, -139, -35, 56, 149, 123, -29, 64, 94, -41, 42, -146, -133, -57, -42, -94, 105, 202, 3, -105, -166, -81, 49, 86, -54, 103, -54, -178, 3, -47, 15, -26, -4, 8, -174, 171, -10, 88, -79, -40, -165, -89, -132, 40, -4, 31, 9, -59, 9, 70, -62, -42, -138, 24, -42, 1, -148, 43, 84, -77, -74, 25, 2, 93, -112, 80, -84, 82, 154, -6, -88, -9, -10, 191, 45, 41, -90, -12, -126, 17, 118, 54, 79, 82, -1, -65, 13, 47, -134, -56, -65, -126, 112, -62, -7, -113, -5, -31, 9, 39, -96, -82, -127, 26, -48, 83, -44, -6, -137, -87, -56, -172, -52, 126, 102, -56, -31, -38, 9, -28, -48, 33, 89, 10, -161, -45, 84, -2, -27, -104, 59, 14, -51, -48, -20, -87, 55, -70, 79, -121, 186, 44, -100, -79, -71]
3772g1p8O6L29j65p3l2o5LJ62J2l8JJ18J3j54M5j77L7R4M5K7k15M5K23k01Q1j62
3799a30O5L06j83k4l3j78J26J96j83K8j46P9J10J60j76q2K12j63j3l7P8J8j46
3822a16K5J86m0k25K52M4j29o7J64l02J78K3J38n2o5j36O7J10k91K54j33J71j98
3845a42J56o6Q8O6j70n1m8J53L0oM2J9p0j26q3J72J95l43K00om5j46J24M5K3R
3871B0j32J44m0j3Q3Jm8M9k1j45l3L75k42J48j33J68k12P7j54J88m2R2K3j65P8
3896F6j29oR2J04j49m4J32k02k4K46j11J83j36k17K11j14J40K8N9j74J50j03K8
3919C0M9k02K04j82L4Q2M3J82j97%Kk1l2o5l4J32K8r1R8J1o2r7J86j40r4K67o0
3946G1l6N0j23j08K93q4j1M3j22J70l02O4N5n5J40p3P6N3N4p6k4n1Nj09J08pM3
$$ y = [-71, -149, -83, 246, 81, 8, -24, -89, -86, 76, 88, 50, 51, 169, 182, 28, 73, -104, -67, 27, 72, 99, -116, -71, 152, -49, 32, -130, -65, 241, 58, 34, 1, -177, -51, 145, -38, -10, -156, -77, 33, 193, 17, -65, 147, -16, -29, -66, 12, 30, -116, -91, 95, 55, -170, 82, 126, -3, -70, 94, -208, -30, -7, 131, 79, 14, -122, -55, 55, -236, 18, -115, 56, -142, 14, -52, 36, 102, -68, -119, -167, -14, 16, 10, 52, 71, 1, -125, -208, -36, 159, -184, 16, 10, -35, -181, -57, -12, 11, 20, -112, 32, -8, -21, 62, 63, 15, 64, 43, -102, -135, 240, -2, 146, 13, 181, -31, 46, -108, 80, 38, 130, 153, -12, 66, -63, -69, 23, 127, -22, -66, 66, -136, -160, 86, -25, 158, 22, -195, 16, -98, 42, 70, 129, -45, 105, 2, 30, 79, -123, 81, -101, -67, 15, 58, 240, 43, 43, 45, 24, -8, -73, -107, 25, 53, -38, 60, 71, 9, -88, 98, -42, -136, 131, 71, 35, 85, -38, -146, 147, 63, 52, 95, -27, 143, -159, -95, -40, -95, 45, -28, 48, 101, 155, 79, 55, 4, 9, -100, 8, 1, 44]
3973D4KLj45J01J08pl50M36l00J21ML9j71J8J06n4O5k51J33J58k7j77K47j11j23
3998a31p8R0J09J04j61K2k8J2K6n7L8N7j9l6J56j94O8kj8o2J34J61j76jl0Pj0
4025a9R8o0j60Q3K9m5O3L7q9K24j94Q3m0J17j85j0J13j83K28q5j3L4p2R9O0j04
4051IL6l6J31k10K2O7j14k3P0j12J90J77l71J85j2j8L9j13J7R3r4PM9Q3j41J09
4077D0j63J45m3J70k10j6JJ8K1R6k6J11j12o6j2J16j16Rj16K14j21MK27j90K19
4102B00j26J12j4j55j5J0r1J21J9m6M6n5N0j9k23J62o4o9K85j34J3j2m2nO0o0
4128e2J50p3J20j20L7j42K29j07Q7k42K86j11p1l9J21O1j36M0Q2k02J27P0j49
4151c4J3KK0j16J15p4Q0L2j16J15L4j05O6n4J22j53J48m0j61J12on3L6Q1n5l7
$$ y = [44, 46, 49, -96, 5, 113, 106, -244, 192, -108, 13, 17, 56, -115, -97, 9, -45, 20, -231, -98, 60, 33, -144, 103, -8, -131, -209, -119, -10, 94, -67, -45, -73, -61, -35, -92, -54, 3, -16, -52, 104, -90, -22, -24, -42, -104, 30, 191, 15, 14, -16, -9, -19, 79, 19, -141, -58, -29, -74, -11, 26, -63, 161, -33, 50, 10, 127, -58, -68, 45, -138, 90, 5, -8, 26, -46, 53, 113, 9, 45, 9, 140, -70, -48, 19, -95, -118, -48, -160, 30, 207, -164, 21, 9, -9, 30, -83, -66, 27, -67, -60, -11, 72, -69, 40, -123, 22, -21, 149, -61, -77, -76, -58, -37, 59, 33, 144, 32, -34, -46, 70, -46, -37, -153, 61, -60, -56, 171, -19, 200, 74, 186, 172, 17, 2, 12, -79, 42, 61, 15, 61, 6, 56, 37, -186, -24, -88, -157, 128, -6, 7, -5, -47, -52, 8, -52, 98, 25, 145, 25, 62, -80, 149, 42, 129, -113, 173, 62, -9, -48, 73, 134, -2, 38, 120, -82, 45, 115, -34, -21, -19, 1, -115, 0, -74, 6, 38, -78, 37, 71, -34, 32, -22, 100, -53, 95, 55, -106, 6, 0, -53, -17, 64, 9, -28]
4177b8o6J88j11m3K8K8m7KJK0j28K72p6m3r5J13Q6k67L00J4q8N0l3k87R2K01o1
4204B2q1J00k1j08o1J43j36J41K26k72J15L3k17J48J7p3J47o8j42K09r8J4j8q0
4228f0J3L6J92k15j44KJ49J68r7j46K12j19P2j40J89j81mJ30j38J03p6K11k01
4251d4K2K08k53J01J5J6k6j47Q3M0qj05J52j05L4K0j34Q5l8J83q5K14l10J77n1
4276D4j12J01l2M9L3j3j30J6L8j95J3J93KO6n0Q1o7J8j61J35n7Q7o5J06q3p9K37
4303A75k37J1J76l2j21l0J77n4j67J66j12J31o1M6r8J56j69J64m8M6k88J52no5
4327h7M4J59k40J33M5n8jO9j03Q0j10L9J6j0j1J4J01l2k01P6NJ95L0k32J28j13
4353f4J90j94J03p5j23P8J53L2l5Mn2m3j7J42j45n2N4J05r0J7K3L9l9j4O6j66
$$ y = [-28, -94, 94, -17, -60, -32, -4, -51, -49, -48, -28, -156, 116, 40, -3, -98, 15, 101, -166, 134, 148, 60, 110, 77, -210, -118, 83, 22, -59, 41, 20, -88, -149, -6, -142, -1, 225, -47, 68, 101, -116, 32, 49, -24, 123, 55, -87, 122, 24, 38, 20, -60, -47, -11, 181, -34, -178, -176, -27, 141, 44, -102, 110, -9, 63, -77, 112, -69, -73, 57, -81, 22, -54, 157, -44, -22, 186, -67, 34, 49, 65, 39, -108, -25, 15, 7, -98, 54, -51, -17, 3, -131, -46, -84, 99, 14, 228, -82, 95, 44, -68, 33, 1, 50, 83, 70, -60, -44, -6, -201, -188, 5, 7, 73, 23, 104, 37, 55, -106, 29, -28, 59, -6, 100, 17, -62, 175, -62, -51, 125, 93, -28, -58, 119, 65, -102, 64, -48, 83, 22, 68, -30, 126, -43, 121, 73, 119, -169, -17, -22, -87, -43, 116, -124, 9, 54, -4, -5, 64, -39, 41, -69, -30, -14, -24, -35, -21, 80, 48, -153, -77, -72, 123, 153, -79, 49, -64, 126, -68, 35, -40, -163, -85, 68, 100, 65, 69, 17, -26, -43, 99, -46, -98, -44, 61, -29, -12, 11, 50, 11, -3, 63, -103]
4379a03J59j48J21j6J7q0J19k04K60j42j42J57K1j83K31r1l8jJ14m1l4J05j73
$$ y = [-103, 56, -92, 29, 13, 30, -50, 69, -135, 125, -17, -159, -2, 19, -164, 67, -24, -62, -63, 51, 10, -24, 81, -92]
$$ [...]
8191D5
##END NTUPLES=NMR FID
##END=
