##TITLE=1H_35-2024-Bay
 CDCl3
 8 sc, 
 6.5.2024
##JCAMPDX= 6.0         $$ Bruker NMR JCAMP-DX V2.0
##DATA TYPE= NMR FID
##DATA CLASS= NTUPLES
##ORIGIN= UXNMR, Bruker Analytische Messtechnik GmbH
##OWNER= root
$$ XWIN-NMR		Version 3.5
$$ Mon May  6 15:27:45 2024 Russian Standard Time (UT+4h)  she@DPX200
##.OBSERVE FREQUENCY= 200.1309
##.OBSERVE NUCLEUS= ^1H
##.DELAY= (6, 6)
##.ACQUISITION MODE= SIMULTANEOUS
##.ACQUISITION SCHEME= undefined
##.AVERAGES= 8
##.DIGITISER RES= 18
##SPECTROMETER/DATA SYSTEM= spect
##.PULSE SEQUENCE= zg30
##.SOLVENT NAME= CDCl3
##.SHIFT REFERENCE= (INTERNAL, CDCl3, 0, 15.7039)
##AUDIT TRAIL= $$ (NUMBER, WHEN, WHO, WHERE, WHAT)
$$ ##TITLE= Audit trail, XWIN-NMR		Version 3.5
$$ ##JCAMPDX= 5.01
$$ ##ORIGIN= Bruker BioSpin GmbH
$$ ##OWNER= she
$$ F:/spectra/data/she/nmr/H-F/1/audita.txt
$$ ##AUDIT TRAIL=  $$ (NUMBER, WHEN, WHO, WHERE, WHAT)
(   1,<2024-05-06 15:25:26.98 +0400>,<she>,<DPX200>,
      <created by zg, POWCHK disabled, PULCHK disabled
       configuration hash MD5:
       00 E9 B6 7A A2 85 ED C7 34 08 36 98 17 FE 4E 26
       data hash MD5: 16K
       34 7D D9 86 29 03 33 2B 1A 40 12 BA 84 32 0D D4>)
$$ ##END=
$$ 
$$ hash MD5
$$ DD 82 B5 60 37 1D 7F D6 C5 63 DF D9 42 43 61 DE
##$RELAX= 
##$RELAX= 
##$RELAX= 
##$RELAX= 
##$RELAX= 
##$RELAX= 
$$ Bruker specific parameters
$$ --------------------------
##$DU= <F:/spectra>
##$EXPNO= 1
##$NAME= <H-F>
##$PROCNO= 1
##$TYPE= <nmr>
##$USER= <she>
##$AMP= (0..31)
100 100 100 100 100 100 100 100 100 100 100 100 100 100 100 100 100 100 
100 100 100 100 100 100 100 100 100 100 100 100 100 100 
##$AQSEQ= 0
##$AQ_mod= 1
##$AUNM= <au_zg>
##$AUTOPOS= <>
##$BF1= 200.13
##$BF2= 200.13
##$BF3= 200.13
##$BF4= 200.13
##$BF5= 200.13
##$BF6= 200.13
##$BF7= 200.13
##$BF8= 200.13
##$BYTORDA= 1
##$CFDGTYP= 0
##$CFRGTYP= 5
##$CHEMSTR= <none>
##$CNST= (0..31)
1 1 145 1 1 1 1 1 1 1 1 1 1 1 1 1 1 1 1 1 1 1 1 1 1 1 1 1 1 1 1 1 
##$CPDPRG= <>
##$CPDPRG1= <>
##$CPDPRG2= <>
##$CPDPRG3= <>
##$CPDPRG4= <mlev>
##$CPDPRG5= <mlev>
##$CPDPRG6= <mlev>
##$CPDPRG7= <mlev>
##$CPDPRG8= <mlev>
##$CPDPRGB= <>
##$CPDPRGT= <>
##$D= (0..31)
0 1.2 0 0 0 0 0 0 0 0.06 0 0.03 0 0 0 0 0.0002 0 0 0 0 0 0 0 0 0 0 0 0 
0 0 0 
##$DATE= 1714994726
##$DBL= (0..7)
120 120 120 120 120 120 120 120 
##$DBP= (0..7)
150 150 150 150 150 150 150 150 
##$DBP07= 0
##$DBPNAM0= <>
##$DBPNAM1= <>
##$DBPNAM2= <>
##$DBPNAM3= <>
##$DBPNAM4= <>
##$DBPNAM5= <>
##$DBPNAM6= <>
##$DBPNAM7= <>
##$DBPOAL= (0..7)
0.5 0.5 0.5 0.5 0.5 0.5 0.5 0.5 
##$DBPOFFS= (0..7)
0 0 0 0 0 0 0 0 
##$DE= 6
##$DECBNUC= <off>
##$DECIM= 32
##$DECNUC= <off>
##$DECSTAT= 4
##$DIGMOD= 1
##$DIGTYP= 9
##$DL= (0..7)
0 120 120 120 120 120 120 120 
##$DP= (0..7)
150 150 150 150 150 150 150 150 
##$DP07= 0
##$DPNAME0= <>
##$DPNAME1= <>
##$DPNAME2= <>
##$DPNAME3= <>
##$DPNAME4= <>
##$DPNAME5= <>
##$DPNAME6= <>
##$DPNAME7= <>
##$DPOAL= (0..7)
0.5 0.5 0.5 0.5 0.5 0.5 0.5 0.5 
##$DPOFFS= (0..7)
0 0 0 0 0 0 0 0 
##$DQDMODE= 0
##$DR= 18
##$DS= 0
##$DSLIST= <SSSSSSSSSSSSSSS>
$$ [...]
##$SUBNAM2= <"">
##$SUBNAM3= <"">
##$SUBNAM4= <"">
##$SUBNAM5= <"">
##$SUBNAM6= <"">
##$SUBNAM7= <"">
##$SUBNAM8= <"">
##$SUBNAM9= <"">
##$SW= 18.0517689322627
##$SWIBOX= (0..15)
0 0 2 0 0 0 0 0 0 0 0 0 0 0 0 0 
##$SW_h= 3612.71676300578
##$TD= 16384
##$TD0= 1
##$TE= 0
##$TE2= 300
##$TE3= 300
##$TEG= 300
##$TL= (0..7)
0 120 120 120 120 120 120 120 
##$TP= (0..7)
150 150 150 150 150 150 150 150 
##$TP07= 0
##$TPNAME0= <>
##$TPNAME1= <>
##$TPNAME2= <>
##$TPNAME3= <>
##$TPNAME4= <>
##$TPNAME5= <>
##$TPNAME6= <>
##$TPNAME7= <>
##$TPOAL= (0..7)
0.5 0.5 0.5 0.5 0.5 0.5 0.5 0.5 
##$TPOFFS= (0..7)
0 0 0 0 0 0 0 0 
##$TUNHIN= 0
##$TUNHOUT= 0
##$TUNXOUT= 0
##$USERA1= <user>
##$USERA2= <user>
##$USERA3= <user>
##$USERA4= <user>
##$USERA5= <user>
##$V9= 5
##$VALIST= <valist>
##$VCLIST= <CCCCCCCCCCCCCCC>
##$VD= 0
##$VDLIST= <DDDDDDDDDDDDDDD>
##$VPLIST= <PPPPPPPPPPPPPPP>
##$VTLIST= <TTTTTTTTTTTTTTT>
##$WBST= 1024
##$WBSW= 4
##$XGAIN= (0..3)
0 0 0 0 
##$XL= 0
##$YL= 0
##$YMAX_a= 228136
##$YMIN_a= -280255
##$ZGOPTNS= <>
##$ZL1= 120
##$ZL2= 120
##$ZL3= 120
##$ZL4= 120
##$ABSF1= 10
##$ABSF2= 0
##$ABSG= 5
##$ABSL= 3
##$ALPHA= 0
##$AQORDER= 0
##$ASSFAC= 0
##$ASSFACI= 0
##$ASSFACX= 0
##$ASSWID= 0
##$AUNMP= <proc_1d>
##$AZFE= 0.1
##$AZFW= 0.1
##$BCFW= 1
##$BC_mod= 2
##$BYTORDP= 1
##$COROFFS= 0
##$CY= 11.3945322036743
##$DATMOD= 1
##$DC= 2
##$DFILT= <>
##$DTYPP= 0
##$F1P= 15.6554695791079
##$F2P= 12.8336369535428
##$FCOR= 0.5
##$FTSIZE= 0
##$FT_mod= 4
##$GAMMA= 1
##$GB= 0.15
##$INTBC= 1
##$INTSCL= 1
##$ISEN= 128
##$LB= 0.24
##$LEV0= 0
##$LPBIN= 0
##$MAXI= 10000
##$MC2= 0
##$MEAN= 0
##$ME_mod= 0
##$MI= 1.114404
##$NCOEF= 0
##$NC_proc= 0
##$NLEV= 6
##$NOISF1= 3.799351
##$NOISF2= 2.8
##$NSP= 1
##$NTH_PI= 0
##$NZP= 0
##$OFFSET= 15.70392
##$PC= 1
##$PHC0= -25293.55
##$PHC1= 4.587494
##$PH_mod= 1
##$PKNL= yes
##$PPARMOD= 0
##$PSCAL= 0
##$PSIGN= 0
##$REVERSE= no
##$SF= 200.130013532006
##$SI= 16384
##$SIGF1= 3
##$SIGF2= 2
##$SINO= 400
##$SIOLD= 16384
##$SREGLST= <1H.CDCl3>
##$SSB= 0
##$STSI= 0
##$STSR= 0
##$SW_p= 3612.71676300578
##$SYMM= 0
##$S_DEV= 0
##$TDeff= 0
##$TDoff= 0
##$TI= <>
##$TILT= no
##$TM1= 0
##$TM2= 0
##$TOPLEV= 0
##$USERP1= <user>
##$USERP2= <user>
##$USERP3= <user>
##$USERP4= <user>
##$USERP5= <user>
##$WDW= 1
##$XDIM= 8192
##$YMAX_p= 0
##$YMIN_p= 0
$$ End of Bruker specific parameters
$$ ---------------------------------
##NTUPLES= NMR FID
##VAR_NAME=  TIME,          FID/REAL,        FID/IMAG
##SYMBOL=    X,             R,               I
##VAR_TYPE=  INDEPENDENT,   DEPENDENT,       DEPENDENT
##VAR_FORM=  AFFN,          ASDF,            ASDF
##VAR_DIM=   8192,          8192,            8192
##UNITS=     SECONDS,       ARBITRARY UNITS, ARBITRARY UNITS
##FACTOR=    0.0002768,     1,               1
##FIRST=     0,             0,               0
##LAST=      2.2672688,     0,               0
##MIN=       0,             -280255,         0
##MAX=       2.2672688,     228136,          0
$$ Real data points
##PAGE= N=1
##DATA TABLE= (X++(R..R)), XYDATA
0@%%%%%%%%%%%%%%%%%%%%%%%%%%%%%kMoOl%KkLnQj1J3j7K1k3K6l0L5m1M5n0N5
52B8n8O2o5O4o1N7m5K4J2p1J66l23N88j070K017m157J0486n4327k03439K62148
72A2036K4963m1174R4022k86933q3169L52694P059j63244Q1800j84618J6618L32551
84A62605j79045r6586J66560j16076N7382J49701j95971l0446K10170j21349k044
95D901J64471k16148K5064J37385k04010R6260J53377j79426j2541O1173j45743
106a15237J14891J54393k49418J8723J28348j24764J31486n158k34419J35119
116d6036J58282r6801J3085l6600j62766K02059J21904k07809N4986k200p4059
127g5955J78978n4553j80535J15743P5411p1559P3329p3969j42520K02211J5223
$$ y = [0, 0, 0, 0, 0, 0, 0, 0, 0, 0, 0, 0, 0, 0, 0, 0, 0, 0, 0, 0, 0, 0, 0, 0, 0, 0, 0, 0, 0, 0, -2, 2, -4, 2, -1, -1, 1, -1, 2, -3, 5, -6, 7, -10, 11, -12, 14, -16, 19, -22, 23, -27, 28, -30, 32, -33, 31, -30, 27, -18, 6, 18, -53, 113, -210, 378, -692, 1325, -2832, 7654, -46673, -250112, 12036, 36999, -4175, 89847, -197086, -280255, 72439, 79498, -83746, -1946, -186564, -169946, 162605, -16440, -113026, 53534, -62542, -5160, 144541, -51430, -81876, 128294, 6945, 4901, 169372, -46776, -21712, 115673, -88337, 7923, 161300, -18126, -30667, 30506, -115237, -346, 154047, -95371, -76648, 51700, -73064, 58422, 53264, -181155, -46036, 112246, 15445, 28530, -8070, -170836, 31223, 153127, -54682, 304, -1896, -75955, 103023, 48470, -132065, -16322, 59089, -12470, 60859, -13110, -155630, 46581, 61804]
138F1804j29189J02853n3590l5252J32219q1201j03622J35927K6910o8638Q0045
149F8266r8730n6119J82999o3883o9891Q0987m9401J5694P7618j10454o1932J38019
161E3173j0333l2180N2494j31714J9859J33441r1475k2512M7599m1634L5646M8042
173F0406j22391j7094J25424m6381Q210K0400j16233O9145P1806q6667p9L9445
185E991j9765M0874J6667j21818L4518R6344m6503L1268k7635o7946Q7450K6073
197E5518p0455M45L0268p086N0703k2973j12745O3812M8018k6495K7623n8491
209b1858k8231P2514K695o3596O772K5183j252N4911n4143p4429P2779J8735q96
222I184P661m6542N229N5089r678n8018K1714J8354J5435L8341p8455k8496N6173
$$ y = [61804, -67385, 35468, -18122, -53374, 78845, -2356, -105978, 29949, 56859, -11779, 68266, -30464, -86583, 96416, 32533, -37358, 43629, -5772, 9922, 87540, -22914, -84846, 53173, 42840, 10660, 63154, -68560, -48701, 84740, -6735, -29247, 18352, -23282, 12364, 60406, -61985, -79079, 46345, -36, 8174, 28574, -87659, -18514, 53292, -33375, -33454, 5991, -13774, 27100, 43767, -78051, -43533, 52811, 6308, 37576, 9941, -58005, 29445, 55518, -14937, -14492, 15776, 8690, 59393, 36420, -76325, -12513, 35505, 9010, 36633, -21858, -50089, 22425, 25120, -38476, -31704, -6521, -7773, 47138, -7005, -81434, -8655, 10080, 9184, 16845, -29697, -24468, 30621, 20943, -37075, -15361, 2993, 18428, 56769, -21686, -50182, 5991]
235E991O966O382j7302k8165J7599M4355l0061m9494L0407R203L6200J0212p6375
248c4082J875L8029J5875l720k1756j0201K2559L8271m7138l3955K3649J3470
260B876M2323k4084n5173O305K7126J8704k2177j6256k328L2640K2114n4207j4229
273c6366J3578L2404L4469l7613k9190P134L4078R279k5257o700K737M2753j079
286D0227m9473j0340Q319M2525P345l6950k2378L186L4976j1486k4176q464J3273
299a3416M0699k0303l4728j4454K0151M5957r330k2563j7541J8533L0634j8702
311D937j5645q929L3410L0076k7244k7433j8176L4160K8540j5612k1263j7774
323b0953L0177J0541k2231j9249m943M2753J1022k3073l0742r415M1485J2178
$$ y = [5991, 12957, 19339, 2037, -26128, -8529, 35826, 5765, -43729, -13322, -4119, 32081, 42293, -34082, -32207, 5822, 21697, 17977, -3779, -13980, 8579, 46850, -288, -34243, -10594, 2876, 45199, 21115, -34058, -27753, -627, 18077, -4100, -20356, -22684, 9956, 32070, -22137, -36366, -22788, 9616, 44085, 6472, -22718, -15584, 18494, 27773, 2516, -4184, -1447, 41306, 40227, -9246, -19586, -11267, 31258, 38603, 1653, -20725, -17539, 17437, 5951, -18225, -26689, -13416, 27283, 6980, -27748, -42202, -22051, 23906, 14576, -7987, -25528, -6995, 23639, 4937, -10708, -19637, 13773, 43849, 16605, -10828, -29004, 5156, 33696, 18084, -3179, -20953, 9224, 19765, -2466, -21715, -26658, 16095, 27117, 4044, -26698, -36113, 5372, 17550]
335A7550j0172k3020k006L3578k483j5675k4751J0405M2180J04j9929l4065O211
348b2073L1388M411j0603k8879J7003K2995r155j6924k6126K4536L3482M60k5166
361d651k6456K1088J8933R705j8211k0421L2638J1831o194k3431j8586L0471K5748
374C2464j331l5442j0776J7192Q902R578l3610n325L1977P80r229k7747q118K5908
388d777K6141j1332l4109J0319O123J3054M238l6665J5704K9805p24j4239k1336
401a7798j286K6358K8663k9910j9748J7749l294K0430j3438l4055K6704K5164
413B5539o559j9503j5271o607L4320K0280m4308K074J0869l919K2837k7026k3450
426c0724L3228K2387j6431j2696j0908r282M6615j117m2290K1011P60K894J5526
$$ y = [17550, 7378, -15642, -17648, 15930, 13447, -2228, -26979, -16574, 25606, 25710, 5781, -28284, -22073, 9315, 13726, 3123, -25756, -8753, 14242, 5087, -11837, -37963, -13427, 20055, 20515, -4651, -31107, -10019, 8914, 18619, 408, -20013, 12625, 24456, 18262, -5169, -23755, 6716, 32464, 31133, -4309, -15085, 2107, 11009, 20587, -13023, -18348, 13629, 14409, 5180, -22567, -30685, -4777, 21364, 10032, -24077, -13758, -7635, 5419, 9657, -27008, -11304, 18501, 17777, 3538, -17798, -19084, 7274, 35937, 6027, -13721, 4028, 734, 21164, 7726, -26329, 375, 25539, 18980, -523, -15794, -22401, 11919, 32199, -12109, -10035, 834, -3085, 19752, -7274, -30724, 2504, 24891, 8460, -4236, -15144, -24426, 22189, 21072, -21218, -207, 553, 3447, 18973]
439A8973l4849j4271M0670J5399k5590q60k0512k264N3703k6234k7671K5219q219
452f506J0659J0808l8967q428M7910j809j9042J3775l5355J3359M4855m0787k067
465a1595K6098j4680R537P283l8417J0430M8350l1103o966J6232l4666L3425J4413
478B8341n4591J4993L0052j3535N215j0808m8728L9438M5710m7287K644n557k2729
491c6842N8421k037n7839J6970K6528l417K6861k3435n8695N6743L0263k9936
503C585K2808l2256j9752O0608p741m1190K3286n41j4011M4295l1523m2898N3566
516A8236j5995j6596L8821l3308j1111L7462l2304j9074N1535j5522j8457L4055
528A7742m6130M438O0908m3763j2983L0222k0263K0067K9212o1370j2239O0987
$$ y = [18973, -15876, -30147, 10523, 25922, 332, -528, -21040, -23304, 30399, 4165, -23506, 1713, -6506, 4153, 14961, -24006, -32434, 15476, 13667, -5375, 8400, -26955, -13596, 31259, -9528, -11595, 14503, -177, 9360, 16643, -21774, -11344, 37006, 5903, -1063, 15169, -19497, 13928, 28341, -26250, -11257, 18795, 5260, 10475, -333, -49061, -9623, 36087, -11200, -8556, -14113, -36842, 21579, 19542, -38297, -21327, 5201, 1784, 28645, 5210, -53485, 3258, 33521, 3585, 26393, -5863, -25615, 34993, 27252, -13938, 9348, 8807, -5204, 39091, 7568, -35330, 18236, 2241, -14355, 24466, -8842, -19953, 17509, -14795, -33869, 17666, 2144, -16313, 17742, -28388, -23950, 36958, -6805, -19788, 10434, -9829, 10238, 39450, -21920, -34159, 26828]
540B6828j6128O678J0286p0018K9436N4301l9924m514N156k9042L8043L0072o9052
553b7878m07L7229k4594L8184j974o6785L6082K8261l1142J8283J478l5802M2487
566A3422J3195n8807L2523J2354l0880M4084j6126l9289M5232n69l7044K8916
578G011M06k3818M6145k3070m8675N2409k402j7385L1308l5692j5541N3303j3489
591A0510l6164K8268j2230p44N1257m7857l0715M7281j1330N640K1361m4783k877
604b2383N0693k2082k0133K5200k9166J8314M1716n4391o427K9656j9021J6251
616H227J4335m1721R359L6702l6272N25K0474l2531L1751J5370m9858J5604J8986
629A0951k1224J6109M383l3752K9520K0051m5680J4679Q007j8024M0131r726m1588
$$ y = [26828, 10700, 17378, 27664, -42354, -12918, 41383, 1459, -3055, 2101, -26941, 11102, 41174, -27878, -28285, 8944, -15650, 22534, 20560, -46225, -10143, 18118, -13024, 5259, 6737, -29065, 13422, 26617, -32190, 333, 12687, -18193, 25891, 9765, -29524, 15708, 15139, -21905, 7011, 7417, -16401, 29744, 6674, -42001, 10408, 8006, -9379, 21929, -13763, -29304, 23999, 10510, -25654, 2614, -9616, -10360, 40897, -6960, -37675, 9606, -1724, 3916, 25277, -19506, -22383, 28310, 6228, -13905, 11295, -17871, 443, 42159, -12232, -18659, 10997, -8024, 8227, 22562, -19159, -9800, 26902, -9370, -8845, 11629, -20902, 10849, 26219, -23639, -8035, 10951, -10273, 5836, 10219, -23533, 5987, 26038, -19642, -4963, 3044, -14980, 25151, 15425, -26163]
642b6163K4084J3593j5597J6073j0211k7071M3988L226l8416J7290r063j188L8548
655B9093k0829l0831K2226N415j0141J9465k1695j4924M4141j3684k1735J5109
667A610j5662R879K7374k4778j7250K4512m736o391J7139k7093N412L5029k5591
680e46r086Q648j0679J6456J5562k8567o419K6138j2006J168N841k7739K2687
693A458K1269k5573l969J114m872J8805P631k9876M332J9858j4081Q526o991j8326
707b0695K8462Q293j9205l104M04j038J7876m12k6348J5476J0205j0795P451j5698
721i128l525K5746P28j6854l161J876J307J7014j1370j8524K0548K083l785k44
735B711j6730O267K0493j067j6667p04J271M700J3987j8932o671J7801k68M55
$$ y = [-26163, -2079, 11514, -4083, 11990, 1779, -25292, 18696, 21922, -16494, 796, -8267, -9455, 29093, 8264, -22567, -341, 5074, -5067, 14398, -7297, -22221, 21920, 8236, -13499, 1610, -14052, -4173, 23201, -1577, -18827, 5685, 949, -5442, 11697, -15396, -9984, 25045, -546, -9632, -984, -11663, 4793, 20355, -8212, -14631, 11507, -499, 669, 6510, -21229, 1458, 22727, -2846, -6815, -5701, -10573, 8232, 15863, -14013, -9681, 10177, -3904, 4622, -2369, -20695, 7767, 16060, -3145, -6249, -5845, -6883, 10993, 10581, -15767, -291, 9914, -881, 6570, -9128, -12653, 13093, 13821, -3033, -6194, -4318, -3011, 14003, 2633, -15891, 4657, 6740, 2955, 2711, -14019, -7752, 12741, 11674, -4993, -5697, -4426, 274, 14261, -4671, -11342, 6459, 6191, 6646]
749F646q591j1006R654J6776l901j5494K272k67R059N914k0305K600J2401K782
763H540k250j2591m789J0107J5339r002j1388K598L97J1956m814j5014O154Q895
777D138N863q583j0832j683J1113J1712j2678n988J224M653R681j1775p261N607
791d809J1229M140j1954o606n90J4299N353j1999k580K49J0275J520j2417l659
805g549M556J3590j527j1722n874J429J4414k006r152l205L152J1420n652r672
819g798l462Q197J3098o107q650o283P173J1561n913n521l664R023Q088q614p192
834f064l494J2782Q065o959p454n508J1452N018n439n674k007J2710J775p399
848A804q443o65J4642J977m799r367j317J2059m09m788p623L401J1006j352o721
$$ y = [6646, -1945, -12951, -3297, 13479, 9578, -5916, -3644, -3911, 5148, 11062, -9243, -6643, 5758, 8540, 6290, -6301, -11090, -983, 14356, 5354, -6034, -3436, -3039, 8917, 4103, -10911, -4757, 4138, 10001, 1418, -9414, -11097, 16, 11728, -950, -6938, -5714, -1061, 8620, -3155, -10416, -4809, 6420, 10560, -1394, -8000, -8590, 5709, 11062, -937, -3517, -3268, 7007, 8527, -3890, -7549, -2993, 10597, 9070, -2652, -8526, -7097, 7317, 5311, -3841, -7046, -3894, 7526, 1874, -7798, -11260, -3063, 10035, 3928, -4722, -11005, -3832, 7729, 1816, -3705, -7369, 1654, 9742, 1128, -6064, -9558, 3224, 11289, 4330, -3124, -8632, 2820, 7838, 2399, -3275, -5282, 7428, 9203, 1804, -6639, -7304, 7338, 9315, 4516, -4851, -6168, 5891, 5482, 694, -6929, -3528, 7478, 6126, -595]
863e95j1367N953J1399m78m169j0530N203R178j726o197o132R132P360K97r498
878b170r244J2091O258K73n536q180Q599N758k383r703j175Q921M137J044j4582
893e892l817J2173J626M14q063l754Q412N261n900j0606N573N658N733n83j7196
908a0961M335R877O00r32p830l18Q683N978j2602o642Q123J710R738o982j5703
923a2926R080O582j22k969n500l02J1495L634j7280J532N390J622J1907j2341
937a98j0005J0634M780k828j909l313j147J5332m045j6893Q160J13M311Q225j5441
952d224m677J2230K137p185R86m901K243J8147j4571j1777J0572k322Q855L081
966H594j6927r60J5948k651p746L702j0542J0663J6733k1546m049P671k783J1524
$$ y = [-595, -11962, -6009, 5390, 4912, 743, -9787, -4584, 4594, 2868, -3329, -9461, -329, 7031, 7328, -2170, -11414, 677, 6935, 7208, 1672, -6508, 2091, 7849, 5466, -4237, -5412, 3509, 7646, 8690, -5892, -9709, 2464, 4090, 4504, -3559, -7313, 1099, 6360, 460, -10146, -4573, 1085, 6818, 6235, -10961, -6626, 3251, 3851, 2919, -4911, -5229, 3454, 9432, -3170, -9812, -1689, 21, 9759, 2777, -12926, -3846, 2736, 2614, -355, -5855, -6157, 5338, 8972, -8308, -6776, -1386, 236, 12143, -198, -10203, 431, 5211, 2383, 474, -2839, -3986, 11346, 7301, -9592, -1432, -1319, 2992, 11217, -4224, -8901, 3329, 5466, -1719, -733, -5634, -3391, 14756, 185, -11592, -1020, -3342, 5513, 8594, -8333, -9293, 6655, 4004, -3742, -40, -10582, 81, 16814, -4732, -8781, -1110, -3893, 7631]
980G631R51j7561L132J6755r312j191L107j3855J8174Q571k0922L337L374l677
994a486J0354j072j7275R859J0951j7014N724j115j0369K1034l800j8927Q826
1007d310L421m093R180o372j4795K2561M027j8312Q715p384R49K4730j1800j7693
1021a1176J0473M071p91J2073j6792j2988K8200l764j0580O356j7679O293K3038
1034A6734j3090j3949Q953n362K534J7018k1315m969K1496j2476K021P622j6808
1047a1591P359J4949j4067j602J4043j4079K795J1766j9664J2332J3398k1133
1059e494K440N152p880J2892M902k4760N352J7252j2263Q280n278k1437K4565
1072C723J1800j7568m51l958n458K3261L798k7757Q146O815o313J8646j3666j8704
$$ y = [7631, 8582, -8979, -5847, 10908, 1596, 405, 3512, -10343, 7831, 16402, -4520, -1183, 2191, -1486, 8868, 7796, -9479, 380, 11331, -5683, 41, -1074, -11443, 9591, 5791, -13136, -4310, -889, -4982, 4198, -2174, -16969, 5592, 9619, -8693, 22, -7362, -6413, 18317, 6517, -11176, -703, 3368, 2577, 14650, -2142, -15130, 13070, 9306, -1274, 5082, -12597, -6304, 16734, 3644, -10305, -1352, -6714, -4180, 12838, -8477, -13446, 8050, -4426, -2405, 5217, -11591, -4232, 10717, -3350, -4952, 9091, -4988, -2193, 9573, -10091, 2241, 15639, -5494, -3054, 2098, -5782, 7110, 12012, -12748, -7396, 9856, -2407, 5873, 595, -20842, 3723, 15523, -2045, -2496, -6454, -11912, 11349, 15147, -12610, -4464, 2351, -3962, 14684, 1018, -17686]
1086a7686K1424M769q653N598r781r114K3324j987j7213J4947p283m830J7393
1099A0908j3782n660J7360n702q360J0929p582l411J8306j5762o783J9503r209
1112G55k86N721j6766M534J9407j0050r358P634j0103Q281J5541k3207p69J3628
1126D962o740P111O9j8130P249J7345j1141j666L943j4059J4591P787k0173O559
1140b293N859o831P937k375j4419J1327J0092j4817N644M16r726J6915l794j4816
1154a0881J1081M276m471N350o497j0563J7786L695j3957O890n574j091J5602
1167A1646j0082j1059R506L017k235N013j0828p466J9081l131p924N857q561M752
1181b414J0805j1007o073R439P60p53N052j2884L35J5564q313j608K839o561P460
$$ y = [-17686, 3738, 8507, -146, 5452, -4329, -13443, 9881, 7894, -9319, 5628, -1655, -6485, 10908, -2874, -8534, 8826, 3124, -5236, 5693, -1889, -5300, 13006, -2756, -9539, 9964, 755, 469, 6190, -10576, -6042, 13365, 3315, -6043, 1591, -8512, -231, 15310, -7897, -8666, 4962, -1778, 5333, 5402, -12728, -5479, 11866, 725, -941, 3002, -11057, 3534, 11321, -8852, -2293, 3566, -3265, 4672, 2297, -12122, -795, 9297, -5520, 124, 540, -9186, 7729, 3935, -10881, 200, 4476, 5, 5355, -1142, -11705, 6081, 9776, -4181, 2709, -2865, -3956, 11646, 1564, -9495, 11, 3028, 793, 5806, -5022, -12488, 6593, 3462, -4462, 1395, -7166, -2414, 8391, -2616, -8689, 750, 1510, 757, 5809, -7075, -6740, 8824, 511, -1097, 1742, -4819, 2641]
1196B641M853j0962k758J0053k082R70J987j3544P710R418q790N54k22j846P449
1211E431J266j1502O71R460l510L319l545j0047J1280L221p101p47j218J202O259
1226D439j641j2120M462O557k457M073q042l819J0792P92m334j734O65K702O507
1241F842l621r957P487K968O59J845r037Q13O968N43n069j927R09J904N470p739
1257i42n969O396P27K299k508o236K995N171m67n657M54J177M207L392r225q98
1273e084M993J967J882n239k455L436M876k251n853J329J359N294q85q061R89
1288c703K966L715j126m746m27L198M824m383l716J367K328N780m040m969R47
1303a985L179L778l642k871n55M317K764n764k284R5M541K995n394k899O4M923
$$ y = [2641, 7494, -3468, -6226, 3827, 1745, 2715, 4702, -8842, -1132, 8286, -504, 50, -172, -2018, 5431, 6697, -4805, -4134, 5326, 1816, 5135, 1590, -8457, 2823, 6044, -1057, -1804, -3022, -1820, 4439, 2798, -9322, -4860, 1697, -760, 3313, -4729, -8548, 2244, 3036, -1298, -3032, -2367, 335, 6842, 3221, -6736, 751, 3719, 4378, 6223, -2814, -2001, 4967, 5510, 441, -1486, -577, 1327, 6797, -942, -6911, -515, 212, 2511, 3, -6233, -3238, 1933, 1466, -4191, -3737, -2560, 1647, 5039, -4186, -5084, -91, 1876, 3758, -1481, -3936, -500, 4376, 2125, -3728, -2399, -1040, 4254, 3369, -4692, -3703, -737, 2978, 1852, -2894, -3321, -123, 4701, 318, -3398, -2031, 297, 6077, 2037, -2932, -1985, 1194, 4972, 1330, -1541, -2096, 2221, 4985, -779, -3063, -2968, 1573, 4568, -826, -3725, -3661, 1262]
1319A262J324m270j786K72N854J64m905j343Q09O396o6m010k211Q83N801j464
1335B710l029j981J921N460k409l545k401K579N345k368k868k785L163M045k775
1350A062k332k228M494L304k971k755k601M808K961k199l095k104N318J092k158
1365E96l323j189N981P65k767l489o15N355R75j714m106Q39M940l96j610m180
1381c938J591N436k51k493m047K171L745P65k223m682L867K680q88j816m093L440
1397g36M013o84l604k598K875K255J438m520k552N205Q00N3l344k898M425L130
1413C258j166m918R6K109K419R42o703P34M535J65m8m290j035M253L458k937l676
1430b804J948N03L755r45o286L755L072J52j202l817j04M675K822o074j379J769
$$ y = [1262, 2586, -1684, -3470, -3198, 2656, 2820, -2085, -3428, -2619, 3777, 3711, -299, -2510, -1627, 4174, 2710, -319, -2300, -379, 5081, 2672, -873, -3274, -695, 4650, 2282, -586, -3371, -208, 3837, 1062, -1270, -3498, 996, 4300, 1329, -1426, -4027, 781, 3742, 1543, -1552, -3656, 1662, 2754, 596, -2727, -3916, 2065, 2830, 63, -3426, -4041, 1314, 2289, 575, -3531, -2692, 2248, 1852, 242, -3938, -2347, 3089, 2838, 345, -3702, -1531, 2214, 2979, 756, -3926, -59, 2621, 1733, -83, -4176, -736, 3277, 2593, -1011, -3609, -734, 1521, 2959, -1561, -4113, 1092, 1892, 1945, -1399, -4297, 128, 3258, 2092, -2826, -2730, -621, 1798, 2740, -3963, -3229, 1306, 1471, 1423, -2867, -3902, 351, 3809, 872, -2804, -856, -353, 3402, 2457, -3829, -74, 2998, 3150, 1948, -1869, -1973, 2702, 5524, -550, -1929, -160]
1446a60L1M546m850n042M961K343k22k356l288l67O634J277o694J491l62K052
1462fM984o120k375M262K183o17o19l156q79P573k829m027L319k571K335K076
1478C533o307K91M813p47k879R56l280K195O386p744j427M048q20L776j718o913
1494e837K410P693j565k920n91n098P769N496q942p91R62P61N851k004q503J757
1510c552O707k099J491k763o981Q960K100n712J880j366r20N092r92o299M589
1525A35K109m880M916k765k733P172l930m174M715N75j297K505m424l752R964
1540D136j334m998K866m951L301Q019o753m856M163Q77J668L582r129k469J0317
1555D439k506p09O02p257M647O502n642l186L602k387L139L738r582J802O173
$$ y = [-160, -129, 4417, -433, -5475, -514, 1829, 1607, -749, -4037, -4404, 2230, 3507, -3187, -1696, -2058, -6, 4978, -1142, -3517, 745, 2928, 2311, 1692, -1464, -2343, 5230, 2401, -1626, 1693, -878, 1457, 3533, -2774, -2483, 2330, 1583, -1296, -340, -3620, -1425, 4961, -2783, -4210, -162, -982, 2794, 1076, -5837, -3427, 4266, 2701, -219, -810, -5908, 1861, 7357, -1585, -2376, -1414, -653, 5198, 3194, -5309, -3552, 3155, 1056, 2547, -216, -7197, 1763, 3863, -1849, 31, -1335, -2255, 2837, 1845, -4454, 135, 2244, -2636, 2280, -485, -3218, 3954, 24, -4150, 565, 1140, -157, 2348, -2076, -5828, 4136, 2802, -2196, 670, -4281, -980, 7039, 286, -4570, -407, 470, 2138, 5720, -3409, -5878, 4439, 1933, 1224, 1826, -5431, -784, 5718, 76, -3110, 492, -1895, 1244, 4982, -4600, -2798, 3375]
1570C375m865K479J15m812M936L135o866N80M919l908M060m29q622P070L372n511
1586i72J675j567k297O699P15r157K921K892k436O098n156o513Q127J420l319
1601h70J487l070j387Q302j562p399M956p37m10O451p160k857P153j165k177K135
1617A690l216m36P495n400m386O034k821J238L091p358P59O595k905k642K296
1632C4l709K926O024q323r89M881k192L642l29o856K814O121l647j294J335m397
1648c959O296L298q734J598K345j207M098j964n992L961M446m509N98o47l583
1663c955P813q66o566K995N11l20K805k586m597N602K062m771K297k191p51O872
1679D354l355m360L144O44K47J950l467k842O944l16l813J835l202K375M969m833
$$ y = [3375, -1490, 989, 1104, -3708, 1228, 4363, -2503, -1923, 2996, -912, 3148, 2719, -5903, 1167, 4539, -972, 703, -864, -3161, 3538, 4253, -4904, -1983, 909, -1527, 4571, -585, -7098, 1029, 2449, -870, 617, -2453, -3840, 4462, 2900, -4499, 457, -280, -690, 5761, -1399, -4256, 2897, 1732, -445, 1690, -1526, -1962, 5533, 133, -4253, 1781, -1040, 198, 3289, -4069, -3310, 3285, 380, -2262, 34, -3675, -749, 5275, -3048, -4037, 844, -1348, 2294, 1965, -4891, -2077, 4044, 397, -897, 438, -3959, 2337, 5635, -3099, -1501, 844, -363, 3735, 1771, -4221, -260, 4186, -323, 275, -372, -3955, 3858, 2992, -3574, -579, -68, -388, 2417, -169, -4766, 836, 2898, -1873, 424, -1767, -2518, 4354, 999, -3361, -217, 427, 674, 2624, -843, -3685, 3259, 2943, -870, 965, -2237, 138, 5107, 274]
1695B74l146K773R62K48J354n181o58P012k516j934L91l056M596K376m277k215
1711b997K751P41Q58Q55o084K503N006l040k94j342j141M136J247m095j598L088
1727E94m27J426p77m883L917K371k464k17j604N94L029J64m298M96K973q71J692
1744A715k739k250M611P64j711j581n61J597K863j079m655K034K057K03N64m388
1760b556J74L897M94j707k219L00J645K814k327l554K206J163J393o69l753J195
1776a504K943R94k463j452L86J365K602l511j466J936P60J500k143k063J320K322
1792A526L06k859j65L38K191J020l759K1J303J741K19k860p23J345K963j098k702
1809a193nP86K901j265k676K14J263K469j582k102m88J771K291j924j768l38J739
$$ y = [274, -2872, -99, 863, 1111, 2465, -2716, -3374, 3638, 1122, -812, -421, -3477, 1119, 3495, -782, -2997, -246, 495, 1353, 2208, -3876, -1373, 3633, 593, 299, -1043, -2184, 1952, 3199, -896, -2494, 594, 167, 1593, 816, -4067, -150, 2221, -243, -460, -2064, -1470, 1559, 1723, -2575, -2079, 894, 23, 1715, -1024, -3274, 1337, 2101, 390, -1191, -1752, -155, 2708, 1629, -3026, -992, 1065, 1268, 1832, -2556, -2382, 1515, 2009, 302, -1917, -1617, 28, 2842, 515, -3039, -833, 330, 1723, 1054, -2699, -1504, 1439, 2433, -30, -1482, -1096, 269, 2871, -640, -2106, -170, 590, 2090, -53, -2116, -796, 1526, 1832, -1027, -1192, -854, 1337, 2357, -1402, -1381, -78, 1663, 1882, -978, -1701, -356, 2607, 1509, -1193, -1198, -412, 2489, 1224, -1452, -1238, 25, 2494, 912, -1190, -1678, 93, 2384, 460, -1308, -1646, 93]
1826I3K220k156j817K78J915J565k138j196l88K541J204k269j097o12L056R15
1842B114k295j164j82K926N23k128j348n4L259r6j931j573N68L166o48j565j804
1859b232J125K974r58j304j888J284K878r28j395j768J708K301q28j628j739K297
1875a01J772q75j445j658K642J441r64j606j348K667J084p03k281p07K880P90
1891A588m34k390n94K766O45o79k305k36K512N48m38l075P40K523J38n98k773
1908b062P31K526J66j043k395J203J925Q80j943k302K082J539M59j482k463J923
1924b56K147L3k217j212J356J509J217l116j635K476N86R52k337j826J968J824
1940A469j34k609j92N60J958R39l952N52J595O55O76k472m76J651K044j592j746
$$ y = [93, 2313, 157, -1660, -1382, 533, 2098, -40, -1236, -1624, 917, 2121, -148, -1245, -1857, 1199, 2114, -181, -1345, -1527, 1399, 1922, -206, -1554, -1608, 1651, 1555, -376, -1949, -1381, 1785, 1137, -428, -2232, -1107, 1867, 909, -395, -2283, -999, 1879, 951, -444, -2212, -504, 1797, 969, -659, -2398, -101, 1671, 796, -649, -2307, 335, 1776, 812, -794, -2142, 525, 1609, 906, -1375, -2082, 798, 1588, 1154, -1236, -1830, 936, 1581, 902, -1403, -1639, 873, 1421, 983, -2092, -1352, 1171, 1309, 711, -2062, -1331, 1195, 1361, 318, -2077, -874, 1051, 1931, -12, -2314, -232, 1307, 1766, 284, -2179, -256, 1891, 1924, -293, -1505, -149, 1360, 2577, -539, -2174, 302, 888, 1840, -497, -2323, -355, 1469, 1335, -1274, -1466, -906, 1052, 1991, -1961, -1409, 186, 841, 1517, -955, -1431, 220, 2264, 672, -1074]
1957a074Q67J66K562j124l388J666J036O81r01j993l00K489J499l212p54N76M96
1974g08L017k884k326J618J598Q29j158j870l73L774P21l199N65q00J719K696
1990C219l516j276J401J452P3n69k001j97L665j547j820J015j484K465N80l030
2006a570m74J981N90p70J12k288J648L343l123p34N59M6K590n90k872J06L088
2023A642k07q89k25k870L546K015l237k01l34P27K340j027l319P20K753j156O79
2040I57j608k135M113K54k231M0l32O33J903j147l051K506J266j422J554k422
2056a122k93L799j338j894O88J14O41J725k424k380L791nr22N87l282J718K710
2073B113j726j674M10K38P74K032l900j065L835j006N85n69k719K256K329j585
$$ y = [-1074, -207, -41, 2521, 1397, -1991, -325, 711, 1392, 491, -1502, -1802, 687, 2186, -1026, -1780, -1204, -708, 2309, -575, -2901, -1283, 315, 1144, -14, -1884, -2257, 1517, 2238, -961, -396, -1196, 523, 3219, -297, -1573, -172, 1280, 1353, 784, -1217, -1414, 2251, 704, -1116, -101, -1585, 880, 1460, -1570, -2044, -63, 527, -243, -131, -2419, -771, 2572, -551, -1285, -726, -680, 1910, 1320, -1552, -1446, 1642, 1435, 546, 321, -2549, 997, 3012, -225, -426, -760, -33, 2307, 1280, -2039, -1319, 1434, 278, 957, -651, -2786, 1327, 1581, -650, -610, -942, -309, 1594, 447, -2604, -98, 1168, -254, 1300, -1122, -1415, 2384, 1046, -848, -160, -46, 595, 2320, -104, -2484, 1307, 1302, 380, 967, -2315, -597, 2113, 387, -1287, -877, -639, 135, 2167, -1733, -2798, 1037, 31, 616, 47, -2672, -416, 1913, 328]
2089C28j464J185n45J424J412m441J450K213j376Q23r40j560K080J499k875o09
2105a396J721j040J982r65l525K963J190q17l33j450l22K997J016l817L94J293
2121a09j21K878k743k596K933J059m0n97j669o95L613J92l376J102o81Q29K461
2138B440k959j352J717O73j64O9j585l10L213j358j639J749j367J621P57k685
2154a180L84J863p1j326N80j329R94K689l305n37J376l55J712j034k369Q36K505
2171A433n25j312nj622L203J432l570J27J76J304J464j456k620Q52L030r94o20
2188B97j105j382L721L24k345p13q0J528J114r87k442J227J918r76O65j948k06
2205a390K890p05j058l33K11O02R80q43j852K006L1o81L96j543J308R85j143j040
$$ y = [328, -1136, 49, -496, 928, 2340, -2101, -651, 1562, 186, 1009, 69, -1491, 589, 2088, -787, -1396, 325, -715, 1267, 302, -3223, -260, 930, 113, -220, -1670, -1992, 1005, 2021, -1796, -1402, -109, -230, 2648, -95, -2691, 242, 1301, 1261, 664, -1005, -1700, 1913, 2105, -1271, -169, -850, -21, 2440, -519, -1871, -154, 519, 355, 424, -1161, -1471, 1742, 384, -1255, 494, -873, 748, 1505, -1180, -796, 1067, 996, -330, 250, -1079, -85, 2604, -701, -1238, 138, -217, 1495, 461, -1908, -1072, 1433, 908, -404, -409, -2031, 1172, 2604, -966, -839, -663, 641, 2105, 649, -1971, -1119, 1911, 917, 297, -808, -2190, 1531, 1855, -490, -1203, -1283, 245, 1359, 372, -2070, -843, 1075, 99, 764, -1184, -1390, 1500, 795, -263, -596, -385, 217, 1197, 354, -1498, 508, 539, -142, 254, -1289, 19, 1004, -139, -1179]
2223a179M85J152j31J02j871n6K814q94o42p66m10K247M30j056j726Q77J495L37
2241A208l25k675Q42K175l28l38j880J03J886R74j488j726Q90P46R78m55k359
2258a772J372P62N98q30j289O78J079P93j661o05Q79K06J057j402j054J445M45
2275G01P0j115o60Q91J045J24k103M11N82P90J65j937J29J133J016o23j473j9
2293h73Q30J408p43j654N94K76J473q38j452L71R48J069j444q41J33Q09J393j510
2311e1q01J04Q82J224j612p15K13J390O63j709n02P0J279P44j836k14J79J525
2329H33M6j721j69L83J651m22j072l24N6J899o00j062l94M88J609o98j033p30
2347a260J073J401q68p78n65P04J470j202n95o06J158J160j136o65o66J577Q59
$$ y = [-1179, -694, 458, 327, 429, -1442, -1498, 1316, 422, -220, -986, -1396, 851, 1281, 225, -1501, -624, 871, 1208, 883, -1792, -950, 1225, 897, 559, -1321, -1218, 668, 1642, 154, -1572, -682, 64, 1042, 587, -1772, -400, 362, 960, 130, -1159, -481, 598, 1391, -270, -875, 4, 210, 1267, -135, -1189, 256, 701, 771, -344, -1004, -113, 932, 1056, -1047, -636, -54, 736, 901, -1036, -907, 226, 1242, 619, -854, -873, -43, 1365, 622, -1032, -438, -162, 1311, 473, -979, -608, 340, 1409, -35, -876, -743, 66, 1459, -51, -852, -748, 134, 1358, -254, -969, -756, 634, 1297, -412, -914, -844, 435, 1179, -657, -871, -692, 833, 879, -842, -1011, -628, 1023, 601, -471, -795, -739, 1160, 560, -502, -896, -408, 1201, 503, -530, -1260, -187, 1214, 346, -432, -997, -293, 1177, -25, -620, -1226, -68, 1092, -44, -709, -1375, 202, 1061]
2364A061q77q17n40J641O36q07p13l87J672L64q44r53l84K099k14m84j233j38
2382i18J832j68p46j113L89J525o43j27j508O94J677l61m43j321J081R29k9o12
2400A38j260J313R80j97o03j453J510O69n7r58j044J238O18p3j338o49J221N41
2418E96N0j552n71J422M67Q2j442j3J038M91R4j643K53J066O90j69j632K75J041
2437E43M32m50j320M28Q12N93p74j578R68M28P01p70j384N87Q31O54j194q83O90
2456f86Q07Q15j504q02J050Q65P07j545p20P08J134R8j437lM5J250L74j801L2
2475f13K61R74L56j282m58L17J295n83p33J11j28J492o71j285Q6N79R44m16p13
2494d67l15J056P98j161l80r1R22J267j527p90q8J151Q97r02r73j74J637M75j422
$$ y = [1061, 184, -633, -1173, 468, 1104, 297, -416, -803, 869, 1233, 389, -564, -948, 1151, 937, 453, -780, -918, 914, 746, 0, -1113, -724, 801, 158, 31, -1477, -783, 894, 533, 90, -1231, -150, 779, 750, 138, -1122, 191, 1171, 974, 371, -1082, 428, 1097, 1040, 82, -962, 276, 894, 821, -517, -1166, 55, 596, 646, -906, -1477, -55, 412, 494, -948, -961, 77, 568, 662, -981, -728, 338, 1028, 859, -773, -498, 543, 975, 525, -795, -367, 445, 1038, 264, -1314, -346, 82, 783, 13, -1371, -784, 47, 701, -493, -1376, -686, 121, 936, -568, -1370, -320, 545, 1252, -293, -1013, -305, 829, 927, -510, -513, -468, 782, 1156, -645, -613, -352, 622, 978, -304, -762, -445, 850, 267, -466, -355, -483, 1009, 338, -947, -861, -282, 662, 246, -467, -782, 274, 1072, -89, -469, -560, 362, 1629, 102, -688, -776, 375, 1272, 370, -603, -777, 860, 1335, -87]
2513h7j74l87J389O41j253o67j10J225K0k80j026k06J892p44n21j25k61J394j47
2532E73q65n37P84P33l20m80p26Q99J291j292k03n44O66J425o58j279n19J455
2550D03N06m83o78j245J557Q89p60o91r47J124R96jj374l18J191j75P36r82p74
2569a026J519p2k03n10n9M87M44l94r49Q00L42o38M07j172Q38J142q00p44m82
2588a070R34O73L86j513j075J956M33o8q39j482J335J667k25j696o72R11J203
2605H58O60k143p02J301M17Q81j573j050J061J140K17j520k82J43J096P93j915
2622f18P6M45N86M18j047k92M32R76o38o03M11n16J176n72r37R41r5K22n17o04
2642g56M60P84M06j546J47M98L47O91j575m20J084Q80j13j336n25M69J848o3j913
$$ y = [-87, -261, -648, 741, 1382, 129, -538, -648, 577, 597, 317, -709, -915, 977, 233, -288, -413, -674, 720, 573, -292, -829, -45, 688, 368, -112, -838, 61, 1352, 60, -143, -687, -21, 1404, 746, -533, -1052, 403, 909, 426, -252, -1497, 60, 949, 189, -502, -1449, -325, 671, 670, -704, -1022, 169, -6, 730, -252, -1026, 493, 421, 218, -292, -351, 136, 580, 186, -763, 37, 379, -259, 148, -1024, -186, 956, 156, -588, -1070, -136, 537, 923, -590, -1665, 291, 724, 656, -183, -1665, -330, 1337, 1112, -584, -1256, -345, 858, 1518, -625, -1327, -26, 391, 1272, -301, -1351, -290, 850, 1067, -453, -735, -592, 504, 1297, -618, -542, -97, 489, 907, -140, -432, 0, 976, 338, -265, 146, -370, 806, 234, -703, 238, 143, 365, -152, -756, -296, 488, 894, -652, -505, -7, 340, 1031, -544, -964, 120, 1000, 887, -449, -974, -505, 1343, 1280, -633]
2661f33j21J67J556L29j997m55N23J532r6j458o94K16K120j43j277m81j83J878
2679G83J21j218p08N28J245k97l95r68N51J251p10j41m65L33P80o89k24l84J094
2698D87o2q45n6l42J142K76r89k58p5J419rr78o42J76J693j25p47j167K90J818
2718A006j81p48j209O65J548l43o19j337P32J419p9o57j266N66J196J31q12r08
2736h96R18M95K00p80j195J389L99L2m84j213J205N05P5p71o75J259J94k92r59
2755e94j21J285J87o0j338j68J228K48l23j301L23J150L30k96j619N65J139K84
2773I19m20j389N57P11L82n58j264O72O83Q04j090j030O58P34P10j291o51P11
2791a52M63N79j120o51P53K90P93j486k96M44N85L88j293o2K18R26K30j432J24
$$ y = [-633, -754, -587, 969, 1298, -699, -1154, -631, 901, 805, -653, -1347, -1131, 989, 846, -431, -912, -1095, 783, 904, -314, -1022, -494, 751, 454, 59, -909, -358, 893, 183, 42, -423, -90, 690, 1, -223, -607, 487, 425, -420, -476, -818, 324, 600, -389, -647, -722, 697, 688, -290, -932, -756, 937, 812, 65, -1102, -812, 1006, 825, 77, -1132, -467, 1081, 738, 119, -1218, -486, 933, 854, 197, -1069, -503, 693, 824, 12, -896, 22, 517, 717, -63, -1258, 131, 530, 562, 78, -1135, 70, 575, 650, -121, -796, 463, 657, 365, -594, -715, 570, 757, 697, -641, -809, 419, 667, 344, -957, -634, 516, 846, 550, -1069, -504, 635, 919, 499, -890, -333, 378, 760, 202, -1062, -390, 293, 1097, 7, -1023, -365, 369, 1079, -212, -863, -152, 311, 890, -230, -881, -128, 162, 955, -531, -827, -383, 202, 590, -703, -765, -547, 379, 609, -823, -699]
2810f99N09J004j98j316K20K84J022k91j233L59K72J095p81j033L35L34J345r55
2828B73r45M6N79J060j208l12k69R01Q23j290n15k4J093R92j276m43k52J246M79
2847I58r41m24j98J554J9j094l96mJ504n0q64o92l01J702j32o70o45j05J829n56
2867D94p85m52J75J496n37m40r47P86J186o78m13o88Q67J138o76o17r09J196Q87
2886A083o20o40n21R86L19l25n80p92J440K97l40q05n84J446N9r7j032l32J472
2905D34O9l63r13N6J504m6l73j184K81J085K4j62j220P24O47m8n28r50O70R15
2925F22J25p81j207J042M97L61p79r80R88M37M19j282p30J150M79M37j371m83
2943a056J055L94K94j227l41Q90M97L85j613L05L90P36J42j470O3N98O56l63j228
$$ y = [-699, -190, 814, 616, -700, -480, -196, 826, 535, -698, -339, -67, 1028, 247, -786, -451, -117, 1228, 273, -672, -626, -47, 1013, -195, -507, -776, 125, 948, -342, -857, -881, 212, 1204, -72, -515, -767, 479, 958, 17, -407, -605, 949, 968, -126, -522, -526, 978, 928, 64, -628, -929, 773, 641, -29, -674, -779, 1050, 494, -291, -743, -568, 928, 391, -49, -996, -210, 976, 298, -115, -803, 64, 1202, 526, -91, -1000, 196, 1083, 463, -177, -698, 288, 607, 282, -298, -1090, 350, 647, 307, -498, -1082, 364, 423, 326, -706, -1038, 434, 503, 140, -773, -717, 787, 741, 368, -816, -535, 550, 574, 412, -808, -84, 563, 515, -13, -963, -293, 622, 747, -34, -1241, -199, 298, 659, -120, -1100, -112, 325, 744, -538, -1268, -118, 361, 798, -573, -1056, -1, 393, 687, -540, -881, 9, 506, 891, -722, -417, -27, 709, 851, -619, -556, 42, 698, 335, -893]
2962h93N36N18O05n01j154M57L89R20o88r07J86O87O72r56p32N37N88Q89j183
2981c0r41N29O56Q49j072n10L6J033N35j198l32N1J082L97j265l69P4R97L05j016
3001a89j06j84J386n63r31K81K9J132n56p24j68M45R82n24o20l87O30J213j051
3020I5o88j2N04J263q17q00m69J079Q54q76m21p08J199P31q17m75n79J093P04
3039H60o60p14l66J271l7l5o52m22J315j46n18l37k47J254M9n02p29K33J006p29
3059a06J62p31K55J428p36m26n81O05Q28k57o86j020J362O40l92m03j241J462
3077A63O80l95r63n70J121N87K91j328m73J061K53K23r42n23R41P38k75j080J08
3096c83N79L68J25j386K76R50l10L03j015k7R18M64q37q04P26Q7P05k89j454J152
$$ y = [-893, -357, 161, 766, 265, -889, -432, -43, 877, 189, -718, -532, 155, 827, -129, -861, -324, 264, 1153, -30, -971, -442, 214, 1063, -9, -519, -483, 550, 1085, -113, -445, -394, 688, 1085, -180, -549, -475, 522, 827, -189, -295, -479, 907, 344, -587, -306, -277, 855, 299, -425, -593, -148, 834, 310, -310, -697, -67, 1146, 95, -593, -605, -101, 1162, 345, -455, -924, 155, 1009, 133, -288, -996, 203, 934, 117, -358, -937, 156, 860, 200, -514, -880, 391, 354, 319, -333, -755, 560, 414, -104, -441, -688, 566, 615, 113, -616, -383, 623, -106, 56, -675, -420, 1008, 272, -154, -735, -130, 698, 441, -245, -1265, 97, 737, 345, -58, -1299, 163, 843, 448, -515, -1085, 36, 623, 914, -414, -887, 174, 427, 650, -292, -815, 126, 864, 589, -491, -383, 196, 564, 689, -697, -421, 529, 219, 522, -493, -520, 398, 862, 25, -779, -53, 34, 739, 450, -1004, 148]
3116A48L63j00l00q02M12Q44K03j314j86N55M83P09j238q20J144N08%q37n78L75
3136d31J347J49j652k8M36M64P57j517l90Q26M80q4o67n34R2J677m57j063K15
3155c80k99J176j42q94R9L98M67n00j56l54N93J024j409J2K25K1P02n83o82O13
3175f9N46k4p18q4l60J353J64j575K33L02O06K12j107l56M73J486o98p45m13j54
3195i28K022k65j267k10J35J131L05q88j132P40J347m87j64j146J62J630l88n67
3213C0m69J39M75M48m37r29Q23L44j38J98r80N99L20m85Q8j76O02l23r8n75J30
3234d14J436p47l97k56j23J222k17q56n06N29J027k60l35j284P07J398m09l67
3252A48j151M49J156K13q49q76Q74L29O35n89j367J015L96L10n11r22N00M00M83
$$ y = [148, 511, 411, 111, -691, -279, 565, 768, -546, -732, -177, 306, 1015, -223, -1043, 101, 609, 609, -228, -806, -431, 916, 1065, -587, -615, -179, 285, 1042, -475, -865, -39, 441, 357, -310, -844, -752, 925, 468, -595, -380, -679, 497, 355, -539, -440, -42, 425, -75, -231, -585, 8, 1032, -377, -365, -140, -119, 583, 0, -682, -69, 477, 453, -265, -349, -709, 644, 808, -767, -534, -232, 374, 586, -521, -877, -404, 1082, 384, -361, -774, -928, 1094, 829, -438, -648, -513, 618, 923, 35, -1097, -357, 990, 503, 339, -807, -645, 985, 597, 30, -439, -300, 175, 623, 186, -743, 80, 424, 286, 484, -496, 103, 423, -62, 26, -150, 452, 129, 31, -544, -414, 1022, 275, -122, -378, -501, 721, 504, -352, -858, -329, 698, 438, 103, -1181, -474, 924, 515, 148, -1003, -554, 602, 815, -34, -910, -36, 293, 928, 339, -1028, -13, 383, 693, 182, -740, -240, 160, 643]
3271F43r68k70O39j12N72p93n59R69J1K69p49k97O75J46K4r81M61N07k2L09j178
3292g04K05N89M83k20q66L61J77P27p92o55P23J5O14n27p15L90L89L77o03l12
3312c44M9O46L15r03k81L64L90N46j045k22K07O82K83j138J95M7N96K06j055J07
3332c55O0P59j3q52R9k1R58k94n59J8N8Q08k98p91J22K94P16n29m68JL48O06n82
3355H5m8m11M86Q10r57k35n8N89M58p58j47l25O30M11q40J35k87R26l8n60k01
3376c35k70R03J39n06l03k0Q25k54l29m00K09Q61k77m66l84L63P45l04j04o68
3396e75O03N86l71l91m55O37M89l72l94l44N88M03k52l52o12R18L25l96m44k54
3416f63P76J82j01n81k9O36J0J49p91J3O36O8Rq03M9P51K1m2q17L83M29M2q4q86
$$ y = [643, -325, -595, 44, -68, 504, -289, -848, 121, 132, 401, -348, -645, 30, 176, 200, -781, -320, 187, 165, 474, -704, -499, 90, 573, 353, -513, -152, 25, 752, -40, -695, 28, 43, 657, 130, -585, -195, 194, 571, -32, -344, -295, 351, 666, -237, -518, -154, 236, 782, -263, -485, -278, 404, 687, -451, -256, -209, 387, 593, -462, -355, -295, 464, 451, -401, -302, -323, 635, 341, -218, -200, -142, 666, 368, -423, -301, -7, 709, 180, -288, -287, 61, 667, 85, 37, -374, 112, 922, -35, -270, -328, 261, 719, -39, -186, -511, 119, 530, -310, -175, -462, 464, 426, -134, -335, -605, 298, 437, -69, -372, -392, 433, 179, -150, -550, -341, 520, 243, -223, -607, -244, 501, 197, 93, -575, 28, 614, 243, -148, -603, 34, 523, 151, -243, -587, 1, 404, 152, -200, -812, 106, 431, 35, -409, -663, 113, 295, 194, -387, -416, 220, 230, 379, -412, -399, 237, 305, 314, -489, -440, 311, 332, 290, -527, -144, 285, 327, 243, -643]
3440f43O21L95o0k15p09O00P2M32m25n70N49K56K64o51n60O27M09Mq09j78O53
3461F2L16J80q36m8N46p9K06p74M4N29J87q5n64K20R6N47k26p73L79J58K47j21
3483B11q36L54L72N11n48o54L80N7P64n12o22L54J98M77n42m77J43P71J00q61
3503c60K1L7K20Q83j101j78M29J49J67k79m04K3J117l73p39K35l72J024l5j041
3523e77L66K30K41p5k42n42N23J016j164q6J60p5Q56n48o05J06O42J67l77l03
3543b87n45J000N96j205K48k92M05Q92p86n31K12P63k72J6m86o36J380J93o92
3562b7Q0m67N73M45m12p41O11M60m85M97p96k30J293p86o2P3j83K63L67p02m70
3583f99J088k45l08M68j047P35P26r63j2P0K30K23K60j312J54J336q35K98j46
$$ y = [-643, -22, 373, 313, 98, -611, -11, 61, 493, 68, -502, 47, 303, 567, -84, -644, -17, 392, 396, -413, -591, 62, 378, 558, -278, -326, 220, 141, 347, -427, -383, 146, 333, 248, -316, -96, 0, 547, 321, -452, -73, 85, 332, 211, -625, -271, 101, 612, 64, -590, -210, -153, 611, 99, -523, -169, 29, 506, -36, -513, -370, 401, 501, -360, -339, -302, -82, 801, -300, -478, -49, 100, 267, -12, -416, -393, 724, 351, -388, -153, -525, 499, 464, -577, -211, 19, 260, 185, -57, -599, -76, 940, -224, -310, -150, -225, 631, 83, -522, -416, 226, 393, 16, -287, -832, 168, 764, -441, -193, -485, -80, 812, 26, -505, -293, 470, 198, 214, -272, -908, 472, 665, -27, 53, -414, 159, 604, 192, -549, 62, 522, 37, 534, -262, -492, 801, 15, -47, 26, -157, 106, 473, -229, -699, 389, 144, -164, 304, -743, -8, 718, -245, -257, -187, 43, 266, 526, -786, -632, 704, -131, 167, 21]
3602B1r40J266K86q42k84L69Q7O51k0j659Q05J176q32N48r25l76J170L97r98l45
3622d45K01J13J105p65j551J165J99l1N42j202r7R08L94r77L72j20n02J431q34
3641i4n81J012p14K87N86o97j48P68m00p48J139l42l4N16j240N42R89p21k49q9
3661b18N1M98P27j442n37J157l22R59l49j819Q58J030J1n41n40n35J218J184j551
3680a61m32L30p3J522m79j427L74N03l2L30k58j120J078M85r22M40l93p8J097
3699G84o72n55P36j6m87N41l00l80J247p94p55R71k63J93K79q54m28J272J21r63
3719c23K94n85M72J364j391m95N07N3P37j91p08o13J143J46m74J97j080R77P70
3738H00j053k01J56J71K84J94q25n6J184o25l7M7o53R21L14p12k34J78Q5M60r2
$$ y = [21, -919, 347, 633, -209, -493, -124, -37, 614, 594, -1065, -260, 916, 84, 632, -293, -669, 501, 898, -100, -445, -244, -131, 974, 209, -1342, -177, 22, -9, 533, -669, -766, 142, 536, -441, -69, -189, -691, 740, -94, -675, 337, -377, -90, 496, -201, -349, 419, 19, -729, 410, 68, 34, 550, -690, -148, 841, 120, -129, -218, -167, 331, 1058, -384, -921, 236, -86, 873, 524, -1295, -437, 593, 604, 63, -477, -1012, 206, 1390, -161, -593, -263, -336, 1186, 707, -720, -346, 157, 125, 455, 197, -923, 155, 640, -282, 158, -235, -313, 784, 112, -443, 293, 277, -210, 331, 31, -349, 898, 104, -651, 320, 57, 250, 529, -325, -753, 519, 640, -323, -29, -614, -142, 1222, -169, -664, -157, -104, 633, 442, -266, -879, 264, 410, -64, 133, -947, 30, 800, -253, -454, -298, -127, 157, 351, -474, -530, 654, 29, -8, 39, -614, 307, 621, -91, -325, -147, -62, 398, 306]
3759C06j063O85N45o38M63p74n7J004kq19l83O52J51M03m12j055J035N25n85K02
3779A83r41O38N93r6p97J41M06l13P28o99k96O59J07k05k66l98N49O36j37q51
3799c59L26K49N1K77j038R5O71L9j30m41n3K89P29o14o33M48O7M82k05p45L31
3820a64L60K11l99l04o3N82L77r05kL07J49K33o26l44O27O4J68n83K4k3O57K65
3842F11j069J69J61L52L07r32K9L15N81l57n58R4r5R22k56n61k20K62O31m25l00
3863c39P6J95M25l64j81j66K67P53p42l14lL74O24p97m7k47P37K69n84j69j23
3884c56M21M59o07l04jN93J07l93l54P2P16r4k56l06k7P99j35m36l00J96N09k16
3906H7j38m95K18Q41m23r6m55N80L77l94j06m99P11J40p0m07m66P70M47m20l78
$$ y = [306, -757, -72, 473, -165, 298, -476, -533, 471, 469, -350, -733, -81, 70, 473, 61, -994, 41, 566, -19, 183, -758, -120, 473, 377, -420, -279, 127, -186, 542, -157, -453, 206, 313, 108, -158, -556, -7, 629, 492, -359, -33, 216, 267, 544, -494, -399, 272, 311, 181, -260, -313, -24, 705, 91, -542, -94, -27, 455, 250, -495, -164, 196, 407, 8, -296, -359, 223, 600, -305, -307, 0, 149, 382, -244, -588, 39, 103, 271, -312, -288, -311, 346, 611, -458, -289, -128, 224, 531, -401, -372, -57, 524, 167, -391, -297, -392, 530, 274, -287, -507, -245, 386, -39, -339, -263, -68, 357, -7, -188, -354, -87, 666, -76, -390, -393, -19, 605, -192, -239, -486, 251, 520, -64, -233, -356, 65, 524, -83, -387, -388, 205, 312, -81, -435, -363, 353, 259, 3, -303, -330, 469, 334, -102, -402, -206, 303, 87, -51, -546, -328, 513, 90, -6, -461, 119, 496, 102, -4, -503, 208, 348, 278, -129, -595, 175, 622, 202, -176]
3927a76k69O21K41k07k97k38N81r7K41p96j03R15j00k0n82r0O92Nk75n61K68N15
3949B68q3K17r29L35N21j35O3o27J10N08K81o45m91P30r1L56l48o68P14N4Pk75
3971a28k23J67L16M15q75J8N01P1J97o34m87O79J04Q7n58N2MN23mr54N04K92L9
3994A06L07q08J2K88L45l84J1mj75J000p94m74O15k42L48J01o71N2N32K47o62
4015b50J57j97M78P13j090m26P61j91N79l57o04Q9P72M6p60M40o83P96O35j318
4035d10J47K21N4M47l34q25M03R21o15l7L8o28J216L7j140L69L98j56R7J50j043
4056f90Q17M01o52L08l39k51J096l59o41K10K23k50N07q8j002J240k57n95O59
4075C37n52J89M91o31m43P07J32n69P14p70j91J480q41m83M58m61N83M51q72o25
$$ y = [-176, -445, 176, 417, 210, -87, -325, 256, 159, 400, -396, -499, 416, 316, 296, -286, -376, 316, 321, 46, -515, -247, 268, 185, 402, -527, -192, 329, 194, 257, -370, -260, 248, 529, -116, -607, 123, 32, 388, 40, -628, 86, 140, 147, -128, -351, -184, 132, 547, -328, -310, 191, 262, 459, -175, -662, 17, 121, 208, -350, -298, -294, 229, 225, -729, -225, 67, 106, 413, -395, -383, -95, 250, -134, -123, -127, -302, 698, -96, -570, 45, -197, 151, 252, -419, -367, 165, 412, -250, -93, -290, 188, 901, -189, -615, 146, -45, 534, 177, -427, -338, 434, 480, -280, 160, -523, 273, 908, -410, -263, -42, 12, 459, 125, -700, -297, 624, 9, -28, 10, -618, 598, 635, -505, -136, 262, 106, 203, 353, -690, 127, 528, -124, 184, -155, -406, 690, 331, -310, -100, 123, -127, 380, 292, -710, 530, 273, -322, 337, -215, -26, 465, -166, -609, 98, 230, -339, 375, -395, -586, 894, 53, -430, 28, -433, 150, 601, -271, -896]
4095h96J139j68j25O54j584N92J202o74l71j9r0N90O49j345k71R43l49M15K46
4114E38j483Q22N04o07L38n7n16O58L32j068L58P83j012O62q0q04J030K7q08K18
4134a65L31o12R87k66j209J154M33q84P24r81m6J208k15r04L90j5j81J403r53
4153A99j238J438l93o4O28j296J55J269l00p22N43n07n7J359j447k54J084o89
4171b92N31J36r48K36J075o86n07R46j009O66N54j272M60M02l05J04Q2p55N38
4190d4Q99j311L05O71j026J084k19j213P86M98n84J87k07p05J090O94j453M96
4208e2l9j67J006n17r86Q41J88l86M47k62j040J438r6r37R12q68L08P20n47n28
4228e65P52On35P67n88m28J281q04l25P19n32L99K30p64k25J020l52l50N05p34
$$ y = [-896, 243, 75, -50, 604, -980, -388, 814, 140, -231, -250, -340, 250, 899, -446, -717, 226, -123, 292, 538, -945, -123, 381, -226, 112, 55, -461, 197, 529, -539, -181, 602, -410, 252, 172, -632, 398, 425, -383, -165, 166, -446, 541, 275, -934, 220, 653, -231, 493, -488, -534, 674, 459, -445, -55, -70, -251, 1152, 199, -1039, 399, 6, -58, 570, -726, -571, 698, 398, -324, 219, -288, -345, 1014, -433, -687, 397, -292, 239, 375, -573, -337, 738, 52, -455, 491, -518, 148, 702, -570, -110, 292, -13, 91, 173, -582, -44, 855, -456, -151, 520, -506, 578, 359, -854, -68, 430, -154, 33, -174, -879, 211, 905, -548, -52, -91, -258, 748, 231, -755, 86, 274, -112, 335, 73, -967, 471, 375, -562, 350, -518, -210, 510, -37, -565, 187, 193, -342, 425, -163, -591, 690, -114, -439, 280, -252, 147, 377, -387, -612, 408, 56, -294, 211, -523]
4248e23L08J040r25j03J93k56N03J73p75j79Q50k63P5N0r31R69L35o83J93k48
4268a97P8M93K03j073L45N24n24K34j67m64R14N5n66M6J33q5M67l68p21Q80K77
4289D84n57L50o67K06O35l57m54K11K55o8L08l63o45R35j58j29J26o35M81M88
4309D46n1p90K57M2J11M62p88k43R12l77J98l20j44J47N33k63n24J73J73L17m4
4330B27o95L68Q3J11j14k61P1O3N10m97j62K14K7L16k50l19L76K42m4k98j86k5
4352b43L85K45p76R9M7J74N36m54l28K41M52j27l51k4j51N85j04l78K6p9M47N8
4374B80n21J14JM10j97n6k68J32O92n86r7l01L69M08l01P2k46J36L11l97M8k74
4396b71L69K31n42J92j89L24J45j24k56j5M71j3j43k42j49L50K27m75kJ8L92j07
$$ y = [-523, -215, 825, -100, -203, -10, -266, 237, 410, -365, -544, 306, 43, 118, 168, -763, 206, 541, -142, 51, -197, -119, 374, 577, -496, -151, 373, -151, 83, -84, -548, 366, 421, -145, -99, 34, -51, 416, 48, -673, 207, 484, -73, 277, -390, -184, 451, 94, -360, -149, 106, 38, 346, -17, -662, 273, 115, -14, 112, -523, -42, 446, 395, -395, -138, -96, 15, 477, -311, -554, 358, -19, 179, -141, -285, -138, 395, 132, -392, -219, -46, 271, 227, -468, -100, -17, 94, -20, -281, -210, -147, 363, -134, -296, -82, -55, 261, 11, -308, 68, 310, 266, -32, -218, -243, 142, 387, -389, -290, -243, -69, 467, 13, -315, -74, 378, 251, -100, -124, -275, 310, 206, -172, -146, -225, 222, 280, -241, -127, -126, 284, 87, 31, -237, -105, 587, 1, -96, -397, -28, 380, 79, 151, -95, 41, 352, -45, 3, -271, 98, 329, -213, -21, -210, 114, 259, 135, -121, -136, 335, 322, 179, -63, -212, 138, 365, -110, -112, -94, 298, 191]
4418A91k28l04K29L97l04R9l75Q1O51n51R8l37K00L48j42j02m00K11L98k34J16
4439D2m74M00K38r4j68l33M95K26j74k28l31M92J05M8l53m21O55Q9r1m35O4M41
4461A93j03J95p02J95K78Q3r0l47j66M82K28l01n35M89R7L16l0o43J78L31M0j69
4483A9k01M1J98L75l62k82M54m92O48k79m29O80j40j53o2j03j45M25K51q77J73
4504b61L38j91M36p82M2M10L15j92k44K51k64N45j00p94O54%K5k4l96j01M35K15
4526C17n08L10l98N2Q07p66j46M03j49L28n3k61j63O63l43k35K87m47L52M95r77
4547d32K17K72j16M48k50o75J52Q31m83KJ55p21Q09J75q49N30n5q6K98j51n50
4568d79N10M91q97N15p6n64J053m07o47M29Q0p1K38o2p83J132j53n11M89o53M2
$$ y = [191, -37, -341, -112, 285, -19, 80, -295, -214, 437, -114, -16, -353, -153, 195, 53, -49, -449, -238, 160, -74, 42, -432, -32, 206, 112, -56, -389, 106, 332, 158, -70, -401, 91, 196, 244, -109, -530, 125, 214, 123, -312, -248, 193, 90, 285, -417, -222, 56, 139, 49, -298, -464, 18, 246, -55, -590, -101, -4, 312, 282, -361, -183, 148, 188, 19, -182, -141, 57, 432, 70, -212, 242, -250, 398, 119, -310, 370, 230, 77, 15, -88, -233, 192, 443, -434, -261, 77, -114, 322, -460, -418, -8, 307, 115, -129, 122, -142, 403, 303, -491, 163, 163, 188, 164, -232, -333, 102, 317, -191, 119, -279, -227, 580, -186, -332, 71, -78, 250, 197, -64, -227, 436, 93, -142, 145, -302, 50, 545, -432, -215, 57, -59, 389, 139, -536, -384, 447, -36, -34, 121, -600, 209, 384, -465, 65, 10, -76, 222, 71, -479, 31, 522, -375, 140, 64, -500, 553, 146, -501, -72, 8, -63, 175, 113, -670, 462, 309, -202, 287, -366, -324]
4589c24Q83m15o21M45J21j84N32m74o60J131n03j38N29q52M59O28p15k45O89l68
4609h2J37N80j105Q5J099r49K96K78p93O46L58r36o2J031r04L78K97j120R63N58
4629G55q33k0jk80P32L18j166J59O88n70P58k05j091J031M0o22M47l06k95O52
4649A91K88j096P76j30o01J192n66n36R77k82m71M84j21n11Q12l12o78J218o79
4668d5k72P23o62K2R12n09p26O92m45OJ268j344j97R61o21L96J79r46K33J164
4688G89q04k93K67o45N45J090j456L46L57n00O01J75j103M81N90q32M01M09q99
4707d81O93L37j196P80K03n17K31J63q65J003K85j281N32J16n17J086o67o82P86
4726IJ90j56M47n73n87J013J04p38O39o77K46Q45o42m31L57j23l5O27o71l93J009
$$ y = [-324, 559, 144, -477, -32, 89, -95, 437, -37, -697, 434, -69, -207, 322, -530, -71, 557, -158, -403, 286, -82, 55, 635, -470, -385, 714, -235, 61, 339, -454, 192, 550, -386, -448, 583, -321, 57, 354, -766, 197, 755, -78, -98, -99, -379, 353, 671, -495, -336, 352, -218, 540, 335, -756, 275, 315, -307, 140, -166, -461, 191, 479, -617, 159, 29, -572, 620, 54, -482, 495, 213, -258, 226, 105, -406, 406, 94, -584, 634, -45, -317, 406, -256, -234, 678, 169, -557, 135, -310, -304, 964, -380, -577, 384, -237, 159, 338, -608, -375, 789, -15, -308, -41, -686, -141, 949, -507, -161, 196, -304, 297, 472, -631, -150, 440, -392, 9, 418, -481, 212, 549, -647, 133, 336, -181, 50, 213, -652, 351, 636, -645, -113, 3, -514, 572, -95, -777, 9, 199, 43, 490, -83, -670, 343, 447, -291, 348, -329, -83, 762, 120, -311, 46, -77, -112, 515, -156, -549, 460]
4747D60m39l83P57o64J88O62p08N1N43l47l19O86p60J44Q87r14J21J60m01N84
4767C08N2o55j66N99o3j93L90r01O53M18p09k5L63k53L64J62p10K48M61l22K8
4788D9J8n35P12r0j17j53r0J22L42No54L64K79n45P33n58j36N50n8l27N3K4j10
4811a22M04k2o52O76j49r9R1n14K79L64j83l52L03qj66M91l94m26O97k31J57q7
4833E7l58J96M04j92l43J38j07L56J48m86r6M05k11K45j96m9J09L09k10l56L51
4854A14k41N26k19m04K39J35J04j46j83QN4L10k17q1O3j60L59j73m33J61L11j21
4876Fj08o1J86J61K53o31Q0q6J83J81l02l9N8L24m3k50L9q3M11j3k85Jn5L15o6
4901A76k87K4Q0R0j03N7j98J61M49k74m05Q8RK58r2j92j48L88O8k55nk14M76K7
$$ y = [460, 21, -362, 395, -269, -81, 581, -127, -76, 467, 120, -199, 487, -273, -129, 758, -156, -35, 125, -276, 308, 360, -295, -461, 138, 75, -118, 272, -629, 24, 442, -267, -292, 71, -182, 182, 344, -366, -118, 343, 21, 49, 67, -468, 244, 154, 37, -116, -206, -84, 258, 263, -391, -27, 252, -293, 440, -118, -254, 296, 238, -89, -36, -12, -122, 282, 260, -392, 284, 135, 36, 127, -387, -108, 256, 73, -279, 24, 16, -150, 341, -53, -479, 218, -13, 144, 57, -301, -105, 299, 107, -236, -98, -205, 151, 299, -187, -283, 122, -89, 156, -40, -89, 20, 329, 119, -237, 114, -127, 399, 180, -224, 15, 150, 254, 108, -75, -67, -13, 297, 80, -1, 62, -98, 261, 88, -345, -184, 127, 6, -102, -163, 23, 184, 437, -194, -114, -200, -17, 164, -138, -177, -119, 205, 162, -88, -49, -132, 279, 266, -19, -18, -73, 242, 176, -111, -87, -7, 83, -20, 37, -161, 0, 449, 175, -230, -142, -133, 125, 33, -159, -307, 81, 149, -106, -111, -325, 151, 178]
4925A78k17n1j03K74j2j56k6j02M02j86O8j56j36M11m7k45n4P6J20J19Ql49J18
4948f6L43k66N7q1O1J78k40m0k60K67R7L4r5k13K65M9k0N1m13L63J85k47j41J22
4972a0J10o2J40m04p0M86j0q8n2j96L96L1k95o1J7J5M0L87o59J91J24j10J73l29
4996b36J20J50K09p7l24L53l34K48J41o24L77o1K60k29J7j07J57J45m45K06L8
5017a6j94N32l26l48M47lq1N9k45N2M06P8n34K72j26j5J48k42O8J98q8j0M5j03
5041b6k20M71j81l47N26r2K7l9l78M1L28j62k05L55l58R5O44o51K0K67k22K69
5063A62J5n45R9M12p9q2K80n54K75M27o46K16R9j81L10p3m58K52M93o09L36n2
5085I7m70P76j53n78M18O4j96J91j76l73N58J38r04O47j41j35P15o26j79J95L13
$$ y = [178, -39, -90, -193, 81, 69, -87, -113, -215, 187, 1, 69, -87, -223, 188, 141, -104, -158, -82, 38, 157, 165, -184, -66, 277, 11, 68, -13, 48, 226, -14, -54, -314, -47, 50, 84, -11, -224, 41, 90, 70, 121, -292, 71, 256, 9, -132, -10, 100, 38, 178, -226, -296, 190, 180, 92, 40, -156, 240, 271, -24, -85, -68, -53, -13, 374, -285, -94, 30, -80, 93, -236, -116, 34, 243, 166, -158, 195, -139, 109, 250, -374, 3, -58, 202, -27, -10, -117, 40, 185, -260, -54, -16, -210, 322, -4, -352, 95, 92, 11, 70, -175, -123, 283, 361, -173, 99, -27, -42, 106, -136, -68, 130, 42, 32, 77, -26, -246, 225, 44, -303, 223, 131, 158, 119, -259, -218, 110, -52, -257, 98, -260, -165, 479, -172, -152, 115, -107, 162, 177, -368, -269, 143, 64, -18, 262, -292, -17, 410, -236, -20, 79, -102, 208, 135, -323, -71, 422, -187, 149, 97, -373, 403, 250, -328, 90, 154, -42, 149, -27, -400, 158, 296, -608, 39, -102, -237, 478, -148, -327, -132, 181]
5106A81j03K22l80l08P20k37k95N65o92K58O50n63r2j6j47M05M57p83k70Q13n12
5127a27Q5K95m25Q4M16l60j9K63m32K62L53p40J55P58p74J08N0j73K93J46o78
5148d60J66O25n98M16J32j013Q64K69n65K41M2o39P30J37q52O98n4m82Q59n58
5168d2o38Q22Q8l49L10r9l27O86m78n84R67m28r1M21m71M1M85l52m39N70l91J94
5190a05O26o96k28P74l92J17J79o73J89P28n22o9M30n37J95O04q61oL48l28M54
5211B27J91p59K64L75m58P3K95n98M48K60o96M22J90n26K82K25m89M57J03o43
5231c57N12O7n63P00k46o53O39L6k41J26N7n86R11o4p68O19l30j34P31n29l20
5252c93O17j89k21M02m93m3O27j44m25L65m42J49O08l85k99K48rj74N03o52J42
$$ y = [181, 78, 300, -80, -388, 332, 95, -200, 365, -327, -69, 581, 18, -74, -90, -237, 168, 625, -158, -428, 385, -127, -42, 253, -172, -88, 328, -32, -51, 212, -220, 42, 395, -345, -190, 568, -206, -98, -48, -221, 72, 218, -460, -294, 331, -267, 149, 281, -732, 132, 401, -164, 77, 119, -520, 210, 347, -505, 193, 139, -343, 516, -42, -680, 142, 230, -119, 191, 92, -235, 451, -27, -611, 356, -72, -163, 258, -213, -172, 313, -39, -478, 92, -299, -105, 521, -175, -403, 371, -21, 96, 275, -398, -209, 519, -3, -72, 358, -179, 16, 620, -241, -247, 101, -227, 227, 418, -341, -77, 298, -160, -87, 208, -390, 58, 318, -378, 44, 234, -292, -10, 215, -274, 183, 286, -357, 155, 222, -341, 359, 113, -540, 99, 135, -106, 20, 77, -509, 402, 338, -430, 189, -141, -275, 456, -73, -393, 224, 35, -186, 216, -277, -320, 307, 163, -262, 103, -339, -190, 418, 33, -266, -18, -27, -201, 302, -350, -208]
5273b08M84m52K11j9k20M36j50k78MM85m54j6K42m15K96K72m85K64nj91L77r0
5295H8k17n7M53l78K92j93l77N79j1l01J08no6J80R0n24K31J45j09L82n20j64
5317c74P76l26j40J04o6lL61j83k86J90j0j7K39o38K74K96o4k69J25k5N0L53n63
5340a96Q9K87j43p1J82l87L27M7n1k6j20J3O7L21n46n5M26p7O0l67K09R3J22O
5364B10l84J68k49L75J66n12J38L2J6J27j26M9j83M07m05O5J88k38K79ml13J98
5386Dj14J84m4q9j44K73K5j78L5J4n4L15l22J84j23J51M8l35J47nJ25J16m19J47
5410e9j01M41j75k84J24J57p7K6N6l26K18L09m53L4j4K23K87l33oq5j2J70p3n1
5434dj44M0J35L6p2k16M05N5k34or7J22Q1k0j46p4L20k10K6j34l3M00q8kl09J07
$$ y = [-208, 276, -176, 35, 16, -204, 232, 82, -196, -192, 293, -161, -177, 65, -350, -54, 218, -267, -3, -8, -199, 178, 88, -129, -186, 267, -111, 181, -12, -389, 190, 179, -122, -14, -19, -85, 95, 185, -339, -108, 37, -72, 310, -210, -374, 402, 76, -64, 40, -26, -29, 332, 149, -137, 53, 43, 26, 265, -373, -99, 197, 133, -136, -11, -36, 14, 367, -196, -107, 180, 37, -34, 148, -239, 88, 135, 84, 58, -62, -49, 18, 339, -207, -262, 164, 87, 147, -220, -11, 82, 204, 210, -174, -6, -255, 120, 286, -226, -88, -56, -40, 87, -39, 10, -173, 234, -171, -106, 82, -156, 123, 119, -194, 4, -110, 74, 30, -59, -203, 70, 95, -83, -48, -34, -88, 227, -95, 89, -34, 117, 165, -170, -23, -28, 97, 213, -206, -59, -160, 281, 106, -178, -54, 103, 26, 52, 108, -218, 0, 309, -144, -110, -124, 99, 386, 53, 47, -38, -50, 120, 47, -4, -148, -108, 27, 63, -9, -225, 180, 235, 1, -5, -102, 20, 101, 81, -65, -139, 181, -29, -3, -137, -170, 230, 142, 140, -169, -62]
5460f2J20j72K64j29k08L04qj37J42p4QL2p5k23K13R0j80J71k70O5K0K28q3q1
5484d5R9j93L30k38j34L58k27J74n0l13L77L8j53j8k4Q5J01l1k07j31K29j47J58
5507C8r3k19K94J40k06j86K61k79L06K19n34K33J52j24L5k93J59J84P7l90J38
5528h8N1j02K88j58m10N43j40J70p0l77O2N37J3n21R6R2m2K82m06J5J88N1n1N6
5552G9j25j38M82k28p1K54l22K93L23n62k09L50L5k85K00j38O9M33m72j15M92
5573C45n72N30l1n54k6M57k72l0L54m96K83M03m78J64m1l69M65j63k07J22L66
5594B50m27K24L1n32N76J45o26M46j73k5K31r6l98L63K87m83L24M1m37M86j92
5615A5k59K87K7k43N51l43n10P50l40j51N41n26R9N60n49j66K53J3o4K18n07n5
$$ y = [-62, 58, -114, 150, 21, -187, 117, 109, -28, 114, 40, 48, 80, 5, -218, -5, 85, -95, 76, -194, -129, -109, 119, 36, -45, 54, -139, 191, -47, -181, 177, -50, 124, 74, -239, 138, 176, 23, 5, -19, 66, 167, 136, -71, -202, 27, -120, 38, -55, -274, 20, 160, -46, -232, 29, -250, 56, 275, -259, -26, 126, 2, 37, -256, -97, 87, 164, -226, -88, -37, -139, 149, -9, -419, 124, -16, 154, 84, -293, -231, 306, 319, -202, -106, -14, -56, 226, -180, -165, 23, 74, 23, 79, -46, -184, 298, 70, -1, 253, -69, 224, 547, -15, -224, 126, 161, -124, 76, -62, 7, 440, -32, -147, 345, -227, 303, 272, -282, -308, 149, -123, -153, 201, -295, -12, 391, -87, 77, 36, -333, 132, -31, -238, -116, 250, -177, 47, 78, -454, 122, 267, -359, 87, -86, -111, 120, 24, -374, -11, 276, -207, 117, 158, -279, 207, 15, -244, 43, 70, -173, 378, 35, -475, 275, -65, -216, 325, -201, -102, 458, -91, -257, -4, 9, -55, 163, -344, -399]
5637c99P07l89k3K07m11L79K77n08nM23m07J01M49o40P2N02p20N46l5n44M15K91
5659B88o33K21L46m20K96K39q65P13k15j99L21ol52M36J49o33J98L08m44M16k5
5680A39n79O72lm59L22k12j93N47j04m75N38j02k71O38m47l15M48l7k62M30m35
5701a60k59P92k64l21M77m36J4N12n65Q5N59m04l30K96k18J98N32r01M7Q17n88
5722a17K22J01p00M67K70k39j03L16p63O21N03q19J48K30l12M61Qo31N9M20l83
5743b41K67N3o55O13K56p18O51j88k79L78l0m12K98K78m67M80k47m28O19m39l9
5764b50M31j39j11N3M1l32O32k99m34O04l84Q3M79m64k33N65r8j59K92l80k60
5785c63N85k18j65L25m92M01L28m35j33J70J25n3J85m69j24O64m52O5J02k34K29
$$ y = [-399, 308, -81, -104, 103, -308, 71, 348, -160, -165, 258, -149, -48, 401, -239, -167, 335, -385, 161, 126, -418, -3, 288, -345, -124, 222, -198, 98, 337, -528, 185, -30, -229, 92, 86, -266, 170, 319, -314, -116, 192, -252, 164, 139, -440, 232, 229, -230, 92, -120, -313, 234, 130, -345, 193, 91, -180, 458, 11, -304, 144, 107, -155, 275, -160, -419, 373, 109, -212, 265, -171, -157, 355, -210, -125, 434, 30, -300, -4, -222, -24, 508, -393, -346, 471, -117, 105, 206, -494, -27, 243, 4, -99, 217, -546, 75, 578, -241, -93, 137, -175, 286, 294, -337, -278, 142, -241, 26, 79, -576, 37, 293, -425, 226, 38, -241, 137, 107, -305, -7, 271, -196, 284, 37, -391, 228, -211, -250, 181, 42, -69, -16, 25, -307, 325, 26, -408, 196, -188, -105, 374, -90, -323, 242, 144, -15, 277, -103, -363, 222, 4, -161, 164, -328, 73, 401, -34, -167, 3, 128, 75, 260, -209, -333, 331, -121, -56, 46, -188, 41]
5806D1J03k33r6K17j64K8L05m45K15J66l12K64j23j64L57j20j61K23J09l33K02
5827G9J53l71K29O0j39r4J91k15K92n5m89L73oj50K23j52o4J93Q6k71j6p4m0K04
5851e3k9j43L41k31J58M2j81K3K60k11P0q3J9o3L55k78j87K61n2P7o2j33J56j5
5875D1J69m08M1k0K37O3l44K58L7r2K29k76j58K75O8mk78J71j38R1J75l01J63
5898am0q1J43O5k57J55J73j48o1J1LJ99Nk68J30Q9q5O4k44O8J95J46k89m3Q4j66
5924a53J54j03R6j24J55m9M2O5k27L12k33q2J88j98L07l3m6j57J79L8j69J49k57
5947a46N9K28j33L0j33J66K11k27j75j2J98k1M3l9r6J31M0k24K23l07K05L0%j31
5971h0j64L36q9j33K50j88J25o2R7j54J0J56M6q4l9n5K17k22J12m6k27K76k50
$$ y = [41, 144, -89, -185, 32, -132, -104, 201, -244, -29, 137, -175, 89, -34, -198, 159, 39, -122, 101, 210, -123, 79, 232, -139, 90, 150, 11, -83, 108, -107, 185, 130, -359, 14, 8, -142, 81, -71, -135, 58, 144, -127, -143, -217, -257, -53, -82, -225, 116, -115, 43, 85, -96, -73, 187, -24, 46, -37, -18, -81, 274, -4, -191, 70, 18, 95, 33, -100, 56, 41, 210, -198, -157, -177, 60, 123, -221, 37, 74, -18, 211, -65, -223, 52, 120, 116, -162, 9, -129, -38, 137, -164, -1, -41, -122, 21, 86, -171, -16, 157, 9, -52, -41, -38, 161, 166, -102, 28, 117, 32, 96, -148, -80, 115, 261, -28, -71, 13, -153, 1, -102, -6, -130, 25, -24, 18, 83, -144, 168, -65, -147, 41, -157, 150, 117, 71, -86, 93, 131, -38, 111, -146, -87, 141, 8, 38, -95, 71, 282, 55, -120, -132, 66, 45, 88, 49, -47, 84, 124, -100, 123, -184, 21, 51, 51, -80, -244, 92, 3, -130, 120, -68, 57, -5, 92, -62, -52, 104, 150, 66, 27, -28, 189, -33, 79, 33, -194, 82, -168]
5994a68K00K0m7n3p5M0k66K98qj18K74k52P1K05l6J11k62m3m0J46J9j87K33j20
6018e8J20m1k20J49K1k8j11J93j10J10J65j32p4J31L1K3r7l20J59J33r6n8J94
6041H4l14L09k8j18K34p9j94K81j32j31r8K88j68RJ44k74L30j11k43L44m7m7j50
6064a11J18k4R8Rk25K3J58k07M52l13l9K27j98J75L4o5l20L94k33p8J60k53K52
6087C4K64l96j0M2j6m7K50j89j06M23l09K1J55j92J53ok61J58J05k13K49Nk59
6110a45K00K96n52J36J21l39M24K9l84K34J02l03M32k63l51L06K64m18M34j74
6130D9j42P1K5k47M34k28j05L02n1j90L63k87j83M13k16j68L24k07k42O64l19
6151F0k52K69k23K48L62n63J1L0rJ19J94l41j6K47k53J65K84l52j40N18m29Q1
$$ y = [-168, 32, 52, 5, -48, -123, -83, -349, -51, -59, -177, 97, -155, -84, 121, 85, 196, -66, -109, -149, -3, 16, -171, 62, -58, 62, 21, -199, -50, -29, -57, -168, 25, -85, 25, 190, 58, -16, 115, 146, 169, 72, -248, -89, 44, -52, -110, 84, -230, 79, 51, -67, 167, 88, -106, 175, 43, -88, -186, 102, -66, -57, 87, -187, 143, 32, -211, 133, 86, 39, -111, 7, -17, 81, 90, -135, -112, 46, -161, 291, -22, -61, 166, -32, 143, 177, 112, -208, 186, -47, -125, 35, -218, 34, 298, -98, -108, -66, -82, -129, 121, -68, -174, 249, -60, -39, 116, -76, 77, 71, -190, -32, 73, -140, 109, 114, -145, 55, 351, -201, -65, 56, -283, 141, 170, -214, 20, 122, -181, 251, -12, -363, -57, 207, -211, 223, 49, -93, -22, 3, -244, 190, -38, -143, 159, 108, -82, 281, -6, -189, 224, 8, -160, 164, -43, -285, 379, 60, -192, 77, -146, 102, 464, -99, -88, -58, -67, 52, 246, -95, -111, 136, -117, 48, 332, -20, -160, 358, -71, 10]
6173A0J60k68R4L10n31L83J5l97M57k20k43K21J7k91J95K48l05J92j00k37M87
6194A97n3l14l1K44k37M46p1n20K30K16k37M56k31m17M07r9p1J69k56j56O06j12
6216A66m77K72j02o6M08j60n2J14j19o2K60l75N1K73k34n1J82l57J38K63k14J11
6238c1K63l56J34K00m35K24K52n00J19M28l94Q3O1k50K05K88m86K88L3l99M17
6259A44K22n90K30P0k18K60j29q7M1K75k83L50j26n09M29K9l83L17J17j06K1O
6281H0k92L26M7k50J42q7j63K65n4m9j7J4j00M05l38J20J50k02q0Q4k13J03J37
6304B8j61l9K92k47J72K79l36j31K85l15J10K12l23J62J26k23j6K59l53K36R8
6325A15j47N7J06l48K06q4o2K92j1k11J15j07l66O06L4l82O8J92k57K54L1k56
$$ y = [10, 170, -98, -4, 306, -225, 158, 173, -224, 233, 13, -230, -9, 8, -283, -88, 160, -145, 47, -53, -290, 197, 144, -170, -201, 43, -194, 252, 181, -339, -109, 107, -130, 326, 95, -322, 85, -14, -85, 84, -172, -328, 278, 166, -311, -39, -141, -207, 201, 41, -11, 103, -16, -78, 182, -193, -142, 131, -103, -154, 28, -329, -191, 72, -142, -31, 232, -124, 10, 210, -225, -1, 251, -249, -130, 298, -96, -13, 48, -202, 3, 291, -195, 93, 126, -273, 144, 366, -224, 6, 76, -142, 118, -11, -98, -57, 218, -65, 285, 159, -350, 79, 108, -275, 42, 159, 53, 74, 80, -212, 114, 161, -89, 53, -34, -197, 68, 14, -35, -52, -38, -138, 267, -71, 49, 199, -3, -83, 1, -212, -109, 28, -133, -172, 120, -127, 45, 324, -12, -143, 142, -173, -63, 149, -174, -12, 114, -109, -125, 134, -219, 17, 115, -32, 25, 131, -217, -11, -95, -157, 135, 124, -87, 28, -79, -445, 161, 195, -187, -119, 73, -184, 70, 101, -155]
6347a55J28J35k32L15j97L7J01q6j73J83J7l0j79J20rQO3j80J55L3o7Q4k64J80
6371a3k4K06k50J7j5k8L07j94j10J23j34L35k54k26K27K24L9k83j7J67k21K55
6393A31j55j8K60k17j0r5N9J16m2k5l0J06j92K27k4j45K4l6O7j70N8P1p5K19r3
6418A1n2K7j04J81L8j4Jj49J66k14K53j5k51J69k00K34j41K0K3l7pM1m8J73j04
6443An6o2J02jkR6k47K5J42j42J03pK10k34J03j11l3J12kM6m8j63J65Pn8L7J90
6470A73m7l04J88j58O9J21k28K39j05l2K11j66r9JJ61j15R5J50l60K56P2l0l13
6493b21R9J28o1J87k48M5O9o4J38p1j6J51j13M5j46P5Q1n7j28Q7M1Q0o4K1k49
6518a91J76J55r5m9P9k3j43L6J35j96J03%J65j36Pr9J44P1j87r0K33m9J38k02
$$ y = [-155, -27, 108, -124, 191, -6, 31, 132, 46, -127, 56, 73, 43, -136, -16, -25, -17, 46, -134, 21, 54, -13, 71, -193, -13, -37, 169, -81, -64, -79, -107, 200, 6, -104, 19, -115, 220, -34, -260, -33, 191, 230, -53, -70, 97, -124, 131, -24, -42, 218, 1, -9, -104, -45, 71, 29, 4, -26, 80, -112, 115, 91, -54, -30, -66, 1, -169, -111, -40, -115, 104, 11, -41, -14, -118, 63, 101, 87, 88, -61, 105, -109, 144, 129, -122, 47, -153, 81, -60, -40, -17, -54, -61, -20, -68, 105, 1, -55, -117, -15, -16, -18, 78, -169, -144, -2, -144, -41, -48, 162, -72, 31, -80, -113, -1, -3, 43, -5, -168, -3, 4, -54, -17, 173, 126, -178, 10, -148, -79, 42, -186, 53, -52, -84, 127, -39, -138, -137, 24, -91, 4, 154, -206, 50, 122, 92, -221, -122, 6, -55, 132, -116, -71, -2, -66, 72, 1, -15, 136, 23, 68, -78, -3, 78, 21, -107, -20, 21, 101, 37, 58, -191, -15, 140, 45, -4, 75, 52, -91, -55, 80, -116, -13, -13, 152, 16, 23, -76, 68, 139, -48, -138, 95, 46, 184, -18]
6542a8M5K9k35J23j4nM2K35j85K2k07O0K1K48l09J80M2j3J22k12L0K7J51l64J77
6567hP2j98K44l0j68K56k87J26O6k65J67k3m1r8N9n2mP7J0o7K23J2j83N3k6j32
6593b17L18r7l1N6r6n9L83l52m6R1O8M8Jl0p8J51k84J70R4k57J43J66k52J93K15
6618B98k80N6jm06M20J33l39M6J90l51K73O0j72L9J70j84P8J57m79N12j28k6M7
6641A13k5k50J96Q2m10J58J17j30J88Q1l50L75r9j68J17r5K3J76M2k02K21j93
6663c3j57K84j98J01J67k91K84m4q1j04j04L3j25N38l24J30oj82J43J76l27P6
6685d4J18k51J65K74l01QK40k54Q6M5l48L68j2r6m6P2j13L0J93j71j48J46j08
6708a47J57L1k40J11J14q0j1N1q2Q2J04l86N95m49L1J78r0n5J91o4k33L41j34
$$ y = [-18, 27, 56, -179, -56, -70, -75, -33, 202, 17, 39, -168, -108, -87, 161, -148, 32, 74, 61, 183, -29, 1, 28, 179, -185, -8, 64, -134, 110, 80, -88, 168, -119, 7, 73, -192, -25, -48, -89, -187, -128, -180, -184, -107, -97, -164, 59, 71, -112, -59, -85, -217, 101, 4, -27, 29, -67, -126, 257, -95, -141, -50, 18, 66, 67, 37, -41, 110, -174, -4, 90, -167, -24, 142, -110, 83, 298, 18, 74, 73, -333, 87, 220, -119, -73, 117, -234, 39, 99, -73, -34, 136, -48, 30, 187, -292, 220, 92, 66, 113, 88, -162, 34, 116, -294, -136, -19, -149, 39, 120, -230, 145, 46, -122, -5, -100, -77, 99, 141, -61, 160, -33, -190, 94, -104, -3, 164, -127, 157, 113, 32, -72, -176, -143, -268, 270, -54, 76, 70, -112, 31, 207, -120, -44, 74, -177, -12, 262, -39, -31, 209, -45, 41, 86, -262, 106, 94, -2, -48, 24, -89, -59, 134, -37, -185, -39, -147, 10, 41, -199, -88, 26, -54, -65, -14, -96, -14, 90, -296, 299, -150, -119, 59, -31, -86, 105, 41, -192, 149, 15]
6731A5k04L68j50l28L45%o7J91l48K03J79j70k45L53l52J4M89m55R9M8M6L6L3
6754A00j26j76N32l39J8P6l02K38J28k05P3R5j36J41O3l46Q8L56l64K62r2m2J63
6777B05l77j05J73Q6j22K32l1k56K16%k72L29j61M8k2j4q8K51J0l29M21k01p9
6800h6K03p2q1J65j06q3L35k41o2M4l1j23J67qk03L16k71Q2J67k68J10Q8k14k1
6824a93J50r5k1J51j51K91k7k25K15P8l5j10O0k65J30K81k97Q5J75j85mJ2j03
6847h3Q7l5o2L8K41m87K64K73k87J33k08n3J85K29l45J3J17o8J56j77P1j04K16
6870A14j66J12k52P1K00J37k57L2L3L0rl5j3R5j20J51q2j39k7J24p5O7P9k43P2
6895a01O4j45P1J62R5j66M0J05j26Q5j13K9K31j00p8j30o0Q4n4J53j34J02j06
$$ y = [15, -189, 179, 29, -299, 46, 46, -21, 170, -178, 25, 204, 34, -211, 142, -210, -196, 293, -162, -63, -15, 31, 67, 100, -26, -202, 330, -9, 9, 85, -217, 21, 149, -56, 17, 112, -24, 117, 180, -166, -78, 278, -86, 176, 84, 42, 205, -172, -277, -104, -18, -140, 92, 61, -195, 21, 21, -251, 78, -83, -35, -57, -71, -159, 92, 102, -227, 194, -7, -86, 117, 45, -36, 129, 23, -60, 275, 34, -28, 16, -15, -138, 29, 21, -182, 134, -137, -55, 112, -156, -46, 42, -172, -193, -43, -138, -159, -8, -159, 132, 105, -120, 95, 173, 138, 28, 88, -177, -47, 234, -63, 22, 197, 12, 8, 20, -83, 4, -31, -93, -55, 186, -301, -37, 236, -51, 82, -126, -179, 6, 235, -110, -97, 20, -48, 108, -69, 2, -102, 114, -52, 60, -192, -121, 79, 216, -41, -9, 24, 54, 45, 10, -3, 92, -28, 123, 41, -98, -125, -1, -76, -9, 70, -173, -101, -37, -182, -111, 51, 146, -20, 20, 125, -1, 84, -29, 0, 231, 131, 53, -77, -137, -53, -107, 46, -88, 14, -92]
6918i2P2O4k04L07j68k95K83L9k08MJ84k0j41J51K4j32J51J2q4l1J00O2L5k26
6942a13R8J5J00O8j09j07K00j32k00K89k07Q5n9o4N3J8J00j39R5k18J84J42j54
6965e5J01n7j20J6N3J14j63J34M8k8k1k41K07J57p7l49L65nr9J03j98J08J69k95
6989a33J02J32l33K52L6j85K17jj02K4J63k30J39m0j32J08r4J27m8J25k9k74K81
7012A05j81M4j6P9J48j91L6M9j72j07L23r5rN9j32p1J64j18k41M60l2j12r5Q0
7036b5k07J80R3j61M2Q8%J3j59%J60j10J16j17K34l06L52j9k34K30j29L6q1k32
7060b36K24O9J6j18Q6N3j84J00k30N2K60J9N5k09n9J14l8k9J76j93q1J64On6P8
7085C9q0J0n3J2J99j43n6j39J41J89j59L7J09k23J96j39Q4R0j02k3r6J80k17K92
$$ y = [-92, -20, 44, -160, 147, -21, -316, -33, 6, -202, -198, -14, -34, -175, -24, 0, -132, 19, 31, -53, -84, 16, 78, 113, -113, -15, 0, 100, 168, 59, -48, 152, 20, -180, 109, -98, -13, -72, -136, -83, -65, 35, -104, -9, -227, -43, 99, -55, 46, -11, -131, -115, -62, 52, -111, 23, 71, 43, 22, -219, -12, 145, 68, -281, 84, 79, -20, 83, -115, -7, 162, -133, -31, 101, -232, 20, 56, -129, 88, 87, -15, 9, 172, -58, 81, 41, -91, 17, -77, 50, 2, 127, 98, -176, 105, -76, -32, -48, 31, 179, -12, 24, 73, -99, -206, 117, 22, 13, 72, -60, -131, 33, -85, -326, 134, 102, -10, -105, -25, -232, -52, 41, -120, -78, 10, 10, 23, -136, -136, 24, -86, 30, -87, 147, -159, 193, 174, -60, 170, 41, 77, -4, -236, -12, 57, 73, -45, 41, 94, -90, 10, -220, -168, 92, 111, 166, -43, -102, 12, -26, -55, 121, -72, -153, 11, 17, -39, 39, -41, -31, -84, -72, 127, -16, -72, -211, -70, 119, -40, -3, 106, -117, 79, -60, 24, 114, 12, -11, -107, 73, -144, 148]
7109A48j72j05K14j68K17j49L3j19R7P4r7N7M7j18J55j09q1Q4o3J34o2p7R7N9
7133I6j35j1l4n0M5P9m0L13k58r3J11Rj30M9N9j78K24j01K6l5J59m5q9J20k09
7158a18J15R6l24L05M6l94J61J13r2J51j26p0K02q4j22rK06j73K61k28j00L08
7180A24r1n3M2L9mj31J06j19K21j81j77L48n5N2l5k04O3M3p1J11J64m03R7M55
7204C41m34K40p9j40J00O2o4j34J59oj00J72o0j37K82q2m5k2K6q7O7o5j21K46
7228A19j92K85k30n2o4R9r8K86j58J1m0pM4n8J1oJ13j59O6J8J9L4p3M6M3K8Kj97
7256a10K61L5k69L2j20J44K0j3P9q7o1J1k0K74p3j09m7J22J26l75J26J5k1L9N2
7281C1k24J79J27k73Q7J45k21K27M7j13j32Q0J1J64R1l17N0J12nM1J6p6j58J49
$$ y = [148, -24, -129, 85, -83, 134, -15, 18, -101, -4, 70, -27, 30, 77, -41, 114, 5, -76, 8, -55, 79, 17, -60, 37, 96, -39, -50, -84, -134, -89, -10, -50, 263, 5, -88, 23, 32, -98, -49, 10, -168, 56, -45, -19, -54, 105, 60, -29, 91, -118, -3, 93, -231, 74, 120, -274, -113, 0, -92, 59, -67, -137, 65, -19, -141, -150, 56, -117, 144, -84, -184, 124, 33, -20, 22, 61, 57, -74, 32, -87, 134, -47, -224, 124, 69, 121, 86, -118, -55, -12, -83, 28, 192, -211, -114, 341, -93, 147, 68, -72, 28, 90, 26, -108, 51, 45, -55, 117, 57, -80, 202, 120, 75, 53, 79, -8, 59, -6, -127, 119, -73, 212, -18, -70, -134, -35, -133, 153, -5, 6, -34, -41, 3, -55, -44, -50, 63, -96, -30, -12, 7, 41, -32, 14, 57, 85, 87, -110, 151, 186, -83, -51, -171, -27, -7, -20, 59, -28, -89, -78, -98, 176, 103, -6, -53, 69, 195, -180, -54, -39, -60, -21, 31, -193, -14, 113, -160, -73, 72, -149, 78, 125, 12, -120, -40, -29, 135, 226, -91, -41, 71, 66, 107, 123, 47, -111, 38]
7305C8k6n2J74j87R2j1j81K13Q0j61R6q2Q4j48Q3%R5q8j30R3KJ53m9Q6n0k44J43
7332B3j36k6K54j70K08j99p0J63J7J5j67J45j51P6k8NL2L8k1J01k43K80n2q4J22
7357A32r8J5o3j08K46j7j19k0j10K20j20l8L4K7l2Jj5J1KP1j03Q4p1J07j71J98
7383F3pr5q1Q9mR7J4j95N4Q4M4j51p8L20n6p6o8L8j21J80k05K02Q7k10J23q1L1
7410bl1N6J17j52J07j23J00J24k63J45j92K21Rk21J09J29j65j4r9j5K32R1k22
7433e9j95K59p5K5J18l7j01J72j58P3r2L7QN3j36J66P5j2r7J9k8nR2p1Qj18J6
7460f3OM4l3P8Ol4L0J41k81J44P5j09R6k38o3L85k65J14o4P2L4p4r7R0K3Q7j00
7487DL7j64K09q1Q4p6l6J8n5N5P3j33K0RJ79j35o5Q2q5L03l48J52j47Q8j05J67
$$ y = [38, 12, -40, 134, -53, 39, 28, -153, 60, 140, -21, 75, -7, 77, -71, 12, 12, 107, 19, -111, -18, -16, 137, 88, 174, 124, -120, 23, -113, -139, 115, -55, 153, -46, -116, 47, 64, 79, -88, 57, -94, -18, -46, -41, -9, 29, 8, 109, -134, 146, 94, 10, 132, 34, 49, -14, -122, 124, 107, -12, -32, -142, 78, -42, -80, -46, -19, -51, -50, -65, -54, -52, 19, -84, 0, -71, 36, -135, 63, 56, -39, -120, -31, -35, 62, 76, -119, -65, 19, 63, -88, -166, 154, 98, 22, -46, -8, -129, 51, -154, 48, 135, -75, 48, -33, -2, -33, 23, 140, -12, 95, -28, 72, 196, -67, 78, -114, 107, 116, -105, 4, 133, -32, -46, -145, -160, 72, 163, -59, -254, 5, -70, -45, 73, 36, -65, 107, -51, 22, -70, -33, -25, 28, -108, 58, 133, 121, 24, 43, 15, 10, 102, 31, 39, -79, -63, -57, -13, -46, 32, 38, 4, 34, 175, -106, 38, 113, 4, 100, -138, -201, 184, -81, 33, -31, 41, 75, 1, -96, -6, 17, 104, 4, 41, -123, 86, 5, 89, 13, -23, -5, -60, -5, 68, -65, -45, -36, 143, 8, -57, 25, -60, 243, -105, 47, -100, -12, -117, 50]
7513E0m2M8N9L6k97J62J25k02J38k17P9M1j59K13qj65K03j73Q6k3J59j32J80k23
7537f2n1O5J81l1k21J28k4r8P4M2q2J87k02K65j84j6J52m6o4L2J13j66l2J66k12
7562h6k4J58R6l23J87m2K19j87J66k12M4L8O1j64r0J62Q5L3j46K49k93p1K14J4
7586H8j71Q9K4PR7j85M4o3K03O2j70O4l15N20l10n3R9p3J0k6J03j04J34m2M5k07
7612a30J00J8J8R4n1k7P1j40O3N9j74K36j14j8j1q5K14k12N3j19L63j29k4k5j37
7637a07L6P0r3P9p4J26r4J19j75rK53j10r6J92k47J06M2p0J77j06j66J95lk95
7661b50K76P1k18K29j21j47L57k04m4OJ2k68J43L2N8O7K8k1n7O0m4M8P9n0j43
7686a01K01M3n2j5j50R0J4j33K92m56J20J33J48m3k58K53j04K5o4qj1m6J17J9
$$ y = [50, 8, 56, 115, 151, -146, 16, 141, -61, 77, -140, -61, -20, -179, 34, 26, -139, 64, -109, -23, -46, 113, -19, 161, -62, -113, -48, 133, 102, -119, 9, -15, -113, -39, 3, -79, 108, -94, 171, -13, -29, 123, 77, 13, 45, 158, -8, -40, 126, -86, -110, 48, 144, -179, 8, -34, 185, -2, 164, -48, -4, 34, 95, -69, -159, 3, 88, 121, -25, 224, -69, -140, 74, 88, -83, 6, 30, 37, 134, -51, -7, -70, 133, 195, 25, 89, -226, 294, -16, -69, 30, -43, -33, -59, 44, -60, 74, 32, 77, -130, -30, -12, 6, 100, 49, 22, 93, -47, 16, 75, -99, 137, 23, 5, -6, -91, 123, -89, -36, -155, 208, 79, 55, 30, -107, -71, -1, -94, -15, -89, 37, -57, 62, -113, -122, 131, 21, -75, 117, -130, -24, 18, -52, 125, 19, -147, 48, 45, -250, 26, 97, -121, 108, -13, -160, 197, -7, -51, -45, -33, -301, -158, -126, -68, -1, 27, 6, -51, 9, -35, 13, 92, 42, -101, 100, 143, 91, 76, -74, 16, 30, -103, 189, -267, -147, -14, 134, 91, -167, 86, -18, 7, -57, -65, -76, -122, -5, 14]
7710A4j47mL87k34j70K34j16L1j15M9J49j94J47J4l2N4Q4j07J35k81K07p4m3J21
7734A09k25J82j87J97q1m3M3l0L07m95L66j25n6o0J47j18J80l7k38J63Lq7J2O7
7758fJ73p9j90N3l1J1LL0k6R7j32K65p9L5j67j42K15J23j45Jj19R0M9k03j7K49
7784E8j23o5J9L2J14j08J50m4N6r0j03K51j44K1n2kL3q6p6J74J59k16L7J5n7J04
7810E7P3k31n0R3K03k47J0Q0M2L6R3j51q2o7J17k9L7J26r2on1r1J17n1K4j56J87
7837in0j60K49R3j15j17J29o8K07k8k16N7Q3k00L09j06j20N9j5j5J1o2M3K5j28
7862a44J76J12j17n1pj71J89j27J00J07l3l5n0J17j13J17O3j69JR4J09j78r2K44
7886A42j72jJ45j72K5j70K11oP8o2N9l5k07Q1K15j26M8j66J90m7j13L4Q6RJ0L5
$$ y = [14, -133, -137, 250, 16, -154, 80, -36, -5, -120, -71, 78, -116, 31, 45, 13, 67, 151, 44, 179, -102, 105, 31, -12, 109, -116, 66, -121, 76, -5, -48, -5, -35, 272, -223, 143, 18, -38, -98, 49, -69, 111, 74, -164, -1, 2, -85, -73, -6, 167, 88, -102, -49, -80, -69, -66, -36, -62, 35, -97, 168, 89, 124, -43, -185, 30, 153, 8, 9, -110, -20, 29, -174, -191, 58, -65, -130, -111, -79, 35, -73, 77, 33, 89, -1, -104, 147, 3, 24, -28, -30, 3, -83, -159, 15, 174, -42, -5, 10, -47, 57, 130, -101, -151, -58, 145, -102, -92, -12, 30, 66, 159, 8, -74, -141, -24, -53, -16, 110, 18, 12, -39, -130, -13, -64, -40, -196, -9, -59, -219, 30, 123, 8, -109, 20, -48, 159, 131, -85, -28, 55, -145, 164, 58, -62, -3, -18, -33, -22, -84, -41, -16, -144, 32, 144, 27, -24, -31, -202, -13, -140, -40, 67, 34, -1, -51, 66, -47, 70, 133, -36, -35, 59, 168, -10, -102, 142, -30, -31, 114, -58, -33, -203, 8, 2, 80, 18, 77, 42, -165, -84, 131, 5, 53, -113, 77, 30, -83, -49, 37, 46, 56, 91]
7912I1P3N2j46k17OL28k51K72l74J56J70k42K15j63N8l2p5J52J6j25L5q2O5N8
7936D0r6J14J28j13k4J68j76j07R5j35J18J6qJ40r8J25j92l6m3O6K0k00L22j13
7960A1j53J28n4K63k35L4j28NK69j23n6P0j9Q0j42ML9lP2p1K8k34K02J05j05J05
7986I2q1M3r4J34j82O6L0J27j42MP7m0m7j32K76k05L4n5J29l9J6N8p0O3J1k16
8012a43Q2M4M4j70L23k20J53O6k92J64l5k1o9P9J4k94K20O4m7rQ2M3j18ok6kR1
8039A7P2k6k05J19j8K8n3P7Qk8J20j30l9J08k7j82K99k63K30j32j1k4J5K6k2J8
8065b3J4j11K13j16j6R8j56J27j01nM1j8K44j01j15K4J30J3j15j65J11j4J98m2
8089A15q9p5O1k3M3pj01J06O3j04l3o8P5j65Q1J94o6m9l8J61K3j8M1j93m7Q7O7
$$ y = [91, 164, 216, 70, -147, -141, 187, -64, 208, -166, -10, 160, -82, 133, -30, 28, -4, -79, 73, 89, -36, -1, -83, -18, 40, -56, 58, 186, 73, 49, 217, 41, -66, 29, -106, 12, 28, 20, 160, 62, 187, -5, -41, -84, -18, 2, -198, 124, 11, -142, -14, -68, 195, -40, -6, -134, -129, 140, 17, -39, 31, 12, 92, -50, -46, -7, -10, 62, -9, 19, -215, -13, 92, -13, 92, 11, 54, -40, 94, -88, -22, 8, 135, -7, -3, 74, 34, -13, -145, 131, -74, -40, -95, 34, -5, 11, 69, -1, 62, 73, -143, -61, -17, 27, -143, 180, -40, 113, 179, -113, 51, 16, -5, -74, 5, 19, -275, -55, 9, -38, -47, 35, 78, -40, -46, -72, -74, 17, 89, 63, -142, -23, -41, -13, -66, 11, 19, -9, 111, -19, -58, 50, 23, -159, 140, -123, 107, -25, -36, -60, -45, -19, -41, -23, -9, -120, 93, -23, -39, 59, -97, 30, -71, -76, -35, -53, 191, 90, -25, -1, 129, 142, 27, -138, -27, -41, 157, 115, 26, -49, 12, -11, 32, 25, -76, 30, 93, -11, -44, -112, -37, -202, -121, 73, 7, -42, -80, 81, 104, 86, 127, -66, -113, -26, 41]
8116D1P7k02K43k42M5Q4K9j08J20o0R8K4k30K11k6k24J39J20j66l9J14j46m9K16
8140F9O5j58j59Q4R1Q4k21J24k2J12Kj21jj47K44n2K6J6q4pn9J52n4j02J06R6
8166H4j53n8J57K1q4j5j17R6N4Q6Kj22K1n9J11o0J44k68J21R5k6n2r7J82j54
$$ y = [41, 118, -84, 159, -83, -38, 46, 75, -33, 87, 27, 125, 149, -81, 130, 104, -120, 19, 139, -27, -66, 48, -98, -147, 69, 134, -24, -183, -99, -8, 76, -145, -21, -43, 69, 71, -50, -51, -198, 46, -6, 20, 36, -48, -55, -114, 38, -16, -118, -12, 84, -69, -127, 30, 51, -33, -48, -165, -69, -15, 71, 73, -49, -28, -87, 24, -36, 108, -160, -39, 56, 30, -22, -119, 63, -91]
8191i1
$$ Imaginary data points
##PAGE= N=2
##DATA TABLE= (X++(I..I)), XYDATA
0@%%%%%%%%%%Qj6J6j6K4l2M0m8N6p2Q8j04J22j46J75k07K41k75L15l63M18m79
32b55N45o17O97p86Q83r90J109j238J378j535J705j889K091k309K547k810L099
49A625l414L761m144M566n036N560o147O813p576Q456r485J0710j2194J4039j6406
64h872J9558k3994L0750m2405O8041k23762O2998K54044j94879J06446j78555
75a30630j03885L17797P2630k71595J00113J1112m7908K80502j28488k63220K24393
86F0821p258k4814J62626j54577j38487J98230n9554j12767J96695j09000r6367
97h4452J93101j74649l7602K03128j43198o0491J49994q3050l402J51259k09717
108i9079o5284K54939p5789J1982O3289k37805O9667K14911j11534n1321N4835
$$ y = [0, 0, 0, 0, 0, 0, 0, 0, 0, 0, 0, 8, -8, 8, -8, 16, -16, 24, -24, 32, -40, 48, -56, 66, -80, 95, -112, 129, -146, 169, -194, 224, -255, 290, -327, 370, -416, 467, -523, 586, -652, 726, -809, 896, -993, 1098, -1211, 1336, -1474, 1625, -1789, 1972, -2172, 2394, -2642, 2918, -3229, 3584, -3992, 4464, -5021, 5689, -6505, 7534, -8872, 10686, -13308, 17442, -24963, 43078, -180684, -117686, 136358, -58521, 47925, -130630, -234515, 83282, 155912, -115683, -15570, -4458, -52366, 228136, 99648, -163572, 60821, 53563, 28749, 191375, 36798, -101689, 96541, 36987, -75780, 120915, 11915, -84452, 108649, -66000, -103602, 99526, -43672, -104163, 45831, -37219, -40621, 110638, -99079, -164363, 90576, 14787, 26769, 90058, -147747, -78080, 136831, 25297, -26024, 28811]
119B8811j07073J00176J46480k48752k0907J42714p1426J17518j981k24694P9136
130e9998J34166q8222K3224K6308j32793J35354P4023k05827P1646N7228o4197
141b9088J21542l7248j47776R9993O8071j06117N4937O834r0582J48485k9386
152E9665j58440R4924J6518j8023Q0999p6100r7105J15527K3885r3686O5022m0693
164b7507k5547J43671q9728r4489Q1787l443J3729O1001q5618n6906J22872k5231
176A4591o1579O8881o0790L2598R8703j08590m4569O6493P53J6901L6702q8226
188b8132r990J10348o3023k8023L2910m9550P3910L9803j03812k6072M8012L378
200b41K1715J0829r4402L4172P4611o9954L45n561j8581Q3154Q682q3249j3078
$$ y = [28811, -78262, 21914, 168394, -80358, -101265, 41449, -29977, 87541, 85560, -139134, -59998, 74168, -14054, 9170, 35478, -97315, 38039, 112062, -93765, -22119, 35109, -29088, 92454, 55206, -92570, 7423, 75494, -30623, 24314, 31148, -59434, 89051, 59665, -98775, -3851, 12667, -5356, 75643, -457, -97562, 17965, 41850, -51836, 13186, -27507, -53054, 90617, 889, -93600, -11813, -15256, -1527, 59474, -26144, -83050, 39822, 14591, -46988, 21893, -38897, -6299, 92404, -16186, -60755, 5738, 6491, 23392, 60094, -28132, -38122, 72226, 9203, -18820, 14090, -35460, 38450, 78253, -25559, -51631, -3619, -241, 21474, 32303, -62099, -27927, 46684, -23270, -22925, -28486, -47067, 36087, 44769, -38480, -51558]
213e1558M6639J60L1985o868p4390O6585L3128n3909K909j8301J5757O2233r850
226D4520p2906Q72L7457p119K9925l6794l6683P1631k985l5720j3084j1634L4897
239B377M5849k0938o4399K1862K3205Q63K1163n2200L945N6805j0702k9763k7468
252b9401N996L3407L6339l3853n3162K9683R526J1506n948m3841K8769L6527l369
265B2179l6779k4439K0140L4433L0530m4366k5725K7836Q903J6466k9951k0182
277b0955L3726K7137n398m8552j3168J6136L3835J2671n1378p554J4757J4235
289E492J55l9501Q22K6433L0921j4990m5991P6J8214M0315m509l5314N108J4019
303A250K5864j9083k9476J1085K6914L1374l0705l5014j938K1749L3308k5685
$$ y = [-51558, -4919, -4759, 27226, 20358, -54032, 12553, 45681, -8228, -5319, -23620, -7863, 54370, 44520, -28386, -27514, 9943, 2824, 32749, -4045, -40728, 30903, 27918, -7802, -20886, -32520, 2377, 48226, 27288, -37111, -15249, 7956, 8819, 29982, -22218, -18273, 38532, 27830, -1933, -29401, -23405, 10002, 46341, 12488, -40674, -10991, -1465, 10041, 4093, -39748, -10979, 25548, 22179, -14600, -39039, -18899, 15534, 46064, 1698, -24027, 3809, 12712, 29178, -773, -20955, 12771, 39908, 34510, -14042, -27210, -11074, 22761, 35432, -15946, -23500, -8743, 5492, 5647, -33854, -33032, -6599, 24322, 9332, -36659, -36583, -18369, 21946, 17437, -17877, -12769, 1250, 27114, 8031, -21445, -10360, 16554, 47928, 17223, -17791, -19729, 2020, 35328, 9643]
315I643k2420J080J8541J6760l6262j8431P453L5161K0368l7922k2147k629L3554
328B749J8169k6475r359K488L1886J177l4198j1201R782M3423J700l1537j9080
341b0476J02L6885k441k1709r013J0336L0544j4999k5453j5864K1309M1276j2778
354A7719j9931j8925J2423L2097j0545j6799q037K7027J8881j8768k2125j9433
366b6416L6102K5930j8239j7555j9458K0692J6889j4375k2349p86L2604J204j1984
379B259k8823j2376M5260Q676j3428j4527q159K2527J1466j3409k5265K1427K6860
392B2488n620l643l6621N191M2434l733j3321j2448J945J5138R706k6915k2968
405b8367L7025R299k220r613m1301K0855L3661j0684j6061l934L411J5181J1710
$$ y = [9643, -12777, -11697, 6844, 23604, -12658, -31089, -23636, 11525, 31893, -6029, -28176, -30805, 2749, 20918, -5557, -14916, -12428, 19458, 20635, -13563, -24764, -14982, 28441, 30141, -1396, -20476, -20374, 16511, 14070, -7639, -16652, -6316, 24228, 9229, -16224, -32088, -10779, 30497, 17719, -2212, -21137, -8714, 23383, 12838, -3961, -11998, 15029, 33910, 15142, -6983, -26416, 9686, 35616, 17377, -178, -19636, 1056, 17945, 3570, -18779, -19565, 13039, 14243, 2259, -26564, -38940, 6320, 14996, 1568, -12959, -21118, 1409, 12875, -534, -25799, -4372, 22488, 16868, 13225, -23396, -18205, 24229, 20496, 7175, -5273, -3328, 11810, 21516, -5399, -28367, 8658, 17957, 15737, 6124, -35177, -14322, 19339, 8655, -7406, -11340, -7929, 7252, 18962]
418A8962m3581m688M1125l544R096j8630l4029L0697K4824j7804j2760P963l618
431e987K1946K158n3459J9834L0147q014J2201k7784k2847L5513J6851k9681j813
444a0935R472q099L6137j8612m9541L6515J4176j726J3916l1829j6663M0970O103
457A9884l3118J8679l807n875M2826l8475k8405M1296m522j804J4175k8682p734
470a5562M1545k3833k9123L7632j5513O945K4885n8754j193M6600j1826o817O075
483A061l0907J8609M9691n1531j8305L4367j3564L9514Q450p0582R488M5919o297
496A5913O323l044n0865L7441M5617n5544K238M216k3076N4386Q94o2627J1336
509a6792K0796j9677L0418k313n4119M4227Q464m5323L7378o468k2555M3515j3521
$$ y = [18962, -24619, -29307, 11818, 8274, 17370, -1260, -35289, -4592, 20232, 2428, -10332, -2369, -5987, 15959, 18117, -35342, -15508, 14639, 6625, 18826, -8958, -31805, 3708, 20559, -9122, -10935, -1463, -9562, 26575, 7963, -41578, -5063, 9113, 7387, 21303, -10526, -27189, 13781, 19884, -13234, 5445, 1638, -4237, 38589, 114, -28291, 13005, 8483, 6679, 20854, -7828, -15562, 25983, 2150, -26973, 10659, -4854, 2091, 26976, -31778, -32971, 13629, 1803, -5014, 1061, -29846, -11237, 38454, -13077, -31382, 2985, -10579, 28935, 37385, -33197, -23709, 22210, 15913, 22236, 19192, -31673, 5768, 51385, -4159, -1921, 2295, -20781, 33605, 34499, -28128, -16792, 4004, -15673, 14745, 12432, -41687, 2540, 11004, -34319, 3059, -3409, -25964, 17551, 4030]
522D030l5856M1997K476l8001L7828r195j9535N9668l5126m3789M5018k448n01
535F566L0603m5634l0384O3348n964l1263K5389m1278J0076O7344m8136l4141
547c3474K5290j1131K2312L7780n9104k3055N7183j9624K901K3039n7038K4948
559i973M9857m3637o831J7698k7285K6057L4264n7764O538L6493m3409K1650J3717
572A7375m4465L7851J7805n0650J2376K0524k9701K9996P877n5665M1325J9884
584B4532m5617K4080p229k1743N2582l37n3399J9748J2671j8143M2902k0810m6587
597c7350N3714K788k6889K0802k6022r122N5392j0485m4370K4165q237o489M7183
610C5080l7920k5162M6547j5146j0158J8859l0012L18M7295k5121k4559L1054
$$ y = [4030, -31826, 10171, 12647, -25354, 12474, 3279, -16256, 43412, 8286, -35503, 9515, 7067, 6566, 37169, -8465, -38849, 24499, 18535, -12728, 12661, -28617, -18541, 48803, 667, -33474, -8184, -19315, 2997, 40777, -18327, -41382, 15801, -3823, -922, 22117, -34921, -9973, 39884, -3753, -10584, 7114, -20171, 5886, 40150, -17614, -11076, 25417, -17992, 3658, 17375, -27090, 10761, 28566, -22084, -9708, 10816, -18885, 11111, 18988, -36677, 4648, 24532, -21085, 2995, -4234, -25977, 26605, 26268, -27131, -7383, 5288, -12855, 30047, 9237, -37350, 16364, 19152, -7737, 13065, -12957, -22079, 33313, 22828, -21542, 2623, -5614, -12103, 35080, -2840, -28002, 18545, 3399, -6759, 12100, -17912, -17594, 29701, 4580, -19979, 11075]
622A1075k4551O025L3361m3312M490L6258k5824m250J3652k5646J6173L5923m2729
635i355m855K8305k6011J9781Q549m2501K2951K8214k5781k363K753k4430L2681
648G938K2500m7255Q590J2028j6523K8201r555l3968K7226J9176k1598M489o643
661e394k1278M1091M706l6121J8232k653o972K3901j7348k0080K9631Q049k1369
674e605J0858j3700q955L9788j5600k1188J9973o638J309J2393k2330r310L3407
687A4402k062j7336R496k0771P955L0921k5073q977J4139m150O037N035k4724
700a5108J7L2322j0582o889L328k0913J9998J6000k3112j405R905r20N048p34
714F955k4423J0961K4734j5097Q0n780j1186K2631K174j8826O34J1087k7L982
$$ y = [11075, -13476, -7451, 25910, -17402, -12912, 23346, -2478, -6728, 6924, -18722, -2549, 33374, -9355, -14210, 14095, -11916, 7865, 16414, -26087, -3136, 25078, -703, -3066, -313, -24743, 7938, 30438, -16817, -8227, 3801, -12722, 15479, 5924, -28044, -818, 18358, -3240, 1249, -5394, -26672, 14419, 19125, -16996, 1236, -1417, -8389, 15512, -1836, -21916, 7715, 15764, -5605, 5253, -8447, -17402, 22386, 6786, -14402, 5571, -1067, 242, 12635, -9695, -19005, 14402, 12340, -4996, 4500, -16271, -8316, 22605, -2468, -11445, 2694, -1456, 4581, 9616, -15108, -15091, 17231, 6649, -240, 3088, -17825, 2173, 18173, -4939, -6344, 3561, 2641, 7689, 6955, -17468, -6507, 18227, 3130, 3210, -2570, -13756, 8875, 11049, -7777, -7143, 3944, 3917, 7899]
728G899p089k1801K1023J4196j2445J155j1402Q69J8224l808j5969K723J1911
741E486m50N114j4940j3621K3779M473o108l376r938P756J1638n937j5348O794
755d678J0070Q26K763k0114k577J9803J127l452q621k981Q915P658q927j3818
769a4006J1184O802M037l573j9551O347J2738K348n627q676L645P279N680j3111
783d484p951J1994N856O048j1041j2235Q743Q796L202r949m098N247O887K190
797I205j6612j397Q856P608K728j5663m715O412Q793l07j1978P60M783R136m178
812C431j4645K279P706J1026l662j3081r2N660J0125n818q899K921O771Q779j0446
827B055r840K067R072J0169r728q208l8P541O738j0083m610J727R858M617j2918
$$ y = [7899, 810, -20991, 32, 14228, 1783, 2938, -8464, -7595, 10629, 6821, -9148, -6425, 5486, 5036, 10150, -4790, -18411, 5368, 9841, 3733, 357, -9581, -1825, 9813, 3876, -11472, -4678, 5392, 6218, 8981, -11133, -13710, 6093, 7220, 3768, -4853, -7834, 1081, 8739, -188, -14006, -2822, 3980, 8017, 4444, -15107, -8760, 3978, 6326, 699, -7977, -4332, 2947, 8627, -4484, -12435, -441, 5415, 11463, 422, -11813, -3070, 5726, 8928, -1021, -5119, 128, 7015, 9205, -7407, -8804, 52, 7660, 10388, -5275, -9990, -3578, 5215, 4908, -7070, -6310, -1527, 7609, 3431, -11214, -8935, -1229, 9797, 6135, -6946, -7038, -1378, 8747, 2929, -5970, -3049, 3722, 12501, 2055, -7785, -5718, 3354, 13523, 3795, -4413, -4451, 3090, 9828, -255, -4865, -3138, 6720, 11337, -1581]
842a581n766O58J2107M924j0521m946k52J0634J16r681k364K020J2975j821j1628
857e126m711L016J2915j273p315n184L913J1135n953o193k788O269J2813n904
871E614r080m688P767R274l421n625o303J0265O022q958m466l789R980Q258p528
886C322r842k722J0250K787j905p318l974J4295m67p275m433j738J2307N090p027
901A350j0477M170Q400m87N98j1152L098J4266n606o213n239J984J0689M140j0330
916h09r744J0453K314P62j234j3105J0759J0628p096o135l739L392J0048N156
930A1650j5401l098J1414l077M899n628j0461J4472N742q240o076o21J108J0908
944G591J533j8585O462O991n372O163j0027m809J6177K691j1638k554J435m73
$$ y = [-1581, -7347, -6689, 5418, 10342, -179, -5125, -5377, 5257, 5373, -4308, -6672, -4652, 8323, 6502, -5126, -9837, -6821, 6094, 4821, -2494, -7678, -3765, 7370, 1417, -4776, -7564, -1295, 11518, 5614, -3466, -8154, -387, 8887, 5466, -159, -6462, 3803, 9825, 867, -3599, -7388, 2592, 10850, 3322, -6520, -9242, 1008, 3795, 1890, -5428, -9402, 4893, 4426, -2849, -7282, -9020, 3287, 8377, 1350, -9127, -4957, 3443, 2956, 3554, -7598, -4500, 9766, 4160, -2053, -7292, -5308, 5381, 9521, -809, -10553, -100, 2214, 2976, 1742, -11363, -604, 10024, 2928, -3207, -6946, -3554, 6494, 11650, -3751, -6849, 4565, 1488, 6387, 759, -9702, 4770, 10512, 2272, -3804, -4425, -3317, 7591, 9124, -9461, -2999, 3992, -1380, 4783, -5244, -10053, 6124, 8815, -2823, -5377, -3942, -4415]
958d415J5172o763j6895J4803J428k627M196j3683K72J8691l87j4706K322k216
972d808K198J8351j6133j0316J6401k869J559J376j4531K802J9878o097j2200
985d389O993r868P343J4912k1542n55J2261o807K499L75j4028O083J7906j5226
999d043l804Q807j2819J3375N363k0802R829J1613q197J401m97j2635J7067J3339
1013A7997k3243L832M748p757J8895o818k1346J3635J1107q283K467q568j5750
1026a9084K6473O478k2349P181o799k237K2683j0467j8208J3410N599n652J2520
1039I548j3651j3659K7160l836r376J2805j3192j223J7166j0717q042J7076o644
1052C415q443J4566j4681l47K0235j9123l991J4922p996K729O297j9847O20K5691
$$ y = [-4415, 10757, 3994, -12901, 1902, 3330, 703, 4899, -8784, -8512, 10179, 9792, -4914, -2592, -4808, -2610, 15741, -392, -10708, 5693, 2824, 4383, 5759, -8772, -5970, 13908, 7811, -4389, 2604, -7264, 79, 14991, -6551, -7106, 5155, -1652, 847, 1222, -12806, -6723, 11183, -4043, -7847, 960, -11859, 1516, 6879, -13923, -4094, 7519, -678, 723, 226, -12409, 4658, 17997, -5246, -1414, 3334, -4423, 14472, 7654, -13692, -57, 11050, 2767, 5234, -3334, -19084, 7389, 13867, -8482, -1301, -8100, -10337, 12346, 1879, -16329, -2919, 2680, -2972, 9548, -4103, -17762, 9398, 5562, -3814, 8991, -4201, -5424, 11742, 1025, -7017, 10059, 3415, -5028, 9538, -5143, -5490, 14745, -4378, -8369, 6553, -1443, 1286, 7583, -12264, -11644, 14047]
1066A4047j0544n773M820j9296J6926J8979k2651m006P526m112J3081N044k8342
1079a4301L485K1478r511P430m479k3644K0213J2391j5172K362k39r760J6359
1092F612M698k3809J1444O657j1843J5499o634j4301J7074m36j2563J0464J414
1105D276j0201J3758p254j5578K2149j650j0677R723j0924j491J8566p351j4980
1118a1634J1589nj598J5007j9170r433K2142l916j558M090j4765K813J8216r730
1132B048j0107J0909p592N005J2570k1652K70J4511p852L243K913j2674N709J3365
1146A0666j4948j489J0982r521J0026K725j9491Q999R821p342J699m11r752J1647
1160C611P774j9089L544N634n422J3120o436j5481J0301P054n478K165l048q331
$$ y = [14047, 3503, -2270, 2550, -16746, 180, 19159, -3492, -7498, 28, -4084, 8997, 14041, -14301, -10816, 10662, 1151, 8581, 4102, -19542, 671, 13062, -2110, 252, 13, -9747, 6612, 11310, -12499, -1055, 5602, -6241, 9258, 2624, -11677, 5397, 4961, -7602, 2862, 4276, -5925, 7833, 579, -14999, 7150, 5500, -5177, 4546, -6378, -7869, 10697, 3346, -11634, -45, -50, -1648, 13359, -5811, -15244, 6898, 2982, 1424, 5514, -9251, -6438, 11778, 2048, -8059, 2850, -4742, 263, 12833, -8819, -8549, 5962, -1890, 1353, 4266, -8408, -2699, 10666, -4282, -5771, 5211, -4310, 5716, 8441, -11050, -2051, 7770, 428, 2127, 1716, -8036, 3611, 11385, -7704, -4160, 1474, -3948, 9172, 2736, -12745, -2444, 4610, -868, 1297, -1751, -10082]
1174a0082J5767J895j5939P306l12j8J1719r562r441J0057L737n058L973n441
1188a399m235J5958o685r867P668l021L743O265j0440n005J0611K23n301M504
1202C019p719K550J2936j1434m316M855j310N378J622j0107j974J1035l173l352
1216a990J896p939Q564O637j1485j700K654J804M611n02r671J994J0308m825j90
1231A66j508m186J1574J454q562j816K828L130L282j949r898N463O334n274N30
1246A568n374j81R104j665p018k355L209K066L124m094p076P971K142k529o65
1261a773m453M611O093j711n954m93M284J555K581o557k276P812k49j505m012
1276b047j864N225L939k633o921J660L319J879M76p529J745N625L69k047m917
$$ y = [-10082, 5685, 7580, -8359, -1053, -1365, -1383, 10336, 774, -8667, 1390, 5127, 69, 4042, -1399, -5634, 10324, 3639, -6228, 1440, -1581, 2162, 8427, -2013, -7018, 3593, 3816, -1485, 3019, -4700, -2150, 10786, -648, -4964, -109, -1419, 3959, 5581, -4526, -6500, 4535, 1362, -1990, -94, -8033, 531, 7168, -4317, -6017, -3363, -1559, 3052, 2550, -7121, -5127, 5181, 356, 166, -1342, -5528, 6046, 7500, -1062, -2878, -50, 3080, 6362, 4413, -5485, -22, 6312, 1038, 1568, -3806, -3987, 5117, 3452, -3566, -5921, -2712, -646, 2478, -1616, -8692, -721, 1421, -1108, -1773, -6226, -1615, 4478, 2767, -3187, -3680, 604, 2159, 4740, -1817, -4093, 3719, 3470, 1965, -2047, -3911, 1314, 5253, 2620, -4301, -2641, 678, 2557, 3033, -4496, -2751, 2874, 3243, 1196, -3721]
1291c721J358M519L663l979n723L398J890L045k823n674L458L104J575m704m048
1306d662K407L537L047o025k858K749K222K550n279j952L390L484Q06n879r87
1321c450K490M478J095o154l83K006L716k59n530K58K154M417j924n633j75K271
1337f23M889k242m744K96K001M001l336l685N21L033M291m242l272j35L164M142
1353D059m175k407j91L515K735m682k077K10M697J799m541k115l64N134J530m437
1369a310j295L43N012l2l967j787R54O140j245l181k152P95N484j201l368j686
1385b496J988M197j858k908k974L535M498k541k089l040K531M709k411k969j516
1400c344M278K013j513l347k759O334J505k605j475k678M323K455k613l401N07
$$ y = [-3721, -2363, 2156, 5819, 1840, -3883, -485, 1405, 4450, 1627, -4047, -589, 2515, 4090, -614, -4662, -2255, 1282, 4329, -1696, -4554, -1805, 417, 2967, -2312, -4264, -874, 2610, 3416, -2463, -3450, -960, 3518, 4613, -1541, -1924, 82, 3798, 3539, -1991, -1733, 421, 4838, 2914, -2719, -2894, -623, 4266, 2024, -2720, -2424, -423, 3578, 242, -3443, -2922, 111, 4402, 160, -3112, -3247, -83, 4059, -116, -2523, -2714, 801, 3536, -1146, -3223, -3013, 1684, 3483, -1058, -3173, -3537, 1597, 3127, -1310, -2605, -2262, 2750, 2718, -1249, -3036, -2082, 4058, 2813, -368, -2520, -1725, 3759, 2558, -810, -2496, -508, 3689, 1831, -1077, -4051, -516, 3982, 1441, -648, -3688, -1157, 3552, 1141, -1828, -3344, 934, 2947, 1434, -1913, -4672, 1662, 3167, 562, -913, -3591, 732, 3187, 574, -2827, -2320]
1415b320M465J43m53n111l02O690m78j486k572r85M524J940l334l709L318K581
1431B911J13l96o679K992N044k060j705k465J46L788J357n532k251M984K4J779
1447B050k608o030N633L646j852k060j563R87M675J537p664R37M232n52L689m835
1463B22m644O022K035k218j380j108o86M999j064p003L987Q30q20L116n687q56
1479d255N569k67l694R33M32J68N379n759m452P553J44K69r6o169J935P694j818
1496C566n993J453j181L962N997j0110l124N666M58L175j564p903J465Q380k154
1511B093l188R59n105O487M787q457J89K154j216L674M07o310K217M961n880K165
1527f3J892n019O051p60o589M883K353l127J307j181l907P827J334r007L384j46
$$ y = [-2320, 2145, 2288, 1835, -3276, -3578, 3112, 2634, 1148, -1424, -2409, 2115, 4055, 721, -2988, 330, 2911, 3024, 2628, -4051, -1059, 3985, 1925, 220, -2245, -2099, 1689, 3046, -2486, -4737, 247, 271, 2050, -558, -6588, -955, 2691, 839, -1221, -2784, -1797, 2878, 4415, -3249, -2312, 1920, 1368, 5057, 222, -4422, 1600, 3635, 1417, 37, -1071, -1757, 3242, 2178, -4825, -838, -8, -828, 2288, -3399, -4255, 1314, 1047, -2647, -1714, -1282, -1114, 4265, -1494, -5946, 1607, 1751, 2020, 1924, -4245, -2310, 5384, 3566, -2427, -974, -2155, 1807, 7804, -2306, -5430, 236, 694, 3869, 2305, -5598, -4133, 4247, 2093, -1095, -136, -5241, 1246, 6033, -2424, -2235, -81, -1297, 2377, 2784, -3526, -1309, 3652, -2228, -63, 1829, -3190, 2861, 2101, -4488, 395, 2748, -379, 928, -253, -4160, 3667, 5001, -4006, -622, -768]
1543g68L2P636n829p157N555L607j707J746n268m110J0813n37o623K910m098K452
1559a346P603n844n395M747O28m58M284o899j386R045m628j932L214m162L085
1574E56M236o408j898O539k958n72L075p450M138O503p864m83K108k243M880J725
1590C884q657N93P258l750K173o81p577Q094L981o525N81j40j501O106O95q859
1606d325L344L533l776M810l644n146Q090P0n048J638m28j786O121k141p293O922
1622I41L79l279M074n118p41P601k111n044K900l75j26N992o210l765P937j680
1638A375n54J580n847K047O884l355m505K978j889K300M954q732p12O324k501
1653C47J375p84n259L250N595m395k516K466l136M591K337q348K527L882k157
$$ y = [-768, -736, 6900, 1071, -6086, -531, 3076, 1369, 3115, -2153, -6263, 4550, 4013, -2610, 300, -3798, -1346, 6257, 413, -4982, -235, 393, -65, 4219, -2680, -4066, 4979, 351, -1581, 1633, -2529, 556, 4792, -1616, -3514, 3025, 67, -505, 2570, -4880, -742, 5761, -2103, -2586, -478, -2721, 2159, 3884, -4773, -4180, 3078, -672, 1501, 820, -6757, 1337, 5318, -1207, -626, -766, -2267, 3839, 4534, -4325, -981, 2552, -1224, 3586, -58, -5204, 2886, 2956, -2092, -454, -882, -2668, 3453, 1312, -5981, 941, 1320, -1959, 2115, -3003, -3744, 3857, 1746, -3298, -398, -773, -899, 5093, -1117, -4882, 3055, 1375, 821, 2401, -3446, -1399, 5485, 2130, -2375, 603, -1286, 1014, 5968, -2764, -3476, 2848, 347, 1722, 938, -4321, -1071, 4524, 129, -2387, 79, -3057, 1534, 3871, -4477, -1950, 1932, -225]
1668b25J421j325l827M281M144n959M48J766k633N555j499o233M376K153j621
1683H22M50j854k745N710J602o452J863j19l16M853m172l823M088J924j598J28
1699C61k672j571P194j278m666K042j508K672L087m583k533L903J927j600K77
1714A052l589J87O588k915k790Q40j027K990R48l980j464L767O33j311L70l908
1730c609K709M113l727r24L87L50K560m64l409j42M461j039n84j112k523M562
1746A609J251l416p68M38J683J395j144l986J374L997j560j45k663m57M565j15
1762B058k355j817J054K436Q56j769l542K551K628o12o14l291J290L322j66k396
1778c67j514J814J326R85k664k372L375Q99J79j854k245K374J746j03k856k79
$$ y = [-225, 1196, -129, -3956, 325, 4469, -1490, -1042, 724, -1909, 3646, 2147, -4086, 290, 2443, 822, 1272, -582, -3327, 2383, 3985, -2467, -604, -723, -1039, 3814, -358, -4181, -93, 1831, 233, 361, -2311, -3882, 3312, 2034, -2632, -590, -2098, 574, 3661, -922, -3455, 448, 2375, 775, 1052, -2537, -2350, 4238, 1323, -1467, -627, -1654, 1336, 2284, -1696, -3160, 607, 1240, -71, 299, -3609, -900, 3213, -514, -1438, -1051, -701, 1859, 1395, -2014, -2156, 2305, 1266, 682, -430, -2953, 1609, 2860, -556, -1324, -886, 797, 2192, 1048, -2938, -1564, 2433, 873, 728, -1935, -2392, 2173, 2058, -297, -2114, -1060, 1376, 2232, 463, -3079, -528, 2100, 1488, 874, -2417, -1127, 2195, 2029, -367, -1881, -67, 1259, 2244, -420, -2792, 583, 1482, 1661, -193, -2438, -64, 1682, 1579, -1277, -1556]
1794a556J758J085M89l353l96K909O38j76k929k26K179J389o69l243J133J269
1810C01J422n58l518Q55J933J344j227k636P74J735J692k081k199J192J524J873
1826B426k520k096J190J608J542k442j535R31J788J293l160p18Q81J942R57l010
1842i23r90R53K267N95l090l90O60K542o9l129n8R64K390l88k623m19J016K764
1860B072j038k421m4R81K829j401k169l33J460K544j893j639m62J904K022k055
1876C57j302p15K388J873k605j139l02K368J202j946j345n26K993O80j851j220
1892a090o22L202M43k072j283N7K770R1j397j861N58L117p55j231j684N68L476
1909B287r08j720j283J077K444l86j452k182K124K183j323q86k054J882K465j220
$$ y = [-1556, 202, 1287, 1776, -1577, -1973, 936, 1574, 1398, -1531, -1757, 422, 1811, 1142, -2101, -968, 301, 1723, 1165, -2353, -1498, 435, 1779, 552, -2084, -1310, 425, 2117, 36, -2163, -971, 553, 2426, -94, -2190, -1000, 608, 2150, -292, -1827, -896, 892, 2185, -975, -1693, -812, 1130, 2087, -923, -1913, -960, 1307, 1902, -1188, -1578, -918, 1624, 1555, -1574, -1632, -668, 1722, 1334, -1289, -1708, -692, 2072, 1034, -1387, -1431, -450, 2379, 978, -1191, -1524, -64, 2480, 587, -1052, -1514, 390, 2412, 357, -945, -1660, 728, 2601, -4, -1143, -1445, 923, 2125, 179, -1166, -1692, 1301, 1981, 130, -1090, -1712, 1490, 1933, -139, -1422, -1365, 1405, 1496, 99, -1762, -1204, 1913, 1158, -73, -1757, -1189, 2287, 1379, -341, -1624, -547, 1897, 1511, 59, -2123, 1, 2184, 861, -25, -2079, -197, 2268, 1048]
1925A048k018j170K141J258j56k150j819L177Q50o17j516j621K510J767p76k597
1941a689J14J881P44O52l349j63L271n18Rj589p07K268J022j585k267J521P09
1958C24P69k77l579J659K252n23j061j751O64K170J150l224j259K485L94J664
1974A857j808l036L069J478k06j353j160M63K551J104m025MJ462J98K156k966
1990b12k091K322J306m79j169r05l20L179n38l460J752o6J020J094k990l30K556
2007F69P72j602k35l65O44L203k758j972K313k02J646o21k922J24L157O5k146
2024b30J83j674K308K750m200q84J314M60J561j009k946N44L593j326j081K43
2040c94k150L514J372l779M55O48N10J302p22k655J477K786k576M60k57j536L793
$$ y = [1048, -970, -2140, 1, 1259, 1103, -1047, -2866, 311, 1161, 544, -972, -2593, -83, 1684, 908, -1689, -1575, 306, 1050, 1702, -1647, -1810, 1461, 943, 952, -637, -1344, 924, 1946, 361, -1906, -385, 324, 1093, 816, -2763, -1104, 1148, 625, -436, -2187, -1523, 647, 1797, -1427, -2686, -201, 193, 1857, 49, -2987, 82, 1560, 1354, 1, -1159, -696, 1855, 2959, -1066, -1062, 400, 598, 2754, -212, -2303, 19, 1325, 846, -323, -1228, -1548, 1631, 1093, -2367, -615, -681, 339, 1433, -1557, -1887, 669, 1441, -161, -396, -761, -117, 3086, 328, -1644, 669, 467, 2113, 1492, -1430, -1306, 1851, 1916, -230, -47, -1721, 587, 3337, -863, -1747, -433, 27, 1588, 579, -2367, -1823, 1770, 444, -637, -394, -2544, 970, 2342, -1437, -982, -334, 176, 1478, 756, -1899, -422, 2364, -212, 248, -9, -1545, 2248]
2057B248r56k713P98Q22L22O34j433k681L648J073k896P40j388O36L394j967k547
2074b266J007J590k19J213k258j894M498l82j578O16k091J855K670k202k123J332
2090b32Q21j56J468l305l68L859j915n54J89j389J912J041k359j166K549m70L65
2107B90L33l410K383K752k531l31l09K13K309Q97l761l96K902n30J179j458l347
2124b815L468J614j644p64j057L7K570R80m292R14J179n44K414k494k077K864
2140C53P95r04j92o58m67K685n18k889K370l69k21J564k336j16K105k66j651J96
2158e19L17j27K359k578j568K892m57K98k97k183J192K493n73k496P34k89J565
2175G63K033l920o53K128L73P43j569j986J153K793q58k077L8p42K967Q75l517
$$ y = [2248, 1292, -1421, -623, 199, 521, 1155, -278, -2959, 689, 1762, -1134, -394, -1782, -1146, 2248, 281, -2266, -1259, 331, 112, 1325, -933, -2827, 1671, 1289, -289, 327, -1764, 91, 2761, 559, -1564, -232, 589, 433, 1901, -1404, -1772, 2087, 172, -382, -193, -1582, 330, 1371, -988, -2154, 395, -75, 290, 623, -2787, -404, 2348, -183, -514, -823, -610, 1699, 2596, -1165, -1561, 1341, 811, 1990, 532, -2815, 653, 2267, 623, -141, -1198, -1161, 1409, 2389, -1903, -989, 190, -354, 2060, -434, -2511, 353, 1148, 244, 52, -606, -1073, 1612, 1094, -1795, 575, 206, -15, 1549, -787, -903, 1202, 936, -715, -519, -202, -329, 2030, -548, -2116, 776, 319, 617, 320, -1863, -671, 1822, 1249, -1247, -513, -802, 763, 2796, -1124, -1777, 351, 724, 1467, -102, -2088, -935, 1858, 1000, -1077, -1039, -1781, 1186, 2061, -1456]
$$ [...]
8191F7
##END NTUPLES=NMR FID
##END=
