##TITLE=1H_35-2024-Bau
 CDCl3
 8 sc, 
 3.6.2024
##JCAMPDX= 6.0         $$ Bruker NMR JCAMP-DX V2.0
##DATA TYPE= NMR FID
##DATA CLASS= NTUPLES
##ORIGIN= UXNMR, Bruker Analytische Messtechnik GmbH
##OWNER= root
$$ XWIN-NMR		Version 3.5
$$ Mon Jun  3 14:11:54 2024 Russian Standard Time (UT+4h)  she@DPX200
##.OBSERVE FREQUENCY= 200.1309
##.OBSERVE NUCLEUS= ^1H
##.DELAY= (6, 6)
##.ACQUISITION MODE= SIMULTANEOUS
##.ACQUISITION SCHEME= undefined
##.AVERAGES= 8
##.DIGITISER RES= 18
##SPECTROMETER/DATA SYSTEM= spect
##.PULSE SEQUENCE= zg30
##.SOLVENT NAME= CDCl3
##.SHIFT REFERENCE= (INTERNAL, CDCl3, 0, 15.7039)
##AUDIT TRAIL= $$ (NUMBER, WHEN, WHO, WHERE, WHAT)
$$ ##TITLE= Audit trail, XWIN-NMR		Version 3.5
$$ ##JCAMPDX= 5.01
$$ ##ORIGIN= Bruker BioSpin GmbH
$$ ##OWNER= she
$$ F:/spectra/data/she/nmr/H-F/1/audita.txt
$$ ##AUDIT TRAIL=  $$ (NUMBER, WHEN, WHO, WHERE, WHAT)
(   1,<2024-06-03 14:10:14.09 +0400>,<she>,<DPX200>,
      <created by zg, POWCHK disabled, PULCHK disabled
       configuration hash MD5:
       00 E9 B6 7A A2 85 ED C7 34 08 36 98 17 FE 4E 26
       data hash MD5: 16K
       57 72 CF CF 2C 49 CC 45 B7 42 22 9F 42 23 3D 82>)
$$ ##END=
$$ 
$$ hash MD5
$$ 9B 67 8E 7D F5 D4 CF 58 2F 1F 85 AA 95 1F EC 57
##$RELAX= 
##$RELAX= 
##$RELAX= 
##$RELAX= 
##$RELAX= 
##$RELAX= 
$$ Bruker specific parameters
$$ --------------------------
##$DU= <F:/spectra>
##$EXPNO= 1
##$NAME= <H-F>
##$PROCNO= 1
##$TYPE= <nmr>
##$USER= <she>
##$AMP= (0..31)
100 100 100 100 100 100 100 100 100 100 100 100 100 100 100 100 100 100 
100 100 100 100 100 100 100 100 100 100 100 100 100 100 
##$AQSEQ= 0
##$AQ_mod= 1
##$AUNM= <au_zg>
##$AUTOPOS= <>
##$BF1= 200.13
##$BF2= 200.13
##$BF3= 200.13
##$BF4= 200.13
##$BF5= 200.13
##$BF6= 200.13
##$BF7= 200.13
##$BF8= 200.13
##$BYTORDA= 1
##$CFDGTYP= 0
##$CFRGTYP= 5
##$CHEMSTR= <none>
##$CNST= (0..31)
1 1 145 1 1 1 1 1 1 1 1 1 1 1 1 1 1 1 1 1 1 1 1 1 1 1 1 1 1 1 1 1 
##$CPDPRG= <>
##$CPDPRG1= <>
##$CPDPRG2= <>
##$CPDPRG3= <>
##$CPDPRG4= <mlev>
##$CPDPRG5= <mlev>
##$CPDPRG6= <mlev>
##$CPDPRG7= <mlev>
##$CPDPRG8= <mlev>
##$CPDPRGB= <>
##$CPDPRGT= <>
##$D= (0..31)
0 1.2 0 0 0 0 0 0 0 0.06 0 0.03 0 0 0 0 0.0002 0 0 0 0 0 0 0 0 0 0 0 0 
0 0 0 
##$DATE= 1717409413
##$DBL= (0..7)
120 120 120 120 120 120 120 120 
##$DBP= (0..7)
150 150 150 150 150 150 150 150 
##$DBP07= 0
##$DBPNAM0= <>
##$DBPNAM1= <>
##$DBPNAM2= <>
##$DBPNAM3= <>
##$DBPNAM4= <>
##$DBPNAM5= <>
##$DBPNAM6= <>
##$DBPNAM7= <>
##$DBPOAL= (0..7)
0.5 0.5 0.5 0.5 0.5 0.5 0.5 0.5 
##$DBPOFFS= (0..7)
0 0 0 0 0 0 0 0 
##$DE= 6
##$DECBNUC= <off>
##$DECIM= 32
##$DECNUC= <off>
##$DECSTAT= 4
##$DIGMOD= 1
##$DIGTYP= 9
##$DL= (0..7)
0 120 120 120 120 120 120 120 
##$DP= (0..7)
150 150 150 150 150 150 150 150 
##$DP07= 0
##$DPNAME0= <>
##$DPNAME1= <>
##$DPNAME2= <>
##$DPNAME3= <>
##$DPNAME4= <>
##$DPNAME5= <>
##$DPNAME6= <>
##$DPNAME7= <>
##$DPOAL= (0..7)
0.5 0.5 0.5 0.5 0.5 0.5 0.5 0.5 
##$DPOFFS= (0..7)
0 0 0 0 0 0 0 0 
##$DQDMODE= 0
##$DR= 18
##$DS= 0
##$DSLIST= <SSSSSSSSSSSSSSS>
$$ [...]
##$SUBNAM2= <"">
##$SUBNAM3= <"">
##$SUBNAM4= <"">
##$SUBNAM5= <"">
##$SUBNAM6= <"">
##$SUBNAM7= <"">
##$SUBNAM8= <"">
##$SUBNAM9= <"">
##$SW= 18.0517689322627
##$SWIBOX= (0..15)
0 0 2 0 0 0 0 0 0 0 0 0 0 0 0 0 
##$SW_h= 3612.71676300578
##$TD= 16384
##$TD0= 1
##$TE= 0
##$TE2= 300
##$TE3= 300
##$TEG= 300
##$TL= (0..7)
0 120 120 120 120 120 120 120 
##$TP= (0..7)
150 150 150 150 150 150 150 150 
##$TP07= 0
##$TPNAME0= <>
##$TPNAME1= <>
##$TPNAME2= <>
##$TPNAME3= <>
##$TPNAME4= <>
##$TPNAME5= <>
##$TPNAME6= <>
##$TPNAME7= <>
##$TPOAL= (0..7)
0.5 0.5 0.5 0.5 0.5 0.5 0.5 0.5 
##$TPOFFS= (0..7)
0 0 0 0 0 0 0 0 
##$TUNHIN= 0
##$TUNHOUT= 0
##$TUNXOUT= 0
##$USERA1= <user>
##$USERA2= <user>
##$USERA3= <user>
##$USERA4= <user>
##$USERA5= <user>
##$V9= 5
##$VALIST= <valist>
##$VCLIST= <CCCCCCCCCCCCCCC>
##$VD= 0
##$VDLIST= <DDDDDDDDDDDDDDD>
##$VPLIST= <PPPPPPPPPPPPPPP>
##$VTLIST= <TTTTTTTTTTTTTTT>
##$WBST= 1024
##$WBSW= 4
##$XGAIN= (0..3)
0 0 0 0 
##$XL= 0
##$YL= 0
##$YMAX_a= 1047119
##$YMIN_a= -934715
##$ZGOPTNS= <>
##$ZL1= 120
##$ZL2= 120
##$ZL3= 120
##$ZL4= 120
##$ABSF1= 10
##$ABSF2= 0
##$ABSG= 5
##$ABSL= 3
##$ALPHA= 0
##$AQORDER= 0
##$ASSFAC= 0
##$ASSFACI= 0
##$ASSFACX= 0
##$ASSWID= 0
##$AUNMP= <proc_1d>
##$AZFE= 0.1
##$AZFW= 0.1
##$BCFW= 1
##$BC_mod= 2
##$BYTORDP= 1
##$COROFFS= 0
##$CY= 11.3945322036743
##$DATMOD= 1
##$DC= 2
##$DFILT= <>
##$DTYPP= 0
##$F1P= 15.6554695791079
##$F2P= 12.8336369535428
##$FCOR= 0.5
##$FTSIZE= 0
##$FT_mod= 4
##$GAMMA= 1
##$GB= 0.15
##$INTBC= 1
##$INTSCL= 1
##$ISEN= 128
##$LB= 0.24
##$LEV0= 0
##$LPBIN= 0
##$MAXI= 10000
##$MC2= 0
##$MEAN= 0
##$ME_mod= 0
##$MI= 1.114404
##$NCOEF= 0
##$NC_proc= 0
##$NLEV= 6
##$NOISF1= 3.799351
##$NOISF2= 2.8
##$NSP= 1
##$NTH_PI= 0
##$NZP= 0
##$OFFSET= 15.70392
##$PC= 1
##$PHC0= -25470.84
##$PHC1= 9.38748
##$PH_mod= 1
##$PKNL= yes
##$PPARMOD= 0
##$PSCAL= 0
##$PSIGN= 0
##$REVERSE= no
##$SF= 200.130013532006
##$SI= 16384
##$SIGF1= 3
##$SIGF2= 2
##$SINO= 400
##$SIOLD= 16384
##$SREGLST= <1H.CDCl3>
##$SSB= 0
##$STSI= 0
##$STSR= 0
##$SW_p= 3612.71676300578
##$SYMM= 0
##$S_DEV= 0
##$TDeff= 0
##$TDoff= 0
##$TI= <>
##$TILT= no
##$TM1= 0
##$TM2= 0
##$TOPLEV= 0
##$USERP1= <user>
##$USERP2= <user>
##$USERP3= <user>
##$USERP4= <user>
##$USERP5= <user>
##$WDW= 1
##$XDIM= 8192
##$YMAX_p= 0
##$YMIN_p= 0
$$ End of Bruker specific parameters
$$ ---------------------------------
##NTUPLES= NMR FID
##VAR_NAME=  TIME,          FID/REAL,        FID/IMAG
##SYMBOL=    X,             R,               I
##VAR_TYPE=  INDEPENDENT,   DEPENDENT,       DEPENDENT
##VAR_FORM=  AFFN,          ASDF,            ASDF
##VAR_DIM=   8192,          8192,            8192
##UNITS=     SECONDS,       ARBITRARY UNITS, ARBITRARY UNITS
##FACTOR=    0.0002768,     1,               1
##FIRST=     0,             0,               0
##LAST=      2.2672688,     0,               0
##MIN=       0,             -934715,         0
##MAX=       2.2672688,     1047119,         0
$$ Real data points
##PAGE= N=1
##DATA TABLE= (X++(R..R)), XYDATA
$$ [...]
2627e935L8Q69J652K183K362K208J723J182J85o37j445k033k439k401k100j363
$$ -5935 -5897 -5028 -3376 -1193 1169 3377 5100 6282 6467 5830 4385 2352 -87 -2488 -4588 -5951
2643e951o31K66J279K004K498K522K396J877J104N8q87j790k503k734k783k305
$$ -5951 -6582 -6316 -5037 -3033 -535 1987 4383 6260 7364 7422 6535 4745 2242 -492 -3275 -5580
2659e580j544n96M32J398K188K776K815K606J995J071J5r02j821k547k875k748
$$ -5580 -7124 -7720 -7288 -5890 -3702 -926 1889 4495 6490 7561 7576 6674 4853 2306 -569 -3317
2675c317k439j631o89L25J305K048K581K815K607K059J380N13o35j447k013k600
$$ -3317 -5756 -7387 -8076 -7751 -6446 -4398 -1817 998 3605 5664 7044 7557 6922 5475 3462 862
2691H62k664k443j850j143j55O26J551K158K486K554K269J785R66K64q35j537
$$ 862 -1802 -4245 -6095 -7238 -7393 -6767 -5216 -3058 -572 1982 4251 6036 7002 7266 6431 4894
2707D894k114k398k434k158j470q37R4R02J562K092K439K260J844J359N65k20
$$ 4894 2780 382 -2052 -4210 -5680 -6517 -6423 -5521 -3959 -1867 572 2832 4676 6035 6600 6380
2723F380j049j740k158k257k186j658j021l20M64J215J701K186K054J898J374
$$ 6380 5331 3591 1433 -824 -3010 -4668 -5689 -6009 -5545 -4330 -2629 -443 1611 3509 4883
2738D883P78L5q11j321j873k164k052j715j130n04K99J103J554J969K097J888
$$ 4883 5661 5696 4885 3564 1691 -473 -2525 -4240 -5370 -5874 -5575 -4472 -2918 -949 1148 3036
2754C036J352Q10J5p09j337j774k046j893j527r87l08M55J160J598J911J974J706
$$ 3036 4388 5198 5213 4504 3167 1393 -653 -2546 -4073 -5060 -5368 -4913 -3753 -2155 -244 1730 3436
2771C436J208M67r9q84j453j822j844j795j347p96k6O71J176J758J905J878J546
$$ 3436 4644 5111 5012 4128 2675 853 -991 -2786 -4133 -4929 -4955 -4284 -3108 -1350 555 2433 3979
2788C979J150L70l47r51j552j797k094j787j387q94q0O23J285J711K107K008J621
$$ 3979 5129 5499 5152 4201 2649 852 -1242 -3029 -4416 -5310 -5390 -4767 -3482 -1771 336 2344 3965
2805C965J291M80k42r18j602k036k078k205j551r52l10O03J176J839K071K280
$$ 3965 5256 5736 5494 4576 2974 938 -1140 -3345 -4896 -5848 -6158 -5555 -4379 -2540 -469 1811
2821A811J948J326P51m2q08j500k013k224k185j766j243m46L72J122J746K149
$$ 1811 3759 5085 5836 5794 4986 3486 1473 -751 -2936 -4702 -5945 -6391 -6019 -4897 -3151 -1002
2837a002K299K128J623J041K66o07j285j836k292k186k067j436p78l2Q28J556
$$ -1002 1297 3425 5048 6089 6355 5748 4463 2627 335 -1851 -3918 -5354 -6132 -6164 -5336 -3780
2853c780K044K278K176J855J267N04l18j073j648k021k230j992j568q98j90N51
$$ -3780 -1736 542 2718 4573 5840 6344 6026 4953 3305 1284 -946 -2938 -4506 -5404 -5594 -5043
2869e043J286J658J940K045J677J101O28j78p65j288j693j846j746j436q94k07
$$ -5043 -3757 -2099 -159 1886 3563 4664 5292 5114 4349 3061 1368 -478 -2224 -3660 -4554 -4761
2885d761K97Q62J222J584J584J420J122O52Q8m67r01j317j392j505j237r10m00
$$ -4761 -4464 -3602 -2380 -796 788 2208 3330 3982 4070 3603 2702 1385 -7 -1512 -2749 -3659 -4059
2902d059P0O49R80J307J385J240J103O88J31k26o70j040j285j232j124p68m55
$$ -4059 -3989 -3340 -2360 -1053 332 1572 2675 3363 3494 3268 2598 1558 273 -959 -2083 -2851 -3306
2919c306M5N60Q34J199J222J204R62N54K11k45p04j044j261j255j145q42l80P1
$$ -3306 -3261 -2701 -1867 -668 554 1758 2720 3274 3485 3240 2536 1492 231 -1024 -2169 -3011 -3391 -3320
2937c320N38R57J170J405J281J031P30J90l58q61j226j475j545j343j075m21K8
$$ -3320 -2782 -1825 -655 750 2031 3062 3792 3982 3624 2763 1537 62 -1483 -2826 -3901 -4322 -4294
2954d294O74J105J573J724J519J276Q74J99m86r83j497j767j826j569j113m79
$$ -4294 -3620 -2515 -942 782 2301 3577 4451 4650 4164 3181 1684 -83 -1909 -3478 -4591 -5070
2970e070J06P74J342J775J853J782J335R34J67m15j083j544j856j846j579j237
$$ -5070 -4964 -4190 -2848 -1073 780 2562 3897 4831 4998 4583 3500 1956 100 -1746 -3325 -4562
2986d562o02M9Q04J270J661J877J823J487J000M62l20q01j405j790j757j683j249
$$ -4562 -5164 -5115 -4311 -3041 -1380 497 2320 3807 4807 5269 4949 4148 2743 953 -804 -2487 -3736
3003c736q41k12M79R86J426J670J741J511J076M95P7n93j125j380j599j590j275
$$ -3736 -4577 -4789 -4310 -3324 -1898 -228 1513 3024 4100 4595 4672 4079 2954 1574 -25 -1615 -2890
3020b890r28l13J38N90J058J379J478J293J008O96K03k67p43j053j322j305j134
$$ -2890 -3818 -4131 -3993 -3403 -2345 -966 512 1805 2813 3509 3712 3445 2702 1649 327 -978 -2112
3037b112q88n73o2L48Q14R57J198J281J063P96K73N6m71q53r84j192j089r81o00
$$ -2112 -3000 -3573 -3635 -3287 -2473 -1516 -318 963 2026 2822 3095 3151 2680 1827 843 -349 -1438 -2419 -3019
3056c019k07K73N32J026J091J206R72P90L47J5n11p22r97j138j029q31n15n0K83
$$ -3019 -3226 -2953 -2421 -1395 -304 902 1874 2664 3011 3026 2515 1793 796 -342 -1371 -2202 -2717 -2767 -2484
3075b484O26R76J045J079Q79O81J87j31n86p80j077j121j006p95l64j3L84P02
$$ -2484 -1858 -882 163 1242 2121 2802 2989 2858 2272 1492 415 -706 -1712 -2507 -2871 -2884 -2500 -1798
3093a798J001J122J045R56O59K50k88o08r58j147j220j033r50l82o7M12P52J052
$$ -1798 -797 325 1370 2326 2985 3235 2947 2339 1381 234 -986 -2019 -2969 -3351 -3418 -3006 -2254 -1202
3111a202J328J212R86P37L85j50o18r07j291j338j219r26o01j11L19P77J073J351
$$ -1202 126 1338 2324 3061 3446 3296 2678 1771 480 -858 -2077 -3003 -3604 -3715 -3396 -2619 -1546 -195
3129a95J383J161R38M63O0m91q28j249j351j365j178q07m45J71O30J012J392J384
$$ -195 1188 2349 3287 3750 3810 3319 2491 1242 -109 -1474 -2652 -3459 -3904 -3733 -3103 -2091 -699 685
3147F85J373J225P46K26k11p53j243j387j540j370j069o86j38M83Q95J272J470
$$ 685 2058 3283 4029 4255 4044 3291 2048 661 -879 -2249 -3318 -4004 -4142 -3659 -2764 -1492 -22
3164b2J471J240R80L94j25o58r90j376j455j409j074o85k23K09Q83J091J350J407
$$ -22 1449 2689 3669 4063 3938 3280 2290 914 -541 -1950 -3024 -3709 -3932 -3723 -2840 -1749 -399 1008
3182A008J140Q05M46pm90q33j229j239j206r77o20j91K56O79R62J127J050J071
$$ 1008 2148 2953 3399 3392 2902 2069 840 -399 -1605 -2582 -3202 -3393 -3137 -2458 -1496 -369 681 1752
3200A752P65L52Ml89p28j003r81q83q90l93j40K44N93Q34Q73R31O80N70J96j00
$$ 1752 2517 2869 2873 2484 1756 753 -228 -1111 -2001 -2394 -2534 -2290 -1697 -863 10 941 1621 2191 2387 2287
3220B287l43p47p50q30p30o11k37K6K60N90O92Q39P25M69M52J24k14m61o70p49
$$ 2287 1944 1197 447 -383 -1113 -1724 -1961 -1935 -1675 -1085 -393 446 1171 1640 2092 2216 2002 1541 871 122
3240A22q59o87n78k69j5K78N67P79Q15Q77Q24M60K60j42l63p88q88j053j008p69
$$ 122 -737 -1424 -2002 -2271 -2286 -2008 -1441 -662 153 1030 1854 2314 2574 2432 2069 1281 393 -660 -1668 -2437
3260b437n56j23K02O50R03J130J151J127P80M32O0l82q55j016j234j290j103p50
$$ -2437 -2993 -3116 -2914 -2264 -1361 -231 920 2047 2827 3259 3319 2937 2082 1066 -168 -1458 -2561 -3311
3278c311l77J03N63J035J270J355J317J125P44K63k60p22j134j414j476j364j059
$$ -3311 -3688 -3585 -3022 -1987 -717 638 1955 3080 3824 4087 3827 3105 1971 557 -919 -2283 -3342
3295c342n95r7L86R63J221J504J453J303R94M84r0n76j024j412j503j391j224
$$ -3342 -3937 -4034 -3648 -2685 -1464 40 1493 2796 3790 4274 4184 3608 2584 1172 -331 -1722 -2946
3312b946p53l41K41P40J083J296J380J280Q98N50J25l39q96j066j228j204j019
$$ -2946 -3699 -4040 -3799 -3059 -1976 -680 700 1980 2878 3428 3553 3214 2318 1252 24 -1180 -2199
3329b199o96l39L1N95P07J021J071J036Q06N28P7j76n46p29r48r77p52n34l42
$$ -2199 -2895 -3234 -3203 -2608 -1901 -880 191 1227 2033 2561 2638 2462 1916 1187 239 -738 -1490 -2024 -2366
3348b366N8L41O35P80Q27P65O73L96M9j86m39o29q21p21o64m29j96J88M00O99
$$ -2366 -2308 -1967 -1332 -552 275 1040 1713 2109 2158 1972 1533 904 83 -638 -1302 -1731 -1927 -1739 -1339 -640
3368f40O38P66O95M71J50r8l43o18p71p97o99n87k50J2L01N80P42Q31Q80O61M82
$$ -640 -2 764 1459 1930 2080 1982 1639 1021 250 -547 -1246 -1833 -2083 -2071 -1770 -1190 -448 383 1263 1924 2406
3389B406J73k57n47q74q73r99r15p17k88k7L45P59R38J062J085R99N30L72j59
$$ 2406 2579 2322 1775 901 28 -971 -1886 -2603 -2891 -2918 -2573 -1814 -876 186 1271 2270 2800 3172 3013
3408C013n28r25j034j285j143q91n96j88K54P62J037J227J302J161Q52M99N1l06
$$ 3013 2485 1560 526 -759 -1902 -2793 -3389 -3577 -3323 -2561 -1524 -297 1005 2166 3018 3517 3568 3262
3426C262q60j058j233j276j129p53m46M9N74P14J101J240J219J102P24L78r1m75
$$ 3262 2402 1344 111 -1165 -2294 -3047 -3493 -3444 -2870 -2156 -1055 185 1404 2506 3230 3608 3517 3042
3444C042q47j114j193j205j053o61l10P3M48Q44J126J103J154R72O40K78j84n08
$$ 3042 2195 1081 -112 -1317 -2370 -3031 -3341 -3268 -2820 -1976 -850 253 1407 2379 3019 3297 3113 2605
3462B605q44j112j128j065q31o10q0K34O13Q44R87J136Q36O60L13Q4l73o58q44
$$ 2605 1761 649 -479 -1544 -2375 -2985 -3065 -2831 -2218 -1374 -387 749 1585 2245 2558 2642 2269 1611 767
3481G67r42r28p25m78j21J44M87P73Q78Q24P27N77K52j45l76o55p36q37p53n34
$$ 767 -175 -1103 -1828 -2306 -2427 -2283 -1796 -1023 -145 679 1406 1983 2235 2090 1714 1059 323 -514 -1267 -1801
3501a801k00j6L41O23P93R17P62N72L24k8m05n74q73q81q11o52l63n4L24O80R04
$$ -1801 -2001 -2017 -1676 -1053 -260 657 1419 1991 2315 2287 1882 1308 435 -446 -1257 -1909 -2272 -2326 -2002 -1322 -418
3522d18R63Q61P75M39J69k95o19q83r59j168r35o26l30M3N08Q04R60J120J130
$$ -418 545 1406 2181 2620 2789 2494 1875 992 33 -1135 -2070 -2696 -3026 -2983 -2475 -1671 -711 409 1539
3541A539Q37O03K03j80o36q63j237j137j097p82o08j61K95P31R85J174J213J063
$$ 1539 2376 2979 3182 3002 2366 1503 266 -871 -1968 -2750 -3358 -3519 -3224 -2493 -1508 -334 879 1942
3559A942Q47N39J28l86o81j025j127j195j076q14m95l9L90O41J087J171J092J048
$$ 1942 2789 3328 3456 3070 2389 1364 237 -958 -2034 -2848 -3343 -3382 -2992 -2351 -1264 -93 999 2047
3577B047Q29L81Q3k79p23r58j111j124j040p42m81M5K93O67R85J055J087R81O98
$$ 2047 2876 3257 3340 3061 2338 1380 269 -855 -1895 -2637 -3118 -3073 -2780 -2113 -1128 -73 1014 1995 2693
3596B693M12Ol74p49r18j071j037r04o03k69P7M10P75R11R36R39P41L77J63j89
$$ 2693 3105 3111 2737 1988 1070 -1 -1038 -1942 -2545 -2814 -2737 -2327 -1552 -641 295 1234 1975 2352 2515 2326
3616B326n91p17q44r01p78l99l44Q1L59O37O91Q29O51M85K26k1k23m44o65p15
$$ 2326 1735 1018 174 -727 -1505 -1904 -2248 -2167 -1808 -1171 -480 349 1000 1485 1711 1690 1467 1023 358 -357
3636c57n62m47k47m7L38M08N17P73O52M14L55j5k34m33p06o52p00n36m18n2K53
$$ -357 -919 -1366 -1613 -1660 -1322 -914 -397 376 1028 1442 1797 1782 1548 1115 409 -243 -943 -1479 -1897 -1949 -1696
3657a696M15O97P37Q71O47M74K62j10l82p06q37r41q82o93l63p5J53O67Q07R42
$$ -1696 -1281 -584 153 1024 1671 2145 2407 2297 1915 1209 372 -569 -1451 -2144 -2507 -2582 -2429 -1762 -955 -13
3677a3J004Q92O44L43m2l70o55r32j068j064q83p34k41m4N72P14J064J084J098
$$ -13 991 1883 2527 2870 2828 2458 1803 871 -197 -1261 -2144 -2878 -3119 -3163 -2591 -1877 -813 271 1369
3696A369R57O39L34j76m52r55r90j184j102r39p72j81J41O08R59J093J260J113
$$ 1369 2326 2965 3299 3123 2671 1716 726 -458 -1560 -2499 -3271 -3452 -3311 -2703 -1744 -651 609 1722
3714A722R67N30J68k24p26q55j101j157j012p31m46j52L05O59R10J036J043R00
$$ 1722 2689 3219 3387 3163 2437 1582 481 -676 -1688 -2419 -2865 -3017 -2712 -2053 -1143 -107 936 1836
3732A836N90L30K1l35o83o92j014q14p44m62k68J04L23M92P25P97O97N30L46J00
$$ 1836 2426 2756 2777 2442 1759 1067 53 -761 -1505 -1967 -2235 -2131 -1808 -1316 -591 206 903 1433 1779 1879
3752A879j13l95n09o19o44n74k85k64M9J51M04N21M43L86L89K62N1k00k17l58
$$ 1879 1766 1371 862 243 -401 -975 -1260 -1524 -1475 -1324 -920 -399 44 430 819 1081 1132 932 715 357
3772C57m24l66l77j68l6R9K91L42M01L33L48J96M5o5k82l65l73m47m38k88r6J02
$$ 357 -67 -433 -810 -978 -1014 -915 -624 -282 119 452 800 996 1041 976 694 329 -44 -491 -929 -1217 -1313 -1211
3794a211K16M34N18O01N46M04K49jj77l44o16o47p30o27m62k92Q1L15N79P76P96
$$ -1211 -995 -561 -43 558 1104 1508 1757 1756 1579 1235 619 -28 -758 -1385 -1847 -2139 -2058 -1743 -1164 -388 408
3815D08Q74O99M39K68k17m78p52r24r78r59p04n20n2K90M96R59J018J059R11P56
$$ 408 1282 1981 2420 2688 2471 1993 1241 317 -661 -1620 -2324 -2844 -2896 -2606 -2110 -1151 -133 926 1837 2593
3835B593M09m8l18p22r47j157j064q66p21l10N0M75Q31R11J083J078R11N90K16
$$ 2593 3002 2954 2636 1914 967 -190 -1254 -2120 -2841 -3151 -3101 -2626 -1795 -884 199 1277 2188 2778 2994
3854B994m1n25q38q89j068r42p98n25j15K13M55Q23Q34Q92Q69N85M18P2j24m91
$$ 2994 2953 2428 1590 701 -367 -1309 -2107 -2632 -2747 -2534 -2079 -1256 -422 470 1339 1924 2342 2414 2290 1799
3874A799o37p91p16o95m54l11j20K43L98N45N39O14N33L20K00P0j54l73m61m79
$$ 1799 1162 371 -345 -1040 -1494 -1805 -1925 -1682 -1284 -739 -200 414 947 1267 1467 1537 1383 1010 549 70
3894G0m94m43j58p8L6J71K79M51L25L68J98J33q8r0k63k88l00l18k25k0j5J31
$$ 70 -424 -867 -1025 -1103 -1067 -896 -617 -166 159 527 725 858 770 680 417 129 -171 -489 -714 -734 -749 -618
3916f18J88L20L55L09J36J19r1j64k63l33l77l59k75k0N7J86L41M68N49L46L69
$$ -618 -430 -110 245 554 690 809 718 554 291 -42 -419 -778 -1053 -1073 -1016 -830 -489 -21 528 874 1243
3937A243K22%j53l83m46n58o44n02l94j95J02K61N06O52P35O58O61M34J04q4m30
$$ 1243 1465 1465 1312 929 483 -75 -719 -1221 -1615 -1810 -1708 -1447 -941 -289 446 1104 1765 2199 2303 2219 1789
3958A789o76q08q01q18o17m79j33K09N05P15R09R17Q22N31L95J62k85n45p29q69
$$ 1789 1113 305 -496 -1314 -1931 -2410 -2543 -2334 -1829 -1114 -205 712 1534 2065 2460 2622 2337 1792 1063 194
3978A94r31p81o60l52m7K24M81Q21Q47Q55P58O63L74L1k38m51p69p99r05p26o14
$$ 194 -737 -1518 -2178 -2530 -2577 -2353 -1872 -1051 -204 651 1409 2072 2446 2477 2239 1788 1019 220 -685 -1411 -2025
3999b025l44n0K73M91O48Q41P25P84N63L34L7k40m78o37o96p87o53m75k22%K88
$$ -2025 -2369 -2419 -2146 -1655 -1007 -166 559 1343 1906 2240 2277 2037 1559 922 226 -561 -1214 -1689 -1911 -1911 -1623
4020a623M08O21O01O24N50L44J07r1k44l58m79n26n22l06k51l2J54K88L50L46
$$ -1623 -1215 -594 7 631 1181 1525 1632 1541 1297 939 460 -66 -588 -894 -1145 -1177 -1023 -735 -385 -39
4040c9L45K96K11l7j09j90j84m27k38k08j36l8J73K73K55L20K57K19M6j09k12
$$ -39 306 602 813 776 667 477 293 -134 -372 -580 -716 -754 -581 -308 -53 267 524 743 789 680 468
4061D68k84l68m42l13o5r0J32K62M14L66N05M53K58J11r6j78m20n92n38m70m02
$$ 468 184 -184 -626 -939 -1004 -1094 -962 -700 -286 80 585 1038 1296 1407 1311 1133 713 121 -417 -887 -1289
4082a289k77m5J53L69M67N45P46M60M81K62J0j11l76n54o37p23o52m79l02p9J43
$$ -1289 -1566 -1611 -1458 -1089 -622 -77 669 1129 1610 1872 1882 1771 1395 841 204 -519 -1171 -1650 -1952 -2031 -1888
4103a888M74N03P95O10P11O42L01J26k02l58n96p37q17p61o28l78j38J20L72O00
$$ -1888 -1414 -911 -116 494 1205 1847 2148 2274 2072 1714 1118 381 -436 -1197 -1825 -2203 -2341 -2221 -1849 -1249
4123a249P50Q64P61O19M15K47j34m65n61p96q36q08n47m42j84R3M06O68P45P75
$$ -1249 -499 365 1126 1745 2160 2407 2273 1808 1247 451 -385 -1193 -1740 -2182 -2366 -2273 -1867 -1199 -454 321
4143C21P67O21M16Q9j03l85o12q02o48p19n62k35q9J79M17N56O33O59N74M27K13
$$ 321 1088 1709 2125 2214 2111 1726 1114 312 -336 -1055 -1617 -1852 -1941 -1762 -1345 -789 -156 503 1077 1504 1717
4164A717k8k42l86m82n15o11l71j77j08R2K17M04L60L72L14K49J06n6k50k24l56
$$ 1717 1689 1447 1061 579 64 -547 -918 -1095 -1203 -1111 -894 -490 -130 242 556 805 911 855 605 381 25
4185B5l06j26j60j0M4J98K16K41K92K15nk1k17k08l06k62l42j67m1M9J84L35L58
$$ 25 -281 -407 -567 -577 -533 -335 -119 122 414 629 624 603 386 178 -128 -390 -732 -899 -940 -891 -707 -372 -14
4208a4M51K65L95J62L1j74l99m15m92n23m48k75j41L9K47M17N84O31N46N18L34
$$ -14 437 702 1097 1259 1290 1116 717 302 -190 -713 -1161 -1436 -1577 -1538 -1291 -874 -290 341 887 1405 1739
4229A739J70j8l40m98n94o88p11o12l01k39J78K96N04P46P38Q33N42M37K03k07
$$ 1739 1909 1891 1551 1053 459 -229 -940 -1552 -1853 -2092 -1914 -1618 -1114 -368 370 1203 1745 2182 2385 2178
4249B178k73o08p79q41q01o69m33j93J55L97N77P16Q92Q13O44M44J72j83l72o08
$$ 2178 1905 1297 518 -323 -1124 -1793 -2226 -2419 -2264 -1867 -1290 -574 318 1131 1775 2219 2391 2208 1836 1228
4269A228p36q29p02o98n06n5J49L18N99P27P92O49N90L51J55r9m28m29o65o78
$$ 1228 492 -337 -1039 -1737 -2243 -2298 -2149 -1831 -1232 -505 287 936 1526 1877 2032 1933 1505 1076 411 -267
4289b67n50m17k99j99J30L39L77O30N22M59L50K72Kj20j98l66m25m85k86k96j67
$$ -267 -817 -1234 -1533 -1732 -1602 -1263 -886 -256 266 725 1075 1347 1349 1229 1031 665 240 -245 -531 -827 -994
4310i94Q5J39J82L49L33K77J60J64K8j29j34k48j95k29j65p3O6N8J92K24K12J84
$$ -994 -909 -770 -588 -239 94 371 531 695 723 594 460 212 17 -212 -377 -450 -384 -326 -134 90 302 486
4332D86LM2qk41k00l65j84k37j59rN9K54L16L92M30L18K82O7k5k39l36m73n51
$$ 486 489 531 523 282 82 -283 -467 -704 -863 -872 -813 -559 -243 149 579 897 1179 1246 1221 982 646 173 -378
4355c78n59m28l39q6J55L44N50P08O87O40N46K64N5k17m78n97q91p79p24n36k07
$$ -378 -937 -1365 -1704 -1790 -1635 -1291 -741 -33 654 1294 1840 2104 2159 1942 1464 867 -24 -803 -1527 -2063 -2270
4376b270j6L20N38P56Q28Q40P50M77K44Rl05o68p88q25r13o76m82k08N9L03O06
$$ -2270 -2286 -1966 -1428 -672 156 996 1746 2223 2467 2476 2171 1503 715 -110 -1023 -1699 -2181 -2389 -2330 -2027 -1421
4397a421Q24P97P89O71N28K22j06l68n41p29q50p19n57m14k55O5L04M30O33O96
$$ -1421 -597 200 989 1660 2188 2410 2304 1936 1395 666 -184 -903 -1460 -1874 -2129 -2064 -1760 -1330 -697 -1
4417aO57N71L65K82o9k59m61n32n60n25m97l18j49k5J46L32M72M72M75L64K87
$$ -1 656 1227 1592 1874 1805 1546 1085 553 -7 -532 -1029 -1347 -1496 -1521 -1375 -1043 -571 -99 376 740 1027
4438A027K27l0k51j72l02l95m22k12j87j26O6J02L07K28K51K92J13J36k9j11k04
$$ 1027 1254 1224 973 801 499 104 -318 -530 -717 -843 -777 -675 -368 -140 111 403 516 652 623 512 308
4459C08k28j63k03l3j36R7J98J94J59K01J89N2o1j17k60l01l07k67k39m9N9J78
$$ 308 80 -83 -286 -319 -455 -358 -160 34 193 394 583 635 574 457 197 -104 -411 -678 -917 -966 -907 -729
4481g29L90M33M00L64L29J35j5j45l71m98n80n10m92l28j19R4L05M23O12P30O12
$$ -729 -339 94 494 858 1187 1322 1307 1162 791 293 -287 -797 -1289 -1617 -1736 -1642 -1337 -914 -302 428 1040
4502A040N57K90J53j00m02n45p30q21o42o27l22j18K09M00O16P84P68P76N64L77
$$ 1040 1597 1887 2040 1940 1538 993 263 -558 -1200 -1827 -2149 -2267 -2058 -1658 -1042 -258 510 1286 1850 2227
4522B227J52k18m29o63p46p99o99n38m17j03J97M22N95P10P34P85M63L92Q0q3
$$ 2227 2379 2161 1732 1069 323 -476 -1175 -1713 -2130 -2233 -2036 -1614 -1019 -309 425 1210 1673 2065 2145 2062
4542B062l98n70p01o85o94n04l24r8R0L25N62N76O14N74N17K52N7j28k71m54n81
$$ 2062 1664 1094 393 -292 -986 -1490 -1814 -1912 -1822 -1497 -935 -359 255 829 1346 1598 1655 1527 1256 802 221
4563B21m60n50l87j64r9J69K69L71M07M55L06L05J56L7j30k78k39l12l07j89j65
$$ 221 -239 -789 -1176 -1340 -1439 -1270 -1001 -630 -223 232 538 843 999 1036 906 628 389 77 -230 -419 -584
4584e84l5P9J14J70K06J77K07K8K5o5j21j74j17r2j67pJ15J86J84K16K02J21j4
$$ -584 -619 -540 -426 -256 -50 127 334 362 387 322 201 27 -90 -182 -349 -356 -241 -55 129 345 547 668 654
4607F54m4q7l25k60k73l23k10k4j8J56K30M12L75M01L46J92J19j31j55l86m41
$$ 654 610 523 198 -62 -335 -658 -868 -892 -910 -754 -524 -112 263 664 1010 1202 1321 1190 1035 649 208
4628B08m90m80l29l02j14J9K76L99N77M98N01N44L08Q7j01k16m54n27o50o16m53
$$ 208 -282 -762 -1091 -1393 -1507 -1488 -1212 -813 -236 262 763 1307 1615 1702 1601 1385 931 404 -246 -862 -1315
4649a315m33j81M2K92M65N56P03P01N53M25K81k6l02m46p23o16p03n80m78k17
$$ -1315 -1748 -1929 -1887 -1595 -1130 -574 129 830 1383 1808 2089 2063 1761 1315 592 -24 -727 -1307 -1785 -2002
4669b002l0K21N70N79P33O27O64M74K12n5k75m41n83o60p30m56m06k50M6K63M09
$$ -2002 -2032 -1811 -1241 -662 71 698 1362 1836 2048 1993 1718 1277 694 34 -696 -1152 -1558 -1808 -1762 -1499 -1090
4690a090N13O03O09L81M01J24Jk67l64m43n27n14l15k25q2L1L39K89L61L04K73
$$ -1090 -577 26 635 1016 1417 1541 1542 1275 911 468 -59 -573 -888 -1113 -1195 -1164 -825 -536 -175 129 402
4711D02K89P6J7j03j29k84l03j63r7p4o3J05O7J67J26J07L9Lq9r2Jj95j07Q3l8
$$ 402 691 767 784 681 552 268 -35 -198 -295 -369 -432 -327 -260 -93 33 140 179 182 93 1 2 -193 -300 -217 -255
4736b55J03J07J78K24J54J03jJm9k31k81k42k51j61j55j19M4K36K30K87L66L10
$$ -255 -152 -45 133 357 511 614 613 614 565 334 53 -189 -440 -601 -756 -875 -831 -595 -365 -78 288 598
4758E98L30K45L5j9k56k89n02m31m05l55k65j55J49J22L38M77N02N35M75K33K59
$$ 598 928 1173 1208 1189 933 644 142 -289 -694 -1049 -1314 -1469 -1320 -1198 -860 -383 119 654 1129 1362 1621
4779A621m4k16l34n33n24o31m87l78j77pJ96L46N54O19O06N24M43K94o6j18m01
$$ 1621 1577 1361 1027 494 -30 -661 -1148 -1526 -1703 -1710 -1514 -1168 -614 5 611 1135 1578 1872 1806 1688 1287
4800A287n26p05o01n39m25l27j5K34L32O11N70O70M85M59K32J7j27l67m78n25
$$ 1287 761 56 -545 -1084 -1509 -1836 -1851 -1617 -1285 -674 -104 566 1051 1510 1742 1759 1632 1265 787 262
4820B62o03n03m71j21n7J44L05M34M51M88M55L18J81J0q8k47k74m53m08l19k71
$$ 262 -341 -844 -1315 -1436 -1493 -1349 -1044 -610 -159 329 784 1102 1283 1293 1205 958 684 231 -177 -496 -767
4841g67j50m6Q6J90K35K65K39L05J55J25l4j06r7j44j75j97l3j08l7O1P0N7R1
$$ -767 -917 -963 -877 -687 -452 -187 52 357 512 637 603 497 400 256 81 -116 -149 -257 -294 -233 -163 -106 -15
4864a5J3%L1J4m9j53j3MqJ6M1J62J29K01N6J23Rm1j21k19k48k47j67k37j34J3
$$ -15 -2 -2 29 43 -6 -159 -172 -168 -176 -160 -119 43 172 373 429 552 561 520 399 180 -68 -315 -482 -719 -853 -840
4890h40J50J83K37M24L69L54J54K09j3j51k85l53n20m38m60l69q9o4K31L23M28
$$ -840 -690 -507 -270 154 523 877 1031 1240 1227 1076 791 438 -82 -520 -980 -1349 -1438 -1502 -1271 -948 -520
4911e20N68N79N48L41J43j3j51l89n49n96n78n25m05k01J3K29L29N84N53O51M95
$$ -520 48 627 1175 1516 1659 1646 1495 1106 557 -39 -617 -1142 -1547 -1748 -1735 -1506 -1177 -593 -40 611 1106
4932A106L98K23Q2k24l72n13o16n70n64l48k67o6J61L18M85N32N99N25L30K19
$$ 1106 1504 1727 1809 1585 1213 700 84 -486 -1050 -1398 -1665 -1731 -1570 -1252 -767 -235 364 889 1219 1438
4952A438J00n4k57l57n18n06m19m03k75j07O3K28K58M64M29M36L64K31J16kj63
$$ 1438 1538 1484 1227 870 352 -154 -573 -976 -1251 -1358 -1295 -1067 -809 -345 84 520 884 1115 1231 1229 1066
4973A066k37l35m07l85k99k35j33m3J83O8L12L21L08K13K06J74k2m9j88j33k97
$$ 1066 829 494 87 -298 -597 -832 -965 -1008 -825 -757 -445 -124 184 397 603 777 755 706 518 385 88
4994H8j48k06q6p3J9N0Q6J46R7Q6L0L5j5p0n0j6j03K7J14Q5L8Q1J73N4p0k0q7
$$ 88 -60 -266 -352 -425 -406 -356 -270 -124 -27 59 89 124 109 39 -11 -27 -130 -103 11 96 134 215 388 442 372 352 265
5021B65j99k29k58j83j65k0KJ44K55L88L14L50L30J59Kp4j76m08m07m55l88l84
$$ 265 66 -163 -421 -604 -769 -789 -787 -643 -388 0 314 664 994 1153 1155 1081 905 497 90 -365 -753 -1137
5043a137k51J2J34K73L92N35N31M85M20J93M1q0l99m80m81o42n59l92k76r0J84
$$ -1137 -1388 -1376 -1242 -969 -577 -42 489 974 1394 1587 1628 1548 1149 669 188 -454 -1013 -1405 -1681 -1771 -1587
5064a587K35N41N64O25M92N23K89O9m8l43m20o03n67n80m60k94j73R9K21M22N16
$$ -1587 -1352 -811 -247 378 870 1393 1682 1751 1703 1360 940 337 -230 -810 -1270 -1564 -1737 -1638 -1417 -995 -479
5085d79N95N03N39M09J58j4k52l26m97n94m67m66l66l53R9J67L15M04M75N66M16
$$ -479 116 619 1158 1567 1725 1711 1459 1133 636 42 -425 -891 -1257 -1610 -1511 -1344 -1029 -625 -150 416 832
5106H32K88K76K2j75k13l98l85m48m68k08j19j11N7K66L01L12K95L16K21K26n
$$ 832 1120 1396 1418 1243 1030 632 247 -201 -669 -877 -996 -1107 -1050 -784 -483 -171 124 440 661 887 882
5127H82o9j41k42k04k43j62k08p8J8K7L1J55J05J54M5P1mj8m9k3k4m2M8jR0Q1
$$ 882 813 672 430 226 -17 -179 -387 -465 -447 -420 -389 -234 -129 25 70 141 137 119 70 47 23 -19 29 28 118 199
5153A99N9J9L0q3o4j89j50j67j42n4%QN2K14K43K72K68J64K09J27r8r8k82l90
$$ 199 258 277 307 224 160 -29 -179 -346 -488 -542 -542 -534 -482 -268 -25 247 515 679 888 1015 917 819 537 147
5177A47l25l63k60k41j46J6J62L09L63M54M60M13K65K32qj75k99m10n12o04m54
$$ 147 -178 -541 -801 -1042 -1188 -1172 -1010 -701 -338 116 576 989 1254 1486 1478 1303 1004 594 82 -522 -976
5198i76m24j95k4J18L63M67N74N45N89M52L05Pq5l71n32o11o71n18n46k50r7K01
$$ -976 -1400 -1595 -1619 -1501 -1138 -671 -97 448 1037 1489 1794 1801 1716 1345 813 202 -469 -987 -1533 -1783 -1880 -1679
5220a679L05M62O42O46O47L59L11J81n7l83n49n42n98n28m94k25j62P3L27M38
$$ -1679 -1374 -912 -270 376 1023 1382 1693 1874 1817 1434 885 343 -255 -783 -1277 -1502 -1664 -1591 -1264 -826
5240h26M22N50N50M15K48J54j28k16l05m19m92l78l80k80rR9J10K03L43L48K61
$$ -826 -404 146 696 1111 1359 1513 1385 1169 864 445 -47 -425 -805 -1085 -1094 -995 -885 -682 -339 9 270
5261B70J94K92L4Rq7j49k03k23k00j29j28o5n2N6L0Q1M2P0O9J15K2J26j7k5M2
$$ 270 464 756 790 799 712 563 360 137 -63 -192 -320 -385 -437 -381 -351 -270 -228 -158 -89 26 48 174 157 132 174
5286A74P5J5p1Q0p2J8j05o2q9j04j19l0j04n1l1M6Q4J89J18K39J52J98J59L7Q2
$$ 174 249 264 193 273 201 219 114 52 -37 -141 -260 -290 -394 -445 -476 -430 -346 -157 -39 200 352 550 709 746 828
5311H28j48k30j65l03m10l08j37j37j5L9K08L44M08L67M68K95J35J47r8k25m07
$$ 828 680 450 285 -18 -428 -736 -873 -1010 -1025 -986 -778 -434 -26 341 809 1104 1239 1386 1288 1063 656
5332F56m54m46m40m61k32j25P6K61L36N53N52M85N10K98J66o5k96l99m65o97n65
$$ 656 202 -244 -684 -1145 -1377 -1502 -1426 -1165 -829 -276 276 761 1271 1569 1735 1670 1374 975 510 -187 -752
5353g52m61l19j25J0K13M02N31N65O15M21L58J92l1k30m14n02n55m98m64k73j23
$$ -752 -1213 -1532 -1657 -1647 -1434 -1032 -501 64 679 1100 1458 1650 1619 1389 975 473 -82 -580 -1044 -1317 -1440
5374a440qJ62L20M04N32L93M29L30J75k9n9k82l20m35l97k58l10j67m2M7J76K09
$$ -1440 -1448 -1286 -966 -562 -30 363 792 1122 1297 1268 1209 927 607 172 -225 -483 -793 -960 -1002 -955 -779 -570
5396e70K97K86K84K57J89P6m5j29j78j29k44j85j55q9j38N0m3J55O4R8K1J58R7
$$ -570 -273 13 297 554 743 819 774 645 467 338 94 -91 -246 -335 -473 -423 -466 -311 -247 -149 -128 30 127
5419A27N4K3K7J3j4J0nOn9k4j7l4q0j17r0j13r8n1J1r1J51K09J18J37J97K09J35
$$ 127 181 204 231 244 230 240 235 241 182 158 141 107 27 -90 -180 -293 -391 -442 -431 -522 -371 -162 -44 93 290 499 634
5446F34J25k5q0j91k35l17k48k86k16j69l2J54K79L08L72K99L70K42K07N8r8k44
$$ 634 759 734 654 463 228 -89 -337 -623 -839 -1008 -1040 -886 -607 -299 73 372 742 984 1191 1249 1151 907
5468I07k57m11m81m35l18k13j14J55Q4L94M50L74M82L93K13J70k4k11l02m64l62
$$ 907 650 239 -242 -677 -995 -1208 -1322 -1167 -1083 -689 -239 135 617 1010 1223 1393 1369 1158 856 392 30
5489C0m98m34k47k13J1P5K66M29M37M73L65L88K40K6k9j89l65m37m61m11l66l27
$$ 30 -468 -902 -1149 -1362 -1351 -1276 -1010 -581 -144 329 694 1082 1322 1348 1319 1130 765 328 -133 -544 -910 -1237
5511a237m9m2K47K89L88M09L57M26K98R5J9p1k66l23l28m32m50j67k27mL5K13
$$ -1237 -1286 -1328 -1081 -792 -404 5 362 788 1086 1181 1200 1129 863 540 212 -220 -670 -837 -1064 -1068 -1033 -820
5533h20K66L00L67L66K25J62Mrj71j74k42k33k19k28j28oj9JR9J71J97L4J54J17
$$ -820 -554 -254 113 479 704 866 870 861 690 516 274 41 -178 -406 -534 -540 -559 -558 -459 -288 -91 -57 97 214
5557B14L9P0N1p6Op9Q4jm1j17p1j25j11j31j28k5o6k9J24J45J59J24K32J54K31
$$ 214 253 323 374 298 304 225 309 308 267 150 79 -46 -157 -288 -416 -441 -507 -536 -412 -267 -108 16 248 402 633
5582F33M9P6r3j11k40k07l25k48k29j74J3RJ33J64L18L39L44K73K29O6J5j03j63
$$ 633 682 758 665 554 314 107 -218 -466 -695 -869 -856 -847 -714 -550 -232 107 451 724 953 1019 1034 931 768
5605G68l34l20m14k81l40r5r0R5J44K20L80M81L51K37K42J41J6j09k27l79m04
$$ 768 434 114 -300 -581 -921 -1016 -1106 -1011 -867 -647 -267 214 565 802 1044 1185 1201 1092 865 486 82
5626H2m65l32k96j65LN6J66L21L35M14M49L53K52J72m8j71l33l09l86m92m11l16
$$ 82 -383 -715 -1011 -1176 -1173 -1117 -951 -630 -295 119 568 921 1173 1345 1297 1126 793 484 98 -394 -805 -1121
5648a121j30j6K6L60K97M19L68M79L00J30J54o2k05l65l70l45m46k52k54q0M5
$$ -1121 -1251 -1267 -1241 -881 -584 -165 203 682 982 1112 1266 1204 999 634 264 -81 -527 -779 -1033 -1113 -1068
5669a068K02J74K96L74L24L22K21R4j9n5j71k15k75k34k26j65j98o0N9P6P2R7
$$ -1068 -866 -692 -396 -22 302 624 845 939 920 865 694 479 204 -30 -256 -421 -619 -679 -620 -544 -472 -375
5691c75K79J59Q4K46J42M0Km8j10j15r6k06p2j78j04r6j1M4n7Q5J21P0J31J97
$$ -375 -96 63 147 393 535 575 577 529 419 304 208 2 -70 -248 -352 -448 -459 -415 -472 -387 -266 -196 -65 132
5715A32J76M3J14P6R1p1o1j05j71k43j71j55j73j40j05Q3N2K08J98K58K30K56
$$ 132 308 351 465 541 632 561 500 395 224 -19 -190 -345 -518 -658 -763 -680 -628 -420 -222 36 266 522
5737E22J84J77M6q0r7k48l29k59l66k68k19r1l2R6K78K68L50M54L52L20J48R9
$$ 522 706 883 929 849 752 504 175 -84 -450 -718 -937 -1028 -1060 -964 -686 -418 -68 386 738 1058 1206 1305
5759A305j03k18l52m15m29l91l40l20j08J03J44L90M05M40M42M35K89Q6K0j92
$$ 1305 1202 984 632 217 -212 -603 -943 -1263 -1371 -1268 -1124 -734 -329 111 553 988 1277 1363 1383 1191
5779A191k28m91m42m24m16l30j49l3J11K00L57L73M62L99L40K23J04k9k10k17
$$ 1191 963 472 30 -394 -810 -1140 -1289 -1322 -1211 -1011 -654 -281 181 580 920 1143 1247 1218 1008 791
5799G91m28l69l38l47j76j65KP5K17K18K96M07K81K06J65J31j2j08k05j98l78
$$ 791 363 -6 -344 -691 -867 -1032 -1030 -955 -738 -520 -224 183 464 670 835 966 954 846 641 443 65
5820F5k10l55j37q8j11J08R1J93J77K77K22J82J23J15K7l1r5j99j66j82j68j33
$$ 65 -145 -500 -637 -725 -836 -728 -637 -444 -267 10 232 414 537 652 679 648 553 354 188 6 -162 -295
5842b95j63J2l9L8R5N0J16J36Q4J38L2R3R8O0OJ5r0k5j66q3j25k05k28j83k9j6
$$ -295 -458 -446 -485 -447 -352 -302 -186 -50 34 172 204 297 395 455 461 476 386 361 195 112 -13 -218 -446 -629 -658 -674
5868f74kJ08J86J75K97K14L07J73J05O2o8k00k40l05l65l36l25k07j00O4J21L96
$$ -674 -676 -568 -382 -207 90 304 611 784 889 951 883 683 443 138 -227 -563 -888 -1095 -1195 -1131 -1010 -614
5890f14L62M24M33L70K25J29J4j84k87m06m92m59m03l36k42L6K16K65M12M79M62
$$ -614 -252 172 605 975 1200 1329 1343 1159 872 466 -26 -485 -888 -1224 -1466 -1430 -1214 -949 -537 -58 404
5911D04M79L36J95N4j36k53l51m11n50m86k90k48j13O5J90L31L40M52M12M15K87
$$ 404 883 1219 1414 1468 1332 1079 728 317 -233 -719 -1009 -1257 -1370 -1305 -1115 -784 -444 8 420 835 1122
5932A122J98M5j99j70m04l52n13l50l29k19p9J0J90L58L63M10L59L67J96P2K0
$$ 1122 1320 1365 1166 996 592 240 -273 -623 -952 -1171 -1250 -1240 -1050 -692 -329 81 440 807 1003 1075 1095
5953A095p2k29l09l50l57l07j53j91L3J4J89J79K34K49K44J96J32M0N4l3j74j11
$$ 1095 1023 794 485 135 -222 -529 -682 -873 -840 -826 -637 -458 -224 25 269 465 597 637 691 658 484 373
5975C73j07k41j39j56r7o7L8m4L7J59K4J22J08J09J48O4Q3L6K8J2n2r8j17j75
$$ 373 266 25 -114 -270 -367 -434 -396 -440 -403 -244 -220 -98 10 119 267 331 414 450 478 490 438 340 223 48
5999D8k09j66o1j65o8k5%J54J23J78K92J68L17J92K4Q5j00j64k07l07k76l51k46
$$ 48 -161 -327 -388 -553 -621 -646 -646 -492 -369 -191 101 269 586 778 802 887 787 623 416 109 -167 -518 -764
6022g64j54r9P5J12K25L37L29L57L51L37R4J6j35k41l27l46m94l67k58k80j11
$$ -764 -918 -1017 -942 -830 -605 -268 61 418 769 1106 1200 1216 1081 840 513 167 -327 -694 -952 -1232 -1343
6043a343J20K09K89L97M35M50L84L32M2M2r3l85l60l52n74m72k47k45n5J43K80
$$ -1343 -1223 -1014 -725 -328 107 557 941 1273 1315 1357 1264 879 519 167 -407 -879 -1126 -1371 -1426 -1283 -1003
6064a003L63N10M54M23L46K85K9k4k55l65m66m10m81l07l21o1L3J77K85L47M53
$$ -1003 -640 -130 324 747 1093 1378 1407 1383 1128 763 297 -113 -594 -901 -1222 -1283 -1250 -1073 -788 -441 12
6085A2M63K48K70J27po5k86k42l99k74l85j78j13m9L9J66K00J96K52K98R1J89
$$ 12 475 723 993 1120 1113 1048 762 520 121 -153 -538 -716 -829 -878 -839 -673 -473 -277 -25 273 364 553
6107E53J19M2o0k5j98j57j97j31k24r6p4l1j8PJ32N8J50P9J72R6J41J37O7L1n4
$$ 553 672 714 654 629 431 274 77 -54 -278 -374 -448 -479 -497 -490 -358 -300 -150 -71 101 197 338 475 542 573 519
6132E19p9r5j67j89q9k14j57o9l7qj2K38K01R3K29J89K56L7R5j9r1j43k72j83
$$ 519 440 345 178 -11 -100 -314 -471 -540 -577 -585 -597 -359 -158 -65 164 353 609 646 741 722 631 488 216 33
6156C3k06k44k38j36l2P7j0K15L06K15L05L14K50J18M2j7j49l17k89l23l73k85
$$ 33 -173 -417 -655 -791 -823 -746 -756 -541 -235 -20 285 599 849 967 1009 992 843 526 237 -86 -459 -744
6178g44k38j25rP0L18L54L13M00L99L63K08Kp3j71m08m04m58m72l29k43q8PK34
$$ -744 -982 -1107 -1116 -1046 -728 -374 -61 339 738 1101 1309 1311 1238 1067 659 255 -203 -675 -1004 -1247 -1335 -1328 -1094
6201a094K55M57N43M16L34L25J54o0k05k32m08m19m43l88k95j68j06J41K56K96
$$ -1094 -839 -382 161 577 911 1236 1390 1330 1125 893 485 66 -377 -765 -1060 -1228 -1334 -1193 -937 -641
6221f41M52M59L03L47J94R5n9j75k83l11l14m26k09k69j71QP6J86K24L40L18L22
$$ -641 -189 270 573 920 1114 1209 1150 975 692 381 67 -359 -568 -837 -1008 -1000 -924 -738 -514 -174 144 466
6243D66K23J61M0P0j01k31l08j50l19k63j72j34o8L6R9J94J35K18K79K21J27R0
$$ 466 689 850 890 960 859 628 320 170 -149 -412 -584 -718 -786 -750 -651 -457 -322 -104 175 396 523 613
6265F13pR1n2j15k87j04j88j60j74p1n8r0O6J09J79P9J89K10J39J39P0P1r0l6
$$ 613 606 697 645 530 243 139 -49 -209 -383 -454 -512 -602 -536 -427 -248 -169 20 230 369 508 578 649 559 523
6289E23j12j33k11j63k37j27r9j44j7P0J27J80K03K57K74J48J50J19P0j63j21
$$ 523 411 278 67 -96 -333 -460 -559 -703 -720 -650 -523 -343 -140 117 391 539 689 808 878 715 594
6310E94j86k88k56k72l01j47j00L8J94J68K43M17K68L03K53Q4Kqk24k73l31l61
$$ 594 408 120 -136 -408 -709 -856 -956 -918 -724 -556 -313 104 372 675 928 1012 1014 1006 782 509 178 -183
6332a83l36k93n6j60m5J95K26K31M20L11L18K64J60pl6j11l45k98l45l15l58k50
$$ -183 -519 -812 -868 -1028 -1073 -878 -652 -421 -1 310 628 892 1052 1045 1009 898 553 255 -90 -405 -763 -1013
6354a013p4k2J66J75L47L58L73L42K71J82K0nj44l02m46k80l88k95k58j17kJ23
$$ -1013 -1087 -1109 -943 -768 -421 -63 310 652 923 1105 1125 1120 976 674 228 -52 -440 -735 -993 -1110 -1112 -989
6376i89K16L05L35M03L30K19J87N8r6k36k04l01l46k95k01k24j1n6J22K17K09
$$ -989 -773 -468 -133 270 600 819 1006 1064 968 732 528 227 -119 -414 -615 -839 -850 -906 -784 -567 -358
6397c58K81K72K13J83J42N8p9j39k9k50k26k39j85r6j25k5M8JQ8J67J20K13J29
$$ -358 -77 195 408 591 733 791 712 573 544 294 68 -171 -356 -452 -577 -602 -554 -553 -465 -298 -178 35 164
6420A64K37J23M1N3rq1r1k34j48k00j43k21j26m3J1L3K33J40K85K21J80J38K05
$$ 164 401 524 565 618 609 528 437 203 55 -145 -288 -509 -635 -678 -667 -634 -401 -261 24 245 425 563 768
6443G68j0q6k8k22j56k49j78l07k32l4o4N9J14J95K34K03K64K46J81J18N9j24
$$ 768 758 672 644 422 266 17 -161 -468 -700 -734 -798 -739 -625 -430 -196 7 271 517 698 816 875 751
6465G51o5k49k72k08k37k90j97m6r3L4J76K66L26K96K98K61J57J19L2j06k17k88
$$ 751 686 437 165 -43 -280 -570 -767 -813 -906 -872 -696 -430 -104 192 490 751 908 1027 1059 953 736 448
6487D48l72l22l11k90k32J2O7J14L72L01L80M04K67K60N6N7k05j90m26m13l67
$$ 448 76 -246 -557 -847 -1079 -1067 -1000 -886 -514 -213 167 571 838 1098 1154 1211 1006 816 390 -23 -390
6508c90l21k50j51q3J32J88L40L58L58M04K31J66N8j4j24k65k76l49l52k88k24
$$ -390 -711 -961 -1112 -1195 -1063 -875 -535 -177 181 585 816 982 1040 1026 902 637 361 12 -340 -628 -852
6529h52j52nJ33J78K51L27K80K72K39K05M3m8j20j40k64k29l00k16k37m5j02R4
$$ -852 -1004 -1009 -876 -698 -447 -120 160 432 671 876 919 871 751 611 347 118 -182 -398 -635 -680 -782 -688
6551f88kK93J18K19K40L08J04Q7K7ko0j90j38k51k06k27p8j67m1O1P0J00K19J43
$$ -688 -690 -397 -279 -60 180 488 592 679 706 704 644 454 316 65 -141 -368 -446 -613 -654 -593 -523 -423 -204 -61
6575f1K16J84R6N7K20k6j11n3j97k00j90j63j73j09j18m2M5Q0J66J87J65K94J66
$$ -61 155 339 435 492 712 686 575 522 325 125 -65 -228 -401 -510 -628 -670 -625 -545 -379 -192 -27 267 433
6598D33K67N1L4m8r9j61k50k19l00k35k52j16nJ13J22K43K62L71L05K99J50J06
$$ 433 700 751 785 737 638 477 227 8 -292 -527 -779 -895 -900 -787 -665 -422 -160 211 516 815 965 1071
6620A071j04j21j94k48l75l40l47k22j46j7P2K21K97K78L76L09L43J48L4%j13
$$ 1071 967 846 652 404 29 -311 -658 -880 -1026 -1043 -971 -750 -453 -175 201 510 853 1001 1035 1035 922
6641I22k08l90l17k84l76k21j64j3J36J38K60L37L32L58K61J54J04k3r2k84j41
$$ 922 714 324 7 -277 -653 -874 -1038 -1051 -915 -777 -517 -180 152 510 771 925 1029 1006 914 630 489
6662D89l87l40k55k62j54l2J1J60J71L19L23L49K08K03J62j1j01j61k70k91k88
$$ 489 102 -238 -493 -755 -909 -941 -930 -770 -599 -280 43 392 600 803 965 954 853 692 422 131 -157
6683a57l32j49j58m5k6K04J64K48K75K68K33R9J74K0j45r5j85r3l41j48j53j45
$$ -157 -489 -638 -796 -841 -867 -663 -499 -251 24 292 525 624 798 818 673 578 393 300 -41 -189 -342 -487
6705d87q9J0N0L4J34J42J88O9K68J01O1P6n2kk0j54j99j18j57j79r7j68m8JO2
$$ -487 -576 -566 -516 -482 -348 -206 -18 51 319 420 481 557 505 503 483 329 130 12 -145 -324 -421 -589 -637 -636 -574
6730e74J58J78J50L00K41J35J66K9K2j15j41k34l00l08k29k24j21n9L7J61K44
$$ -574 -416 -238 -88 212 453 588 754 783 805 690 549 315 15 -293 -522 -746 -867 -926 -889 -728 -484
6751d84L53J84L99K60J74J25l4p1j93k76m04l24k40l73j22n4P4K13K22L06L80
$$ -484 -131 53 452 712 886 1011 977 906 713 437 33 -291 -531 -904 -1026 -1080 -1006 -793 -571 -265 115
6772A15L56L32K37J16m6p9k11k70m67l62l58k30j92p8Q6K19K00L59M41K61L56
$$ 115 471 803 1040 1156 1110 1031 820 550 83 -279 -637 -867 -1059 -1137 -1051 -832 -632 -273 168 429 785
6793G85K57P7ll9k95l11l23m36k56l14k18J4N7J51L05K97K81L47L60J92J98j00
$$ 785 1042 1119 1116 1077 782 471 148 -288 -544 -858 -1076 -1062 -1005 -854 -549 -252 29 376 736 928 1126 1026
6815A026r0k69j86l53l19k75k45j13k9O0J42J73K28K81K09K67J47P0n3j0l7j75
$$ 1026 936 667 481 128 -191 -466 -711 -824 -853 -793 -651 -478 -250 31 240 507 654 724 671 661 624 449
6837D49k57r7l16j46j28r4PN0P7J24M6K41J54J51J45O2J02%l9n5j10j30k39k02
$$ 449 192 95 -221 -367 -495 -589 -582 -532 -455 -331 -285 -44 110 261 406 468 570 570 531 476 366 236 -3 -205
6861b05r9j60q7o0m6R8Q9K22J94J68K25J58J84J20q1m1o1k27l08k73j94k26j50
$$ -205 -304 -464 -551 -611 -657 -559 -470 -248 -54 114 339 497 681 801 720 679 618 391 83 -190 -384 -610 -760
6884g60j35mJ33J39K79K67L03L41K40K48N4j27r8j71l43l91l76k82l33j45n8J65
$$ -760 -895 -899 -766 -627 -348 -81 222 563 803 1051 1105 978 880 709 366 -25 -401 -683 -1016 -1161 -1219 -1054
6906a054J92L18M70M30L35L13K07L3K5k37k84m45m11m56l40k26k09JK13L13M05
$$ -1054 -862 -544 -74 356 691 1004 1211 1244 1269 1032 748 303 -108 -564 -904 -1130 -1339 -1338 -1125 -812 -407
6927d07M17M11M33K69J09Q1p0l34l13m52m38l87k69k67%N9J92L07M43L50L60K87
$$ -407 10 421 854 1123 1232 1313 1243 909 596 144 -294 -681 -950 -1217 -1217 -1158 -966 -659 -216 134 494 781
6949G81L12Rj2j72j83k98l00l64l34j90r5j8J6J78K39K25K05L28K16J02J23Lr1
$$ 781 1093 1102 1090 918 735 437 137 -227 -561 -751 -846 -864 -848 -670 -431 -206 -1 327 543 645 768 771 680
6972F80j41j41j98k07k44j70p1j47%L2J35J51J57J89J30J25J19J06j6J2n2j02
$$ 680 539 398 200 -7 -251 -421 -492 -639 -639 -607 -472 -321 -164 25 155 280 399 505 489 501 449 347
6994C47q0j11k02j19j05m2o8m3n3R4Q0J36J05J18J52J34R9J52k7qm5k02j19j50
$$ 347 267 156 -46 -165 -270 -312 -380 -423 -476 -382 -302 -166 -61 57 209 343 442 594 567 559 514 312 193 43
7018D3k96j09k34j18m9l1J30K25K53J79L02K95K62J13J2Nk15k49l05l34m06l08
$$ 43 -253 -362 -596 -714 -763 -794 -664 -439 -186 -7 295 590 852 965 977 982 767 518 213 -121 -527 -835
7040h35j41j63j0J56L61L12L91L76M17K93J23o0o3k57l60m61m32l89m12j74m2
$$ -835 -976 -1139 -1149 -993 -632 -320 71 447 864 1157 1280 1220 1157 900 540 79 -353 -742 -1154 -1328 -1370
7061a370R0K60L79L87N18L82L19L04N9r2j40l16m13m51l71l79k97j03m4K12K57
$$ -1370 -1280 -1020 -641 -254 264 646 965 1269 1328 1236 1096 780 367 -84 -455 -834 -1131 -1234 -1278 -1066 -809
7082h09L64L34M39M17K79J22O3r4j99l71l24l46m19k42j75j24M5J37J97L15L38
$$ -809 -445 -111 328 745 1024 1146 1209 1115 916 545 221 -125 -544 -786 -961 -1085 -1040 -903 -706 -391 -53
7103e3L62K30K19Q6R7j02j82j82k96l02k15j66j39p7kJ20J20J93K54J71J92J45
$$ -53 309 539 758 844 941 839 657 475 179 -123 -338 -504 -643 -720 -722 -602 -482 -289 -35 136 328 473
7125D73L4M1n3K8j58j61q8j49j20o8r9k3r3K8P8P9M8P7J15J12O5P4J65K5N6j6
$$ 473 507 548 495 523 365 204 116 -33 -153 -221 -320 -343 -436 -408 -330 -251 -203 -126 -11 101 166 240 405 430 486 470
7151D70n2p4j45j77j35j90j54j23n2k7R4Q2K29K60J99K93J86J68L5j09q7j74k81
$$ 470 418 344 199 22 -113 -303 -457 -580 -632 -659 -565 -483 -254 6 205 498 684 852 887 778 691 517 236
7174B36k93l69k07k13j69O9R6J64K36M73L24K61K64K21P2j02j88l23k96l88m30
$$ 236 -57 -426 -633 -846 -1015 -946 -850 -686 -450 23 347 608 872 1093 1165 1063 875 552 256 -132 -562
7195e62l31j73k10R1O8L16L87L82M32L93K98J99M2j13k20l76l82m26m80l96j88
$$ -562 -893 -1066 -1276 -1185 -1117 -801 -414 -32 400 793 1091 1290 1332 1219 999 623 241 -185 -665 -1061 -1249
7216a249n5RK19L41M19M34M35L90L40J3K2j73k58m33m01n01l45l25j26k9J58K54
$$ -1249 -1304 -1295 -1076 -735 -316 118 553 943 1283 1296 1318 1145 887 454 53 -448 -793 -1118 -1244 -1273 -1115 -861
7238h61L38M45L31M14L01J05Q6j18k46k63l42l58l00j95k38j1M6J56K09K29L36
$$ -861 -523 -78 253 667 968 1073 1159 1041 795 532 190 -168 -468 -663 -901 -912 -866 -710 -501 -272 64
7259F4K10K48J29J9M3n6j98j23j84j77j52j38j7j82N7R5J8J19P4J34R3J06K1J36
$$ 64 274 522 651 670 713 657 459 336 152 -25 -177 -315 -332 -514 -457 -362 -344 -225 -151 -17 76 182 203 339
7283C39K%m1Ml0p3j13o1j57n3j59K5p6l1PJ32J0J78O5K67J02R8R4O2K4q5j03k80
$$ 339 341 341 300 304 274 201 88 27 -130 -183 -342 -317 -393 -424 -417 -285 -275 -97 -32 235 337 435 529 591 615 530 427 147
7311A47j39k06k23k06n6l5LJ09J64K78K69K84K25J77Q5O5j00k10k71k88k62l89
$$ 147 8 -198 -421 -627 -683 -718 -715 -606 -442 -164 105 389 614 791 876 941 841 631 360 72 -190 -579
7333e79k80j73n9K8K08L13L60L78L97L71K12O9k2j66k44m52m47l61l86l72j51
$$ -579 -859 -1032 -1091 -1063 -855 -542 -182 196 593 964 1176 1245 1223 1057 813 361 -86 -447 -833 -1205 -1356
7354a356L9J58K71M25M38L73L93L22K23N3j56k15m07l73m90l35l77k30l5J41J83
$$ -1356 -1317 -1159 -888 -463 -25 348 741 1063 1286 1339 1183 968 561 188 -302 -637 -1014 -1244 -1279 -1138 -955
7375i55K94L91L93M17L21K38O6oj72k88l01l39m13k60k81j02J0M8K08K86L01L10
$$ -955 -661 -270 123 540 861 1099 1165 1159 987 699 398 59 -354 -614 -895 -997 -987 -939 -731 -445 -144 166
7397A66L09K21J43Rk1j55k12k06k49k62j07k14r4J0P7J37J36J33K49J92K17K9
$$ 166 475 696 839 848 827 672 460 254 5 -257 -364 -578 -672 -662 -585 -448 -312 -179 70 262 479 508
7419E08Qk1n4q8p3j57r9n5j42m4no8l6M2l9Q0N9O1J17J13O5N8N7J18P0m1k1p3
$$ 508 516 495 441 353 280 123 24 -31 -173 -217 -222 -290 -326 -284 -323 -243 -184 -123 -6 107 172 230 287 405 475 434 413 340
7447C40j51j39j91j82j36j29r4L6R0J10K25K54K71K43K00J32L8j10j23k34l26
$$ 340 189 50 -141 -323 -459 -588 -682 -646 -556 -446 -221 33 304 547 747 879 917 807 684 450 124
7468A24k77l70k02k26j71P2K21K02L06M58K81L68K63R0L8q4l14l49m11l89l79
$$ 124 -153 -523 -725 -951 -1122 -1050 -829 -627 -321 137 418 786 1049 1139 1177 1093 779 430 19 -370 -749
7489g49l12j74k9J05L05K94M15M01L89L59K20K7n2j72k86l69m54l81m06k65j28
$$ -749 -1061 -1235 -1264 -1159 -854 -560 -145 256 645 1004 1224 1251 1199 1027 741 372 -82 -463 -869 -1134 -1262
7510a262K5J78K54L34L78M16L67L10J30J27j41k04l36l87l62l75l28j65m2Q2R5
$$ -1262 -1237 -1059 -805 -471 -93 323 690 1000 1130 1257 1116 912 576 189 -173 -548 -876 -1041 -1083 -1001 -906
7531i06K29L54M06L68K39K23J13q8n9k34k63l70j95l08j72p7o7J25J18K18K20
$$ -906 -677 -323 83 451 690 913 1026 938 879 645 382 12 -183 -491 -663 -740 -807 -682 -564 -346 -126
7552a26J95K24J13J40M2j9j08q1j12j43j47j65Nq3r0P9q4J33j8J06N6m1J23M9
$$ -126 69 293 406 546 588 569 461 380 268 125 -22 -187 -182 -265 -355 -276 -360 -227 -245 -139 -83 -124 -1 48
7576D8J23R4PN6L7L6r5m3l7j02j80k17j20j39p4l2R5L0L10J30K73K52K36J16J7
$$ 48 171 265 272 328 365 401 306 263 226 124 -56 -273 -393 -532 -606 -638 -543 -513 -203 -73 200 452 688 804 821
7601H21pj03k27k77l01l74k40j98j19N4Q2K50L03K77L76L66K42J46J7p7j51l43
$$ 821 814 711 484 207 -94 -468 -708 -906 -1025 -971 -889 -639 -336 -59 317 683 925 1071 1088 1011 860 517
7623E17l20l96l60l19k51j8pJ60K82L54M79L58M06K60O2O2j66k79l70m10m46l04
$$ 517 197 -199 -559 -878 -1129 -1147 -1154 -994 -712 -358 121 479 885 1145 1207 1269 1103 824 454 44 -402 -706
7645g06l07k13n0J74K53K33M99K84M17L18K30L7o5k28k29l70l79l67l14j96j28
$$ -706 -1013 -1226 -1276 -1102 -849 -616 -117 167 584 902 1132 1169 1104 876 647 277 -102 -469 -783 -979 -1107
7666a107O8J24L32K36L29L36K53K08Q6N1r0k27j93k21k57k33k01j23p4M0P3K06
$$ -1107 -1039 -915 -583 -347 -18 318 571 779 865 916 826 599 406 185 -72 -305 -506 -629 -703 -663 -590 -384
7688c84J79K64J18J25J32M8qj1o7j56j15j03o2j43l4on7J5j9K3K0L6Q1J03J32
$$ -384 -205 59 177 302 434 482 474 463 396 240 125 22 -40 -183 -217 -223 -280 -265 -284 -261 -241 -205 -124 -21 111
7713A11O7K4J19L7l6L7K4n4r0j11j70j79j59m6j09J7o8O6K16J64K47K16J82J50
$$ 111 178 202 321 358 322 359 383 329 239 128 -42 -221 -380 -426 -535 -518 -586 -520 -304 -140 107 323 505 655
7737F55R4L8r3j43k32k98k76k96l02q5Jj0K05K72L11L65L11L77J33J37m9j10k84
$$ 655 749 787 694 551 319 21 -255 -551 -853 -938 -937 -947 -742 -470 -159 206 517 894 1027 1164 1115 1005 721
7760G21l93l66m38l14k40j88l0J97K58L41M08N08K92L55J54K6r0l06l08m56m23
$$ 721 328 -38 -476 -790 -1030 -1218 -1248 -1051 -793 -452 -44 464 756 1111 1265 1291 1201 895 587 131 -292
7781b92m32l03k14MN6L02K94L40L93M77L38J45R6q5j43k59l76m13l29l04k65j18
$$ -292 -724 -1027 -1241 -1237 -1181 -879 -585 -245 148 625 963 1108 1204 1119 976 717 341 -72 -401 -705 -970 -1088
7803a088J04J29K00L02L69K32L16K10P7M3j45j06j85l31k25j95k25j97j3O6R3
$$ -1088 -984 -855 -655 -353 16 248 564 774 851 894 749 643 458 127 -98 -293 -518 -715 -728 -662 -569
7824e69J13J99K27J49K23J28O1L0k8r7j11j90j18l8j18j39q4M0j1oN8J23R8J2
$$ -569 -456 -257 -30 119 342 470 531 561 533 436 325 135 17 -21 -139 -278 -362 -322 -333 -339 -281 -158 -60 -48
7848d8J13Q5L0O1J3K0J4k4kp0q4j22l6j17j24n8p3n9J21J3J30P4K16J84J02K09
$$ -48 65 150 180 241 254 274 288 264 262 192 108 -14 -50 -167 -291 -349 -422 -481 -360 -347 -217 -143 73 257 359 568
7874E68R7l7o1m3j22k44l47j99k32j56k1j6J71J93K18L60K14L57K16J10L9r1l12
$$ 568 665 628 567 524 402 158 -189 -388 -620 -776 -797 -813 -642 -449 -231 129 343 700 916 1026 1065 974 662
7897F62k83l67l55l23k61j45l0Q6K30K41M72L21M21K83K39j4l4l18k54l62l84
$$ 662 379 12 -343 -666 -927 -1072 -1102 -1016 -786 -545 -73 248 669 952 1191 1177 1143 825 571 209 -175
7918a75m22l35j83j44J17J98K86L55L81L99L46L03Q0L8k13k17l89l77m09k64k92
$$ -175 -597 -932 -1115 -1259 -1142 -944 -658 -303 78 477 823 1126 1206 1244 1031 814 425 48 -361 -625 -917
7939i17j42r4J64K57K38L52L27L76K16J59M4j1j84l14l00k98k98k10j22l1p5J83
$$ -917 -1059 -1153 -989 -732 -494 -142 185 561 777 936 980 969 785 471 171 -127 -425 -635 -757 -788 -863 -680
7961f80J72K40K53K74J93J37R4k1j8j12j94k16j85j78p3r0l8L6j4J21J76J05O7
$$ -680 -508 -268 -15 259 452 589 683 662 644 532 338 122 -63 -241 -314 -404 -442 -406 -420 -299 -123 -18 49
7984D9N5J58OJ0q7JK2k9j00k1L0j20j2l6l6j7j32Nm0k1j9M0J66J03J35K32Q7M2
$$ 49 104 262 268 278 191 192 214 185 85 64 94 -26 -38 -74 -110 -127 -259 -254 -294 -315 -334 -294 -128 -25 110 342 429 471
8012D71P3n2o0j19j51k36j90k63n9j21M2M0J43K63J93L51J93K53J02mr5n3l15
$$ 471 544 492 432 313 162 -74 -264 -527 -586 -707 -665 -625 -482 -219 -26 325 518 771 873 869 774 721 406
8035D06k96k88k90l40j60q2R1J43J91L52M18L17L63K11J09j3j01k34l47m50l48
$$ 406 110 -178 -468 -808 -968 -1050 -959 -816 -625 -273 145 462 825 1036 1145 1132 1031 797 450 0 -348
8056c48l50l00j68k9P2K37L16M40M09L93L71J67Or5j80l15m04l95m27l49k20o2
$$ -348 -698 -998 -1166 -1195 -1123 -886 -570 -130 279 672 1043 1210 1216 1121 941 626 222 -173 -600 -949 -1169 -1231
8078a231O7J13L99L59M04L67K78L15O5M1j81k89l23l82l75l34j98j13l6J50K93
$$ -1231 -1164 -1051 -652 -293 111 478 756 1071 1136 1177 996 707 384 2 -373 -707 -905 -1018 -1054 -904 -611
8099f11K25L69L24K01K44J22k3m1k36k04k59k46k10j51j52N2M6O7J81J19K17K31
$$ -611 -386 -17 307 508 752 874 851 810 574 370 111 -135 -345 -496 -648 -596 -550 -483 -302 -183 34 265
8121B65K6O4Q1o6m2p0j13r9n9m1L6p1j2m8K2l0K2l4j4K4k6N5O3J20L0J50O3L5
$$ 265 291 355 436 370 328 258 145 46 -13 -54 -18 -89 -101 -149 -127 -157 -135 -169 -183 -159 -185 -130 -67 53 83 233 296 331
8149C31N5j5m2m6j14j59j70k02j38j17M5j7J25J03K26L26J73K02J74P2Nj05k35
$$ 331 386 371 329 283 169 10 -160 -362 -500 -617 -572 -589 -464 -361 -135 191 364 566 740 812 817 712 477
8172D77j76l79k74k91k33j38K7J36J58K45M15L47L17L64O9P6r6j85k97
$$ 477 301 -78 -352 -643 -876 -1014 -987 -851 -693 -448 -33 314 631 995 1064 1140 1044 859 562
8191E62
$$ Imaginary data points
##PAGE= N=2
##DATA TABLE= (X++(I..I)), XYDATA
0@%%%%%%qQqJ6j6K4l2M0m8N6p2R0j08J30j60J88k23K62l10L66m24M93n68O53p46
$$ 0 0 0 0 0 0 0 -8 0 -8 8 -8 16 -16 24 -24 32 -40 50 -58 72 -88 100 -123 139 -171 195 -229 264 -304 349 -397
31c97Q54r73J105j248J404j580J773j984K213k470K746l047L378l739M133m560
$$ -397 457 -516 589 -659 745 -835 938 -1046 1167 -1303 1443 -1604 1774 -1965 2168 -2392
47b392N030n544O110o732P417q173R014r958J1018j2219J3591j5183J7051j9279
$$ -2392 2638 -2906 3204 -3528 3889 -4284 4730 -5228 5790 -6429 7162 -8021 9030 -10249
61a0249K1994k5382K9758l5659M4106n7297Q1010j37226N29281O06783l03410
$$ -10249 11745 -13637 16121 -19538 24568 -32729 48281 -88945 440336 1047119 743709
72G43709j74715l73162k99825l60487k30843j95542m3850L1357J81903K36083
$$ 743709 568994 195832 -103993 -464480 -695323 -890865 -934715 -903358 -721455 -485372
82d85372L12982L02828L08523K29328J57147L8289m6315j56936k24692k81078
$$ -485372 -172390 130438 438961 668289 825436 863725 817410 660474 435782 154704
92A54704k76145k62954k06158j37165l5219M9082J32813J93064K41136K43875
$$ 154704 -121441 -384395 -590553 -727718 -762937 -713855 -581042 -387978 -146842 97033
102I7033K20845J71006J12458L2002m7728j17408j63368j96558k04246j83040
$$ 97033 317878 488884 601342 633344 585616 468208 304840 108282 -95964 -279004
112b79004j35102q0714k0729M2949J02015J39083J55678J56899J41433J02620
$$ -279004 -414106 -494820 -515549 -472600 -370585 -231502 -75824 81075 222508 325128
122C25128N1723L417l9524q0177j09953j18354j09340r2127o5308k6076J5213
$$ 325128 376851 380268 340744 260567 150614 32260 -77080 -169207 -234515 -260591 -245378
133b45378M5239O5589Q0760Q5222P2626M9452K6283J526k7401n0526n8899n6605
$$ -245378 -200139 -134550 -53790 31432 104058 153510 179793 181319 153918 103392 44493 -12112
145a2112n1227l8767j5323J0491K9198M2928N4617N6882M3874K3303L526j8121
$$ -12112 -63339 -102106 -117429 -106938 -77740 -34812 19805 76687 120561 143864 147390 129269
157A29269m3476o3235o9354o6096n7354l8428p230K5936N2071P3137Q9932R4197
$$ 129269 85793 22558 -46796 -112892 -170246 -208674 -215904 -189968 -137897 -64760 25172 119369
169A19369Q0645N6202K7188q583n0108q5308j05425j13737j12322r4333n8885
$$ 119369 200014 256216 283404 274821 224713 139405 33980 -79757 -192079 -286412 -345297
180c45297j5882K6427O8722J08112J32895J36499J24900J01576O3117J1694m0242
$$ -345297 -361179 -334752 -266030 -157918 -25023 111476 236376 337952 401069 412763 372521
191C72521q4539j21258j47658j53474j36045j03770o2313j0345M7609R8138J33758
$$ 372521 287982 166724 19066 -134408 -270453 -374223 -436536 -446881 -399272 -301134 -167376
202a67376J56275J63255J47482J09950O1601Q880m7519j01909j41638j61125j63871
$$ -167376 -11101 152154 299636 409586 471187 480067 432548 330639 189001 27876 -135995
213a35995j49744j14270o1651m893M9236R9986J41305J62473J61313J43296J10357
$$ -135995 -285739 -400009 -461660 -466553 -417317 -317331 -176026 -13553 147760 291056 401413
224D01413O1190K529n2761r8055j34330j56318j56315j35282j01398n7890m943
$$ 401413 462603 465132 412371 314316 179986 23668 -132647 -267929 -369327 -427217 -432160
235d32160M9463R3154J22456J39489J41558J23104Q8581M7216K863m4040q5790
$$ -432160 -382697 -289543 -167087 -27598 113960 237064 325645 372861 375724 331684 245894
246B45894j12273j22517j21075j06621p6212l6079L945M0999P4891R9478J06913
$$ 245894 133621 11104 -109971 -216592 -292804 -328883 -324938 -283939 -209048 -109570 -2657
257b657R9828Q4046N9781K5925j0801m1173o3908q0502q6450p7363n8049l5675
$$ -2657 97171 181217 240998 266923 256122 214949 151041 70539 -15911 -93274 -151323 -186998
269a86998j0871J7160M1922N6311O1651O1479N3085L4678J2531o378k2508l7460
$$ -186998 -197869 -180709 -138787 -82476 -20825 40654 93739 128417 140948 134570 112062 74602
281G4602m6055m3909l5135k4399j0365Q177K3935L1882L4388L4329K8089J4088
$$ 74602 28547 -15362 -50497 -74896 -85261 -77084 -53149 -21267 13121 47450 75539 89627
293H9627k304j5598k7470l8178m2327l6587k5388j3020K779K2188L8503M6967
$$ 89627 87323 71725 44255 6077 -36250 -72837 -98225 -111245 -108466 -86278 -47775 -808
305h08N0062M8790L9092K0030j779k1429m0272n7758o7116o5150n5793m1400j9094
$$ -808 49254 98044 137136 157166 155387 133958 93686 35928 -31188 -96338 -152131 -193531 -212625
318b12625R195L5922N6124P1235Q0452P8635O4112M2655J7608j1842m3283o8192
$$ -212625 -203430 -167508 -111384 -40149 40303 118938 183050 225705 243313 231471 188188 119996
330A19996q2589q8608q6688p2324m6437j6056J4797M6311P4947R3040R7868R3002
$$ 119996 37407 -51201 -137889 -210213 -256650 -272706 -257909 -211598 -136651 -43611 54257 147259
342A47259P9202N3882J9614j5664m7643p6459r8097j06062r9474q2784n8069k3989
$$ 147259 226461 280343 299957 284293 236650 160191 62094 -43968 -143442 -226226 -284295 -308284
354c08284J5242N1039P9431J00417J10878J05926Q6235N8282K5063j3689n2425
$$ -308284 -293042 -242003 -162572 -62155 48723 154649 240884 299166 324229 310540 258115
365B58115q2667j01306j10042j06522q7697n7069k2273J3414M9418Q0430R8974
$$ 258115 175448 74142 -35900 -142422 -230119 -287188 -309461 -296047 -246629 -166199 -67225
376f7225J03968R8588Q2168N3630J8095j6548m7289p4163r2581r7027q8850p2203
$$ -67225 36743 135331 217499 271129 289224 272676 225387 151224 58643 -38384 -127234 -199437
388a99437m7919j6347J7151M5049O5712Q0432Q5441P7692N9905L7703J2166j6070
$$ -199437 -247356 -263703 -246552 -201503 -135791 -55359 30082 107774 167679 205382 217548 201478
400B01478m1773n8492o6857o8850o2671m6513k4639k994J7802L7376N1259N5198
$$ 201478 159705 101213 34356 -34494 -97165 -143678 -168317 -171311 -153509 -116133 -64874 -9676
412i676N1762M4239L1485J3117n738k0591l1241l9090m0742l4331k3695j2812
$$ -9676 42086 86325 117810 130927 125189 104598 73357 34267 -6475 -40806 -64501 -77313
424g7313q66J2552K3019K7034K6629K4372J7835O642m439j2149j7934k2714k3144
$$ -77313 -78179 -65627 -42608 -15574 11055 35427 53262 59904 55465 43316 25382 2668 -20476
437b0476j7473r315j416P469J7614K4228K4845K2394J8436J0451j740j3937k2767
$$ -20476 -37949 -47264 -48680 -41211 -23597 631 25476 47870 66306 76757 75017 61080 38313
450C8313l0034l5259l4940k7502j6998n574Q240K3902L6291M2525M4678M2776
$$ 38313 8279 -26980 -61920 -89422 -106420 -111994 -103754 -79852 -43561 -1036 43642 86418
462H6418L3765J8100N87j6008l2370m7224n5348n5086m9015l7847k0233K295K3752
$$ 86418 120183 138283 138870 122862 90492 43268 -12080 -67166 -116181 -154028 -174261 -171966 -148214
475a48214M1145N5389O4751O5025N5827M0650K1641j977k6961m7513o1011o8814
$$ -148214 -107069 -51680 13071 78096 133923 174573 196214 194237 167276 119763 58752 -10062
487a0062o9757o0677m2691k0756K684K7652N0659O5896P2181P1500O3398M6055
$$ -10062 -79819 -140496 -183187 -203943 -201259 -173607 -122948 -57052 15129 86629 150027 196082
499A96082K1874l565k7487m9899o7244p4758p2237o2922m7160k3873L063K7915
$$ 196082 217956 214391 186904 137005 69761 -4997 -77234 -140156 -187316 -211189 -208126 -180211
511a80211M8461O4658P3748P1786O0725M4204K3320k102k7774m7934o1466o8962
$$ -180211 -131750 -67092 6656 78442 139167 183371 206691 204589 176815 128881 67415 -1547
523a547o8711n8342m0646k0469J182K4075M3834N6257O1086N9831N2203L6351
$$ -1547 -70258 -128600 -169246 -189715 -188533 -164458 -120624 -64367 -3281 56550 108753 145104
535A45104J6701k659k0693l7392m9473n3170n0150m2955l0689j3624M528J9511
$$ 145104 161805 159146 138453 101061 51588 -1582 -51732 -94687 -125376 -139000 -134472 -114961
547a14961L1491M0961M5024M1568L3134K2580R733n267j8678k7073l1694l3568
$$ -114961 -83470 -42509 2515 44083 77217 99797 109530 104263 85585 58512 26818 -6750
559f750l0877k2486j1551j380Q610J8272K4538K5038K2398J8203J1183J227q239
$$ -6750 -37627 -60113 -71664 -73044 -64434 -46162 -21624 3414 25812 44015 55198 56425 48186
572D8186j4099j8012k0072j8284j2075m352K380R341J6262J9859J8728J4724R586
$$ 48186 34087 16075 -3997 -22281 -34356 -38708 -36328 -26987 -10725 9134 27862 42586 52172
585E2172J673q455j6770k1607k4139k4590k0510j1663j282Q674J8775K8061L2800
$$ 52172 53845 45390 28620 7013 -17126 -41716 -62226 -73889 -75171 -66497 -47722 -19661 13139
598A3139L1862K7468K0403R035n583j9187k9656l7688m2086m0246l1614j9850
$$ 13139 45001 72469 92872 101907 96324 77137 47481 9793 -32293 -72539 -104153 -124003
610a24003o190R871K6443L9106M5999M8353M5716L5973K0368L388j3422l0185
$$ -124003 -130193 -120322 -93879 -54773 -8774 39579 85295 121268 141636 145024 131602 101417
622A01417m4467n2124n2434m7449l7183k1170j435J7382L3223M6589N5165N5862
$$ 101417 56950 4826 -47608 -95057 -132240 -153410 -154845 -137463 -104240 -57651 -2486 53376
634E3376M9057L7407K2078K669j7560l4288m6343n4147n6092n0102l7463k1659
$$ 53376 102433 139840 161918 164587 147027 112739 66396 12249 -43843 -93945 -131408 -153067
646a53067m108J5476L3118M5746N2132N3709M9448L7947K1464L947j3569l0480
$$ -153067 -157175 -141699 -108581 -62835 -10703 43006 92454 130401 151865 155812 142243 111763
658A11763m4087n0736n1019m6890l7529k2355m481J2139K6874L9424M7183M7596
$$ 111763 67676 16940 -34079 -80969 -118498 -140853 -145334 -133195 -106321 -66897 -19714 27882
670B7882M2474L3811K1392N247j1239k4625l4583m1560m3195l8533k9369j8416
$$ 27882 70356 104167 125559 130806 119567 94942 60359 18799 -24396 -62929 -92298 -110714
682a10714n407Q931K1966L0314L4936L6194L3231K4862J4032L382p379j8068k5929
$$ -110714 -116121 -107190 -85224 -54910 -19974 16220 49451 74313 88345 91727 84348 66280 40351
695D0351k8715k7664k4765j8215q560J368R367J5882K1157K2982K0195J5112R365
$$ 40351 11636 -16028 -40793 -59008 -67568 -66200 -56833 -40951 -19794 3188 23383 38495 47860
708D7860K397n575j1778j4413j5283j4595j1397n080J262O074R978J3200J3338
$$ 47860 50257 44682 32904 18491 3208 -11387 -22784 -27864 -26602 -20528 -10550 2650 15988
721A5988R998N535Q11m771j0963j4975j5465j4084j1456n859J765R044J4179J8332
$$ 15988 25986 31521 32332 27561 16598 1623 -13842 -27926 -39382 -45241 -43476 -34432 -20253 -1921
735a921K1214K0176J5193Q377J032p794j7146k3507k6175k6579k4327j7812p630
$$ -1921 19293 39469 54662 63039 64071 56277 39131 15624 -10551 -37130 -61457 -79269 -86899
748h6899L118J2949K2602L0503L3792L2119K7339J9620Q199n592j8068k8081l5716
$$ -86899 -83781 -70832 -48230 -17727 16065 48184 75523 95143 103342 97750 79682 51601 15885
761A5885l9717l7904l0481k0295p808P069K2089L3485M0563M3615M2016L4033
$$ 15885 -23832 -61736 -92217 -112512 -120320 -113251 -91162 -57677 -17114 26501 68517 102550
773A02550K1226O950p820k2915l5670m3227m4866m2167l4817k1941o127R182K3022
$$ 102550 123776 130726 122906 99991 64321 21094 -23772 -65939 -100756 -122697 -128824 -119642 -96620
786i6620L5409M3710M5415M1537L3741K2157O849r385k3117l3921m1679m4538
$$ -96620 -61211 -17501 27914 69451 103192 125349 132198 122813 99696 65775 24096 -20442
798b0442m1025l2281k0960p464P975K2243L2336L8481M0721L8233L0031J8033
$$ -20442 -61467 -93748 -114708 -122172 -114197 -91954 -59618 -21137 19584 57817 87848 105881
810A05881N372p765k0653l0698l5607l6075l3465k6537j5354k954Q293J8284K6659
$$ 105881 111253 103488 82835 52137 16530 -19545 -53010 -79547 -94901 -97855 -89562 -71278 -44619
823d4619L1256L0487K6551K0493J1883J285q908j6280k1383k4517k4272j9849
$$ -44619 -13363 17124 43675 64168 76051 77336 68428 52148 30765 6248 -18024 -37873
835c7873j3503o958M25Q378J4479J7206J7773J7117J3769P980J940k846p500j1630
$$ -37873 -51376 -58334 -57909 -49531 -35052 -17846 -73 17044 30813 38793 40733 37887 30387 18757
849A8757j3239j1940r187o399j971L260P262R000R907R835P729L250j362m783
$$ 18757 5518 -6422 -15609 -22008 -23979 -20719 -13457 -4457 5450 15285 23014 26264 24902 20119
863B0119q468j1409j2074r908o948l302J844P852J2242J4281J5116J4398J0750
$$ 20119 11651 242 -11832 -21740 -28688 -31990 -30146 -22294 -10052 4229 19345 33743 44493
876D4493M533j928p719j3960j9219k1226j9986j6679j1647m004N226J3244J9353
$$ 44493 49026 47098 39379 25419 6200 -15026 -35012 -51691 -63338 -67342 -62116 -48872 -29519
889b9519K4058K6580K4944J9123J1852L061p222j7497k5079k9125l0733k9033
$$ -29519 -5461 21119 46063 65186 77038 80099 72877 55380 30301 1176 -29557 -58590
901e8590k2502j2597j568R490K0587K9897L4625L4934L1948K5168J3955O30j2112
$$ -58590 -81092 -93689 -95257 -85767 -65180 -35283 -658 34276 66224 91392 105347 105977 93865
914I3865k3270l2708l8267l8196l3281k5048j3807K68J4718K6363L4632L9625
$$ 93865 70595 37887 -380 -38576 -71857 -96905 -110712 -110444 -95726 -69363 -34731 4894
926D894L9929L4208K4392J2459q77j5085k7290l5148l8492l8119l3097k3159j0637
$$ 4894 44823 79031 103423 115882 115005 99920 72630 37482 -1010 -39129 -72226 -95385 -106022
939a06022K064J4379K5571L3594L6255L4385K9434K0823R002l649j4434k3499
$$ -106022 -103958 -89579 -64008 -30414 5841 40226 69660 90483 99485 95836 81402 57903
951E7903l0502l3165l0961k5340j7577p727L526J3701K1069K5694K7932K6319
$$ 57903 27401 -5764 -36725 -62065 -79642 -87369 -83843 -70142 -49073 -23379 4553 30872
963C0872K0847J3018M987l521j2056j8453k1299k1716k0311j6093r158j970M332
$$ 30872 51719 64737 69724 66203 54147 35694 14395 -7321 -27632 -43725 -52883 -54853 -50521
976e0521R866J4872J7130J6194J3978J0765N877n3n190q539j0682j2169j1302
$$ -50521 -40655 -25783 -8653 7541 21519 32284 38161 38108 32918 24379 13697 1528 -9774
989i774q171m581j363K512O453Q640Q648P859O513L493o62m035o168p722q770
$$ -9774 -17945 -22526 -23889 -21377 -14924 -6284 2364 10223 16736 20229 19567 15532 9364 1642 -7128
1004g128p484m348q64K278O152R509J1176J0450Q893O231J669m068q918j2298
$$ -7128 -14612 -18960 -19824 -17546 -11394 -1885 9291 19741 28634 34865 36534 32466 23548 11250
1018A1250j4886j6135j4451j0056m949P30P446J3995J8109J9629J9345J7024J1465
$$ 11250 -3636 -19771 -34222 -44278 -49227 -48497 -41051 -27056 -8947 10682 30027 47051 58516
1031E8516L849l832j0873j7841k3052k4462k2808j8906j2710m004N713J4300K0950
$$ 58516 62365 58533 47660 29819 6767 -17695 -40503 -59409 -72119 -76123 -70410 -56110 -35160
1044c5160K6198K8305K6293K0788J3316M259o366j6607k3958k8486l0389k8749
$$ -35160 -8962 19343 45636 66424 79740 83999 77633 61026 37068 8582 -21807 -50556
1056e0556k2545j3253l179P418J8045K6598L1065L1859K9446K3498J3747K266
$$ -50556 -73101 -86354 -89533 -82115 -64070 -37472 -6407 25452 54898 78396 92143 94409
1068I4409q588j8461k6793l1820l1982k8522k2364j3225j901R405J8780K5774
$$ 94409 85821 67360 40567 8747 -23235 -51757 -74121 -87346 -89247 -79842 -61062 -35288
1080c5288L0390L1047K7187K0378J1957J891r012j8333k4597k7934k8553k5736
$$ -35288 -4898 26149 53336 73714 85671 87562 78550 60217 35620 7686 -20867 -46603
1092d6603j8986j0386j526P632J6392K2651K5064K4764K2104J6572Q228l09q094
$$ -46603 -65589 -75975 -77501 -69869 -53477 -30826 -5762 19002 41106 57678 65906 65597 57503
1105E7503j4804k0279k2605k1132j7696j2575n749K170R096J3900J7225J8506
$$ 57503 42699 22420 -185 -21317 -39013 -51588 -57337 -55167 -46071 -32171 -14946 3560
1117C560J7118J2764P319K048l865r446j2947j3804j3148j1319p376k121K721
$$ 3560 20678 33442 40761 42809 38944 29498 16551 2747 -10401 -21720 -29096 -31217 -28496
1130b8496O230R287J1311J0752Q479N214J934k161o273q543r063q630p352l974
$$ -28496 -22266 -12979 -1668 9084 17563 22777 24711 22550 16277 7734 -1329 -9959 -17311 -21285
1144b1285K29L995O863R306J0792R988P284L852J79m403r119j1821j2718j2595
$$ -21285 -21056 -17061 -10198 -892 9900 19888 27172 31024 31203 26800 17681 5860 -6858 -19453
1158a9453j1015o907j380L733Q520J2890J6048J6457J4388J0957O160m05p448
$$ -19453 -30468 -37375 -38755 -35022 -26502 -13612 2436 18893 33281 44238 50398 49993 42545
1171D2545j2901j6885j9377j9748j6803j1592n430J307R034J5674J9732K1476
$$ 42545 29644 12759 -6618 -26366 -43169 -54761 -60191 -58884 -49850 -34176 -14444 7032
1183G032K1233J8503J2723N087k234r521j6526k1546k3288k2294j9269j3730n992
$$ 7032 28265 46768 59491 64578 62344 52823 36297 14751 -8537 -30831 -50100 -63830 -69822
1196f9822K703J0244J6943K2321K4839K4003K0088J4649P128j850j0552j7492
$$ -69822 -67119 -56875 -39932 -17611 7228 31231 51319 65968 73096 71246 60694 43202
1208D3202k2315k5242k4922k0896j4553o979J534J0649J8162K2933K4912K4723
$$ 43202 20887 -4355 -29277 -50173 -64726 -71705 -70171 -59522 -41360 -18427 6485 31208
1220C1208K1208J4424O206k127j0230j7866k2810k4370k3183j9788j3752n377
$$ 31208 52416 66840 73046 70919 60689 42823 20013 -4357 -27540 -47328 -61080 -66457
1232f6457K939J0252J6588K1163K2628K0853J6808J1304M200l855j0656j5653
$$ -66457 -63518 -53266 -36678 -15515 7113 27966 44774 56078 60278 56423 45767 30114
1244C0114j8623j9937j8169j3880q291k251M040J0199J4111J5772J5599J4035
$$ 30114 11491 -8446 -26615 -40495 -48786 -51037 -46997 -36798 -22687 -6915 8684 22719
1256B2719J0179M707n36n224r059j2157j2797j1189q680n452j014L403O859Q673
$$ 22719 32898 37605 37069 31845 22786 10629 -2168 -13357 -22037 -27489 -28503 -25100 -18241 -9568
1270i568R505R443P174L735M44k495n324p565p917o829m992k763O80M048O380
$$ -9568 -63 9380 16554 20289 20733 18238 12914 5349 -2568 -9397 -14389 -17152 -16472 -12424 -6044
1285f044P432P887P319N095J632j629m445p476r589r793q387o324l332P50N182
$$ -6044 1388 9275 16594 21689 23321 21692 17247 9771 182 -9611 -17998 -24322 -27654 -26904 -21722
1300b1722Q545J0658J1989J2033R609N786J516l030p880j2334j4319j4749j3818
$$ -21722 -13177 -2519 9470 21503 31112 36898 38414 35384 27504 15170 851 -13898 -27716
1313b7716j1071o376n11M931R940J4349J6908J7138J4985J1634O531P7o588j1913
$$ -27716 -38787 -45163 -45674 -40743 -30803 -16454 454 17592 32577 44211 50742 50819 44231 32318
1327C2318j5943j8649j8994j6625j2148o589k18O980J3197J7336J9609K0059J8014
$$ 32318 16375 -2274 -21268 -37893 -50041 -56630 -56848 -49868 -36671 -19335 274 20333 38347
1340C8347J3136O954K32o649j3283j8141k0203k0080j8120j3670p076L51P078
$$ 38347 51483 58437 58669 52020 38737 20596 393 -19687 -37807 -51477 -58553 -58202 -51124
1353e1124J3209J8252K0757K0303J7558J3331P152m18p575j3127j7517j9864j9741
$$ -51124 -37915 -19663 1094 21397 38955 52286 59438 59020 51445 38318 20801 937 -18804
1366a8804j6681j1878o102M45P403J2909J6426J7978J7850J5326J0297M698j050
$$ -18804 -35485 -47363 -53465 -53020 -45617 -32708 -16282 1696 19546 34872 45169 49867 48817
1379D8817o787j1806j5147j6074j5334j3253r074l871J446N962R974J3023J3776
$$ 48817 42030 30224 15077 -997 -16331 -29584 -38658 -42529 -41083 -35121 -25147 -12124 1652
1392A652J2604J0308P082K720k039o100q865j0539j1415j0208p446m335r79K812
$$ 1652 14256 24564 31646 34366 32327 26227 17362 6823 -4592 -14800 -22246 -26581 -27560 -24748
1406b4748O178Q178Q589Q446P169M656J267j549m034n919p116o741n113l128r11
$$ -24748 -18570 -10392 -1803 6643 13812 18468 19735 18186 14152 8233 1117 -5624 -10737 -13865 -14776
1421a4776J877M491N919O273N937M976K467m21k836m821o558p464o677m953k633
$$ -14776 -12899 -8408 -2489 3784 9721 14697 17164 16743 13907 9086 2528 -4936 -11613 -16566 -19199
1436a9199L5L346O325P976Q628Q527P190M358O92k809o054r191j0999j1101r772
$$ -19199 -19164 -15818 -9493 -1517 7111 15638 22828 27186 27878 25069 19015 9824 -1175 -12276 -22048
1451b2048p476l960M82N184Q935J1562J3206J3196J0906P175K838k032p298j1694
$$ -22048 -29524 -33484 -33002 -27818 -18883 -7321 5885 19081 29987 37162 40000 37968 30670 18976
1465A8976j4167j5134j4456j1845p216j696L591Q528J3214J5807J6172J4665J1660
$$ 18976 4809 -10325 -24781 -36626 -43842 -45538 -41947 -33419 -20205 -4398 11774 26439 38099
1478C8099P060J178m733r587j3360j5967j6371j4408j0834o426q33M956R963J3389
$$ 38099 45159 46337 41604 32017 18657 2690 -13681 -28089 -38923 -45349 -46182 -41226 -31263 -17874
1492a7874J5321J5880J4236J0598N974R76m174r219j2782j4352j4520j3318j0284
$$ -17874 -2553 13327 27563 38161 44135 45111 40937 31718 18936 4584 -9936 -23254 -33538
1505c3538n662p66L799Q302J1665J3590J3339J1960R354N440N95l855p566j0433
$$ -33538 -39200 -39966 -36167 -27865 -16200 -2610 10729 22689 32043 37483 38078 34223 26657 16224
1519A6224j2184j2200j0573p913m767o18L475O835Q975J0222J0353R009O286L297
$$ 16224 4040 -8160 -18733 -26646 -31413 -32031 -28556 -21721 -12746 -2524 7829 16838 23124 26421
1533B6421J30l137o230q000q477q327p144n110j995O98L030N156O823P066O182
$$ 26421 26551 23414 17184 9184 707 -7620 -14764 -19874 -21869 -21171 -18141 -12985 -6162 904 7086
1548G086M815L106O67j873l721m759n386n295m126k028k71J599L400M697M937
$$ 7086 11901 15007 15674 13801 10080 5321 -65 -5360 -9486 -11514 -11785 -10186 -6786 -2089 2848
1563B848M215L275J666l33k644m093m872n238m743l134q02J384L327N368O780
$$ 2848 7063 10338 12004 11671 9027 4934 62 -5176 -9919 -13053 -13855 -12471 -9144 -3776 3004
1578C004O717N785M216J887j117m129o342p718q572q340o392l727n94K687O043
$$ 3004 9721 15506 19722 21609 20492 16363 10021 2303 -6269 -14609 -21001 -24728 -25322 -22635 -16592
1593a6592Q633R859R837R047O876L253o04m407p710j0443j1811j1448r693p002
$$ -16592 -7959 1900 11737 20784 27660 30913 30309 25902 18192 7749 -4062 -15510 -25203 -32205
1607c2205l175J354N690R163J1574J2764J2524J0167O686K737j821o585j0340
$$ -32205 -35380 -34026 -28336 -19173 -7599 5165 17689 27856 34542 37279 35458 28873 18533
1620A8533j2476j3381j2707j0497o642k100K355O805J0634J3070J3536J2585J0483
$$ 18533 6057 -7324 -20031 -30528 -37170 -39270 -36915 -30110 -19476 -6406 7130 19715 30198
1633C0198O764K120k583o705j0125j2592j3304j2083r686o322k043K647O755R820
$$ 30198 36962 39082 36499 29794 19669 7077 -6227 -18310 -27996 -34318 -36361 -33714 -26959 -17139
1647a7139J1772J2629J1684Q995N672J805k537o453r459j0901j1262j0520q190
$$ -17139 -5367 7262 18946 27941 33613 35418 32881 26428 16969 6068 -5194 -15714 -23904
1660b3904m721r32K484N923Q572R743R606Q555O511L483R3l110n425p455q405
$$ -23904 -28625 -29557 -27073 -21150 -12578 -2835 6771 15326 21837 25320 25413 22303 16878 9423 1018
1675A018p914o644m661k272M35L193N030N963O376O075M680K633Q06j224l060
$$ 1018 -6896 -13540 -18201 -20473 -20038 -16845 -11815 -5852 524 6599 11279 13912 14718 13494 10434
1690A0434m499m999m615l893k859j004Q85K266L267L829M053L249J898O77p13
$$ 10434 5935 936 -3679 -7572 -10431 -11435 -10550 -8284 -5017 -1188 2865 6114 8012 8689 7976
1705G976k193l339l608l374k685j801l2J738K920L835M392M273L320J863K11j442
$$ 7976 5783 2444 -1164 -4538 -7223 -9024 -9056 -7318 -4398 -563 3829 8102 11422 13285 13496 12054
1721A2054l374m918n312n341m696l369j241J014L001M767O204O861O447N102L312
$$ 12054 8680 3762 -1550 -6891 -11587 -14956 -16197 -15183 -12182 -7415 -1211 5650 12097 17199 20511
1736B0511J073j800m331o232p462q189p718o068l683j012K017N096P489Q745R095
$$ 20511 21584 19784 15453 9221 1759 -6430 -14148 -20216 -23899 -24911 -22894 -17798 -10309 -1564 7531
1751G531Q692O945M057N78k746n801q650j0251j0305r372p218m243k65L668O888
$$ 7531 16223 23168 27225 27803 25057 19256 10606 355 -9950 -19322 -26540 -30783 -31048 -27380 -20492
1766b0492R520J1112J1073R678P085L836j32m303p682j0012j1113j1066r514o598
$$ -20492 -10972 140 11213 20891 27976 31812 31680 27377 19695 9683 -1430 -12496 -22010 -28608
1780b8608k920P95M686Q030J0278J0906J0557Q894O043K379j352m668p610r653
$$ -28608 -31528 -30733 -26047 -18017 -7739 3167 13724 22618 28661 31040 29688 25020 17410 7757
1794G757j0234r479p592n111j851J755M871P006Q536R051Q237O190L823Q74k098
$$ 7757 -2477 -11956 -19548 -24659 -26510 -24755 -19884 -12878 -4342 4709 12946 19136 22959 23833 21735
1809B1735m762o691p414p508o720m842k411J45K349M256N700O032N608M478L015
$$ 21735 16973 10282 2868 -4640 -11360 -16202 -18613 -18468 -16119 -11863 -6163 -131 5477 9955 12970
1824A2970J011j139k854l835m419m609l847k504j205J83J705K966L440L432L019
$$ 12970 13981 12842 9988 6153 1734 -2875 -6722 -9226 -10431 -10248 -8543 -5577 -2137 1295 4314
1839D314K300J096k25j402k238k906l204k723j910q01K05J566K678L234L416L138
$$ 4314 6614 7710 7485 6083 3845 939 -2265 -4988 -6898 -7699 -7494 -5928 -3250 -16 3400 6538
1855F538K481J250l18j508k819l808m328m005l288k131n21J335L211M374N203
$$ 6538 9019 10269 9951 8443 5624 1816 -2512 -6517 -9805 -11936 -12457 -11122 -7911 -3537 1666
1870A666N465M976L656J733k31k362m465o045o617o482n767m080j649R16L236
$$ 1666 7131 12107 15763 17496 17265 14903 10438 4393 -2224 -8706 -14473 -18553 -20202 -19286 -16050
1885a6050N345P120P749P329O087M211J572j420m278o337p937q710q284o630m192
$$ -16050 -10705 -3585 4164 11493 17580 21791 23363 21943 17665 11328 3391 -5319 -13603 -20233 -24425
1900b4425j466J656M919P172Q581R115Q717O935M170R61k064n138p664r130r210
$$ -24425 -25891 -24235 -19316 -12144 -3563 5552 14269 21204 25374 26335 24271 19133 11469 2339 -6871
1915f871q543o671m011n62K670N550P755R173R276Q221O184L642L99k871n648
$$ -6871 -15414 -22085 -26096 -26658 -23988 -18438 -10683 -1510 7766 15987 22171 25813 26212 23341 17693
1930A7693p545q539q814p563n433k931j38K943N539P236P902P796O903M879K322
$$ 17693 10148 1609 -7205 -14768 -20201 -23132 -23270 -20327 -14788 -7552 350 8146 15049 19928 22250
1945B2250l33k819n086o735p235o813n804m170j669O90K965M583N873O124N733
$$ 22250 21917 19098 14012 7277 42 -6771 -12575 -16745 -18414 -17724 -14759 -10176 -4303 1821 7554
1960G554M357K720O53j428l196m507m969n066m347l045j189N02J850L321M208
$$ 7554 11911 14631 15284 13856 10660 6153 1184 -3882 -8229 -11274 -12463 -11961 -10111 -6790 -2582
1975b582M228L609K678J534q7j682k774l292l618l345k329j089J64J559K699L598
$$ -2582 1646 5255 7933 9467 9380 7698 4924 1632 -1986 -5331 -7660 -8749 -8585 -7026 -4327 -729
1991g29L588L188K407J227l41j785k887l589m041l758k808j287M0J771L222M288
$$ -729 2859 6047 8454 9681 9340 7555 4668 1079 -2962 -6720 -9528 -10815 -10775 -9004 -5782 -1494
2007a494M820M518L767K467O50j435l050m379n427n569m860l692j930L3K362M207
$$ -1494 3326 7844 11611 14078 14728 13293 10243 5864 437 -5132 -9992 -13684 -15614 -15581 -13219 -9012
2023i012N371O027O027N112L511J424o96k885m949o167o542o373n357l756j460
$$ -9012 -3641 2386 8413 13525 17036 18460 17764 14879 9930 3763 -2779 -9152 -14509 -18265 -19725
2038a9725R67L099M953O376P013O450N525L751J670j017l265n164o452p170o907
$$ -19725 -18758 -15659 -10706 -4330 2683 9133 14658 18409 20079 19062 15797 10633 4181 -2989 -9896
2053i896n624l784j589R07L374N473O638P255P071N769L734J530r98l394n523
$$ -9896 -15520 -19304 -20893 -19986 -16612 -11139 -4501 2754 9825 15594 19328 20858 19860 16466 10943
2068A0943o733p072o662n555l590j075J357L575N434O608P007O264N027L240P65
$$ 10943 4210 -2862 -9524 -15079 -18669 -19744 -18387 -14812 -9378 -2770 4237 10501 15528 18768 19533
2083A9533j577l737n220o200o502n806m411k468m44J836L889N148N766N652N040
$$ 19533 17956 14219 8999 2799 -3703 -9509 -13920 -16388 -16832 -14996 -11107 -5959 -193 5459 10499
2098A0499L391J572m73k306l998m988n199m796l722k381m15J285K816L756M403
$$ 10499 13890 15462 14989 12683 8685 3697 -1502 -6298 -10020 -12401 -12816 -11531 -8715 -4959 -556
2113e56M337L441K083P16p53k235l339l692l636l008k058n76R25K089K919L492
$$ -556 3781 7222 9305 10021 9268 7033 3694 2 -3634 -6642 -8700 -9276 -8351 -6262 -3343 149
2129A49L439K787J787O19o36k086l097l445l397k874k038o99P26K004K967L857
$$ 149 3588 6375 8162 8781 8145 6059 2962 -483 -3880 -6754 -8792 -9491 -8765 -6761 -3794 63
2145F3L905L582K523J420M9j721k928l845m251m380l583k365q16P83K420L770
$$ 63 3968 7550 10073 11493 11542 9821 6893 3048 -1203 -5583 -9166 -11531 -12347 -11564 -9144 -5374
2161e374M707M888M553L743K269L50j550l191m483n348n481m887l656k086j34
$$ -5374 -667 4221 8774 12517 14786 15136 13586 10395 5912 564 -4917 -9804 -13460 -15546 -15680
2176a5680J876L757M878N532N702M993L610J791p8k141m038n283n944n741n093
$$ -15680 -13804 -10047 -5169 363 6065 11058 14668 16459 16381 14240 10202 4919 -1025 -6766 -11859
2191a1859l780j803J96K185M008N595O032N820N141L744J964l95k368m061n362
$$ -11859 -15639 -17442 -17246 -15061 -11053 -5458 574 6394 11535 15279 17243 16848 14480 10419 5057
2206E057n994n833m868l386j635M73K676M209N254N783N597M625K937J140o83
$$ 5057 -937 -6770 -11638 -15024 -16659 -16186 -13510 -9301 -4047 1736 7333 11958 14895 16035 15352
2221A5352k690m183n005n199m840l992k433o16J038K600L912M570M721M081L158
$$ 15352 12662 8479 3474 -1725 -6565 -10557 -12990 -13606 -12568 -9968 -6056 -1486 3235 7316 10474
2236A0474J851K74j322k572l489m028m052l499k385j301M9J465K466L235L345
$$ 10474 12325 12599 11277 8705 5216 1188 -2864 -6363 -8748 -10049 -10000 -8535 -6069 -2834 511
2251E11L149K642J624M18o00j716k437l021k874k407j680q61K70J328K005K386
$$ 511 3660 6302 7926 8344 7744 6028 3591 570 -2304 -4711 -6391 -7252 -6982 -5654 -3649 -1263
2267a263K659K281J663O76k56j061j887k408k501k086j757p27L02J337K137K585
$$ -1263 1396 3677 5340 6016 5760 4699 2812 404 -2097 -4183 -5940 -6667 -6365 -5028 -2891 -306
2283c06K867K619J957J109L9j164k141k981l291l077k679j925l68P28K037L029
$$ -306 2561 5180 7137 8246 8285 7121 4980 1999 -1292 -4369 -7048 -8973 -9341 -8613 -6576 -3547
2299c547L841L863L510K654J526Q2j583k918l883m406m479l804k524j063M79K213
$$ -3547 294 4157 7667 10321 11847 11929 10346 7428 3545 -861 -5340 -9144 -11668 -12731 -12252 -10039
2315a0039L602M552M862M526L829K309N42j177k877m091n084n131m645l549k163
$$ -10039 -6437 -1885 2977 7503 11332 13641 14183 13006 10129 6038 954 -4177 -8822 -12371 -14534
2330a4534k57J556L325M344N063N108M466L293J680L4j759l442m412m953m801
$$ -14534 -14791 -13235 -9910 -5566 -503 4605 9071 12364 14044 14078 12319 8877 4465 -488 -5289
2345e289m210l019j411K87J864L352M396M695M604L861K681J266l86j853l140
$$ -5289 -9499 -12518 -13929 -13642 -11778 -8426 -4030 665 5269 9130 11811 13077 12691 10838 7698
2360G698l961m408m058l266k251r43N32J916L012L544L805L595K852J808N81o28
$$ 7698 3737 -671 -4729 -7995 -10246 -11189 -10657 -8741 -5729 -2185 1620 5215 8067 9875 10456 9828
2376I828j819k681l178l333l047k403j392l27P57J641K480K897K825K508J909
$$ 9828 8009 5328 2150 -1183 -4230 -6633 -8025 -8352 -7595 -5954 -3474 -577 2248 4756 6665
2391F665J038l7j109j847k363k664k634k099j325n37M03J341K110K443K373K128
$$ 6665 7703 7666 6557 4710 2347 -317 -2951 -5050 -6375 -6912 -6509 -5168 -3058 -615 1758 3886
2407C886J479P27k55j175j786k396k412k125j450q39K43J132J930K366K542K347
$$ 3886 5365 6092 5837 4662 2876 480 -1932 -4057 -5507 -6346 -6103 -4971 -3041 -675 1867 4214
2423D214J792Q37m8j079j866k537k832k513k141j226l01R91J989K618L052L176
$$ 4214 6006 6843 6795 5716 3850 1313 -1519 -4032 -6173 -7399 -7700 -6709 -4720 -2102 950 4126
2439D126K792J875Q36l39j559k690l369l444l349k763j794m00R88K150L080L809
$$ 4126 6918 8793 9629 9290 7731 5041 1672 -1772 -5121 -7884 -9678 -10078 -9090 -6940 -3860 -51
2455e1L919L377K529J390oj433k787l571m078m061l417k358j017L69J971L038
$$ -51 3868 7245 9774 11164 11158 9725 6938 3367 -711 -4772 -8189 -10547 -11564 -11195 -9224 -6186
2471f186L839M047L880L258K052N53q50k227l190l938m051l667k861j799l34J104
$$ -6186 -2347 1700 5580 8838 10890 11443 10593 8366 5176 1238 -2813 -6480 -9341 -11140 -11474 -10370
2487a0370K368L153L820L887L465K678J488K81j207k300l157l521l702l158k375
$$ -10370 -8002 -4849 -1029 2858 6323 9001 10489 10770 9563 7263 4106 585 -3117 -6275 -8650
2502h650j090J3J308K425L133L518L339K735K069Q50m28j564k391k985l198k879
$$ -8650 -9740 -9727 -8419 -5994 -2861 657 3996 6731 8800 9650 9222 7658 5267 2282 -916 -3795
2518c795k179j385l63P85J706K362K705K733K298J591P33k55j104j850k314k431
$$ -3795 -5974 -7359 -7722 -6937 -5231 -2869 -164 2569 4867 6458 7191 6936 5832 3982 1668 -763
2534g63k220j738j100j63O59J437J851K100K130J697J102M85l82j154j648k036
$$ -763 -2983 -4721 -5821 -5984 -5325 -3888 -2037 63 2193 3890 4992 5477 5095 3941 2293 257
2550B57j977j800j305o51K13Q90J436J953K026J900J386Q92J01p73j290j880k146
$$ 257 -1720 -3520 -4825 -5476 -5263 -4373 -2937 -984 1042 2942 4328 5220 5321 4548 3258 1378 -768
2567g68j996j732r91l21N38J208J896K194K359K004J579P49j18r00j630k183k567
$$ -768 -2764 -4496 -5487 -5808 -5270 -4062 -2166 28 2387 4391 5970 6719 6601 5701 4071 1888 -679
2584f79k303k009j346o07L31J384J946K568K692K529K101J268L79o30j582k370
$$ -679 -2982 -4991 -6337 -6944 -6613 -5229 -3283 -715 1977 4506 6607 7875 8254 7624 6042 3672
2600C672k790l031k665k183j337k02R77J773K688L090L155K715K082J027j03j277
$$ 3672 882 -2149 -4814 -6997 -8334 -8536 -7559 -5786 -3098 -8 3147 5862 7944 8971 8868 7591
2616G591k258k907l289l237k695j785p30M16J548K562L057L344L101K529J461
$$ 7591 5333 2426 -863 -4100 -6795 -8580 -9310 -8894 -7346 -4784 -1727 1617 4718 7247 8708
2631H708M05q26j837k695l272l208k813k218j067J0J187K175K885L151L077K591
$$ 8708 9113 8287 6450 3755 483 -2725 -5538 -7756 -8823 -8813 -7626 -5451 -2566 585 3662 6253
2647F253J748P61m11j491k398k789k942k637k121j188j70R31J705K346K764K644
$$ 6253 8001 8762 8351 6860 4462 1673 -1269 -3906 -6027 -7215 -7385 -6454 -4749 -2403 361 3005
2663C005K115J441N98l19j256j950k313k388k201j633p31oO98J361J940K085J978
$$ 3005 5120 6561 7159 6840 5584 3634 1321 -1067 -3268 -4901 -5632 -5638 -4940 -3579 -1639 446 2424
2680B424J616R82L80m57j117j553j898j883j625j234o13L7P55J268J644J753J708
$$ 2424 4040 5022 5402 4945 3828 2275 377 -1506 -3131 -4365 -4978 -4941 -4186 -2918 -1274 479 2187
2697B187J355Q91J96k92r35j518j697j757j548j207n86N4P18J202J697J904J739
$$ 2187 3542 4433 4629 4337 3402 1884 187 -1570 -3118 -4325 -4911 -4857 -4139 -2937 -1240 664 2403
2714B403J454R84L31l39r57j531j739j944j735j416o31q3P46J243J826J976K023
$$ 2403 3857 4841 5172 4833 3876 2345 606 -1338 -3073 -4489 -5120 -5203 -4457 -3214 -1388 588 2611
2731B611J773J240N06k50q97j592j934k240k091j742j158m38N05J175J817K266
$$ 2611 4384 5624 6130 5880 4983 3391 1457 -783 -2874 -4616 -5774 -6212 -5707 -4532 -2715 -449
2747d49K386K209J586J104O5p24j533k169k581k463k181j565p94J54J101J835
$$ -449 1937 4146 5732 6836 6901 6177 4644 2475 -106 -2569 -4750 -6315 -7109 -6955 -5854 -4019
2763d019K374K590K459J938J246M34n56j408k016k493k552k220j698r32JQ40J604
$$ -4019 -1645 945 3404 5342 6588 7022 6466 5058 3042 549 -2003 -4223 -5921 -6853 -6852 -6012 -4408
2780d408K150K445K379K057J477N46j97j018j656k142k359k232j761j106l74M52
$$ -4408 -2258 187 2566 4623 6100 6646 6449 5431 3775 1633 -726 -2958 -4719 -5825 -6199 -5747
2796e747J232J820K093K303K039J584Q29J63o83j441j822k112k082j823j164m95
$$ -5747 -4515 -2695 -602 1701 3740 5324 6153 6316 5633 4192 2370 258 -1824 -3647 -4811 -5306
2812e306J11Q46J575J808K042J875J346Q35J87n06j196j674j854j792j615j029
$$ -5306 -5195 -4349 -2774 -966 1076 2951 4297 5132 5319 4813 3617 1943 89 -1703 -3318 -4347
2828d347n28K24Q17J261J663J761J590J225P38R9n27j066j422j735j648j395r49
$$ -4347 -4875 -4651 -3834 -2573 -910 851 2441 3666 4404 4503 3976 2910 1488 -247 -1895 -3290 -4239
2845d239l76L40P85J301J600J695J599J004P25kn89j129j525j695j644j253q60
$$ -4239 -4615 -4275 -3490 -2189 -589 1106 2705 3709 4434 4432 3843 2714 1189 -506 -2150 -3403 -4263
2862d263k19M20R69J462J716J732J508J071M28j92p55j230j668j743j612j201
$$ -4263 -4482 -4062 -3093 -1631 85 1817 3325 4396 4824 4632 3877 2647 979 -764 -2376 -3577
2878c577p42j27N99J045J488J615J728J457J009M37o2q17j196j636j668j715j360
$$ -3577 -4319 -4446 -3847 -2802 -1314 301 2029 3486 4495 4932 4870 4053 2857 1221 -447 -2162 -3522
2895c522r47l47L23P72J419J590J775J607J229P75K31l80r98j473j754j716j617
$$ -3522 -4469 -4816 -4493 -3721 -2302 -712 1063 2670 3899 4674 4905 4525 3527 2054 300 -1416 -3033
2912c033j184p16q7N27J053J545J745J837J471J154N38K4o64j178j577j823j665
$$ -3033 -4217 -4933 -5020 -4493 -3440 -1895 -150 1687 3158 4312 4850 4874 4210 3032 1455 -368 -2033
2929b033j497j002l99J98P50J297J698J780J807J413Q96L72l50r18j446j731j838
$$ -2033 -3530 -4532 -4931 -4733 -3983 -2686 -988 792 2599 4012 4908 5280 4930 4012 2566 835 -1003
2946a003j722j289p44j18N60J110J627J779J790J636J072M69k04p06j410j664
$$ -1003 -2725 -4014 -4758 -4876 -4316 -3206 -1579 200 1990 3626 4698 5167 4963 4257 2847 1183
2962A183j854j660j342p87j91N06J104J361J663J675J483Q38L95k59p76j291j500
$$ 1183 -671 -2331 -3673 -4460 -4651 -4145 -3041 -1680 -17 1658 3141 3979 4374 4115 3339 2048 548
2979E48j590j507r85n41p0O01J051J338J520J442J163O39J69l53q31j203j366
$$ 548 -1042 -2549 -3534 -4075 -4145 -3544 -2493 -1155 365 1807 2970 3609 3778 3425 2594 1391 25
2996B5j384j210q19l11J36O54J028J380J390J224R98N71J05m68q58j152j386j300
$$ 25 -1359 -2569 -3388 -3699 -3563 -2909 -1881 -501 889 2113 3111 3682 3787 3319 2461 1309 -77 -1377
3014a377j092p05k70J84O46J103J351J289J237R72M67M4m30q28j199j386j352
$$ -1377 -2469 -3174 -3444 -3260 -2614 -1511 -160 1129 2366 3338 3805 3849 3419 2591 1392 6 -1346
3031a346j122q54l21R1N64J022J214J451J355R96P47K73l00o95j169j311j452
$$ -1346 -2468 -3322 -3643 -3552 -2988 -1966 -752 699 2054 3050 3797 4070 3770 3075 1906 595 -857
3048h57j450j092o83j79L53Q20J235J546J511J375J020O05O2m54j043j349j587
$$ -857 -2307 -3399 -4082 -4261 -3908 -3088 -1853 -307 1204 2579 3599 4204 4266 3812 2769 1420 -167
3065a67j545j332j013l94J00O54J182J450J644J588J189Q22K62k65p79j214j496
$$ -167 -1712 -3044 -4057 -4451 -4351 -3697 -2515 -1065 579 2167 3356 4178 4440 4175 3396 2182 686
3082F86j575j511r71p18m5M21Q86J347J437J609J351R19M62M6o61r79j312j521
$$ 686 -889 -2400 -3371 -4089 -4134 -3713 -2827 -1480 -43 1566 2917 3836 4298 4344 3683 2704 1392 -129
3100a29j446j193p46l12J42O66J118J302J437J247R50O36J23l85p90j133j265
$$ -129 -1575 -2768 -3514 -3826 -3684 -3018 -1900 -598 839 2086 3036 3672 3795 3410 2620 1487 222
3117B22j331j077q16l79LN59Q20J050J196J178Q90N17K00k89n22r29j063j122
$$ 222 -1109 -2186 -3002 -3381 -3378 -2819 -1999 -949 247 1425 2315 2832 3032 2743 2221 1292 229 -893
3135h93r54p52l15L1L54Q12R53J125J066P73O33J58k36o84q96j017j074j024o42
$$ -893 -1847 -2599 -2914 -2883 -2529 -1717 -764 361 1427 2200 2833 2991 2755 2071 1175 158 -916 -1940 -2582
3154b582k64M2N64Q24J130J156J010R11M61L7m52p92j094j115j228r59n50j79
$$ -2582 -2846 -2804 -2240 -1416 -286 870 1880 2791 3252 3289 2837 2045 951 -164 -1392 -2351 -2901 -3080
3172c080K26O71J046J233J300J092P68L54j55n54j009j222j381j181j065o01j67
$$ -3080 -2854 -2183 -1137 96 1396 2488 3256 3610 3455 2901 1892 670 -711 -1892 -2957 -3558 -3725
3189c725L82Q29J173J291J378J174Q98M67q0o40r82j314j442j364j087q00k83
$$ -3725 -3343 -2514 -1341 -50 1328 2502 3400 3867 3787 3147 2165 851 -591 -1955 -3042 -3842 -4125
3206d125K90P56J177J358J409J392J003N88J01m12q31j226j358j362j189r15m23
$$ -4125 -3835 -3079 -1902 -544 865 2257 3260 3848 3949 3537 2706 1480 122 -1240 -2429 -3344 -3767
3223c767ON08J006J123J361J354J111P20L41j35n49p96j170j285j194r87o71l60
$$ -3767 -3761 -3253 -2247 -1124 237 1591 2702 3422 3763 3628 3079 2283 1113 -172 -1366 -2353 -3024 -3384
3241c384J30N81Q64J116J194J224R61O22K89j86n34r91j075j219j184r30n38j84
$$ -3384 -3254 -2673 -1809 -693 501 1725 2686 3308 3597 3411 2877 1886 811 -408 -1592 -2522 -3060 -3244
3259c244J88O32R21J190J070J065Q49M25j6l46q08r36j138j103q83o24k26K06
$$ -3244 -3056 -2424 -1503 -313 757 1822 2671 3096 3080 2734 1926 990 -148 -1251 -2134 -2758 -2984 -2778
3277b778M38R57R98R74R70P06L34K6l59o80r36j009r19p30m27j47L56N97Q20J060
$$ -2778 -2340 -1383 -385 589 1559 2265 2599 2625 2266 1586 650 -359 -1278 -2008 -2435 -2582 -2226 -1629 -809 251
3297B51R88Q32M91J82j66n58q45r41j038r30o36l06J55N25P95J074J099R50P74
$$ 251 1239 2071 2562 2744 2578 2020 1175 234 -804 -1734 -2370 -2676 -2521 -1996 -1201 -127 972 1922 2696
3316B696L56j0l93p71j163j119j100q91n05j31K13O64R90J189J206J018P63M25
$$ 2696 3052 3042 2649 1878 715 -404 -1504 -2395 -2900 -3031 -2818 -2154 -1164 25 1231 2249 3012 3437
3334C437q9m71q65j113j250j283j025o94k99J07O82J014J269J242J285R24O69
$$ 3437 3348 2877 2012 899 -351 -1634 -2659 -3353 -3652 -3545 -2863 -1849 -580 662 1947 2871 3540
3351C540J69k83o62j065j315j419j152r79o03m9L40Q67J107J330J367J272Q27
$$ 3540 3709 3426 2764 1699 384 -1035 -2187 -3166 -3769 -3818 -3478 -2611 -1504 -174 1193 2465 3292
3368C292N01J1l94q53j164j335j288j208o64m62R6N21R65J148J281J190J028O95
$$ 3292 3793 3804 3410 2557 1393 58 -1230 -2438 -3102 -3564 -3468 -2947 -1982 -834 447 1637 2665 3360
3386C360L17k00n82q58j144j283j112q88n61j53K62O09R00J046J147R81P19L60
$$ 3360 3677 3477 2895 2037 893 -390 -1502 -2390 -2951 -3104 -2842 -2233 -1333 -287 860 1841 2560 2920
3404B920l2l17o93q93j005r07q56n45k10J40M25O63Q71Q41P18N33L59M1l39n46
$$ 2920 2888 2571 1878 985 -20 -927 -1783 -2328 -2538 -2398 -1973 -1310 -439 402 1120 1653 2012 2053 1714 1168
3424A168o52p15o18n45l26l5J93L77O19N96N95N32L60R9j71m08l95o04o90n16
$$ 1168 516 -199 -817 -1362 -1688 -1723 -1530 -1153 -534 62 657 1189 1549 1648 1477 1069 674 70 -620 -1136
3444a136l62j49J09L41M91O28O44P83M51L09m6k16m79o98q41p78o50m36k52J02
$$ -1136 -1498 -1647 -1538 -1197 -706 -78 566 1349 1800 2109 2063 1847 1368 670 -171 -949 -1599 -2035 -2287 -2185
3464b185N04O82Q47J007Q63P36L58P1k81o07r63j050j062j006o65l85Q9M03P85
$$ -2185 -1681 -999 -152 855 1718 2454 2812 2883 2602 1995 1032 -18 -1080 -2086 -2751 -3136 -3047 -2644 -1859
3483a859J024J239J158R83O67L46j98o01r40j257j294j283r80o97j52K09P98J119
$$ -1859 -835 404 1562 2545 3212 3558 3360 2759 1819 562 -732 -2015 -2995 -3692 -3844 -3635 -2837 -1718
3501a718J304J412J260J030N68J02m14q40j263j341j351j256p94m36R4N52R46
$$ -1718 -414 998 2258 3288 3856 3958 3544 2704 1441 100 -1251 -2507 -3301 -3737 -3643 -3091 -2145
3518b145J187J359J243J008O14L16k09n98r16j168j161j061q18m03j60L41O20
$$ -2145 -958 401 1644 2652 3266 3582 3373 2775 1859 691 -470 -1531 -2349 -2752 -2912 -2571 -1951
3535a951Q79R70R93P54O38L18j33l24o02o92q74p53o23l97j52J05L65N61O26O74
$$ -1951 -1072 -102 891 1645 2283 2601 2468 2144 1542 850 -24 -777 -1400 -1797 -1949 -1844 -1479 -918 -292 382
3555C82N83M47K15p6j43m20n54n90n12l90k69l4P6L88M24M74N78L14J98R2j01
$$ 382 965 1412 1627 1551 1408 988 434 -156 -668 -1058 -1327 -1361 -1285 -897 -473 1 579 893 1091 1183 1082
3576A082l21m08m69m77l37l08j38K05K33M19N51O07M63M25J63M1k39m94n62o42
$$ 1082 761 353 -116 -593 -930 -1238 -1376 -1171 -938 -519 32 639 1102 1527 1690 1731 1492 998 436 -206
3596b06o91n46l79j52N9M13O20P89Q45P83P12L76J09k04o45p31j020j037q82p00
$$ -206 -897 -1443 -1822 -1974 -1915 -1502 -882 -93 752 1535 2247 2623 2732 2528 1883 1152 132 -905 -1787 -2487
3616b487m46R7L63O94J038J088J104R05O64K52j34n40q61j091j224j078r87n87
$$ -2487 -2933 -2836 -2473 -1779 -741 347 1451 2356 3020 3272 3138 2598 1737 646 -578 -1656 -2643 -3230
3634c230k14K47O18R61J131J230J140Q42M60J63k40p12r45j168j169j040q49m34
$$ -3230 -3444 -3197 -2579 -1618 -487 743 1883 2725 3185 3348 3108 2396 1451 283 -886 -1926 -2775 -3209
3652c209nL51P06J031J084J045R63P18L55j2l67p60q95j042r17q24n04k83J89
$$ -3209 -3214 -2863 -2157 -1126 -42 1003 1966 2684 3039 3027 2660 1900 1005 -37 -954 -1778 -2282 -2565 -2376
3671b376M00O46Q55Q22Q46N74L98J06p8n48n87p19p23o02m91k31R1J92M06O58
$$ -2376 -1976 -1330 -475 347 1193 1767 2165 2271 2193 1645 1058 339 -384 -986 -1477 -1708 -1617 -1425 -1019 -361
3691c61N72N94M69K24K8j84l60m98n51n81m14k53l1J10L17N34N19N03M34K40O6
$$ -361 211 805 1274 1498 1526 1342 982 484 -67 -648 -1062 -1315 -1346 -1236 -919 -385 134 637 1071 1311 1377
3712A377j15m05n00n99n79n39k63r4J91M42O01N77O95O71L62K51j42l39n99p52
$$ 1377 1262 857 357 -242 -821 -1360 -1623 -1717 -1526 -1084 -483 94 789 1460 1822 2073 1931 1592 993 241
3732B41q14p31n78l45o3L30N21P07R69Q39Q09N50K73j6l58p03q02j009r26p80
$$ 241 -573 -1304 -1882 -2227 -2290 -1960 -1439 -732 237 1076 1885 2435 2708 2692 2334 1631 829 -180 -1106 -1886
3752a886o58k34J55L60P18R95J053R70Q28N23K24j44m73q08q87j079j001q01n30
$$ -1886 -2544 -2778 -2623 -2263 -1545 -550 503 1473 2301 2824 3048 2904 2431 1623 736 -343 -1344 -2145 -2675
3771b675k35J66L95Q11R59J016R11Q19M54K48j76m11o84r03j056r61p69n62j79
$$ -2675 -2910 -2744 -2349 -1538 -579 437 1348 2167 2621 2869 2693 2282 1598 695 -361 -1322 -2091 -2653 -2832
3790b832J55L80P03R42R24R49P88N14J94j38m58o35q64r33r13p07m66o1J45N35
$$ -2832 -2677 -2297 -1594 -652 272 1221 2009 2523 2717 2579 2121 1486 622 -311 -1224 -1931 -2397 -2458 -2313 -1778
3810a778O82Q13Q96P69N75L54l4k76n24o53p55o86o13l77j95J41L83N42N65N85
$$ -1778 -1096 -283 613 1382 1957 2311 2277 2001 1477 824 69 -617 -1230 -1607 -1802 -1661 -1278 -736 -171 414
3830D14N75L58J72o7j97m61n05o34m39l29j01N1K69L83N16M77M42L09L3q2k62
$$ 414 989 1347 1519 1452 1255 794 289 -345 -784 -1113 -1214 -1163 -894 -511 5 482 924 1233 1266 1184 922
3851I22n28m66n35m55l18j91J22L20M63O16O74N31M34K40r3l06m76o93o55p03
$$ 922 394 -72 -607 -1062 -1380 -1571 -1449 -1129 -666 -50 624 1155 1589 1829 1736 1430 954 261 -394 -1097
3871a097n61l25m4J94M47O35P89P45P16M97L80o2l49m85p18q02q55o85n21k03
$$ -1097 -1658 -1983 -2027 -1833 -1386 -751 38 783 1499 1996 2376 2314 1965 1480 762 -40 -895 -1580 -2101 -2304
3891b304j2L25N45P10R56Q72P58N68K14J7l52n67q22r11r09q48n75l08k1L53O14
$$ -2304 -2316 -1991 -1446 -736 220 1092 1850 2418 2632 2649 2297 1730 908 -3 -912 -1760 -2335 -2643 -2664 -2311 -1697
3912a697Q54R55Q54Q93O22K15K3l56o33p98r69r68q07n30l35Q7L42N77Q65R32
$$ -1697 -843 112 966 1859 2481 2696 2719 2363 1730 932 -37 -1005 -1812 -2342 -2677 -2590 -2248 -1671 -806 126
3932A26P83P91N23K11o8l35n66q17p97q11o48m44j17R8L00O12P29P89O44M92L94
$$ 126 909 1700 2223 2434 2366 2031 1465 648 -149 -960 -1608 -2052 -2169 -2071 -1771 -1159 -430 359 1003 1495 1889
3953A889J15j51m50n32n88o39o08l37j82N9K30M33M39M55N62L32K26P2j71l14
$$ 1889 2004 1853 1403 871 283 -356 -964 -1301 -1483 -1424 -1194 -761 -322 133 695 1027 1253 1325 1154 840
3973H40l47m28m46k87k29n2J94J90L16M20K99L02J46Nj37k77k99m64l34l47j47
$$ 840 493 65 -381 -668 -897 -949 -755 -565 -249 171 470 772 918 923 786 509 210 -254 -588 -935 -1082
3994a082J2J56L35K90M97M03M50K64Q2p2l19m32n44n65n45m51k59l5J78M38O24
$$ -1082 -1070 -914 -579 -289 208 611 1061 1325 1407 1335 1016 584 40 -525 -1070 -1521 -1780 -1815 -1637 -1199 -575
4015e75O78P39O04M83K71Ok99o20o87q30p93p02m95k04J17L97O35Q75R87P79P84
$$ -575 103 842 1446 1929 2200 2206 1907 1287 600 -230 -1023 -1725 -2220 -2424 -2307 -1910 -1275 -400 587 1366 2150
4036B150M45J11q4m23p63q95j058r32p16m94j51K34N02P66R58J053R89O81M39
$$ 2150 2595 2706 2622 2199 1436 541 -517 -1449 -2165 -2659 -2810 -2576 -2074 -1308 -350 703 1692 2373 2812
4055B812O2j95o65p95r38j013q37o78m11o4K78N35Q09Q84Q88P26O18L34j7k13
$$ 2812 2874 2679 2014 1219 281 -732 -1569 -2247 -2658 -2722 -2444 -1909 -1100 -216 672 1398 2016 2350 2333 2120
4075B120m82o08q51p68o17n33l02J0K18M12N72O68N86O34L42K25M7j33l44m24
$$ 2120 1638 1030 179 -589 -1206 -1739 -2041 -2031 -1813 -1401 -829 -161 425 1059 1401 1626 1673 1540 1196 772
4095G72o04m81n41k58j78J4J58J82N10M45M13L65J77J42l4j80j96l33m00l51j58
$$ 772 168 -313 -854 -1112 -1290 -1276 -1118 -936 -426 19 432 797 974 1116 1082 902 706 373 -27 -378 -536
4116e36o6n8Q6K16K46K55J88K16P6j19o8j55k89k01j35j88l2J0J75K96K67K59
$$ -536 -602 -660 -574 -358 -112 143 331 547 623 504 436 281 -8 -209 -344 -532 -564 -554 -379 -83 184 443
4138D43K59J83k4r4j78l44l53n77l18k43q1j4K78M79M38O00N81M44K48R6k21l95
$$ 443 702 885 861 767 589 245 -108 -685 -1003 -1246 -1327 -1341 -1063 -584 -146 454 1035 1479 1727 1823 1602 1207
4160A207n84o76o88o54n37k36R2L41M77O41R08P88O77L96K78n0m25m59q67r44
$$ 1207 623 -53 -741 -1395 -1932 -2168 -2076 -1735 -1258 -617 291 1079 1756 2152 2430 2380 1955 1496 629 -315
4180c15p52p13m70k34K13L72O89Q37Q09Q53N96N25J31j60m15o33q11r11p60o68
$$ -315 -1067 -1780 -2250 -2484 -2271 -1899 -1210 -373 436 1289 1885 2410 2541 2381 1966 1333 522 -389 -1149 -1817
$$ [...]
8191D26
##END NTUPLES=NMR FID
##END=
