##TITLE=1H_34-2023
 CDCl3
 8 sc, 
 19.5.2023
##JCAMPDX= 6.0         $$ Bruker NMR JCAMP-DX V2.0
##DATA TYPE= NMR FID
##DATA CLASS= NTUPLES
##ORIGIN= UXNMR, Bruker Analytische Messtechnik GmbH
##OWNER= root
$$ XWIN-NMR		Version 3.5
$$ Fri May 19 13:50:15 2023 Russian Standard Time (UT+4h)  she@DPX200
##.OBSERVE FREQUENCY= 200.13135
##.OBSERVE NUCLEUS= ^1H
##.DELAY= (6, 6)
##.ACQUISITION MODE= SIMULTANEOUS
##.ACQUISITION SCHEME= undefined
##.AVERAGES= 8
##.DIGITISER RES= 18
##SPECTROMETER/DATA SYSTEM= spect
##.PULSE SEQUENCE= zg30
##.SOLVENT NAME= CDCl3
##.SHIFT REFERENCE= (INTERNAL, CDCl3, 0, 15.7039)
##AUDIT TRAIL= $$ (NUMBER, WHEN, WHO, WHERE, WHAT)
$$ ##TITLE= Audit trail, XWIN-NMR		Version 3.5
$$ ##JCAMPDX= 5.01
$$ ##ORIGIN= Bruker BioSpin GmbH
$$ ##OWNER= she
$$ F:/spectra/data/she/nmr/H-F/1/audita.txt
$$ ##AUDIT TRAIL=  $$ (NUMBER, WHEN, WHO, WHERE, WHAT)
(   1,<2023-05-19 13:48:58.45 +0400>,<she>,<DPX200>,
      <created by zg, POWCHK disabled, PULCHK disabled
       configuration hash MD5:
       00 E9 B6 7A A2 85 ED C7 34 08 36 98 17 FE 4E 26
       data hash MD5: 16K
       C4 5B 5E 6F B8 B4 DA 02 72 8F BA 90 12 65 1B E6>)
$$ ##END=
$$ 
$$ hash MD5
$$ 9F A1 2D EA 5A BC 85 26 7C E7 E6 BA 7E 33 69 F2
##$RELAX= 
##$RELAX= 
##$RELAX= 
##$RELAX= 
##$RELAX= 
##$RELAX= 
$$ Bruker specific parameters
$$ --------------------------
##$DU= <F:/spectra>
##$EXPNO= 1
##$NAME= <H-F>
##$PROCNO= 1
##$TYPE= <nmr>
##$USER= <she>
##$AMP= (0..31)
100 100 100 100 100 100 100 100 100 100 100 100 100 100 100 100 100 100 
100 100 100 100 100 100 100 100 100 100 100 100 100 100 
##$AQSEQ= 0
##$AQ_mod= 1
##$AUNM= <au_zg>
##$AUTOPOS= <>
##$BF1= 200.13
##$BF2= 200.13
##$BF3= 200.13
##$BF4= 200.13
##$BF5= 200.13
##$BF6= 200.13
##$BF7= 200.13
##$BF8= 200.13
##$BYTORDA= 1
##$CFDGTYP= 0
##$CFRGTYP= 5
##$CHEMSTR= <none>
##$CNST= (0..31)
1 1 145 1 1 1 1 1 1 1 1 1 1 1 1 1 1 1 1 1 1 1 1 1 1 1 1 1 1 1 1 1 
##$CPDPRG= <>
##$CPDPRG1= <>
##$CPDPRG2= <>
##$CPDPRG3= <>
##$CPDPRG4= <mlev>
##$CPDPRG5= <mlev>
##$CPDPRG6= <mlev>
##$CPDPRG7= <mlev>
##$CPDPRG8= <mlev>
##$CPDPRGB= <>
##$CPDPRGT= <>
##$D= (0..31)
0 1.2 0 0 0 0 0 0 0 0.06 0 0.03 0 0 0 0 0.0002 0 0 0 0 0 0 0 0 0 0 0 0 
0 0 0 
##$DATE= 1684489737
##$DBL= (0..7)
120 120 120 120 120 120 120 120 
##$DBP= (0..7)
150 150 150 150 150 150 150 150 
##$DBP07= 0
##$DBPNAM0= <>
##$DBPNAM1= <>
##$DBPNAM2= <>
##$DBPNAM3= <>
##$DBPNAM4= <>
##$DBPNAM5= <>
##$DBPNAM6= <>
##$DBPNAM7= <>
##$DBPOAL= (0..7)
0.5 0.5 0.5 0.5 0.5 0.5 0.5 0.5 
##$DBPOFFS= (0..7)
0 0 0 0 0 0 0 0 
##$DE= 6
##$DECBNUC= <off>
##$DECIM= 32
##$DECNUC= <off>
##$DECSTAT= 4
##$DIGMOD= 1
##$DIGTYP= 9
##$DL= (0..7)
0 120 120 120 120 120 120 120 
##$DP= (0..7)
150 150 150 150 150 150 150 150 
##$DP07= 0
##$DPNAME0= <>
##$DPNAME1= <>
##$DPNAME2= <>
##$DPNAME3= <>
##$DPNAME4= <>
##$DPNAME5= <>
##$DPNAME6= <>
##$DPNAME7= <>
##$DPOAL= (0..7)
0.5 0.5 0.5 0.5 0.5 0.5 0.5 0.5 
##$DPOFFS= (0..7)
0 0 0 0 0 0 0 0 
##$DQDMODE= 0
##$DR= 18
##$DS= 0
##$DSLIST= <SSSSSSSSSSSSSSS>
$$ [...]
##$SUBNAM2= <"">
##$SUBNAM3= <"">
##$SUBNAM4= <"">
##$SUBNAM5= <"">
##$SUBNAM6= <"">
##$SUBNAM7= <"">
##$SUBNAM8= <"">
##$SUBNAM9= <"">
##$SW= 16.0151230935494
##$SWIBOX= (0..15)
0 0 2 0 0 0 0 0 0 0 0 0 0 0 0 0 
##$SW_h= 3205.12820512821
##$TD= 16384
##$TD0= 1
##$TE= 0
##$TE2= 300
##$TE3= 300
##$TEG= 300
##$TL= (0..7)
0 120 120 120 120 120 120 120 
##$TP= (0..7)
150 150 150 150 150 150 150 150 
##$TP07= 0
##$TPNAME0= <>
##$TPNAME1= <>
##$TPNAME2= <>
##$TPNAME3= <>
##$TPNAME4= <>
##$TPNAME5= <>
##$TPNAME6= <>
##$TPNAME7= <>
##$TPOAL= (0..7)
0.5 0.5 0.5 0.5 0.5 0.5 0.5 0.5 
##$TPOFFS= (0..7)
0 0 0 0 0 0 0 0 
##$TUNHIN= 0
##$TUNHOUT= 0
##$TUNXOUT= 0
##$USERA1= <user>
##$USERA2= <user>
##$USERA3= <user>
##$USERA4= <user>
##$USERA5= <user>
##$V9= 5
##$VALIST= <valist>
##$VCLIST= <CCCCCCCCCCCCCCC>
##$VD= 0
##$VDLIST= <DDDDDDDDDDDDDDD>
##$VPLIST= <PPPPPPPPPPPPPPP>
##$VTLIST= <TTTTTTTTTTTTTTT>
##$WBST= 1024
##$WBSW= 4
##$XGAIN= (0..3)
0 0 0 0 
##$XL= 0
##$YL= 0
##$YMAX_a= 246345
##$YMIN_a= -304621
##$ZGOPTNS= <>
##$ZL1= 120
##$ZL2= 120
##$ZL3= 120
##$ZL4= 120
##$ABSF1= 10
##$ABSF2= 0
##$ABSG= 5
##$ABSL= 3
##$ALPHA= 0
##$AQORDER= 0
##$ASSFAC= 0
##$ASSFACI= 0
##$ASSFACX= 0
##$ASSWID= 0
##$AUNMP= <proc_1d>
##$AZFE= 0.1
##$AZFW= 0.1
##$BCFW= 1
##$BC_mod= 2
##$BYTORDP= 1
##$COROFFS= 0
##$CY= 11.3945322036743
##$DATMOD= 1
##$DC= 2
##$DFILT= <>
##$DTYPP= 0
##$F1P= 15.7292609196834
##$F2P= 12.9074282941183
##$FCOR= 0.5
##$FTSIZE= 0
##$FT_mod= 4
##$GAMMA= 1
##$GB= 0.15
##$INTBC= 1
##$INTSCL= 1
##$ISEN= 128
##$LB= 0.24
##$LEV0= 0
##$LPBIN= 0
##$MAXI= 10000
##$MC2= 0
##$MEAN= 0
##$ME_mod= 0
##$MI= 1.114404
##$NCOEF= 0
##$NC_proc= 0
##$NLEV= 6
##$NOISF1= 3.799351
##$NOISF2= 2.8
##$NSP= 1
##$NTH_PI= 0
##$NZP= 0
##$OFFSET= 15.70392
##$PC= 1
##$PHC0= -19899.18
##$PHC1= 8.452719
##$PH_mod= 1
##$PKNL= yes
##$PPARMOD= 0
##$PSCAL= 0
##$PSIGN= 0
##$REVERSE= no
##$SF= 200.130013532006
##$SI= 16384
##$SIGF1= 3
##$SIGF2= 2
##$SINO= 400
##$SIOLD= 16384
##$SREGLST= <1H.CDCl3>
##$SSB= 0
##$STSI= 0
##$STSR= 0
##$SW_p= 3612.71676300578
##$SYMM= 0
##$S_DEV= 0
##$TDeff= 0
##$TDoff= 0
##$TI= <>
##$TILT= no
##$TM1= 0
##$TM2= 0
##$TOPLEV= 0
##$USERP1= <user>
##$USERP2= <user>
##$USERP3= <user>
##$USERP4= <user>
##$USERP5= <user>
##$WDW= 1
##$XDIM= 8192
##$YMAX_p= 0
##$YMIN_p= 0
$$ End of Bruker specific parameters
$$ ---------------------------------
##NTUPLES= NMR FID
##VAR_NAME=  TIME,          FID/REAL,        FID/IMAG
##SYMBOL=    X,             R,               I
##VAR_TYPE=  INDEPENDENT,   DEPENDENT,       DEPENDENT
##VAR_FORM=  AFFN,          ASDF,            ASDF
##VAR_DIM=   8192,          8192,            8192
##UNITS=     SECONDS,       ARBITRARY UNITS, ARBITRARY UNITS
##FACTOR=    0.000312,      1,               1
##FIRST=     0,             0,               0
##LAST=      2.555592,      0,               0
##MIN=       0,             -304621,         0
##MAX=       2.555592,      246345,          0
$$ Real data points
##PAGE= N=1
##DATA TABLE= (X++(R..R)), XYDATA
$$ [...]
2489B434l833K231k75k020L254l975L613k456Q37Q66k638M028m266L213j170j048
2505a205L183m123L992k967J275P62k229L518l800L239k050J53J828l578M204
2520B202l960K494l08j832L323m059L800k238L08J261k832L519l549K822r58q28
2536h35K574l907M283l289J748L69k401L903m115L016j355o71K197l481L860l138
2552a242J485J51j811L533m139L626k619M38J467k759L635l250J941l27j074K845
2568A900l837L565k740J355P00k416L909m224L227j316r55K544l592L874l169
2583a175J267K94k027L494m050L778k398N72J442l187M092l822K653l84j746L275
2599B078m005L903k423L82J226k685L525l734K882j108q62K249l497L853l092
$$ plain form
2489 2434 -1399 832 557 -1463 1791 -2184 1429 -1027 -190 676 -1962 2066 -2200 1013 -157 -1205
2505 -1205 1978 -2145 1847 -1120 155 917 -1312 2206 -1594 1645 -405 -252 1576 -2002 2202
2520 2202 -1758 736 428 -1404 1919 -2140 1660 -578 -270 991 -1841 1678 -1871 951 -7 -835
2536 -835 1739 -2168 2115 -1174 574 943 -1458 2445 -1670 1346 -9 -680 1517 -1964 1896 -1242
2552 -1242 243 394 -1417 2116 -2023 1603 -1016 -578 889 -1870 1765 -1485 456 129 -945 1900
2568 1900 -1937 1628 -1112 243 943 -1473 2436 -1788 1439 123 -832 1712 -1880 1994 -1175
2583 -1175 92 386 -1641 1853 -2197 1581 -817 -245 1197 -1990 2102 -1720 933 549 -1197 2078
2599 2078 -1927 1976 -447 -65 1161 -1524 2001 -1733 1149 41 -821 1428 -2069 1784 -1308
2614a308J704K57k380L466l537L071j739j14J880l003L340l189K570m52j650L195
2630B111m013L705k615O77J711l041L359l441K388o91j090K210l288L420k832
2645a430J559L90k211L566l771L272j782l64K447l357L576k998J464K11j675L155
2661B052l735L464k524N82J260k815L868l905K469o81j408K873l568L522k508
2676a054J106O90k240L518l679K862j516j90K165l627L903k985J683P0k047L316
2692A975l717L247j936O6J336k840L766l836K645n13j434K906l826L617k552Q64
2708b32J121k570L397l044K189r51m43J976k973L549l209J800J3k273L919m106
2724a837L078j669j00J636k733L361l232J957l45j127K751l836L872k859R93J136
$$ plain form
2614 -1308 396 653 -1727 1739 -1798 1273 -466 -580 1300 -1703 1637 -1552 1018 566 -1084 2111
2630 2111 -1902 1803 -812 -135 1576 -1465 1894 -1547 841 150 -940 1270 -2018 1402 -1430
2645 -1430 129 519 -1692 1874 -1897 1375 -407 -771 1676 -1681 1895 -1103 361 572 -1103 2052
2661 2052 -1683 1781 -743 -161 1099 -1716 2152 -1753 716 35 -1373 1500 -2068 1454 -1054
2676 -1054 52 742 -1498 2020 -1659 1203 -313 -503 1662 -1965 1938 -1047 636 706 -1341 1975
2692 1975 -1742 1505 -431 -365 971 -1869 1897 -1939 706 193 -1241 1665 -2161 1456 -1096 -232
2708 -232 889 -1681 1716 -1328 861 -90 -533 1443 -1530 2019 -1190 610 623 -1650 2269 -1837
2724 -1837 1241 -428 -528 1108 -1625 1736 -1496 461 116 -1011 1740 -2096 1776 -1083 -90 1046
2740A046k731L688l555K694r66j153K822l515L326k703J509J28k148L275l630
2755a913L153j801k55J966l218L725l104J833J88j919K919l537L249k063P64J140
2771A127k699L497l425K605p33j116K602l668L439k663J074R05k524L276l606
2786a909K857j377k33J719l041L674l196K156j83j697L043l713L324k126L54J713
2802A365k757L149l027K079o15j079K564l486L277k501R25Q60k448L480l375K479
2818H90j199m52J970l102L428k668J534r7j486K935l377L024k074M73J413k730
2834a518L446l338K031m31j238K750l431L097k227R05P36k522L342l295K789j117
2850b1p08K614l837L459k284Q49R27k343K887l056K972j913N7J605k933L606l287
$$ plain form
2740 1046 -1685 2003 -1552 1142 176 -977 1845 -1670 1656 -1047 462 590 -1558 1717 -1913
2755 -1913 1240 -561 -816 1150 -2068 1657 -1447 386 574 -1345 1574 -1963 1286 -777 -13 1127
2771 1127 -1572 1925 -1500 1105 372 -744 1858 -1810 1629 -1034 40 945 -1579 1697 -1909
2786 -1909 948 -429 -662 1057 -1984 1690 -1506 650 467 -1230 1813 -1900 1424 -702 -348 1365
2802 1365 -1392 1757 -1270 809 194 -885 1679 -1807 1470 -1031 -106 754 -1694 1786 -1589 890
2818 890 -309 -761 1209 -1893 1535 -1133 401 304 -1182 1753 -1624 1400 -674 -201 1212 -1518
2834 -1518 1928 -1410 621 190 -1048 1702 -1729 1368 -859 46 782 -1740 1602 -1693 1096 -21
2850 -21 -729 1885 -1952 1507 -777 72 999 -1344 1543 -1513 1459 -454 -397 1208 -1725 1881 -1406
2867a406K075k89j439K776l577L185k009L78J225k453L174l412K837j123p08K335
2883A569l214L444k554R71N48k064L039l425K575j118m16J816k812L177k933J899
2899E02k54j506K855l511L095j963M74J247k698L331k919J873k17j287K462l289
2915a805L166k194R20P06k167L069l147K472j173p31K399l078L054k657J608j13
2931C29j767K968l287K747j863M93J365k629L431l022J992l40j222K414l109K885
2947A385k075O19J039k077K801l079K189j232o8J815l152L387k805J449J64j613
2963a253K735l113K534j392J42J402k613L282k807J611n6j493K730l183L082k416
2979h08M68J357k638L028k947K257p78r43K251k848K884k287J123L54j912L208
$$ plain form
2867 -1406 669 380 -1059 1717 -1860 1325 -684 -306 919 -1534 1640 -1772 1065 -58 -766 1569
2883 1569 -1645 1799 -755 216 764 -1300 1739 -1686 889 -229 -645 1171 -1641 1536 -1397 502
2899 502 248 -1258 1597 -1914 1181 -782 -308 939 -1759 1572 -1347 526 309 -978 1484 -1805
2915 -1805 1361 -833 87 793 -1374 1695 -1452 1020 -153 -884 1515 -1563 1491 -1166 442 329
2931 329 -1438 1530 -1757 990 -873 -380 985 -1644 1787 -1235 757 417 -805 1609 -1500 1385
2947 1385 -690 -71 968 -1109 1692 -1387 802 -430 -498 1317 -1835 1552 -1253 196 360 -1253
2963 -1253 1482 -1631 903 -489 -347 1055 -1558 1724 -1083 528 472 -1021 1709 -1474 1608 -808
2979 -808 -340 1017 -1621 1407 -1540 717 -61 -1004 1247 -1601 1283 -1004 119 473 -1439 1769
2995A769l482L008j346l57J808l120L299k754J830k96j072K063k732K588j804
3010e98M77J311k992L265k998K212m20j281K215l048L102k098J039O58k134K854
3026A564l015K332q89l24J541k752L225k777J484Q6j684K675k993K658j835N20
3042a84R88k169K663k646J837m32j266K420l062K966j881O10J020k127K731k642
3058a174K015j022j75J789k972K996k221Q69N47j665K593l127K531j548j13J649
3074I72k341K869k916K063k12j323K275l042L056k005N93R82k379K898k699K122
3090I13q46p61J897k452K661k108P56M41j717K530k735K523j611J13J680k843
3106a559K928k640J823j46j358K200k594K747j868M35O93j996K742k389J638m77
$$ plain form
2995 1769 -1713 1295 -51 -408 1400 -1720 1579 -1175 655 359 -713 1350 -1382 1206 -598
3010 -598 -121 1190 -1802 1463 -1535 677 257 -1024 1191 -1857 1245 -853 186 844 -1290 1564
3026 1564 -1451 881 -8 -332 1209 -1543 1682 -1095 389 475 -1209 1466 -1527 1131 -704 -184
3042 -184 804 -1365 1298 -1348 489 57 -1209 1211 -1851 1115 -766 -156 864 -1263 1468 -1174
3058 -1174 841 -181 -356 1433 -1539 1457 -764 105 652 -1013 1580 -1547 984 -564 -677 972
3074 972 -1369 1500 -1416 647 435 -888 1387 -1655 1401 -604 -11 971 -1408 1490 -1209 913
3090 913 67 -694 1203 -1249 1412 -696 60 501 -1216 1314 -1421 1102 -509 -396 1284 -1559
3106 -1559 1369 -1271 552 406 -952 1248 -1346 1401 -467 -32 661 -1335 1407 -982 656 179
3122A79j025K097k854L009k263P63N38j462K186k533K117j348K4J521k341K901
3138A509k698J762j99j166K301k651K360j657L33J236k467K869k461J633o22j055
3154i73K129k495K579k144Q54M30j583K586k630K095j111n97J744k412K819k148
3170h57J459k20j338K475k853K416j341J5J346k391K485k048J344m49q50J997
3186A190k471K198j604P97O44j918K635k680J774m20q41J826k243K502j902O26
3202A13L50j362K127k303K405j725L02J091k290K678k269J160k24j056K212k441
3218a232K224j404M00N88k021K772k506K053q12q12J953k411K693k187R56M41
3234F95j722K121k471K253j076k28J189j834K167k104J614k68j296K113k581K149
$$ plain form
3122 179 -846 1251 -1603 1406 -857 -94 444 -1018 1168 -1365 752 -596 -572 949 -1392 1509
3138 1509 -1189 573 374 -792 1509 -1142 1218 -439 -106 1130 -1337 1532 -929 704 82 -973
3154 -973 1156 -1339 1240 -904 -50 380 -1203 1383 -1247 848 -263 -860 884 -1528 1291 -857
3170 -857 602 382 -956 1519 -1334 1082 -259 -244 1102 -1289 1196 -852 492 43 -807 1190
3186 1190 -1281 917 -687 110 754 -1164 1471 -1209 565 145 -696 1130 -1113 1389 -513 113
3202 113 463 -899 1228 -1075 1330 -395 -93 998 -1292 1386 -883 277 53 -1003 1209 -1232
3218 -1232 992 -412 -12 576 -1445 1327 -1179 874 62 -750 1203 -1208 1485 -702 254 695
3234 695 -1027 1094 -1377 876 -200 -428 761 -1073 1094 -1010 604 336 -960 1153 -1428 721
3250G21j215J80J146k055K340k418J751l25p25J808k382K399j752N27Q92j871
3266i79K367k522J900o96p46J888k406K324k181J478k83r49J782k221K195j682
3282g31K98J339j997K312k271J521k36j097K228k566K292j446M97N99j743K406
3298A405k373J462o56o67J872k440K375j820J018l5j155K312k333J893j340J35
3314c47R81j828K318k220J576k73q59J716k219K198j576L57R02j620J892j894
3330h96J424n10o84J496k017K099j622P43K42j278K271k493J924o87k08J093k082
3347a185K448j975R17jp06J189j946K442j662K88P39j590K130k003J298n76m63
3364f56J688k187K218j728P74O50j546J863k093J801q40m78J394j993K226j695
$$ plain form
3250 721 -494 -314 832 -1223 1117 -1301 450 125 -600 1208 -1174 1225 -527 0 892 -979
3266 -979 1388 -1134 766 70 -676 1212 -1194 1130 -1051 427 144 -805 977 -1244 951 -731
3282 -731 -433 906 -1091 1221 -1050 471 235 -862 1366 -1200 1092 -354 143 742 -1001 1405
3298 1405 -968 494 -162 -829 1043 -1397 978 -842 176 141 -1014 1298 -1035 858 -482 -347
3314 -347 634 -1194 1124 -1096 480 207 -652 1064 -1155 1043 -533 -176 726 -894 998 -896
3330 -896 528 18 -666 830 -1187 912 -710 33 275 -1003 1268 -1225 699 12 -196 897 -1185
3347 -1185 1263 -712 205 204 -502 687 -1259 1183 -479 -191 548 -1042 1088 -915 383 -193 -656
3364 -656 1032 -1155 1063 -665 109 759 -787 1076 -1017 784 -56 -534 860 -1133 1093 -602
3380f02J007M2j158J967k343J754j224K90R44j858K066j967J510m32p55J839k374
3397a294K211j410M55P66j810K024j720J319l63o12J297j946J894j533R06J87
3413C71j185J816k078J562r11K4J267k020K126j927J187k90p03J743k268K528
3429A242j860N13R77j816K012k097J395j13p26J476j987J946j572O50L61j116
3445g15J539j965J727p64l11J027j464J759j539R36L66j073J720k386J811j045
3461c77L20Q69j590J619j492J195m66o26J540k034J935j546O86M31j329J866j989
3478i88J464p85QJ095j704J761j662J089J30j051J800j995J600j091L02O75j580
3495i32J868j787J511r33j77J103j740J733j317Q00L67j604K014j978J562p64
$$ plain form
3380 -602 405 447 -711 1256 -1087 667 -557 -267 677 -1181 885 -1082 428 -4 -759 1080 -1294
3397 -1294 917 -493 -38 728 -1082 942 -778 541 178 -434 863 -1083 811 -722 184 371
3413 371 -814 1002 -1076 486 -425 -401 866 -1154 972 -955 232 -58 -761 982 -1286 1242
3429 1242 -618 -105 872 -944 1068 -1029 366 253 -473 1003 -984 962 -610 40 401 -715
3445 -715 824 -1141 586 -178 -489 538 -926 833 -706 230 596 -477 1243 -1143 668 -377
3461 -377 -57 812 -778 841 -651 544 78 -548 992 -1042 893 -653 33 464 -865 1001 -988
3478 -988 476 -309 -301 794 -910 851 -811 278 408 -643 1157 -838 762 -329 -27 648 -932
3495 -932 936 -851 660 -273 -450 653 -1087 646 -671 129 496 -1108 906 -1072 490 -274
3511b74r5J257j888J968j687Q16L67j186J596j833J794j014M3Q67j603J959j816
3528g29J091r2j135J641j872J919j250K45N22j367K077k021J546m31n25J349j867
3545h99J894j539P18L77j246J579j665J324p50j13R08j495J963j995J282l61n17
3562e35J281j588J723j236J75P68j571J750j420R22k03l92J240j671J592j300
3578d65P78J95r95J328j685J458p01k83J199j836J829j506Q92j7p92J477j726
3595h50J497r59m9J065j857K075j871J440j08q57J458j914J508j053O81L76j151
3612e69J574j712J196n74l26J290j819J754j468Q75q9p39J265j479J650j261J62
3629b70R27j628J948j531Q12k09m28J408j920J839j152J60K56j117J776j663J535
$$ plain form
3511 -274 -369 888 -1000 968 -719 97 464 -722 874 -959 835 -179 -136 731 -872 1087 -729
3528 -729 362 270 -865 776 -1096 823 -427 -182 340 -1027 1050 -971 575 144 -381 968 -899
3545 -899 995 -544 174 551 -695 884 -781 543 -207 -320 588 -907 1056 -939 343 -18 -535
3562 -535 746 -842 881 -355 -180 588 -983 767 -653 269 66 -326 914 -757 835 -465
3578 -465 313 508 -487 841 -844 614 -87 -370 829 -1007 822 -684 208 191 -601 876 -850
3595 -850 647 -312 -361 704 -1153 922 -949 491 383 -474 984 -930 578 -475 206 582 -569
3612 -569 1005 -707 489 -85 -411 879 -940 814 -654 221 132 -607 658 -821 829 -432 -270
3629 -270 657 -971 977 -554 258 49 -379 1029 -891 948 -204 -44 212 -905 871 -792 743
3646G43p93l21J244j804J810j266N06M03j185J494j701J558p00k72J072j591J695
3663H92j549J118r4p46J105j441J524j233M22M19j443K090j830J078l34o32J541
3680H87j874J794j387O98J39r94J798j616J032o06l2R55j585J614j354P31m9q12
3698f61J475j447J298j010l8Q02j430J812j641R73j24n48J368j748J692j379O45
3715C9M09j421J775j505J227m12k83Q98j608J755j518R83j79r24J759j994J465
3732D66j003J48O89j289J821j792J177q8p49J451j750J477j125O24O83j072J421
3749A089j933J212l32l35R93j552J567j137O01J42j011J350j620J431n99j24O92
3766D34j186J382j420R10J14p03J079j494J593q93J99N20j352J678j468J242n54
$$ plain form
3646 743 -50 -371 873 -931 879 -387 119 522 -663 831 -870 688 -12 -284 788 -803 892
3663 892 -657 461 367 -379 726 -715 809 -424 -2 417 -1026 1064 -766 312 -22 -654 887
3680 887 -987 807 -580 118 257 -737 1061 -555 477 -129 -161 794 -791 823 -531 200 151 -661
3698 -661 814 -633 665 -345 -383 419 -1011 801 -840 133 9 -539 829 -919 773 -606 39
3715 39 448 -973 802 -703 524 112 -171 727 -881 874 -644 339 160 -764 995 -999 466
3732 466 -537 -389 300 -989 832 -960 217 129 -620 831 -919 558 -567 57 740 -332 1089
3749 1089 -844 368 36 -299 694 -858 709 -428 173 315 -696 654 -966 465 -134 -258 434
3766 434 -752 630 -790 120 234 -469 610 -884 709 -184 15 535 -817 861 -607 635 81
3783H1n67J256j695J870j571O81J14n98J454k070J555n97l36Q82j031J191j244
3800f25J069j29q76J815k121J662q56J5M38r84J478j500J015m09n46J387j751
3817i18J505j121O52k9r11J407j524J441q16JR80j736J811j347Q70J16j004J339
3835G16j425J502j039N9Q00j127J300j332P59l73l80J334j764J572q98J50N56
3852D10j108J422j393J157o35j52J198j688J476j066N36K31j217J755j544J193
3868E75r99M25N90j388J583j573J076l31l23J192j691J264o67J65N69j156J492
3885H03j602J058k19l33Q32j244J538j222M19L91q57J168j316R76m41R8M36j301
3903h16J508j172P76j84p25J268j576J449q80K69P31j334J525j597J221m83j39
$$ plain form
3783 81 -486 770 -925 945 -626 55 169 -429 1025 -1045 510 -87 -423 459 -572 619 -625
3800 -625 444 315 -561 1254 -867 795 -61 -46 392 -592 886 -614 401 -8 -554 833 -918
3817 -918 587 -534 118 89 -822 585 -939 502 -314 -313 667 -1069 742 -605 265 381 -623 716
3835 716 -709 793 -246 -187 613 -514 786 -546 213 -160 -540 794 -970 602 -296 -146 410
3852 410 -698 724 -669 488 -147 -299 899 -789 687 -379 157 388 -829 926 -618 575
3868 575 -424 1 591 -797 786 -787 289 -42 -365 827 -864 400 -267 -102 467 -689 803
3885 803 -799 259 40 -293 539 -705 833 -389 30 421 -436 732 -584 392 -49 49 485 -816
3903 -816 692 -480 296 112 -613 655 -921 528 -352 -83 648 -686 839 -758 463 -20 -159
3920a59P70j473J541j145N88K60j005J262j364J287q91k8J065j381J599j607Q87
3937B06k63n16J172j311J365q72j5P05j189J474j281P90k86n55J236j472J416
3954F04r72J56N56q43J394j583J164m84k53R63j595J645j378P30M18j019J196
3971F99j223J035o79k4P05j126J381j181O39o4o83J174j270J105q25K35M76q49
3989d75J219j535J313n80j38J028j672J451j006M04O6n56J311j671J273o04J92
4006B0N46j096J403j377P66J60j071J146j279J406r92J83O70j054J200j314P33
4023E0l6m77R94j251J346j069P26N1r69J582j506J208q03j49R91j137J159j351
4041f41Q19l1p51J292j416J227p98P4O89j254J521j356P14J27m70P94j256J263
$$ plain form
3920 -159 611 -862 679 -466 122 382 -623 639 -725 562 -329 -357 708 -673 926 -681 206
3937 206 -57 -573 599 -712 653 -219 -234 471 -718 756 -525 265 -21 -576 660 -812 604
3954 604 -368 -212 344 -499 895 -688 476 -8 -261 702 -893 752 -626 104 522 -497 699
3971 699 -524 511 -168 -192 513 -613 768 -413 226 162 -521 653 -617 488 -337 -102 374 -475
3989 -475 744 -791 522 -58 -196 832 -840 611 -395 9 75 -481 830 -841 432 -172 20
4006 20 566 -530 873 -504 262 422 -649 497 -782 624 -368 -185 485 -569 631 -683 50
4023 50 14 -463 531 -720 626 -443 283 334 -635 947 -559 649 -154 -303 688 -449 710 -641
4041 -641 178 147 -604 688 -728 499 -299 -225 464 -790 731 -625 89 216 -254 540 -716 547
4059E47p83L01K14q70J436j471J106n37l94J255j415J250r51M04M9r10J532j367
4077f04J017o35l6N72r97J334j147P32k20o00J118j238J353p64n8O67r78J273
4095G89j379R45l84m45J062j250J248j244M49M00o79J054j294J088n13k05P67
4112D09j143J308r82O43m8o74J076j126J192q47J89N40j158J081q60P66m76r9
4130b09P28j150J227q63L44n5m66Q95r11R26n19n8P05j070J024q10M85M5o39J071
4150G00j217J016p92J26O41r90J232j397R15j72m94J190j429J052p65L15M99j262
4168h32J318j013Q85l44l20O79q38Q98q47O12j85m37P66p42Q44m09l3L3n72J281
4188G44j117M12k06j15P50j054Q82p31L14K96p87J256r80M74j86j69O77j229J312
$$ plain form
4059 547 -236 65 279 -591 845 -626 480 -57 -451 804 -611 639 -312 92 141 -769 763 -604
4077 -604 413 -222 -258 314 -683 651 -496 236 16 -584 534 -704 649 -115 -173 494 -484 789
4095 789 -590 355 -29 -474 588 -662 586 -658 -209 191 -488 566 -728 360 -153 -358 409
4112 409 -734 574 -408 235 187 -487 589 -537 655 -192 -3 537 -621 460 -400 366 -110 -209
4130 -209 519 -631 596 -267 77 22 -444 451 -460 466 -53 -111 594 -476 548 -262 223 268 -371 700
4150 700 -517 499 -293 -167 474 -516 716 -681 234 62 -432 758 -671 381 -384 -69 430 -832
4168 -832 486 -527 358 14 -306 373 -465 433 -414 198 13 -424 342 -400 444 35 2 35 -537 744
4188 744 -373 39 -167 -282 468 -586 296 -435 -121 175 -612 644 -336 138 -48 -217 460 -769 543
4207E43q05K83K19m26Q30j212R40l83N7M30r01J095j119O24L4n40R52j235J020
4226D06p67J93M57q15J148q81O08k72k46Q66j193J003o94J36N82q67J058j196
4244d74Q15n67K35K10p83J280r36M74l37l88J222j278J130j053M53M20q27J112
4262G08j223P52j13j29K71o66Q40n48K04J19o68J122j149P16j77k94M85o83P01
4281B68n64L62rl05N75r30J156o80K50J71o40J078j096M68K31n85O58p17P65n48
4301i2jL41o34P91o69L95j88j93O61p78P39o78M06L28r22R72r33N84j55k54O61
4322C81p86R38q11M47K37p62P66q58R94o52J1N06r49R92q47O04o2n08Q31j017
4342e45R67o17J90K76o43Q85q10Q09o48J16L80o88Q03q95O01j80l93Q33r21Q69
$$ plain form
4207 543 -262 21 240 -186 644 -568 372 -11 46 476 -425 670 -449 175 209 -331 621 -614 406
4226 406 -361 -168 289 -526 622 -259 349 77 -169 697 -496 507 -187 -51 531 -336 722 -474
4244 -474 341 -226 9 219 -564 716 -220 254 -83 -471 751 -527 603 -450 3 423 -404 708
4262 708 -515 237 124 -5 266 -400 440 -108 96 215 -453 669 -480 236 59 -235 250 -433 268
4281 268 -296 66 57 -248 327 -603 553 -127 123 294 -346 732 -364 104 335 -250 408 -309 456 -92
4301 -92 -93 248 -386 405 -264 131 -57 -250 411 -367 372 -306 100 428 -494 478 -455 129 -26 -280 381
4322 381 -405 533 -278 169 406 -356 410 -448 546 -106 -95 411 -538 454 -393 211 149 -359 472 -545
4342 -545 422 -195 -5 271 -372 513 -297 512 -136 -20 360 -328 475 -420 181 1 -392 441 -480 389
4362C89n83J53M66r29R52q14O24j19n23Q84p87P35q00J86N96p53Q31q78N71k88
4382h7J04J11n47Q60p38L83J46o11Q83r61P95l70j71N50r02R11r25Q90k40n35
4402d54J014j167J133q92L99M36j018J083q59N17k8l49P36j001O16k25J3K53p38
4421e31J021j148P60l17J80M90r23P96o62M74J5n28P25q17R90n80J6L85o83P49
4441D12o50K76J68m79P42r94P77l57M4M2o22J194j086O45K4k27M64p79N00l62
4461b68L07K10m22O35r54R10n58L0N57r28Q11m57L51j31m99O41p63R17q33N16
4481G2J98q51J008o71M24k44JK90n29O34l80J14K02m47O69q59M70k37K06K25p41
4502d46Q46p31M54j67j14P36j180J032o96K84J63o17Q09p59P57l24j27O22p64
$$ plain form
4362 389 -194 -41 425 -504 448 -366 258 139 -384 500 -287 448 -352 -166 430 -323 508 -370 201 -87
4382 -87 17 128 -419 441 -297 86 232 -379 504 -457 338 -32 -203 347 -555 356 -569 321 81 -454
4402 -454 560 -607 526 -366 33 469 -549 534 -325 192 164 -185 551 -450 166 -59 -46 207 -531
4421 -531 490 -658 102 -215 -35 455 -468 328 -334 140 155 -373 352 -465 525 -55 -39 346 -337 412
4441 412 -238 38 206 -273 469 -525 252 -105 -61 -19 -641 553 -533 112 136 -91 373 -406 94 -268
4461 -268 39 249 -173 462 -492 418 -140 -110 447 -481 330 -127 224 93 -406 235 -528 389 -444 72
4481 72 270 -581 427 -244 180 -64 -63 227 -302 332 -48 66 268 -179 490 -369 101 -136 70 295 -446
4502 -446 400 -331 123 -44 -158 578 -602 430 -266 18 181 -436 373 -386 371 47 -80 542 -222
4521b22M62m10L16p5n08R92p88O02n20J49L72r21R01p75M25J49n28O81p14Q01
4541C89n27J78J83p12Q48p63O39m39LM22n16O92o16L36P5m67O51q49P04k32j59
4562a60M49q60R71n69J03K67m68N50n34L91j39L8L38q52J016q47L77n1o2K63o57
4583d36R78r56K45M64m88N15q14P08m42J35M55q96J091r69L85J70l70O05n69M23
4603B34l78J6Q8m03P62n01M31o5n10Q36r81Q58m49O1O3m77N70n00N23q4j84O13
4625E23n99L08l93J73J10m89P45q18O44r2l13L83n18P68p71M14N3l70P13p54M94
4646B11m29M08n2n31Q65r94O74ok45L66n58N93n57J89K34n92R36p49N10k39l36
4667c02P05p52O93l61K81n6n07R44j043O29j79l10N92p97Q70q04L17K19j79L67
$$ plain form
4521 -222 240 -170 146 71 -437 555 -233 369 -151 -2 370 -551 350 -425 0 149 -379 302 -412 389
4541 389 -138 40 223 -489 359 -404 235 -204 -201 221 -295 397 -219 117 192 -275 376 -473 231 -1 -160
4562 -160 289 -571 400 -169 -66 201 -267 283 -251 140 1 39 377 -475 541 -306 71 20 -42 221 -436
4583 -436 542 -414 -169 295 -193 322 -492 216 -226 -91 364 -532 559 -410 -25 145 -225 380 -189 234
4603 234 -144 -128 -40 -443 319 -182 249 184 -326 510 -471 387 -62 -1 62 -415 155 -345 178 94 -90 523
4625 523 -76 232 -161 12 122 -367 378 -440 204 112 -201 182 -336 432 -339 75 128 -242 471 -283 211
4646 211 -218 190 138 -393 472 -522 152 146 -99 267 -291 302 -255 -66 168 -424 512 -237 273 34 -302
4667 -302 403 -349 344 -17 264 208 -299 645 -398 231 52 -258 334 -463 407 -397 -80 139 -40 327
4687C27p45O09l45m8K65l61P37p46L88j01j87M98l43N91r13M28M4k56M89n83K92
4708D0k19P2N63p59M08m18K99q6j9M01p28O44l08K74K40q67P80m89K3J75k24M11
4730B13l75N90n96K82m7j77N15o71L59l33O9M37m81N01m84L05n5l30N73p23O63
4751B35m78L43O9n73O51n54M97j89j82L21k60L16m87K9K71l00M45n15O11k75j19
4772a44L17k90L21l51J74K36l71L00n03P04o49K02M45q60Q62o24J65Jn4L64n23
4793b78M49j66k21L93m90Q99j066N53j73l33Q32o03N73o43L79P7n41N86n74O15
4813B68j65j02p8l64Q82p86M30K54o80O27m70N08o50K33J42l14N59m76M37k26
4833B9k31O88p41M98m39K39K12l93O02q77N50j45j9L16o68P09l93L7R8l30Q63
$$ plain form
4687 327 -418 191 -154 -202 63 -298 439 -307 81 -20 -207 291 -52 539 -374 54 98 -158 331 -252 40
4708 40 -179 -107 456 -303 105 -313 -14 -100 -119 282 -446 198 -110 164 404 -463 317 -172 -149 26 -198 213
4730 213 -162 428 -168 114 67 -110 405 -266 93 -240 -171 266 -215 286 -198 107 52 -278 295 -428 235
4751 235 -243 100 169 -404 247 -307 190 1 -181 140 -120 196 -291 -262 9 -291 154 -361 250 -25 -144
4772 -144 173 -117 204 -147 27 263 -108 192 -311 393 -256 -54 391 -469 393 -231 -66 -65 -119 245 -278
4793 -278 171 5 -216 177 -313 586 -480 73 -100 -433 399 -204 369 -274 105 182 -359 227 -347 268
4813 268 103 1 -77 -441 441 -345 85 339 -341 286 -184 324 -326 -93 49 -265 294 -182 255 29
4833 29 -202 486 -255 243 -196 43 255 -138 464 -413 137 -8 -27 289 -379 330 -63 -26 72 -258 605
4854F05p02K00l11N5L04m39O71m99K96m5l57P55q29N07m48K85J79n24O42n11M32
4875B66m21L21M6m91P32m48n5j29j43N81n13O26m21j03K84k93M73o74M47m9l15
4896b79L76l92O48m64J52Jm30N97l56J53J40j20J05l68O04n10J06K00n13P69p20
4917c01L05l7J33J46n64N81m06J43J32k96L78l43L25k36j32K88m08O69m70j3J94
4938H8k18M59o80O96m83K77ql54M98k21J17l52J04O64r02N08l87L54N1m65O39
4959C85o50N64m70Q5L50n55Q15r69N96k48N9N90r16Q11n68K4L77o64N92k87L03
4980B24j59k73N26l46L48n89M87q8k90K80k60J90q4N8K38n95N40n71J06L64l91
5001b85O27p08O70m49J47P3k74L43k70L26j57k44N35m12L03k15L0M1k65J86k51
$$ plain form
4854 605 -97 103 -208 -153 151 -288 383 -116 180 135 -222 533 -296 211 -237 48 227 -297 345 -166 266
4875 266 -155 166 212 -279 453 5 -50 -179 -322 259 -254 372 -49 -152 132 -161 312 -362 85 36 -279
4896 -279 97 -295 353 -111 41 42 -388 209 -147 6 146 26 131 -237 367 -143 -37 163 -350 419 -301
4917 -301 4 -33 100 246 -318 263 -143 0 132 -164 214 -129 196 -40 -172 116 -292 377 -93 -106 88
4938 88 -130 329 -351 345 -138 139 131 -223 275 54 171 -181 -77 587 -315 193 -194 160 211 -254 385
4959 385 -265 299 -171 -86 264 -291 524 -445 151 -97 -38 552 -364 447 -121 -97 280 -384 208 -79 224
4980 224 65 -208 318 -28 320 -269 218 130 -160 120 -140 50 -34 24 262 -333 207 -364 -258 106 -285
5001 -285 342 -366 304 -145 2 75 -199 144 -126 200 43 -201 334 -78 225 10 40 81 -184 2 -249
5022b49L95n1k93L14l88L99m04M20j96j29L07l27L96k07j87M32m90N02m31M82
5042B95j01r2J26l56L69m50J63Q2l47O95o76L45m9R9j0k82M72m56J13L33o05N42
5064B10n91N45p2k65O56j001Q48l46L5n0k12L57l00L56k58j07M77n81O09n04J04
5085i0m9nL99n16O59n76J66K57m21K91l47N56k94l52M24l38N87o33J39M21k56
5106B2L14p53M65j68n5L17m21M62k87L33k95R2l5l03N94j26j88J25m41M06m32
5127c74M12J46k49M24n76N11m28K35k75J26M31p93P62l78j19L81n14K78k98M21
5147A23K2j53K50m24K97l2p1J17l40O63o66K08p1j7L13j70J89n12J07J71k50N96
5169C50n93M48l4pn8m67Q08p66L94J30k56K05n51N73j72j27J31k24M88l17l3k0
$$ plain form
5022 -249 146 95 -198 116 -272 127 -277 143 -53 -182 125 -202 194 -13 -200 232 -258 244 -187 295
5042 295 194 102 228 -128 241 -209 -46 36 -311 384 -292 53 4 103 93 -189 283 -173 -60 273 -332 210
5064 210 -381 164 92 -173 483 -518 330 -16 19 -31 -243 114 -186 170 -88 -195 282 -299 310 -194 -90
5085 -90 -139 -144 255 -261 398 -178 -12 245 -176 115 -232 324 30 -322 102 -236 351 -282 -143 278 22
5106 22 336 -417 48 -120 -175 142 -279 183 -104 229 -66 26 -9 -312 282 156 -32 93 -348 58 -374
5127 -374 38 184 -65 359 -217 294 -134 101 -174 -48 383 -410 352 -26 -145 236 -278 0 -298 123
5147 123 145 -8 242 -182 115 83 12 129 -211 452 -214 -6 -77 -94 219 49 238 -274 -167 4 -246 350
5169 350 -243 205 171 164 106 -361 447 -319 75 205 -51 154 -397 176 4 -123 8 -216 272 -45 -78 -98
5191i8k03L38l46O39l83K26n3k96N16o47L69j49J28q9l37O27m61K70k15lN30n49
5213a86K91l73K09M12o13K55l55L73N8k45L95n11O61o20PM47l55L13l51M56k43
5234B5k15M17m27M01k75L54q8n72P22n64K91j32R0P1m61N80m11L84k19j93M01
5255A79k50L23l53J22M9j60K56l59M30j23j86K89n96N47l66J64K11l19L35l69
5275a76K01p6q9N19p99N60n13N11K6l43K63l68N02j98j27N19o84M82n29M38J32
5296B51m60K93n4J6p8J75o7k22L74m36O33k62j96J23m21O43m23R4J6j01K78m39
5318b63M97k96Q1J86m14L34l47K12n8j84M02n20Q35l84l7K08o51N46k15O0r0q3
5340a81N47m11J95k47J9J15k93M32n27M46o3L9j36m2K76m23M27j55j55L43m31
$$ plain form
5191 -98 -301 37 -309 330 -53 173 120 -176 340 -307 62 -87 41 -48 -385 242 -219 51 -164 -167 363 -186
5213 -186 105 -268 -59 353 -260 -5 -360 13 71 -174 221 -290 371 -249 -242 205 -150 163 -188 268 25
5234 25 -190 227 -200 201 -74 280 192 -380 342 -222 69 -63 27 98 -363 217 -194 190 -29 -222 179
5255 179 -71 252 -101 21 70 -90 166 -193 237 114 -72 217 -379 168 -198 -34 177 -142 193 -176
5275 -176 25 -51 -140 379 -420 140 -373 138 164 -179 84 -284 218 20 -107 412 -272 210 -319 119 251
5296 251 -209 84 30 46 -32 143 76 -146 228 -208 425 163 -33 90 -331 312 -111 -17 -1 -102 176 -263
5318 -263 234 -62 19 205 -209 125 -222 -10 -68 -252 150 -370 465 81 44 252 -399 147 -68 -8 -98 -181
5340 -181 366 -45 150 -97 -78 37 -256 176 -351 95 32 71 -65 -107 169 -254 173 18 -137 206 -225
5361b25N64n11K17K11m18K92j38j00K15l06K44k11L82k94J92J06m45N67n01J92
5381C3J14n1J53o05N10k47M9N9j14L46l25M03l99j09L29k73L03n25M26K37n48
5402b34L14j36K13l47J01K62j31K87m92K84j74O4L05l68K65k22L7J68m50L04j32
5423h2K41l99j7L68m08M52k66n1K99l62L31j83R3j12J61j4j84J12j03K80m2k19
5445a05L82n18L62k05K59p7m05P39m79J45k8r3l2JJ33j95J98j63Q6J66l76L03
5467I8k93L56J02m77L79j51j8lk20M09k62L64j87m39K83q6L63l01oJ54j31K94
5489B28m33J93K1l1j11Q1K87l79J54K8PJ69l39K99o7j05l7l9L59k01J93l09J48
5512A16k05k38L28J04j32l7n3N3k19O36k43J38r4m29M94k75R4j2K0j47l25O43
$$ plain form
5361 -225 339 -172 45 256 -162 130 -8 -108 107 -199 45 -166 216 -78 114 220 -225 342 -159 33
5381 33 147 96 249 -356 154 -93 -44 15 -99 247 -78 325 -74 -183 146 -127 176 -349 77 314 -234
5402 -234 80 -56 157 -190 -89 173 42 329 -163 121 -53 11 316 -52 213 -9 28 196 -254 50 -82
5423 -82 159 -240 -257 111 -297 155 -111 -162 137 -225 106 -77 16 -96 65 51 -133 -21 -124 156 114 -105
5445 -105 277 -241 121 -84 175 98 -307 432 -47 98 70 -23 -55 -54 79 -116 82 -81 5 171 -205 98
5467 98 -195 161 263 -214 165 14 -4 -7 -227 182 -80 284 97 -342 -59 -145 218 -83 -89 65 -66 228
5489 228 -205 -12 9 -22 -133 -52 235 -144 10 38 45 214 -125 174 107 2 -35 -74 285 84 277 -32 116
5512 116 -89 -327 1 105 -27 -64 -117 -64 -283 353 110 248 154 -275 219 -56 38 26 46 -101 -426 217
5534B17k35j5m8N6o2j10M07Ll25J29l25L00j6j2K55l41L59l39L94l19J45K8l99
5557b53M24l11J98j81k36M38k31K99k33K44q3k66L38k62L53k29p1K52m49M44l68
5578a83K55j91n0K94l15K26J65k54Po3L82m65K32j6M0J73n20M07k76P7M8R0J35
5601A98m06L16l29J26L22m13L31k54J60j69lK21l93K92J6m3K46l79L49l95K82
5622G5N8n00N29l69L32r8k9J78j99K33m98J63P7L9N5j54J33j81K20J24o1j24j50
5645a47J57K7l9J25k92J46j67J7K34L3j33j9J75R6l97K51j32J26n6J50j14p2J36
5668A05j99J46k05K34j53j38K57j28O5K31k42j3j10L83l78J98k3m6K53n05K28
5689d0j05J32n0o0L03r9p9O7k49N16l43L4k23K03j42q6L80k96L87k02k20K09k45
$$ plain form
5534 217 -18 -33 -81 -25 -87 -197 210 213 -112 17 -308 -8 -24 -36 219 -122 237 -102 292 -27 118 146 -253
5557 -253 171 -140 58 -123 -359 79 -152 147 -86 158 75 -191 147 -115 238 9 -62 190 -259 185 -183
5578 -183 72 -119 -169 125 -190 36 201 -53 -46 -109 273 -192 40 24 64 237 -283 124 -152 -75 -27 63 198
5601 198 -208 108 -221 -95 227 -186 145 -109 51 -118 -121 100 -293 -1 15 -28 218 -161 188 -207 75
5622 75 133 -367 162 -207 125 27 -2 176 -23 210 -288 -125 -48 -9 46 -108 25 -156 64 188 127 3 -147
5645 -147 10 37 -2 123 -169 -23 -190 -173 61 94 -39 -58 117 213 -184 67 -65 61 5 155 41 -31 105
5668 105 -94 52 -153 81 -72 -210 47 -81 -16 215 -27 -40 -150 233 -145 53 30 -16 237 -268 -40
5689 -40 -145 -13 -63 -123 180 81 2 69 -180 336 -7 27 -196 7 -135 -221 159 -137 250 48 -172 37 -208
5712b08L66l65J01M38o21N15k89K83l45J52K7j00J29l06J80J34j88J44j86J93
5732E4k55L7J38j33L37n49N34Qr7Om64O77k95J91j34k92L41k51L12k9J58l02j78
5755a86K14j8k8j21jJ64j33k8J34j11J92j90K68l12k4K05p5K45m82M03j73J15
5777E8k32p8N64n71M33k98j7K11j13Q4j40K54k25j40J85j32K82k43J00K20j02
5798A00k7n3j4R9k07K62o38N11j31L22j68j50J63m4N0l24K82j90R6J95k58J00
5820b4L0j43L30l53K20k2j25K26k14J91k35J26j10Q6L37m25K84j77J19p0k24L22
5842A49j53K1Mj56L10l62L14l06K38j1k4m0J6NJ90r5Q8k40L68l48q5M02n53M48
5866A80m20K69J69q6Mr0J3j91J57j06k6K94n88N62l34J55j40J60K71k67K23k94
$$ plain form
5712 -208 158 -207 -106 332 -289 226 -63 220 -125 27 54 -46 83 -223 -43 91 -97 47 -139 54
5732 54 -201 -164 -26 -159 178 -371 163 171 74 80 -384 293 -2 189 55 -237 104 -147 165 136 294 -8 -186
5755 -186 28 10 -18 -139 -140 24 -109 -137 -3 -114 78 -112 156 -156 -180 25 -50 195 -287 116 -57 58
5777 58 -174 -252 312 -259 174 -124 -141 70 -43 41 -99 155 -70 -210 -25 -157 125 -118 -18 202 100
5798 100 73 20 6 105 -102 160 -478 33 -98 224 56 -94 69 25 75 -249 33 -157 -61 134 -124 -24
5820 -24 6 -137 193 -160 60 38 -87 139 -75 116 -119 7 -103 -17 320 -105 179 2 121 51 -173 149
5842 149 -4 17 21 -135 175 -187 127 -179 59 48 24 -16 0 5 195 100 188 -52 316 -32 -117 285 -268 180
5866 180 -240 29 198 112 116 26 39 -152 5 -101 -127 167 -421 141 -193 -38 -178 -18 253 -14 209 -85
5888h5R2K07n23N10k93K1K21l85L31k92L22j7k48L90k14K28l63L29j39j77J83
5909I8m69M81k00L7q0J79p3L5K46j87k17K72l66J82M8J58m8l38K84l37M85l91
5931b01P0j6Q0L27j00k60n0o1M40l26J8J03J2N4j94K69m18M10P9k20K96l87OM6
5955b3m1p9J1J20J53N8l77J39J77m06N97m26m8J91j72M93m54R8J18j92O5jK67
5978B68o49M55m50K35K71k92M16l44K64j15k91M12k74k7J95k53K93k50J96k02
5998a42k34M26j10J93k07J95m83K72K10m09M06j60K01P5m04L03k26K60jK8j98
6019ek64L14r4R5J45l54K28j09K46k63L19l43p9J73k03J56j39L05O5n04M88j54
6041B3j51K73j28j1k68L96Q5l69K74l35L28k36J48l7j3P2k20L64k46L21k79o5
$$ plain form
5888 -85 7 214 -309 201 -92 -71 150 -235 96 -196 126 109 -139 251 37 265 -98 231 92 -85 98
5909 98 -371 110 -90 -53 -133 46 -27 8 254 67 -150 122 -244 -62 -14 144 96 -242 42 -295 190 -201
5931 -201 -131 -147 -67 260 160 -100 -150 -211 229 -97 -79 24 36 90 -104 165 -253 157 236 16 312 -75 -69 -23
5955 -23 -64 -143 -132 -12 141 199 -178 -39 138 -268 329 -97 -145 46 -126 367 -87 11 129 -63 2 1 268
5978 268 -381 74 -376 -141 130 -162 254 -90 174 59 -232 180 -94 -121 74 -179 114 -136 60 -142
5998 -142 -376 50 -60 133 -74 121 -362 -90 120 -289 117 -43 158 233 -171 132 -94 166 165 193 -5
6019 -5 -269 45 -49 46 191 -163 65 -44 202 -61 258 -85 -164 9 -194 -38 -177 128 193 -311 177 23
6041 23 -128 145 17 6 -262 134 219 -150 124 -211 117 -119 29 -8 -21 51 -169 195 -51 270 -9 -74
6063g4J63j48L01k13l26N89l05L51l87P3J13l28L63k10K26o8o0P7l46L38k66K65
6085A28j6q2O5m30N59j73j67J31J08L9j29k0M9Q8L8k47K00m39K72K83k77M18n58
6108a60K17JK4P3m45L83j90j65O8lM72n39K32K26o5l1q9K93l21O3Q0j73O5j9R0
6133H7l5k84K50j61L42k68J65k83J35R9j28K16r6J4j36k09M52l65K79j74k54L87
6155C3r5J67j10j35K69l89L31l30K20J00qK0m43N35m11M59j37k02L01o4M0j98
6177d7k58L12k03M35l47L09j78k1J35k36K21k14K71j47j9l6l6L33l60R1J4k56
6199b37L79k34J06K3k51M03j78J34l57O0K92k88K66k00J57k4j70K74l35M78l81
6220h3K19%l24L71k26K22k18J02Q7k73K42j39J9Q8k38N99m25Q3rK4J4k92M25m62
$$ plain form
6063 -74 89 -59 242 29 -297 292 -13 338 -49 24 137 -191 172 -38 188 120 60 137 -209 129 -137 128
6085 128 112 30 95 -335 224 51 -116 15 123 162 33 13 62 150 188 -59 141 -298 -26 257 -20 398 -160
6108 -160 57 58 82 155 -290 93 -97 -262 -194 -197 275 -264 -32 194 129 98 9 302 -19 44 124 -49 16 -3 87
6133 87 52 -232 18 -143 199 -69 96 -187 -52 47 -81 135 39 53 -83 -292 160 -205 74 -100 -354 33
6155 33 -62 105 -5 -140 129 -260 71 -259 -39 61 53 73 -370 165 -246 213 76 -126 175 111 151 -47
6177 -47 -305 7 -196 239 -108 201 23 2 137 -99 122 -92 179 32 13 -23 -59 274 -86 5 19 -237
6199 -237 142 -92 14 37 -214 189 11 145 -212 -152 140 -148 118 -82 75 51 -119 155 -180 298 -83
6220 -83 136 136 -188 183 -43 179 -39 63 150 -123 119 -20 -1 87 -151 448 23 106 97 121 135 -157 268 -194
6244a94L19j9m88L58j61J4K30k07M6j53M78l63L43K7k54J27k7L6j01M0r9k2L16
6267B46k35L0m4k5J72l43L50R6l14J23k38L94r6J29l13M7Q1Q7n4k07Q9r1J82J81
6291B47l66J87l48K73K08m91N10l02K80j88N4o2J97j82n3K45k72k3K86m41P9J89
6313B7J68L2l69L99k68P8M0kJ10m01L79j66m3J57l24K31j54K28k79J49J34l4k3
6336F9j24K47K0m08L23k47K35j81K85j47j36Q5o7r4J85m0L5j87R3q9J01N8k46
6359b30J64o9L11k79J62k94L3M19j92j44K31l34M78k29j76K51k21K55l30N17l71
6380d8J02k0k18L48l85J98J01m9K18l70L52o12O67k54l43M41k47N7L6k4Q9k38
6402a99N69m11K73j86J9k3P0P2j64J27l54L26K57l85L7kj33M60l68J98l58Q0J18
$$ plain form
6244 -194 125 106 -382 -24 -185 -171 59 -148 -102 -255 223 -140 203 230 -24 103 76 112 11 51 -48 -70 246
6267 246 11 41 -3 -28 144 -199 151 247 -67 56 -182 212 116 245 -68 -21 60 147 93 -114 -25 -116 66 247
6291 247 -119 68 -280 -7 201 -290 220 -82 198 10 64 2 199 17 -36 209 -63 -86 200 -241 -162 27
6313 27 195 227 -142 257 -11 67 107 105 215 -186 193 27 -16 141 -183 48 -106 122 -157 -8 126 92 69
6336 69 -55 192 212 -196 127 -120 115 -66 219 72 -64 21 -46 -140 45 5 40 -147 -54 -143 -42 16 -230
6359 -230 -66 -135 176 -103 59 -235 -202 217 25 -119 112 -222 256 27 -149 102 -119 136 -194 323 -48
6380 -48 54 34 -184 164 -221 -23 78 29 247 -123 229 -383 284 30 -313 128 -119 -62 -26 -50 39 -199
6402 -199 370 -41 232 46 65 42 112 184 20 147 -207 119 376 -9 28 26 -107 353 -15 183 -175 -95 23
6425B3k25L08j69J79j34m1J60j65K62l78L41J45k10j45j02M42m07L60k12o7K75
6446B40l10L51p1k31k2k1J35j51L01k96K2Rk10L25j82r4L04J30j21k68K93o8j36
6469g1K08l0l6q2j47N5j7K79k20N9J02j65K01l24M11j49PO7k20K27m5o7j09K4
6493d2Mm6L30l49J61J22l18L35l34M48l93K51o7j91K73k76K38j19j77M72j70k03
6515e1oJ2R5k79L60l30K57K6j45J60k90K41l22K33J75k18J43m58M84k7K08l60
6537i2J6L42k56m4m4j24M33l10K54k66j16K48l17M19n6J07q3k12J67j50K07o1
6559F2j42l1q3M96m54J09J83j89k1r7N23l29J31L0l27K85l77K96k71M7K89j05
6581B5j03mJ02P1jj14J9q9jP1q5P5J57m34M73m94J46J12r9M73k68J58j66%j9j35
$$ plain form
6425 23 -202 106 -63 116 -18 -59 101 -64 198 -180 161 306 96 -49 -151 291 -116 244 32 -35 240
6446 240 -70 281 210 -21 -43 -64 71 -80 221 -75 -53 -44 -254 71 -111 -205 99 229 108 -160 133 65 -71
6469 -71 137 107 71 -11 -158 -103 -120 159 -61 -2 100 -65 136 -188 223 74 81 148 -72 155 110 43 -66 -42
6493 -42 -38 -84 246 -103 58 180 -138 197 -137 311 -82 169 102 -89 184 -92 146 27 -150 322 152 -51
6515 -51 -57 -45 50 -229 131 -199 58 84 -61 99 -191 50 -272 -39 136 -82 61 -397 87 60 268 -92
6537 -92 -76 266 10 -34 -78 -202 231 -79 175 -91 -207 41 -276 143 87 194 111 -101 66 -84 123 62
6559 62 -80 -111 -194 302 -152 -43 140 -49 -70 -167 356 27 158 188 -139 146 -231 65 -206 -159 130 25
6581 25 -78 -82 20 91 90 -24 -5 -94 -95 -24 -109 -34 123 -311 162 -332 -186 -74 -173 300 32 190 24 24 5 -130
6607a30K44l47K59l9k10M00l98J64n5K12Q1n42O06n58M86r5k16M28l87J29P9o4
6629D7Q6j59J9j69R6M0k90K89n2J05M6r2M5k56L19m65M73Q5l62K22m12N26o1m
6653G6R0j66J53m19J92l4j15N58l14J00k04QOJ7M3M2j13q7K78J21m25K98m14L43
6677C4K9k66L71l60P1K3J16k22Q3Q5j24J51J14l34L95j95Q4j76J82o0o4L03l88
6700a48K82j66j54N51n37L56j40p8L3k02L18k61K46j25K1k16J71J48o1j32K54
6721A60j40K53o58O57k26l0K41l60J69m27M24mM6J95l16J35j96J70M7m45L83o9
6743IJ77k99J62kk59L44k68K18k3k32J77j73K69j16K89j62j82J21k91K62l2r3
6765a04Q9j77M37l65O8K04m70K01N6k4o1J85K0j50K31k69K14J4j38J82l38J56
$$ plain form
6607 -130 114 -233 26 -13 -223 177 -221 -57 -112 100 181 -361 245 -313 173 78 -138 290 -97 32 111 47
6629 47 133 -26 -7 -176 -80 -40 -330 -41 -93 12 58 -34 11 -245 74 -391 82 167 -195 27 -385 141 80 76
6653 76 166 0 153 -266 -74 -108 -223 335 21 121 -83 -75 -69 -52 -9 33 -80 -167 111 232 -193 105 -309 34
6677 34 63 -203 168 -192 -121 -98 18 -204 -121 -36 -160 -9 105 -229 166 -29 55 -121 61 1 -63 240 -148
6700 -148 134 -32 -186 365 -172 184 44 -34 -1 -203 115 -146 100 -25 -4 -220 -49 99 38 -94 160
6721 160 20 273 -385 272 46 16 257 -103 66 -361 63 59 105 300 -16 119 -77 93 140 -305 78 9
6743 9 186 -113 49 47 -212 132 -136 82 59 -173 4 -169 100 -16 273 111 -71 50 -241 21 -11 -104
6765 -104 -15 -192 245 -120 -52 152 -318 -117 -61 -85 -146 39 59 -91 140 -129 85 99 -39 143 -195 -39
6787c9j93J04M07l59n8j5J7J66o8K29k87K00p2k69J84j87L88k46M9J57j64K44
6809A88m76M32j45K27j84j67L99l71K25k50N8J90m72L91k46J97m3j24M04l01M08
6830C40l67j23K60k03N22l41o6K1k19J24j62N75l53j75J32j89L68k81K93m32L95
6851A19M7l64L34k91M44Q7l83J68k87J20P5j81L34m04L05k26K7K02r7J18l93M22
6873A76k77J18L4k90M41l19K89k12l4K09j65L58l44k3K91m51L68m21N02l25J61
6894H6q0j12J27m44K32L21mJ15m80M11j39k83K40k7K29k70J69k34O0K46k89K29
6916A03l54L03K73m47J78k03J97nk6J05l60N67m35jJ9K71Pk75M7O6m2N8k54L73
6940A65j81j29Q2q2L21j63J70n39N19pl5r2N0L1k31n1K99m70O22j53r8K81k42
$$ plain form
6787 -39 -232 -128 279 -80 -138 -153 -136 30 -38 191 -96 104 32 -237 -53 -240 148 -98 -49 108 -56 188
6809 188 -288 144 -1 226 42 -125 274 -97 128 -122 -64 126 -346 45 -201 -4 -47 -171 233 -68 340
6830 340 -27 -150 110 -93 429 88 22 43 -176 -52 -214 361 8 -167 -35 -224 144 -137 156 -276 119
6851 119 166 -198 136 -155 289 376 -7 161 -126 -6 69 -112 222 -182 123 -103 -76 126 29 147 -246 176
6873 176 -101 17 51 -239 202 -117 172 -40 -74 135 -30 328 -16 -39 252 -199 169 -252 250 -75 86
6894 86 6 -106 21 -423 -191 130 126 241 -239 172 33 -250 -10 -37 192 -78 91 -143 -83 163 -126 103
6916 103 -251 52 325 -122 56 -147 50 45 19 124 -236 331 -104 -105 -86 185 192 -83 -36 30 -12 46 -208 165
6940 165 -16 -145 -63 -145 176 13 183 -356 163 156 121 29 79 110 -121 -172 127 -343 279 126 28 309 67
6963F7L0j25K96k47q9K35k65K18j79J53pk01L26m37M35m03P3K60j84m1j26M93
6985B82k80k35J73k26L87l75L30p6j56L40j48r8q1K0L81k58k6j05M49k94k92L73
7007H5j69K78j16o8j19P7L81m67J53k6k21K74k94L15l2p4R1l56L91k26Q9j79l0
7030b43N28m38M23k96K10j95l9L93l39J78p5k35K86j94J15k88K72J69p16P82o61
7051c63K64J0Q8j47P1K55l07K53j84o8R8J02J45j99K6k8l54M44l22L24Q1k41J83
7074A31n35N65j91k8K18k85J32j98L12k40J62N3r7r9l40L48Q1k3R1j77K36j20
7096dj56J20j13K22l42N35j00k08K69k17K0J05j79P6k06K35j70L63j77M4K6k75
7118a32K54K6j38N3j00K06l03L05j08p3K0k35K58n69M81k0m3K7p2K68l24L24j02
$$ plain form
6963 67 97 -28 268 21 -68 167 -98 120 -59 94 87 -114 212 -225 210 -193 -120 140 -44 -85 -211 282
6985 282 2 -233 -60 -286 101 -274 56 -20 -176 164 16 -82 -163 -143 238 -20 -46 -151 298 4 -288 85
7007 85 -84 194 78 10 -109 -32 349 -118 35 9 -212 62 -232 83 51 -23 68 -288 103 -123 -34 -213 -243
7030 -243 285 -153 270 -26 184 -11 -50 343 4 182 107 -128 158 -36 79 -209 63 232 -484 298 -363
7051 -363 -99 -89 -1 -148 -77 178 -129 124 -60 -128 -30 72 217 18 44 16 -338 106 -216 108 189 -52 131
7074 131 -404 161 -30 -58 160 -125 7 -191 121 -119 43 96 -1 -100 -440 -92 -11 -34 57 -120 116 -4
7096 -4 -160 -40 -153 69 -273 262 162 -46 223 6 26 131 -48 28 -178 57 -113 250 73 117 143 -132
7118 -132 122 148 10 63 -37 169 -134 171 63 -10 10 -225 33 -536 -55 -75 -118 -91 -163 105 -219 105 3
7141Cm3J71l07L76k40k5J98r9K1q8L58l55pJ59l01N01l63j4J03j71J53j51J83
7164F2J88k80Q6l47L82q3K60k97r9L64l52L46k17l3J79k90J95j78K2K93l59M16
7186B58l52L35n02L52O1m79L76q6J18k38J79K0k04L35m01m1M60m29M51m33L12
7207I2l22K56n7j03J98j06J57j53r6K92l64L22k26q9J43jK99l99L94k76j0J41
7229I2k02M33l03K29k40j93N17n70N28l46J66q2j42j04J20K83k12j06L45k79L93
7250C27n09J48K06q5J62l58K61n4l10M55j99j71J72P2o2q0L27j64j1k27k5J59
7272C4j90K31k7P0o8p0K85l85K70l79O8J44P0j3j62K13m0l86M91l17M85m16J54
7295F2J0j92J73j46J71j29j5J50k74K69K5k16J81j43J68m22M29k29N5L44k75K5
$$ plain form
7141 3 -40 131 -176 200 -40 -65 133 34 55 -33 325 -30 -37 122 -179 322 -41 -55 48 -123 30 -121 62
7164 62 250 -30 56 -291 91 8 268 -29 -128 236 -116 230 13 -20 159 -131 64 -114 -92 201 -158 258
7186 258 -94 241 -261 91 152 -327 49 -37 81 -157 22 42 -162 173 -228 -269 191 -238 213 -220 92
7207 92 -230 26 -31 -134 64 -42 115 -38 -134 158 -206 116 -110 -199 -56 -57 242 -157 237 -39 -49 92
7229 92 -110 323 20 249 9 -184 333 -237 291 -55 111 29 -113 -217 -97 186 -26 -132 213 -66 327
7250 327 -182 -34 172 87 249 -109 152 98 -212 243 44 -127 45 117 55 -25 302 138 127 -100 -125 34
7272 34 -156 75 48 118 50 -20 265 -120 150 -229 -161 -17 53 40 -122 91 51 -335 156 -161 324 -92 62
7295 62 72 -120 53 -93 78 -51 -66 84 -190 79 104 -112 69 -74 94 -328 101 -128 -73 271 -4 21
7317B1j43J37j14j2M19m16p6J05Q7j86Q2L27l14J51k02J51j4j92N35m76R1l9K71
7340A93L1m68L74M3m42L18l89N72l23K3K43m03L62l99L26k05j8M29m37K43k86
7361b13K92Q3j02Nj20N6M7p3k5QK06k87P7M2n3L04m25J44m6K13k3n6N6l84L91
7386A17j83N0J73l96M68n32L30l4j18L39l20o5Q1J36J76k46P1k55L32Ok65L37
7408B02l41J76p1J54P5j63K46m20J56Q7j11J24k04M01l35R6j67j60L44p7K62j42
7430A32m04L24l52M72k52L57k19j52L27n26M29k57Q8j1n8K49j77K87l66pJ01m0
7452e5pj86L74j1j80J49r2J55k75K71Opj29j72L01l27K30L6k42M34k88N0J34k78
7476a09K94k97L62k11q2J27r1K37l44J68k20r0L63k72K88k25J3K74m22J26j4L02
$$ plain form
7317 21 -122 15 -99 -111 308 -108 -184 -79 8 -178 -96 231 -83 68 -134 17 3 -189 346 -130 -39 -78 193
7340 193 224 -244 130 173 -269 49 -340 232 -91 -68 175 -228 134 -265 61 -144 -162 267 -170 73 -213
7361 -213 79 162 60 65 -55 1 48 -25 -50 -42 164 -123 -46 -4 -57 247 -178 -34 -80 133 110 54 110 -274 117
7386 117 -66 -16 157 -239 229 -303 27 -7 -125 214 -106 -171 -90 46 222 -24 47 -208 124 130 -135 202
7408 202 -139 37 -34 120 195 32 278 -142 14 101 -10 114 -90 311 -24 72 -95 -255 89 12 274 132
7430 132 -272 52 -300 172 -80 277 58 -94 233 -293 136 -121 -33 -44 -102 147 -30 257 -109 -116 -15 -55
7452 -55 -62 -248 126 115 -65 84 -8 147 -128 143 149 142 13 -159 142 -185 45 81 -161 273 -15 35 169 -109
7476 -109 185 -112 250 39 -43 84 -7 230 -114 54 -166 -256 107 -165 123 -102 -89 185 -237 -111 -125 177
7498A77k12K4J20k93K63j8L9o6k41K68Nj22lJ63J64l70M04n34J49R7j78L81k54
7521c7L20k28p7K45n77M46j86K5l4K4P2j21K12m60L98J50l32L06k33L24n9n48
7543c70O55m23J67O7p5J70k13M88o00K31m0j91L94k62Q7k49K29q6K64j51k63L11
7565A40k96L22k03k17M05n39L88m50N21J49k82J76k84N1J58j2N9p0kN5l33K90
7587B6j65K50k79K30J10j58K69m51K72j48J51l2m71M09k94O2J54l8J71k61M33
7608B40l58L29j09k99M87l37l1J99m57N60m54M03k13J55K44o91M40l22N64m03
7628e3j37K45l46L86k02J60j26j31M50n66J85j11J75K99j23p9l24L87j16q2M40
7649C31l09J3k04K89j00j27L08o49M87j05J48N9m03L25j03N0j34J68J13k67K83
$$ plain form
7498 177 -35 -11 109 -184 79 61 100 34 -207 61 66 -56 -59 104 268 -102 302 -232 -83 14 -164 217 -37
7521 -37 283 55 -22 223 -354 92 -94 -69 -103 -79 -7 -128 84 -376 22 172 -160 146 -87 237 178 -370
7543 -370 285 -138 29 96 21 191 -22 466 -134 97 57 -134 260 -2 85 -164 65 -21 243 92 -171 140
7565 140 -156 166 -37 -254 151 -388 0 -450 71 220 -62 114 -170 -119 39 27 86 16 14 69 -264 26
7587 26 -139 111 -168 62 172 14 283 -168 104 -44 107 75 -396 13 -281 -219 -65 -103 68 -193 240
7608 240 -118 211 102 -197 290 -47 -78 121 -336 224 -230 173 -40 115 359 -332 108 -214 350 -53
7628 -53 -190 55 -291 95 -107 53 -73 -204 246 -320 -135 -246 -71 228 105 26 -298 89 -27 -109 331
7649 331 22 35 -169 120 20 -107 201 -448 39 -66 82 141 -262 63 -40 10 -124 44 157 -110 173
7670A73m04K31K17k42O7q7q8M0n4K35l46N98l88L3J19k16K85j79K6j14NK91n00
7693b98L50j36M7K23l86M34l13K92l72L30J36m71K74j33J9j31K32L3k20L08l65
7714a47P5O2j10k9R8J45r0k04M88n73L43j92K39J20j94K57m19L6K04j75K49m04
7736b21M09m45M08n42L91J56m24N36k42j29J77k65K68k27k6L07q8m0j92L91l86
7757a84Q4J95j30J82l23J26o4J2J95k43L73l67J62j2kK7M7n3k9k42L11l29M62
7780A98k87J8n9r1J95j60J38n7nK07l48M62m45K85L0l3j13j62L64n07L70lj40
7803a43J69p2J28j24n0K11j03K69m46L05k6k74M49n26M21k54L45k81O4j23j8J38
7825E9Pj12r7j67M67j99j04J21k01K81j97K71l34K27O6l55L27k46K34j11O3M29
$$ plain form
7670 173 -231 0 217 -25 42 -45 -133 -93 -147 88 -258 340 -48 -15 104 -112 173 -6 20 -94 -89 202 -298
7693 -298 52 -84 -37 186 -200 234 -79 213 -159 171 307 -164 110 -23 -4 -135 97 130 -90 218 -147
7714 -147 -72 -10 -120 -149 -51 94 4 -200 288 -285 58 -134 105 225 31 288 -131 -95 109 -66 183 -221
7736 -221 188 -257 151 -391 0 156 -268 268 26 -103 74 -191 77 -150 -176 131 43 3 -189 202 -184
7757 -184 -100 95 -35 147 -176 -50 -114 -102 93 -150 223 -144 18 6 4 31 78 25 -4 -246 65 -264 198
7780 198 -89 -71 -130 -221 -26 -186 -48 -105 -110 97 -251 211 -234 51 81 48 -65 -227 137 -370 0 -3 -143
7803 -143 26 -46 82 -42 -92 119 16 285 -161 144 118 -156 293 -233 188 -66 279 -2 62 -61 -79 59
7825 59 66 -46 -143 -310 157 -42 -146 -25 -226 55 -142 129 -205 22 88 -267 60 -186 48 -63 0 429
7847D29m95J76l89J72J67j85K26j61Q2R1K0o5m19J94p6K21J4j88M32k17J19m05
7869b57J60R7j52M45l72J75J17m03L36j55J77k49j1K84l37L77k14j76K42k08J38
7890A4k90J83oJ54J42o15P04m98L53l11K04m3j50J76k04P4L22l29K19k60L64j89
7912A4q9K20m67L54Q1k00J36J32l1k25J70l56K15J36k24J09k2J15l91L49J67l64
7934a71K03k34M04j72r9L15l90L02l35p6M34j44J18k20P6P8j17J27l14N32k75
7955D2o2J59l43L22k94J39J54j08k4k49N13l77rJ24n7K58j72J64k07L6o3j70N57
7978C33l14J39j92j66M71k87Q1N2j74J15l00L67l78L01j74K29J34k02J7l14N52
7999B90j46l46M28m94M96k94K33J19n22K59j62L89j33m13L48l04J29J14J78j50
$$ plain form
7847 429 -66 110 -279 -107 60 -125 101 -60 22 113 133 68 -351 -157 -233 -12 2 -186 246 29 148 -257
7869 -257 -97 0 -152 293 -79 96 213 -190 146 -9 168 -81 -92 192 -145 232 18 -158 84 -124 14
7890 14 -276 -93 -99 55 197 -418 286 -212 141 -170 34 -9 -159 17 -187 -113 209 -120 99 -161 203 14
7912 14 -75 145 -322 32 113 -87 49 181 150 -75 95 -261 -46 90 -134 -25 -47 68 -323 26 193 -171
7934 -171 32 -202 202 30 -69 246 -144 158 -177 -253 181 37 155 -65 11 89 -28 99 -215 317 42
7955 42 -20 139 -204 118 -176 -37 117 9 -15 -264 249 -128 -137 -13 -70 188 16 180 -27 9 -54 -224 333
7978 333 19 158 -34 -200 271 -16 65 117 -57 58 -242 125 -253 48 -126 103 237 35 52 -262 290
7999 290 144 -202 226 -268 228 -66 167 286 -236 23 -139 250 117 -296 52 -252 -123 -9 169 19
8019A9l0J03k10Q1L6r9K57l53L04k90K94k17j32M83k42j3l01q3M46l70N43l55
8041a29K98j16k72N37l38J16q9O2P3l35M73n97L10R5k35K37m66M31N5k88L68j49
8063D1J1M1l7R5Ll0k06Q7O0P7j98j22M21l56M2K16j74o4j81L46l69L14K7K2m9
8088A7k52M4J16K60k44k74L46O7l3j63J02m5RK28k94J43R9j83N55n89Q0J76m5
8111A20N9k69K63p8mj2p7j31J26K5L0k1Rj99L00k63R7J16j76K26k87m1n4L57m4
8136G2q9K9j31M6q7J66L07m26K78n80K94J24j92L51j13N9k08J07l8j39J96k26
8158b00J52o0j10M12n52L53N6N4j71r5L46m02L61j0k89M40k45j05j20M07j80o
8180C6J14k17L02m31K86l4j08j6Rj24L0
$$ plain form
8019 19 -11 92 -118 -37 -1 -100 157 -196 108 -182 112 -105 -237 246 4 -9 -310 -393 53 -317 226 -129
8041 -129 169 53 -219 318 -20 96 7 69 142 -193 280 -317 -7 88 -147 90 -376 55 110 -178 190 41
8063 41 52 93 56 151 154 124 -82 5 65 142 -56 -178 243 -113 -71 145 -29 -93 -274 72 -297 17 44 66 17
8088 17 -235 -191 -75 185 -59 -333 13 80 47 -116 -14 -59 -50 178 -116 27 126 -57 498 -91 -11 165 120
8111 120 179 -90 173 95 91 79 2 -129 -3 22 52 31 40 -159 141 -122 -25 91 -85 141 -146 -187 -241 116 72
8136 72 -17 12 -119 -73 -160 6 313 -113 165 -415 -121 3 -189 162 49 108 -100 7 -31 -170 26 -200
8158 -200 -48 -108 -218 194 -358 -5 51 105 -66 -161 185 -217 144 134 -155 285 40 -65 -185 222 42 36
8180 36 150 -67 235 -196 90 56 -52 -68 -59 -183 -153
8191a53
$$ Imaginary data points
##PAGE= N=2
##DATA TABLE= (X++(I..I)), XYDATA
0@%%%%%%%%%qJ6j6J6k4L2m0N6o6P8j00J20j44J71k00K37k77L24l76M34m98N69
31C04o50P40q40R49j070J206j354J515j692J886k098K328k580K857l160L489l846
48b016M238m670N143n662O239o879P591q390R292j0324J1514j2898J4536j6516
62h802J8959k2058K6143l1797M0195n4138Q2819k37217K91079O8771m33382M68812
74B09384k01234k15349L34527m2592k96667L55225q4475k30940L34011j90826
84b8936q3702K37329j57162j1291R7914q506j44347J46900l1769j27907K60425
95A48948j80360p6097K16515j51839o024J53922j49866p6562K91706k30052l6279
106i5988L10631l84412J38947K08072l42749K04133Q8004k58035J38255J15199
$$ plain form
0 0 0 0 0 0 0 0 0 0 0 -8 8 -8 8 -16 16 -24 32 -34 44 -56 64 -80 91 -109 128 -149 175 -201 233 -265 304
31 304 -346 394 -446 503 -567 639 -715 800 -892 994 -1104 1224 -1356 1501 -1659 1830 -2016
48 -2016 2222 -2448 2695 -2967 3272 -3607 3984 -4406 4886 -5438 6076 -6822 7714 -8802
62 -8802 10157 -11901 14242 -17555 22640 -31498 51321 -185896 105183 173954 -259428 209384
74 209384 8150 -207199 127328 84736 -211931 143294 58819 -172121 161890 -28936
84 -28936 -112638 124691 -32471 -43762 54152 45646 -98701 48199 16430 -111477 148948
95 148948 -31412 -107509 109006 -42833 -48857 105065 -44801 -121363 170343 -59709 -95988
106 -95988 214643 -169769 -30822 177250 -165499 38634 126638 -131397 6858 122057
116A22057k70576J71152J07935k89561K52965m7171j90436K21872p2632n9437
126e3832R2960M444j16728Q4976L7240j66150J93375l1177j28149J42081n7335
137A705o9597J05622J8821j56480J70392r200k11952K64195j22069q9553K35777
148A37661j82925k9126J66873j06309o1410J67800j32745l4179K10745k18458
158h2073N4509J14953j68556J03264Q340p1606L7758N3543p2094l010Q6917j26822
170f4877P5102L4065q9066Q1115k1649m4558M170O6722o5538J9563Q0630j68354
182i2675J15592J5374j22518J38416m0702n8254P7342j0553r4603J02195P118
193C6732j16579J68145r5743n7656J37333j14023L0797N6485n3188j5333N1438
$$ plain form
116 122057 -148519 22633 130568 -158993 93972 46801 -143635 78237 5605 -53832
126 -53832 39128 43572 -73156 11820 49060 -117090 76285 45108 -83041 59040 1705
137 1705 -67892 37730 56551 -99929 70463 61263 -150689 113506 -8563 -98116 137661
148 137661 -45264 -74390 92483 -13826 -75236 92564 -40181 -74360 136385 -82073
158 -82073 -27564 87389 -81167 22097 30437 -41169 -3411 50132 -21962 -24972 61945 -64877
170 -64877 10225 44290 -44776 36339 14690 -29868 -25698 41024 -24514 -4951 75679 -92675
182 -92675 22917 38291 -84227 54189 13487 -44767 32575 22022 -72581 29614 36732
193 36732 -79847 88298 -7445 -65101 72232 -41791 -10994 45491 -7697 -23030 28408
204B8408l0827m1963J03883q9379J2394O3896q7328N0136k23j6891r388L4017
216A6735j4746l8280R3225r1726K3870N6231r5368O5038L836l3136J6821K9136
228C1636n9871P719P3610j09617Q6530P835r7626R9169n1596j7220M8824o379
240A3014k8708K2811J2753p6858Q6943k8189l1421P9938p3309J8733R003j2321
252g611L187J3389J4311n4501O2950m3457j3428O4552o4282L4502J553j9528j027
265i390J8431m288l6060P2628o6945J3013N2882q2714N8802q717k6539K0735Q446
278A0284j3912p869M8841p2188L9763J7414o1076P5331l8506l363J4020j7270
290h531L107j638L4313m8336L8178j2565m0524O1437m4801K3784Q805j7462K383
$$ plain form
204 28408 -2419 -44382 59501 -29878 -17484 46412 -40916 9220 8997 -7894 -17282 16735
216 16735 1989 -36291 56934 -34792 -10922 45309 -50059 14979 18815 -14321 2500 31636
228 31636 -28235 -20516 53094 -56523 30007 37842 -59784 39385 -12211 -29431 19393 13014
240 13014 -15694 7117 19870 -56988 29955 1766 -29655 50283 -23026 -4293 4710 -7611
252 -7611 -4424 8965 23276 -31225 31725 -11732 -25160 39392 -24890 9612 11165 -8363 -9390
265 -9390 9041 4753 -31307 41321 -25624 -12611 40271 -42443 16359 7642 -18897 1838 10284
278 10284 -3628 -11497 37344 -34844 4919 22333 -38743 36588 -1918 -5281 8739 -8531
290 -8531 -5424 -7062 27251 -21085 17093 4528 -35996 25441 -19360 4424 13229 -4233 -1850
303a850q451K1903l9769N3505j9593k5878N4464o2314K7724J0986j6123J1388
315E992n37K751l3928N1262l7853K61M5891o5444M5587j1803j5241K0801j2284
328d545P426j8226L4596l4411J5113K0359m9643N0030l1616N925J8907j7182J4379
341A1112k2825K5449l2938K3999J2474l8202N0403m2382M491J3078j4556J6561
353F664q216J9062l9793K9891q572k6379N8765m6419K1732L007k7244K0393r154
366f263J8071k0227K5050j8914j1381L4571m5199L9807j1907j0328J9720k5386
378a2386K1226k1237K2813j4869l674K6322m2234L9600j8652n995J7362j8737
390a0461J7285j5501K5331k7816J0898J6395m4802N1084k8980L740K2477l1107
$$ plain form
303 -1850 -10301 11602 -28167 25338 5745 -20133 34331 -27983 -259 10727 -5396 5992
315 5992 5455 8206 -25722 25540 -12313 -12052 33839 -31605 13982 2179 -13062 7739 -4545
328 -4545 2881 -15345 19251 -15160 -47 20312 -29331 20699 -10917 -4992 13915 -3267 11112
341 11112 -11713 13736 -19202 4797 17271 -20931 29472 -12910 -8419 4659 -9897 6664
353 6664 -1552 17510 -22283 7608 -964 -27343 31422 -14997 6735 9742 -17502 2891 -6263
366 -6263 11808 -8419 16631 -2283 -13664 20907 -24292 15515 3608 -6720 13000 -12386
378 -12386 8840 -12397 10416 -4453 -8127 18195 -24039 15561 -3091 -9086 8276 -10461
390 -10461 6824 -8677 16654 -11162 -264 16131 -28671 22413 -6567 -2827 19650 -11457
402a1457J5401j3434J6588j4679J7272L73k7767L6804m2644K3714R190j7905K6136
415A7592l1878J7526j3070J1361M645j9529L4084l2836J8918o308j4948K5520
427A1077j4447J7898k3936J6669j0220r662L6761m5632L5099q850k2112L0343
439A2988k1965J4697j0357P719j3013Q537J8606l7377L6667k8331N044K3895l2326
452a5216K9271k0513J1701m158p238J4822k3096L2367k1529O023M268k2186K2328
465F844j7116K3528j5835L591N086l1775M3405k9926J2842J5268l0878K3081j5209
478g094P314m891J2410n564r903K8384m1152K9008o164j5142L5294l3818J7658
491F340j0270N64R251j3059J7321k4165K3528j1696m267J5317k3386K6239k1366
$$ plain form
402 -11457 3944 -9490 7098 -7581 9691 10064 -17703 19101 -23543 171 9361 -8544 17592
415 17592 -14286 3240 -9830 1531 6176 -13353 20731 -12105 6813 505 -14443 11077
427 11077 -3370 14528 -9408 7261 -2959 -12621 24140 -21492 13607 4757 -17355 12988
439 12988 -8977 5720 -4637 3082 -9931 -1394 17212 -20165 16502 -11829 -6785 17110 -15216
452 -15216 14055 -6458 5243 1085 -6153 8669 -14427 17940 -3589 2434 6702 -15484 6844
465 6844 -10272 13256 -2579 1012 6098 -25677 17728 -12198 644 15912 -14966 8115 -7094
478 -7094 220 -4671 7739 2175 -7728 20656 -20496 8512 2348 -12794 22500 -11318 6340
491 6340 -3930 -3366 5885 -7174 10147 -14018 9510 -2186 -6453 8864 -14522 11717 -9649
504i649J3095k673p913K6226l8305K8039j0937o325K6581k6421J5006q968M792
517B548r690P204J0770k3555L5078l6240O950J8019k9618L4147k1081O594J774
530B900r727Q274j3663K4551j7709J3283n670j5830K5017k4162K4463j2375l14
543i62J1384k5294K8802k4575J3897N369j9608K2042j9268J1548p641O626l021
556g01o971K2447l3459L0422j1885j2765K9901l3230K2736o028j734P494j0259
569d032J0580j8883K2433j3802N494J0635k6666K6258k3787J3289L571j2117K1923
582A4896k7174J7974j2482J13J5947j7311J8872j7592Q021n876J182J1526j8744
595a0648K8508k7649R988Q438k5223L2757k1780Q803J361q867P786j0867J7339
$$ plain form
504 -9649 3446 773 -7140 19086 -19219 8820 -2117 -8442 18139 -8282 6724 -2244 2548
517 2548 -7142 62 10832 -12723 22355 -13885 -6935 11084 -18534 15613 -5468 1126 2900
530 2900 -6827 1447 -12216 12335 -5374 7909 2239 -13591 11426 -12736 11727 -648 -962
543 -962 10422 -14872 13930 -10645 3252 8621 -10987 11055 -8213 3335 -4306 2320 -701
556 -701 -7672 14775 -18684 11738 -147 -12912 16989 -16241 6495 467 -1267 6227 -4032
569 -4032 6548 -12335 10098 -3704 1790 12425 -14241 12017 -11770 1519 5090 -7027 14896
582 14896 -12278 5696 -6786 -6673 9274 -8037 10835 -6757 1264 -4612 -3430 8096 -10648
595 -10648 17860 -9789 199 8637 -16586 16171 -5609 3194 4555 -4312 3474 -7393 9946
608I946j9584J6612o510j0941K4149k8418K3530j1679l677J4432j9738K3041j7595
621f432J0302l088r109J7416j7915K0129j3372L905R95j2682K0889k2784K3811
634A2065j0826p892J8685k8900K3586r489K275O872j0989R344j7150J9260j4426
647g585R055R737k3893K5577k4678J1901N296j1306J8847k1115J4469j1329M998
660b6O170j4245J9642k1290J5813o477n166J3769k0131K2255j8749R806L178j5932
674a1383K3263k2808J4765l461m776J0778j2568J6643j8264J2828p127n300K3339
687A5929k5122J9998j4459l294J4341j5765J9017j5545R408n902m977J1987j7659
700a2043K3229j6154N976L325j5694K0054j9575J7680o144k253J0937k2393K1392
$$ plain form
608 9946 -9638 6974 464 -10477 13672 -14746 8784 -2895 -6572 7860 -11878 11163 -6432
621 -6432 3870 782 -8327 9089 -8826 11303 -2069 1836 2831 -9851 11038 -11746 12065
634 12065 1239 -6653 12032 -16868 6718 -2771 -496 6376 -4613 4731 -12419 6841 -7585
647 -7585 1470 11207 -12686 12891 -11787 114 5410 -5896 12951 -8164 6305 -5024 -26
660 -26 6144 -8101 11541 -9749 6064 -413 -5579 8190 -11941 10314 -8435 1371 4549 -11383
674 -11383 11880 -10928 3837 376 -4400 6378 -6190 10453 -7811 5017 -2110 -7410 15929
687 15929 -9193 10805 -3654 -6948 7393 -8372 10645 -4900 4508 -1394 -6371 5616 -12043
700 -12043 11186 -4968 1008 4333 -11361 8693 -10882 6798 654 -1599 9338 -13055 8337
713H337j3896Q906K963j1931J3549j6839J6980j3028N173O232j7951K4494k2641
726i652J2159K40j1102J6451j7666J5637j0422N569K230j1879J8249k1325J8066
739F555o193l699J4364k0971J8090j4722P790L408r199J6422k1533J4683r035
752d040K28J1585j5117J7213j8062J0735n025m963J7863k0462K0503j4448l75
765d365R715j4673J8617j4815J1634o375k752R936j7737K1836j6379P822L043
778E507j4629J8569j8548J4699p218j580R531j5469J7960j6602J0438j587q672
791g601J5682j7291J7503j1059K365N275j4926K0435j8159J3761k192q943J2945
804G795j7334J5568r602O691J119j0812J4718k0662J8165p241j551J2823j9831
$$ plain form
713 8337 -5559 3347 6310 -5621 7928 -8911 8069 -4959 214 6446 -11505 12989 -9652
726 -9652 2507 2747 -8355 8096 -9570 6067 -4355 1214 3444 -8435 9814 -11511 6555
739 6555 362 -3337 11027 -9944 8146 -6576 1214 4622 -4577 11845 -9688 4995 -4040
752 -4040 -3812 7773 -7344 9869 -8193 2542 -2483 -7446 10417 -10045 10458 -3990 -4365
765 -4365 5350 -9323 9294 -5521 6113 -262 -3014 6922 -10815 11021 -5358 2464 5507
778 5507 -9122 9447 -9101 5598 -1620 -3200 6331 -9138 8822 -7780 2658 1071 -7601
791 -7601 8081 -9210 8293 -2766 -401 4874 -10052 10383 -7776 5985 3793 -5150 7795
804 7795 -9539 6029 -3573 3118 4237 -6575 8143 -12519 5646 -1595 -3146 9677 -10154
817a0154J7272j4995P586K463o902J4732j7920J4917j1975K885Q600j3932J8903
830A1480j7896J0577m311n162J4341j8207J8384j4335L914O190j3423J6493j5974
843g929J1630n863l17Q698j5739J9062j7218Q882J878j1116J8769j7732J3353
856F358q127q49P779j2506J7459j5352J0657m857p435J3882j6604J8644j1688
869b639K303L827j3667J7913j6830J4280m046m812J0487j7219J6250j0715P857
882B989P76q952J4243j8834J7048r701J80J1370j7430J7028j4670P408K48o314
896d611J1955j6080J5477j1719M160N193j3047J7207j7246J2178l175l843J1974
909H423j7504J5803j2308O444M398j0483J4661j6707J1730o788O66Q396j3868
$$ plain form
817 -10154 7118 -7877 -291 2172 -4730 10002 -7918 6999 -4976 -2091 6509 -7423 11480
830 11480 -6416 4161 -150 -5312 9029 -9178 9206 -5129 -1215 4975 -8448 8045 -7929
843 -7929 3701 -2162 -2479 6219 -9520 9542 -7676 1206 3084 -8032 10737 -6995 6358
856 6358 -1769 -2618 5161 -7345 10114 -5238 5419 562 -6873 7009 -9595 9049 -2639
869 -2639 -336 3491 -10176 7737 -9093 5187 1141 -3671 6816 -10403 5847 -4868 2989
882 2989 3765 -5187 9056 -9778 7270 -2431 -2251 9119 -8311 8717 -5953 1455 1703 -4611
896 -4611 7344 -8736 6741 -4978 -818 4375 -8672 8535 -8711 3467 292 -3551 8423
909 8423 -9081 6722 -5586 858 5256 -5227 9434 -7273 4457 -2331 -1665 6731 -7137
922g137J7108j7120Q799p53r082J7364j6349J3661r217n48N848j0225J6157j4744
936f238J1537n750n104J2534j6263J8046j1705M048L523j2023J5896j5990J2766
949E277n788k359R861j5081J5086j3039P886l51p226J3169j6521J6189r803L75
963b325P800j4989J7132j2957Q692j264n838J0234j4815J5267j0763O268L057
976E499j2772J5557j6830J2588l932l007J0761j5947J4226j2846O639K516p470
989e018J3561j6269J2409q771J484P795j2197J6683j6067R300j936o756J4445
1002H663j5716J4240r255J186M484r792J3909j4514J1785n794l211J0967j5934
1015h982J6124j2294M885K917r393J4365j4336J1697o938j052Q343j2363J5718
$$ plain form
922 -7137 9971 -7149 1650 897 -8185 9179 -7170 6491 -2726 -3274 2574 -7651 8506 -6238
936 -6238 5299 -451 -5555 6979 -9284 8762 -2943 1105 4628 -7395 8501 -7489 5277
949 5277 -511 -2870 6991 -8090 6996 -6043 1843 1492 -5734 7435 -9086 7103 -2700 -2325
963 -2325 5475 -9514 7618 -5339 3353 2089 -3749 6485 -8330 6937 -3826 2442 5499
976 5499 -7273 8284 -8546 4042 110 -2897 7864 -8083 6143 -6703 -64 2452 -5018
989 -5018 8543 -7726 4683 -4088 -2604 5191 -7006 9677 -6390 2910 974 -5782 8663
1002 8663 -7053 7187 -2068 -882 3602 -6190 7719 -6795 4990 -804 -4015 6952 -8982
1015 -8982 7142 -5152 -267 2650 -6743 7622 -6714 4983 -1955 -3007 5336 -7027 8691
1028H691j3183P737k137o585J2693j4786J5499r913J348N413j3457J5675j3291
1041f296R645k120m636Q494j4068J4669j1195P177K074r976J4368j6496J2228
1054C868m651j464R308j3693J3560j1989O835M25o820J2199j4625J3124q911J214
1068a620N898j1468J4726j4229R445k321n358J1659j4702J3252r330L510M092
1081C554q614J2550j4106J1075o210n76R673j3583J4571j3095N310J624p684J3322
1095G811j3754J1600q153j02N776j0883J5126j2699Q467k924o195J1369j3720
1108h281J5020r145K644L800j0870J3796j2961R871l204k682Q108j2930J3186
1121F352j0756O132J189q402J2535j4447J1756o115j044P411j1696J3035j1169
$$ plain form
1028 8691 -4492 3245 1108 -5477 7216 -7570 7929 -1984 -636 4777 -8680 6995 -6296
1041 -6296 3349 1229 -3407 5087 -8981 5688 -5507 1670 3744 -6232 8136 -8360 3868
1054 3868 -783 -2247 7061 -6632 6928 -5061 1774 2199 -4621 7578 -7047 6077 -2834 -1620
1068 -1620 4278 -7190 7536 -6693 2752 431 -4927 6732 -7970 5282 -4048 -538 3554
1081 3554 -5060 7490 -6616 4459 -1751 -2327 7346 -6237 8334 -4761 549 2173 -5511 7811
1095 7811 -5943 5657 -2496 -2598 3178 -7705 7421 -5278 3189 265 -5930 5439 -8281
1108 -8281 6739 -2406 238 4038 -6832 6964 -5997 3874 670 -2012 6096 -6834 6352
1121 6352 -4404 1728 2917 -5485 7050 -7397 4359 -1756 -2800 4611 -7085 5950 -5219
1134e219P349p49n812J0290j3801J3426p921K654M662j0911J2961j3221R823l039
1148D92k860R748j4024J2107j0032M504L186p675J1663j3799J0112o216k30Q277
1162E253j1494J3698j2413N578L96o172J1969j2228J0960p369J093M526r778J3396
1176G415j2240Q386k923m509R606j2466J2320q997K996L251q829J2296j2404R643
1190C545m835k036P829j1123J2902j0278N846K2p207J1709j2600J2149o256o84
1204a017N420j0963J2453j0392P758j911m730Q728j3211J2772q389L641L664r642
1218e819J1744j2799R372l357j500Q456j1965J1464r981N083K014o639J0856j2341
1232e412J0064o420O8O346j0351J2249j0976O204o62n196R379j1801J0593o747
$$ plain form
1134 -5219 2130 1381 -4431 5859 -7942 5484 -2437 217 4879 -6032 6929 -6292 3531 492
1148 492 -2368 7380 -6644 5463 -4569 -65 3121 -4554 7109 -6690 3422 -2794 -3024 5253
1162 5253 -6241 7457 -4956 622 1018 -5154 6815 -5413 5547 -1822 -729 3797 -5981 7415
1176 7415 -4825 3561 638 -3871 5735 -6731 5589 -3408 -412 2839 -5990 6306 -6098 3545
1190 3545 -1290 -3326 4503 -6620 6282 -3996 1850 1872 -5335 6374 -6226 5923 -333 -1017
1204 -1017 4403 -6560 5893 -4499 3259 1348 -3382 5346 -7865 4907 -3482 159 3823 -5819
1218 -5819 5925 -6874 2498 -859 -2359 6097 -5868 5596 -4385 698 2712 -3927 6929 -5412
1232 -5412 4652 -1768 -1700 4646 -5705 6544 -4432 1772 1110 -4086 5293 -6508 4085 -2662
1246b662K320L386q435J1193j1587Q554l150k831R052j1453J1517r290L771K095
1260B480o957J1194j1413R529n981j145O034r829J2435r958N713j321o152J0379
1274E008j1457J1178o476J017L905r195J0894r640P702k346k681P408j1389J1433
1288E361q193L567K892p988J0726j1669Q536l776j486O616j0131J0483r316N439
1302A061L20n597Q873j1013J0415n936J041M527r799J1547j0088P053j282l715
1316b593Q443j0935R647p422L309K460o634J0048j1449Q128m100k340Q127r582
1330d893J0342r061L288J129n490J0119j0204Q910n688J05M860q809J1065r209
1344c536O071j330m758Q493j0343R955o302J450L275p747R960r876P381k988k235
$$ plain form
1246 -2662 -342 3044 -5391 5802 -5785 2769 -381 -3212 5840 -5613 5904 -3386 385 2480
1260 2480 -4477 6717 -4696 4833 -1148 -2293 3741 -6088 6347 -3611 2102 781 -5371 5008
1274 5008 -6449 4729 -1747 -730 3175 -6020 4874 -4766 2936 590 -2091 5317 -6072 5361
1288 5361 -2832 735 3627 -4361 6365 -5304 3232 -544 -2030 4586 -5545 4938 -4378 1061
1302 1061 1381 -4216 4657 -6356 4059 -1877 -836 3691 -6108 5439 -4649 2404 1122 -2593
1316 -2593 5850 -5085 4562 -2860 449 2909 -3725 6323 -5126 3002 -1098 -3438 4689 -4893
1330 -4893 5449 -3612 -324 805 -4685 5434 -4770 4140 -1548 -1443 3417 -5392 5673 -3536
1344 -3536 2535 1205 -3553 4940 -5403 4552 -1750 -300 2975 -4772 5188 -4688 2693 -295 -2530
1359b530O320r526J0589q322L726J606o956J0370j0289Q637m128o23M716q769
1373e179J0324q693O182r44m447P768j0776R741n785J554L893q469R508r703O666
1388A640j988j986P014r829Q997p541L565K026n616R523j0434P903m171q94O338
1403D547r045R727q053M191P0m577P992r314Q406n688R91L719p981R817r348O086
1419A540j627l093P697r488R524p082K400K068n653Q957q893P009m143j182N853
1434C887q522R972p972M063M44n934Q102r063Q619m420j01L383p547Q795p827
1449d121O171j344l519P095r753R191n604K108L001p327Q908q630O482k718j594
1464a654N707q242Q589p383L767P68n148Q372r862Q267m451m20N105q289Q971
$$ plain form
1359 -2530 3790 -5736 4853 -3469 257 1863 -5093 5277 -5012 3625 -503 -1126 3590 -5179
1373 -5179 5145 -3548 2634 1690 -2757 5011 -5765 3976 -1809 -255 3638 -4831 4677 -5026 1640
1388 1640 -348 -2334 4680 -5149 3848 -3693 -128 1898 -3718 5805 -4629 3274 -897 -1791 4547
1403 4547 -4498 5229 -2824 1367 1437 -3140 4852 -4462 3944 -1744 -753 2966 -5015 4802 -4546 1540
1419 1540 -87 -3180 4517 -4971 4553 -2529 -129 1939 -3714 5243 -3650 3359 -784 -1966 3887
1434 3887 -4635 5337 -2635 1428 1872 -4062 4040 -5023 3596 -824 -925 2458 -5089 3706 -4121
1449 -4121 2050 706 -2813 4282 -5471 3720 -1884 224 3225 -4102 4806 -3824 2658 -60 -1654
1464 -1654 4053 -4189 4400 -2983 784 1552 -3596 4776 -5086 3181 -1270 -1690 3415 -4874 4097
1479D097p917M838j54l510P116r145Q036n637J982L419o866Q860q890N655k099
1494b15k156O747q410Q330o967K388J547n358Q401q574P361m199j054M823p899
1509e235R790p263M047J34m876P647q328P646m495P71L157o853Q545q476O216
1524B427j980k941O491q679Q692o254J935K110o044Q400q210O545l087j158M840
1539C087p659Q678o904M275J23m373P050r004P988l918J71L970p207P755p715
1554c683N234j199k567O374q609P495n826K163K625n995Q425q222N461k286j764
1569b374N847p597Q452o498L033N77m400P530q375P348m274k49M153p594Q466
1584D045p234M284o56l436O463p761P436n267J464K353n421Q044q018N996k389
$$ plain form
1479 4097 -3820 1018 864 -2646 4470 -4675 3361 -2276 -294 3125 -3741 5119 -3771 1884 -215
1494 -215 -2371 4376 -4034 4296 -2671 -283 1264 -4094 4307 -4267 3094 -1105 -2159 2664 -5235
1509 -5235 4555 -2708 1339 1473 -3403 4244 -4084 3562 -933 -162 2995 -3858 4687 -3789 2427
1524 2427 447 -2494 3997 -4682 4010 -2244 -309 1801 -4243 4157 -4053 2492 -595 -1753 3087
1539 3087 -4572 4106 -2798 1477 1600 -2773 4277 -4727 3261 -657 -486 3484 -3723 4032 -3683
1554 -3683 1551 352 -2215 4159 -4450 3045 -2781 -618 2007 -3988 4437 -3785 1676 -610 -2374
1569 -2374 3473 -4124 4328 -2170 863 1440 -2960 4570 -3805 3543 -731 -980 3173 -4421 4045
1584 4045 -3189 1095 439 -2997 3466 -4295 3141 -2126 -662 1691 -3730 4314 -3704 2292 -97
1599i7k035N884p741Q196n706K087J159n264P441p603O792l625m88L732p275Q321
1615C778p229M623p7m120O697q398P322l860P67L259o212P507p501N003j381k125
1631a947O068p970P822o231K370K120n432P761q211O092l024r22M354p090P674
1646C434o553L960r8l949P029q361P356m398O09L848o676Q127o916M043r88k734
1662b267O335p468P325n699J485K187n470P923p643N721k710k105N181p123P882
1677C554n893K798N68m463O934p380O809l906N72L265o608P902p305M995q74l293
1693b325O284p944P206m623J397K248n754P186p514N836k418j623N201p707P871
1708C321n736K583J489m696O533p141O190l020j56L833o578P110o636M158Kl302
$$ plain form
1599 -97 -2132 3752 -3989 4207 -1499 588 1747 -3517 3924 -3679 3113 -512 -1000 2732 -4543 3778
1615 3778 -3451 1172 1095 -3025 3672 -4726 2596 -1264 -497 2762 -3450 4057 -3444 1559 178 -1947
1631 -1947 4121 -3849 3973 -2258 112 2232 -3200 4561 -3650 2442 -582 -1504 2850 -4240 3434
1646 3434 -3119 841 743 -3206 3823 -4538 2818 -1580 -971 2877 -3799 4328 -2588 1455 467 -2267
1662 -2267 4068 -3400 3925 -1774 -289 1898 -3572 4351 -3292 2429 -281 -2386 2795 -4328 3554
1677 3554 -2339 459 1027 -3436 3498 -3882 2927 -979 -407 2858 -3750 4152 -3153 1842 968 -2325
1693 -2325 3959 -3985 3221 -1402 -5 2243 -3511 3675 -3839 1997 -421 -2044 3157 -4550 3321
1708 3321 -2415 168 1657 -3039 3494 -3647 2543 -477 -633 3200 -3378 3732 -2904 1254 1256 -2046
1724b046O436q512O891m484Q17L349o173P514o946M303j454j981N376o712P245
1739C623n709K436Q89m505P496p275N749k779j196M568p004P586o164L409J09
1754A233l933O412p471O506m410Q20L053n969P317o995M688j031k895N891p111
1769c895P240m764J496J594m700O925p097N913k406j561M609p222P506n867L217
1784I88O14m623O260p125O105l516J68L706o230P229o963M321o09k582O033p522
1800c746O988m624J071K404n267P074o631M911k093j571M615o751P072n602K666
1815E16N66m384O906p216N820l271k68L882o145O930o056L707m62k897O165o955
1831c162O539m574R39K684n951P568o665M692j767k503N049o597O780m944K235
$$ plain form
1724 -2046 4390 -4122 2769 -1715 -898 2451 -3722 3792 -3154 1149 -305 -2286 3090 -3622 3623
1739 3623 -2086 350 1239 -3266 4230 -3045 2704 -75 -1271 3297 -3707 3879 -2285 1124 1233
1754 1233 -2700 3712 -3759 2747 -1663 -843 2210 -3759 3558 -3437 1251 220 -2675 3216 -3895
1769 -3895 3345 -1419 77 1671 -3029 3896 -3201 2712 306 -1255 3354 -3868 3638 -2229 988
1784 988 1602 -3021 3239 -3886 2219 -1297 -1129 2577 -3653 3576 -3387 934 325 -2257 3776 -3746
1800 -3746 3242 -1382 -311 2093 -3174 3900 -2731 2180 87 -1484 3131 -3620 3452 -2150 516
1815 516 1082 -3302 3604 -3612 2208 -1063 -1331 2551 -3594 3336 -2720 987 525 -2372 3793 -3162
1831 -3162 3377 -1197 -258 2426 -3525 4043 -2622 2070 303 -2200 2849 -3748 3032 -1912 323
1846C23P75m503O712o961N908l015n08M144o748P208n844L457J65l467O015o933
1862c272N971l843J126K395n772P235o870M573j219k845N747o910O580m788J545
1877c47K011m931O585o909N340k197p10M150o701P187n897L339N13l899O633p274
1893c107N607l350r1L644n872O838o291L900j437k167N499o803O488m644J091
1908f95K353n066O764o207M731j949j603M228n993O710n179K884L52l865O140
1923C605o783N942l446l64L674o080O458n738L417k03l085N530o435O209m073
1938a372J006K183n160O935o782N173j544k056M700o389O312m331J893J289m162
1953b305N642o803N786l283j51L870o327O561o010L613K34l168N332o153N475
$$ plain form
1846 323 1098 -3405 3307 -3654 2254 -761 -1269 2875 -3873 3335 -2509 948 1113 -2354 3661 -3272
1862 -3272 2699 -1144 -18 2377 -3395 3840 -3030 1543 324 -2521 3226 -3684 2896 -1892 -347
1877 -347 1664 -3267 3318 -3591 1749 -448 -1158 2992 -3709 3478 -2419 920 1433 -2466 4167 -3107
1893 -3107 2500 -850 -941 2703 -3169 3669 -2622 1278 -159 -2326 3173 -3630 2858 -1786 -695
1908 -695 1658 -3408 3356 -2851 1880 -69 -1672 2556 -3437 3273 -1906 978 1330 -2535 3605
1923 3605 -3178 2764 -682 -1046 2628 -3452 3006 -2732 685 482 -2603 2927 -3508 2701 -1372
1938 -1372 -366 1817 -3343 3592 -3190 1983 439 -1617 3083 -3306 3006 -1325 568 1857 -2305
1953 -2305 3337 -3466 2320 -963 -1114 2756 -3571 2990 -3020 593 827 -2341 2991 -3162 2313
1968B313l617P45K558m874O375o267M512j743j560M784o718O591m768J754J770
1983A855m655N994n988M547k299q67L782n706O534n656L121j4l439O040o637N971
1999B583l344k36L381n196N989n326L744j003k345M725o150O427m669J549J536
2014A665m952O497o365M852j865j547M159o045O091m667K533N14l138N226o250
2029c292N562l261N67L062n542O455n847L425k70k823N241o168N267l745J155
2044b14J875m561N858n926M427j679j562M639o305N878m172J981J129l751N478
2059C095n819M518k332l61L330m961N984n805L525m96k947N374o181N598l456
2074i34n4K509m563N974n455L921j582j816M509n771O122m362J771J363m336N926
$$ plain form
1968 2313 -1304 -559 1999 -2875 3500 -2767 1745 2 -1558 3226 -3492 3099 -1669 85 1855
1983 1855 -2800 3194 -2794 1753 -546 -1413 2369 -3337 3197 -2459 662 648 -2791 3249 -3388 2583
1999 2583 -761 -997 2384 -2812 3177 -2149 1595 592 -1753 2972 -3178 3249 -1420 129 1665
2014 1665 -3287 3210 -3155 1697 -168 -1715 2444 -3601 2490 -2177 356 870 -2268 2958 -3292
2029 -3292 2270 -991 -424 2638 -2904 3551 -2296 1129 859 -1964 3277 -2891 2376 -1369 -214
2044 -214 1661 -2900 2958 -2968 1459 -220 -1782 2857 -3448 2430 -1742 239 1368 -2383 3095
2059 3095 -2724 1794 -538 -899 2431 -2530 3454 -2351 1174 678 -2269 3105 -3076 2522 -934
2074 -934 -988 1521 -3042 2932 -2523 1398 -184 -2000 2509 -3262 2860 -1502 269 1632 -2704 3222
2090C222n895M453j676j125L535n108N346m712K769j11k962N099n995N478l322
2105a004L30K503m999N913n066L219n12k047L965n139N227l848J705J354l825
2120b224N573o194M879k148p55L696n671N308m401K031J058l361M792n323M525
2135A785l031M78K643m894N992n510L485l32k722N156n719N097l362P40K225m402
2151b371N339n400M134j684j079L545n725O062m651J905J128l728N275n251M259
2166A758k235o87L048m438N182m589K960m53k293M453n792N763l555O64K366m688
2182b536N162m846L326j007j467L544m991N085l881J803R46l483N085n529M329
2197A540j871p01L506n184N320m280K259L56k615M165n005M687k812K76K024m258
$$ plain form
2090 3222 -2673 1780 104 -1021 2514 -2594 2752 -1960 809 698 -2264 2835 -3160 2318 -1004
2105 -1004 -674 1829 -3170 2743 -2323 896 384 -1663 2302 -2837 2390 -1458 247 1601 -2224
2120 -2224 3349 -2845 2034 -114 -869 2827 -2844 2464 -1937 94 1152 -2209 2583 -2740 1785
2135 1785 -1246 -768 1875 -3019 2973 -2537 948 616 -2106 3050 -2669 2428 -934 -194 2031 -2371
2151 -2371 2968 -2432 1702 18 -1061 2484 -3241 2821 -1830 75 1203 -2525 2750 -2501 1758
2166 1758 -477 -1164 1884 -2554 2628 -1961 999 546 -1747 2706 -3086 2677 -878 -214 2152 -2536
2182 -2536 2626 -2220 1106 99 -1368 2176 -2815 2270 -1611 192 1138 -2345 2740 -2789 1540
2197 1540 -331 -1032 2474 -2710 2610 -1670 589 945 -1670 2495 -2510 2177 -635 -359 1665 -2593
2213b593N507n250L271m92k209M221n162M605l445J339J179l123M770n291M195
2228A522j725q43L575n335N766m613J941Q76l145M865n043M258k669L2K201m203
2244b540N054m549L095r75k021M301n483N152l038O38K174m398M982m449L421
2259A364j523q08L163m536M749l860K176M92l259M873n250M113k245m34K821m380
2275b544M582l915K427l28k131L953m761M578l061J012J544l914N086m866L639
2290A301q90j482L572m830M525l401J616N46k984M684n234M362k585k12L113m867
2306b766N157m171K210Q9k539M155m353L886k636P83J474l466M841m736L253r54
2322B27j585L774m782M670l495J166J267l368M343m481L505j517o90K514m476
$$ plain form
2213 -2593 2914 -2336 935 443 -1766 2455 -2707 1898 -1547 -208 971 -2152 2618 -2673 1522
2228 1522 -203 -1046 2529 -2806 2960 -1653 288 1164 -1981 2884 -2159 2099 -570 -538 1663 -2540
2244 -2540 2514 -2035 1060 85 -1936 2365 -3118 2034 -1004 -366 1808 -2590 2392 -2057 1364
2259 1364 -159 -967 2196 -2340 2409 -1451 725 1217 -2042 2831 -2419 1694 -551 -985 1836 -2544
2275 -2544 2038 -1877 550 222 -1909 2044 -2717 1861 -1200 -188 1356 -2558 2528 -2338 1301
2290 1301 411 -1071 2501 -2329 2196 -1205 411 957 -2027 2657 -2577 1785 -800 -1012 2101 -2766
2306 -2766 2391 -1780 430 519 -2020 2135 -2218 1668 -968 -185 1289 -2177 2664 -2072 1181 227
2322 227 -1358 2416 -2366 2304 -1191 -25 1242 -2126 2217 -2264 1241 -276 -966 1548 -2928
2337b928N381m207K100K41k596M306m786M190k070l6K177l834M351l874K783q00
2353C98j651L297m747N062l459J097J356l717M762m668L320j083j363L353m160
2368b203M118l540J846L30k434M199m729M238k199l31K749m164M582l815K026
2383F73l5j806L175m366M223k815R93J092l190M265m506L356j296r03L173m564
2399b531M528l021J119R86k639L994m376L386j791L1J968l830M406l770K190p8
2415E72k520M215m436L618k131R8J800l324L958l924K857r18j012L043m350M544
2431B090l386J388J555l638M451m225K824j107n28K250l451L812l505K180l60
2446C50j698L448m361L698k287RK368l839M184l488K095j50j506L105m149M119
$$ plain form
2337 -2928 2453 -1754 346 587 -2009 2297 -2489 1701 -369 -405 1772 -2062 2289 -1585 1198 398
2353 398 -1253 2044 -2703 2359 -1100 -3 1353 -2364 2398 -2270 1050 -33 -1396 1957 -2203
2368 -2203 1915 -1625 221 551 -1883 2316 -2413 1825 -374 -705 2044 -2120 2462 -1353 673
2383 673 638 -1168 2007 -2359 1864 -951 42 1134 -2056 2209 -2297 1059 -237 -1140 2033 -2531
2399 -2531 1997 -1024 95 1081 -1558 2436 -1940 1446 -345 -314 1654 -2176 2230 -1540 650 572
2415 572 -1948 2267 -2169 1449 -682 -584 1216 -2108 1850 -2074 783 -135 -1147 1896 -2454 2090
2431 2090 -1296 92 1647 -1991 2460 -1765 1059 -48 -576 1674 -1777 2035 -1470 710 350
2446 350 -1348 2100 -2261 1437 -850 -841 1527 -2312 1872 -1616 479 329 -1177 1928 -2221 1898
2462A898k995J209Q75k525M011m362L326j604j018L094m026M095l142J313M39
2477E88k277L686m066L403k127J42J823l493M491m123K632k75j802L397m093L905
2493A811k522O09J412k805L628m079L097j170r43K858m203M418l495J536O82k654
2509a820L695m018L139j432l38K098l136L700l527K449l80j882L417m126L873
2524A712k318L70J552l134L739l445K318q59j010K656l788L934l185J382P85k625
2540a916M054m107L423j728q74K680l532L735k997J626K15j845L092l518L392
2555A700k409L50J651l413L949l516K081k26j584L003l710L769k541R11P28k540
2571a797L952l838L017j920p7K471l804M096l075J466M02k207L123l584L255j904
$$ plain form
2462 1898 -1097 112 987 -1538 2473 -1889 1437 -167 -1185 1909 -2117 1978 -1164 149 588
2477 588 -1689 1997 -2069 1334 -793 -651 1172 -2321 2170 -1953 679 404 -1398 1999 -2094 1811
2493 1811 -711 -102 1310 -1495 2133 -1946 1151 -19 -962 1896 -2307 2111 -1384 152 834 -1820
2509 -1820 1875 -2143 996 -436 -774 1324 -1812 1888 -1639 810 430 -1452 1965 -2161 1712
2524 1712 -606 -236 1316 -1818 1921 -1524 794 -65 -1075 1581 -2207 1727 -1458 -76 709 -1916
2540 -1916 2138 -1969 1454 -274 -1148 1532 -2000 1735 -1262 364 579 -1266 1826 -1692 1700
2555 1700 -709 -359 1292 -2121 1828 -1688 393 167 -1417 1586 -2124 1645 -896 15 743 -1797
2571 -1797 2155 -1683 1334 -586 -663 1808 -1996 2100 -975 491 893 -1314 1809 -1775 1480 -424
2587d24J17J443l020L889l594K385n43j583L306m405L849k471Q35J253k727L418
2603A728l176K425j003o48K497l435L585l082J365O01k561L903m025L136j573
2618b63n51K183l144L421l089J807k44j248L035l896L639k884Q51J699l210M356
2634B462l944K220n57j118K602l636M122l290J378P21k544L419l825L195j474
2649b69q33K481l489M039l246J673Q6j823L014l316L134k090M24J214k788L815
2665B026l566K434m84j382K815l629L409k326N87R95k639L589l505K775j567k15
2681f83K138l566M009l166J945O7k132L174l562L211j790K02J650l107L378k924
2697a156K001p10r88K708l614L293k546J002R00k727L769l759K737j044q40K266
$$ plain form
2587 -424 -307 1136 -1884 2005 -1589 796 253 -1330 1976 -2429 1420 -1051 -216 1037 -1690 1728
2603 1728 -1448 977 -26 -674 1823 -1612 1973 -1109 256 857 -1704 2199 -1826 1310 -263
2618 -263 -814 1369 -1775 1646 -1443 364 120 -1128 1907 -1989 1650 -1234 -383 1316 -1894 2462
2634 2462 -1482 738 181 -937 1665 -1971 2151 -1139 239 960 -1584 1835 -1990 1205 -269
2649 -269 -1102 1379 -2110 1929 -1317 356 442 -1381 1633 -1683 1451 -639 -215 999 -1789 2026
2665 2026 -1540 894 410 -972 1843 -1786 1623 -703 -116 879 -1760 1829 -1676 1099 -468 -683
2681 -683 1455 -2111 1898 -1268 677 744 -1388 1786 -1776 1435 -355 -153 1497 -1610 1768 -1156
2697 -1156 845 135 -853 1855 -1759 1534 -1012 -10 890 -1837 1932 -1827 910 -134 -974 1292
2713A292l128L404k917J629L07j858L064l624L589j970k67K267l516L749l107
2728a086J564n1j527K766l276K981k350R11Q34k570L678l509K653r76j148K728
2744A622l556L450k365J013M68k217L421l300K997j667n2J722l232L518l248J811
2760C85N0j940L258l633K927j903L87J538k584L220l390K604q76j084K832l882
2776b091L907k655P47J268k812L576l490K465r97p89K265l098L511l190J748P1
2792D36j979L192l450L106j982K58J554l045L677l280K109n24j110K703l213L129
2808A581k100O49P62k283L332l545K686j228n99K284l643L750k677J194L00j749
2824a286K829l511L363j906K41J598l090L643l206J911j80j491K859l368L039
$$ plain form
2713 1292 -1836 1568 -1349 280 587 -1271 1793 -1831 1758 -212 -479 1788 -1728 2021 -1086
2728 -1086 478 427 -1100 1666 -1610 1371 -979 -68 766 -1804 1874 -1635 1018 42 -1106 1622
2744 1622 -1934 1516 -849 164 632 -1585 1836 -1464 1533 -134 -186 1536 -1696 1822 -1426 385
2760 385 435 -1505 1753 -1880 1047 -856 -469 1069 -1515 1705 -1685 919 43 -1041 1791 -2091
2776 -2091 1816 -839 -92 1176 -1636 1940 -1550 915 -82 -871 1394 -1704 1807 -1383 365 436
2792 436 -1543 1649 -1801 1305 -677 -419 1135 -1910 1767 -1513 596 72 -1038 1665 -1548 1581
2808 1581 -519 130 892 -1391 1941 -1604 1082 -146 -745 1539 -2104 1646 -1031 163 463 -1286
2824 -1286 1543 -1968 1395 -511 -270 1328 -1762 1881 -1325 586 406 -1085 1774 -1594 1445
2839A445j942K49J257k606L527l470K595j158r15K480l478L408k648J251O43k193
2855a555L320l587K782j478j72K211l127L454l038J848l77j437L046l731L098
2870A257k056M41J518k658L281l276K237q18q82K330l077L361k801J149N78k337
2886a753L669l439K565j379l21K292l243L439k838J551j37j271K530l381L004
2901A288j855L13J322k855L470k942J649j19j582K480k801L093k181N37P62k099
2917a520L271k931K243j237m60K050l194L410k655J500N06k227K944l113K582
2932A169j906K27J718k946L195k951K023l60j266K605l219L108k080M49J002k238
2948a470L216l119K342r38m13J817k726K956k579R25Q23j991K916l334K598j467
$$ plain form
2839 1445 -497 -248 1009 -1597 1930 -1540 1055 -103 -1018 1462 -2016 1392 -1256 -5 638 -1555
2855 -1555 1765 -1822 960 -518 -690 1521 -1606 1848 -1190 658 281 -1156 1890 -1841 1257
2870 1257 -799 -358 1160 -1498 1783 -1493 744 -74 -956 1374 -1703 1658 -1143 6 584 -1753
2886 -1753 1916 -1523 1042 -337 -658 1634 -1609 1830 -1008 543 406 -865 1665 -1716 1288
2901 1288 -567 -254 1068 -1787 1683 -1259 390 271 -1311 1169 -1632 1461 -720 -183 579 -1520
2917 -1520 1751 -1180 1063 -174 -634 1416 -1778 1632 -1023 477 983 -1244 1700 -1413 1169
2932 1169 -737 -510 1208 -1738 1457 -1494 529 169 -1097 1508 -1711 1397 -683 -234 768 -1470
2948 -1470 1746 -1373 969 31 -382 1435 -1291 1665 -914 11 834 -1157 1759 -1575 1023 -444
2964d44k68J778k518K957k798J601j08j260K734l322L263k069J07J515k611L109
2980A666k900K107p20j068K515l128K907k140J018M82k126K948l163K472j169
2995b99l57J632k827L341k636J708k33j497K803l261K959j817N91P87k504L490
3011A880l155K050m92j120K490l169K950k182R58L42j955K783k749K249j190l37
3027f47J901l015L128k376J168L70j814K972l207K504j071k36J495k393K732k445
3043i34J556n69j033K627l198K872k006M77Q79k203L078l022K344r88p39J865
3059A006k569K858k141J150L45j585K542l007K757j656j47J698k775L210k582
3074h96J313j34j224K020k794K717j823N87J245k510L001l233K203o04p45K332
$$ plain form
2964 -444 -712 1066 -1452 1505 -1293 308 200 -1060 1674 -1648 1615 -454 -347 1168 -1443 1666
2980 1666 -1234 873 153 -915 1600 -1528 1379 -761 257 739 -1387 1561 -1602 870 -299
2995 -299 -656 976 -1851 1490 -1146 562 329 -1168 1635 -1626 1333 -484 107 894 -1610 1880
3011 1880 -1275 775 283 -837 1653 -1516 1434 -748 210 552 -1403 1380 -1369 880 -310 -647
3027 -647 1254 -1761 1367 -1009 159 529 -1285 1687 -1520 984 -87 -323 1172 -1221 1511 -934
3043 -934 622 53 -980 1647 -1551 1321 -685 -208 671 -1532 1546 -1476 868 -120 -859 1006
3059 1006 -1563 1295 -846 304 649 -936 1606 -1401 1356 -300 -447 1251 -1524 1686 -896
3074 -896 417 283 -941 1079 -1715 1002 -821 -234 1011 -1499 1502 -1731 472 -132 -877 1455
3090A455k918K865k134R60M99j754K432k816K371j178l13J597k525L008k540J080
3106H9L56j433K610l180K603j588N7R64k073K990k465J763o10o27K045l100L040
3123A441k160P74Q80k102K759k751J884r47l49J898k648K612k271J188J66j602
3139a228K692l193K757j615L95J361k384K485k372J685m01q70K013k561K755k155
3155f36R00M70k110K887k769K199q94q95J795k434K421j936J205K62j536K064
3171I93k112K116j367Q7J279k312K709k332J575k55j396K413k799K556j581L62
3187f4P01j681K299k666K122o74q67K029k664K463k008R56L96j809K786k611K157
3204H65j289M1J318k237K681k221J336k84q34K002k643K527j832J99J031j762
$$ plain form
3090 1455 -1463 1402 -732 228 727 -1027 1405 -1411 960 -218 -531 1066 -1459 1549 -991 89
3106 89 445 -988 1622 -1558 1045 -543 -486 478 -1595 1395 -1070 693 83 -544 1501 -1599 1441
3123 1441 -719 55 935 -1167 1592 -1159 725 -222 -571 1327 -1321 1291 -980 208 374 -1228
3139 -1228 1464 -1729 1028 -587 -192 1169 -1215 1270 -1102 583 182 -688 1325 -1236 1519 -636
3155 -636 264 734 -1376 1511 -1258 941 47 -848 947 -1487 934 -1002 203 465 -1071 993
3171 993 -1119 997 -370 -283 996 -1316 1393 -939 636 381 -1015 1398 -1401 1155 -426 -64
3187 -64 637 -1044 1255 -1411 711 37 -830 1199 -1465 998 -1010 -54 342 -1467 1319 -1292 865
3204 865 -424 -383 935 -1302 1379 -842 494 210 -624 1378 -1265 1262 -570 -371 660 -1102
3220a102K262k206J591m91p58J636k472K650j934Q69M93j742K637k526J957j321
3236d57K84J210k445K627j878R94J11j159K080k734K356j340n4J504k606K665
3252A158k257J634n44q96J996k468K498j706M53O75j743K481k267J642q77k62
3268d83J597k301K447k188R72N26j456K016k359K102j213o0J170j705K115k122
3284i42J427l15r39K038k418K286j539L72P60j635J953j869J428m22o81J716k290
3301a070K245j825Q89K72j513K369k782K246j149j25J213k193K593k046J203j42
3317A85r09J734k175K361j684M67J008k190K369j885J409o90m76J823k540K372
3333A179j480J93M33j518K228k190J777q78k49J230j771J972j703J150k0j425
$$ plain form
3220 -1102 1160 -1046 545 54 -704 932 -1540 1110 -824 45 538 -1204 1433 -1093 864 -457
3236 -457 -173 1037 -1408 1219 -659 335 446 -713 1367 -1367 989 -351 -405 1099 -1507 1158
3252 1158 -1099 535 -9 -905 1091 -1377 1121 -585 -132 543 -1200 1281 -986 656 -221 -483
3268 -483 1114 -1187 1260 -928 44 570 -886 1130 -1229 873 -340 -400 770 -935 1180 -942
3284 -942 485 170 -769 1269 -1149 1137 -402 -30 730 -905 1048 -821 607 185 -496 1220 -1070
3301 -1070 1175 -650 239 511 -1002 1367 -1415 831 -318 -443 770 -1423 1170 -876 327 185
3317 185 -724 1010 -1165 1196 -488 -21 987 -1203 1166 -719 690 0 -476 1347 -1193 1179
3333 1179 -301 -108 325 -1193 1035 -1155 622 -256 -505 725 -1046 926 -777 373 353 -1072
3349a072K216j888J552j120J60Q07j605K272k082J370n90n83J747k141K080j680
3365e57L61R28j720K026k018J662p54k76R93j734K040j572Q28J68j201K074k123
3382h75J999j200k80J180j853K089j696J200k39j013J558k065J963j050J13Q44
3398F75j862K031j712J284n92n55J616j820J958j826J271k1j047J788j977J710
3414I21j126K9Q22j478J753j626R59kq50J526k191K116j443M99Q38j667J944k018
3432i94J480n17o45J592j790J808j487Q19K77j337J826k054J642o46k38R98j777
3449a043K035j848R76K79j200J591j834J794r20J72N61j530J784j851J581m43
3465A04n89J249j887K178j700Q39L54j310J931j956J423o80m71J551k038J843
$$ plain form
3349 -1072 1144 -744 808 -312 -152 655 -950 1322 -760 610 20 -563 1184 -957 1123 -557
3365 -557 -196 732 -988 1038 -980 682 -72 -348 645 -1089 951 -621 207 375 -826 1248 -875
3382 -875 1124 -76 -356 824 -1029 1060 -636 564 325 -688 870 -1195 768 -282 -169 675
3398 675 -1187 844 -868 416 -176 -731 885 -935 1023 -803 468 447 -600 1188 -789 921
3414 921 -205 -176 646 -832 921 -705 254 252 -598 928 -1263 853 -590 -91 747 -920 1024 -994
3432 -994 486 -31 -676 916 -874 934 -553 266 543 -794 1032 -1022 620 -26 -264 734 -1043
3449 -1043 992 -856 120 399 -801 790 -1044 750 -170 2 563 -967 817 -1034 547 104
3465 104 -485 764 -1123 1055 -645 194 548 -762 1169 -787 636 -44 -515 1036 -1002 841
3481H41j654P55L67r15J591k059J887j298K32O67j504K030j551J084l23q20J613
3498I43k070J997j346M26N57j243J752j876J480o35n32J476j926J967j548P67
3514A89K20j174J894k171J946j022k8P78j533J901j593J134m72n69J560j976J799
3531H83j141L46O01j361J609j714J241o36m69J419j629J562j459O48M49j049J377
3548F77j665J580p53k24J084j558J943j785R79N5q88J488j924J825j223K23P01
3565E35j568J889j703J207n02m94J544k050J879j428N35N49r90J308j613J574
3581F72o56k98J144j703J641j246O53l7o93J532k091J893j127L4R90j746K008
3598I70j911J151j21o06J493k012J799j112M24M27j273J735j772J485q15l91J413
$$ plain form
3481 841 -813 -58 309 -606 985 -1074 813 -485 -253 414 -1090 940 -611 473 150 -670 943
3498 943 -1127 870 -476 -50 507 -736 1016 -860 620 -15 -547 929 -997 970 -578 189
3514 189 409 -765 1129 -1042 904 -118 -146 632 -901 1000 -593 541 69 -500 1060 -916 883
3531 883 -258 88 689 -672 937 -777 464 -172 -641 778 -851 711 -748 -100 349 -700 677
3548 677 -988 592 -161 -385 699 -859 1084 -701 278 333 -555 933 -991 834 -389 -166 535
3565 535 -1033 856 -847 360 -142 -636 908 -1142 737 -691 -156 393 -597 711 -902 672
3581 672 16 -282 862 -841 800 -446 207 170 -523 1009 -1082 811 -316 -282 708 -1038 970
3598 970 -941 210 89 -517 976 -1036 763 -349 75 502 -771 964 -808 677 -138 -529 884
3615H84j566J653j615O76K27r76J727k089J694q83k20R26j528K003j409Q94m41
3632d3n72J510j845J461r98N82M88j432J692j421J002k95m78J077j407J550j355
3649d84M79N99j333J494j631J498q40j94J242j828J746j412O74J48p79J208j464
3666h77J567r42J14Q76j613J721j438R45j66p49J208j574J795j393N38J77j125
3683i36J877j757J417q65j18J062j360J687j449O99K1q30J508j894J555p41J11
3700a3N55j406J929j776J178m05n47J374j799J623j258Q58L7j230J889j895J502
3717F16o86l30J081j540J407j202Q01J90j084J792j872J515q51J47Q10j513J565
3734H46j602J026j9r17J342j376J387j145L38P17j409J648j726J280m48k67R55
$$ plain form
3615 884 -682 971 -644 32 259 -717 1010 -1079 615 -268 -488 438 -1090 913 -496 398 -43
3632 -43 -615 895 -950 511 -487 95 583 -849 843 -578 424 129 -349 728 -679 871 -484
3649 -484 -5 594 -739 755 -876 622 -218 -412 830 -998 748 -664 10 158 -621 587 -877
3666 -877 690 -252 -138 738 -875 846 -592 353 187 -562 646 -928 867 -526 12 189 -936
3683 -936 941 -816 601 -264 -382 680 -680 1007 -442 257 278 -552 956 -938 617 -124 -13
3700 -13 542 -864 1065 -711 467 62 -485 889 -910 713 -545 313 350 -880 1009 -886 616
3717 616 -70 -400 681 -859 548 -654 147 337 -747 1045 -827 688 -163 -16 794 -719 846
3734 846 -756 270 251 -666 676 -700 687 -458 -120 597 -812 836 -890 390 -58 -325 630
3751F30j381J562j439R42J8r34J296j479J434q51J81N54j405J453j353J069Or92
3769f89J374j481J424j143O16L82j262J455j437J246l93n28R77j339J662j278
3785d14N29M53j073J466j718J343q87p1R26j247J574j385P47q9p68J349j542J464
3803F57j048J75Q60j440J708j700J119o7o39J148j457J311q91M53K89j110J405
3820G73j370Q76m99j86J043j399J485j205M14L43q56J480j761J387n84k39P57
3837D59j034J413j244R16l24p65J293j512J543j182M98L67r92J505j828J374o57
3854a70j83R41j325J412r54N1O41j092J521j607J498p87k62J039j688J861j232
3871c36N06j28n62J147j338J342q58J08N13j160J549j560J139m60l54J037j102
$$ plain form
3751 630 -751 811 -628 314 332 -602 694 -785 649 -202 -21 533 -872 581 -772 297 303 -689
3769 -689 685 -796 628 -515 101 483 -779 676 -761 485 92 -436 541 -798 864 -414
3785 -414 115 568 -505 961 -757 586 -301 -372 554 -693 881 -504 243 154 -614 735 -807 657
3803 657 -391 -216 644 -796 912 -788 331 264 -375 773 -684 627 -264 189 478 -632 773
3820 773 -597 279 -220 -406 637 -762 723 -482 -68 275 -581 899 -862 525 -59 -298 459
3837 459 -575 838 -406 510 186 -579 714 -798 745 -437 61 428 -564 941 -887 487 -170
3854 -170 -353 588 -737 675 -279 -228 413 -679 842 -765 733 -54 -316 723 -965 896 -336
3871 -336 170 42 -520 627 -711 631 -227 -119 394 -766 783 -777 362 -98 -452 585 -517
3888e17R20p99M86J33q54J430j507J063n47J01N71r90J460j155L41N3p42J253
3906G00j352J250j019K06O84j309J503j292R55l54k77R54j339J191r13M56J90
3923B34q39J396j462J113m30k63Q18j505J666j165O52K10j010J232j365J254q98
3940c62K66O18j192J465j444Q13o1k78Q58j061J169j273M69L79j088J666j631
3957f87J045k59k54N92j118J447j188P29J19r39J205j337J115o68j0P82j236J259
3975E97j221Q41j67n08J162j305J142p56J84M83r67J237j251J043n37k47Q27j259
3993g02J334r28M94m2o94J199j238R02k64k30O68j351J546j409J028j84n91J332
4011H70j487J245p00KN31j034J562j629Q66r9m09R32j374J408j182N31j30o07
$$ plain form
3888 -517 403 -396 90 223 -631 799 -708 355 -192 -91 480 -510 950 -205 136 189 -553 700
3906 700 -652 598 -421 -215 469 -840 663 -629 326 -28 -305 649 -690 501 -412 44 234
3923 234 -605 791 -671 442 12 -251 567 -938 728 -437 215 425 -585 647 -718 536 -362
3940 -362 -96 522 -670 795 -649 164 103 -175 683 -378 791 -482 -13 366 -722 944 -687
3957 -687 358 99 -155 437 -681 766 -422 307 426 -513 692 -645 470 -198 -208 574 -662 597
3975 597 -624 217 50 -458 704 -601 541 -215 -31 452 -515 722 -529 514 -23 -270 557 -702
3993 -702 632 -296 198 156 -538 661 -577 325 61 -169 499 -852 694 -715 313 129 -462 870
4011 870 -617 628 -72 -70 461 -573 989 -640 226 127 -282 650 -724 684 -498 33 -97 -704
4029g04J307j105Q02n21l3P98j380J474r13L22R8o38J191j354J357j072K19N97
4047D45r48J447j390N30j4p82J187j169J293p47JM87r00J186j215J063n79j15
4065b20P64j200J391j257P66J51r32J043j249J063m39l37R32j081J254j350Q96
4082A95k13m15R35j268R51n63M02M53j081J278j295J147l23o00R78j303J351r60
4100c31N53J2o70J005j134J156o91j68P62j016P87p01N20K04p57J157j381Q80
4118A87k21n1J98q14J432j322J061m58k98Q17j202J356r89M86L0r36J399j459
4136g84J110l11j93Q18j333J381j218O66j93l27R81j064P35k35j61O30j090J421
4154H33j165N40j73l52Q90j051J007n80qL86q13J010q74N62l22k52Q41r91R09
$$ plain form
4029 -704 603 -502 300 -221 -254 544 -836 638 -275 47 145 -493 698 -656 701 -371 -152 445
4047 445 -503 944 -446 84 70 -712 475 -694 599 -148 -147 340 -560 626 -589 474 -105 -220
4065 -220 544 -656 735 -522 244 395 -537 506 -743 320 -119 -456 476 -605 649 -701 195
4082 195 -18 -433 502 -766 185 -378 24 477 -604 674 -621 526 203 -397 581 -722 629 -331
4100 -331 222 234 -436 569 -565 591 -100 -268 494 -522 265 -436 84 288 -469 688 -693 187
4118 187 -34 -85 113 -701 731 -591 470 12 -286 531 -671 685 -304 182 212 -724 675 -784
4136 -784 326 15 -178 640 -693 688 -530 136 -57 -384 597 -467 268 33 -128 502 -588 833
4154 833 -332 208 35 -317 573 -478 529 -51 -59 327 -486 524 -350 212 -110 -362 479 -512 397
4173C97r84M67K93n33O40o94Q05o26J55O58j054J207j066O05r8n49J030j047Q47
4192D53o69J71M81q95R80j206R97n98j22R16j021Q66n82Q2L91r40J083p56N03
4211A34j57j67R41j400J032p16O00o4m01N29o55Q90p68o5M32p33J096r35N56P4
4231B23n04O52j331J561q74K50K10m76R03j105R82n46o2O31r00Q75p38M30j66
4250A5m97J090j216J098o64O8N29o62N45o64M99j08J2M11q84Q65o92J64N27q03
4270c67J126j158Q51m27k87O99j120J424q84M4M61p35J098j147P03m25k01M28
4288H3n93R11q79O56j7n50Q09q51Q07q85O43m5o02J132r04M20k02q3M08p23Q03
4309C38p69M81K81n19O21p75P79m59j53N77j048J132o69K97j27l90R67r45M64
$$ plain form
4173 397 -587 -120 173 -360 280 -414 391 -235 -80 578 -476 731 -335 270 172 -377 653 -394 453
4192 453 -216 -45 436 -459 521 -685 312 -286 -408 508 -513 353 -229 -147 244 -696 387 -369 134
4211 134 -23 -190 751 -649 383 -333 267 203 -198 331 -324 566 -202 -267 165 -568 528 -407 149 223
4231 223 -281 371 -960 601 -273 -23 187 -289 614 -491 491 -55 -117 514 -386 489 -249 181 15
4250 15 -482 608 -608 490 -174 -106 423 -239 306 -358 141 33 45 456 -428 437 -255 -91 436 -367
4270 -367 759 -399 452 25 -262 437 -683 741 -143 -99 362 -373 725 -422 281 -144 -345 83
4288 83 -510 401 -478 178 161 -389 420 -431 376 -509 134 89 -513 619 -285 135 -67 -150 258 -465 338
4309 338 -431 50 331 -188 433 -342 437 -22 -175 402 -646 486 -183 114 -13 -403 564 -381 83
4328H3k63K65J68o40P89p95P18j17l22M98r40R65o63K39Q0m03Q03q14L62k33J77
4349d3N36p67P77p41L53L47p44J015j379R38n99J55M10p45P63o48O96k04m41P87
4369D66q54P38k97PK01o33P43p84N41l53j36O74p00J006r27L34J88l78N94q59
4389d29Q59m85M3M97q09Q19q09M24j47k49O97j043R24n07K69K77p90Q78p88K15
4409a54J12k35O80r13J024o56J99L81q92R04n75M90n87J18M24q56Q30n01K16P9
4429H8m38P64p75Q34p20K22N16o58P69r78K50K96m26N99o91P26m99K15K99q45
4449d52R35o26N83m10k16O37j074R17o97L17N9l96Q75o58L65m38K11K86n08Q99
4469F09j076N76l0k13N33p60N03j65j6L71r03Q54p31O21j97j17M07o81N45l60
$$ plain form
4328 83 -180 85 253 -387 402 -393 325 208 -114 384 -556 409 -254 -15 65 -338 465 -349 13 -220 -43
4349 -43 493 -274 503 -238 115 462 -282 733 -646 292 -307 -152 258 -487 276 -372 324 120 -321 466
4369 466 -388 350 53 60 261 -372 371 -413 128 -225 -361 313 -387 619 -308 26 214 -164 430 -429
4389 -429 430 -55 -12 485 -324 495 -314 110 -37 -286 411 -632 292 -215 54 331 -459 419 -369 -154
4409 -154 -42 -277 403 -510 514 -142 57 438 -454 450 -125 365 -222 -104 320 -536 294 -207 9 88
4429 88 -350 414 -361 473 -247 -25 491 -167 602 -376 -126 170 -256 343 -348 378 -121 94 393 -452
4449 -452 483 -143 440 30 -186 451 -623 294 -403 -86 -27 -423 452 -206 159 -279 -68 218 -290 609
4469 609 -467 109 79 -134 399 -361 142 -23 -39 332 -571 283 -448 173 -24 -141 266 -415 130 -230
4489b30L43j8l61P66p35L14j58j51K04n47R21n07K97m3l10N20p30P93m32RL89
4510C34r11J045j055N50n1j08P68j124Q94o30R5K93m38P17p27N42k25o2K21m83
4530c55Q26p29L06k5p5N96r39P77k87j23J8l91O84o76N62j65k39L61n35Q23m49
4551c5n7M47o75P15p55P59l31q8K00m92M84k88K52K29o19O30o81L39j66l2M93
4572C29q93J046j055Q37j34o02R58o91M17j75O0K39q58P93l84M89m85o0L55p01
4592e15P89m91R6K26l65P17q73N50l80K6N24p34P66o07L93J10l96O42p23M68k32
$$ plain form
4489 -230 113 95 -266 500 -235 79 -79 -230 -26 -573 348 -159 138 95 -215 305 -425 368 -64 -55 334
4510 334 -577 468 -587 -37 -88 -196 572 -552 342 -288 -193 100 -338 379 -348 194 -31 -93 128 -355
4530 -355 471 -258 48 23 -52 544 -395 382 95 -28 -10 -401 283 -393 169 4 -235 126 -409 414 -35
4551 -35 -92 355 -320 395 -360 399 68 -20 180 -312 172 -116 136 365 -254 376 -305 34 -132 -164 329
4572 329 -564 482 -573 264 130 -472 486 -205 212 37 97 336 -522 271 -113 376 -109 -169 186 -515
4592 -515 274 -217 -121 105 -260 457 -416 134 -246 -220 304 -430 336 -271 122 232 -164 478 -245 223 -9
$$ [...]
8191a55
##END NTUPLES=NMR FID
##END=
