##TITLE=1H_34-2022
 DMSO-d6
 8 sc, 
 30.06.2022
##JCAMPDX= 6.0         $$ Bruker NMR JCAMP-DX V2.0
##DATA TYPE= NMR SPECTRUM
##DATA CLASS= NTUPLES
##ORIGIN= UXNMR, Bruker Analytische Messtechnik GmbH
##OWNER= root
$$ XWIN-NMR		Version 3.5
$$ Thu Jun 30 14:13:19 2022 Russian Standard Time (UT+4h)  she@DPX200
##.OBSERVE FREQUENCY= 200.1313499994
##.OBSERVE NUCLEUS= ^1H
##.ACQUISITION MODE= SIMULTANEOUS
##.ACQUISITION SCHEME= undefined
##.AVERAGES= 8
##.DIGITISER RES= 18
##SPECTROMETER/DATA SYSTEM= spect
##.PULSE SEQUENCE= zg30
##.SOLVENT NAME= D2O
##.SHIFT REFERENCE= (INTERNAL, D2O, 0, 15.737)
##AUDIT TRAIL= $$ (NUMBER, WHEN, WHO, WHERE, WHAT)
$$ ##TITLE= Audit trail, XWIN-NMR		Version 3.5
$$ ##JCAMPDX= 5.01
$$ ##ORIGIN= Bruker BioSpin GmbH
$$ ##OWNER= she
$$ F:/spectra/data/she/nmr/H-F/1/pdata/1/auditp.txt
$$ ##AUDIT TRAIL=  $$ (NUMBER, WHEN, WHO, WHERE, WHAT)
(   1,<2022-06-30 14:12:17.95 +0400>,<she>,<DPX200>,
      <created by zg, POWCHK disabled, PULCHK disabled
       configuration hash MD5:
       00 E9 B6 7A A2 85 ED C7 34 08 36 98 17 FE 4E 26
       data hash MD5: 16K
       FB 43 3D 7B BF F8 2C 87 34 2F 7F A2 3C F8 68 21>)
(   2,<2022-06-30 14:12:20.79 +0400>,<she>,<DPX200>,
      <Start of raw data processing
       efp BC_mod = 2 LB = 0.24 FT_mod = 6 PKNL = 1 PHC0 = -18083.63 PHC1 = 71.20069 SI = 16K 
       data hash MD5: 16K
       7C 60 37 5F 42 BB 0E F5 46 8D BB 2F DB A4 64 5D>)
(   3,<2022-06-30 14:12:40.93 +0400>,<she>,<DPX200>,
      <pk PHC0 = -117.2435 PHC1 = -62.40001 
       data hash MD5: 16K
       9C 8E 9B DC 43 85 8B 1F 53 03 5A B9 10 E4 6D 46>)
(   4,<2022-06-30 14:12:44.12 +0400>,<she>,<DPX200>,
      <abs ABSG = 5 
       data hash MD5: 16K
       D6 D7 5C 83 BB CC 37 3E A8 13 EF 2C 19 7F 7C 79>)
$$ ##END=
$$ 
$$ hash MD5
$$ 4E 81 BD 52 31 04 56 09 A7 C3 50 39 5B 97 24 17
##$RELAX= 
##$RELAX= 
##$RELAX= 
##$RELAX= 
##$RELAX= 
##$RELAX= 
$$ Bruker specific parameters
$$ --------------------------
##$DU= <F:/spectra>
##$EXPNO= 1
##$NAME= <H-F>
##$PROCNO= 1
##$TYPE= <nmr>
##$USER= <she>
##$AMP= (0..31)
100 100 100 100 100 100 100 100 100 100 100 100 100 100 100 100 100 100 
100 100 100 100 100 100 100 100 100 100 100 100 100 100 
##$AQSEQ= 0
##$AQ_mod= 1
##$AUNM= <au_zg>
##$AUTOPOS= <>
##$BF1= 200.13
##$BF2= 200.13
##$BF3= 200.13
##$BF4= 200.13
##$BF5= 200.13
##$BF6= 200.13
##$BF7= 200.13
##$BF8= 200.13
##$BYTORDA= 1
##$CFDGTYP= 0
##$CFRGTYP= 5
##$CHEMSTR= <none>
##$CNST= (0..31)
1 1 145 1 1 1 1 1 1 1 1 1 1 1 1 1 1 1 1 1 1 1 1 1 1 1 1 1 1 1 1 1 
##$CPDPRG= <>
##$CPDPRG1= <>
##$CPDPRG2= <>
##$CPDPRG3= <>
##$CPDPRG4= <mlev>
##$CPDPRG5= <mlev>
##$CPDPRG6= <mlev>
##$CPDPRG7= <mlev>
##$CPDPRG8= <mlev>
##$CPDPRGB= <>
##$CPDPRGT= <>
##$D= (0..31)
0 1.2 0 0 0 0 0 0 0 0.06 0 0.03 0 0 0 0 0.0002 0 0 0 0 0 0 0 0 0 0 0 0 
0 0 0 
##$DATE= 1656583937
##$DBL= (0..7)
120 120 120 120 120 120 120 120 
##$DBP= (0..7)
150 150 150 150 150 150 150 150 
##$DBP07= 0
##$DBPNAM0= <>
##$DBPNAM1= <>
##$DBPNAM2= <>
##$DBPNAM3= <>
##$DBPNAM4= <>
$$ [...]
##$SUBNAM2= <"">
##$SUBNAM3= <"">
##$SUBNAM4= <"">
##$SUBNAM5= <"">
##$SUBNAM6= <"">
##$SUBNAM7= <"">
##$SUBNAM8= <"">
##$SUBNAM9= <"">
##$SW= 18.0517283424941
##$SWIBOX= (0..15)
0 0 2 0 0 0 0 0 0 0 0 0 0 0 0 0 
##$SW_h= 3612.71676300578
##$TD= 16384
##$TD0= 1
##$TE= 0
##$TE2= 300
##$TE3= 300
##$TEG= 300
##$TL= (0..7)
0 120 120 120 120 120 120 120 
##$TP= (0..7)
150 150 150 150 150 150 150 150 
##$TP07= 0
##$TPNAME0= <>
##$TPNAME1= <>
##$TPNAME2= <>
##$TPNAME3= <>
##$TPNAME4= <>
##$TPNAME5= <>
##$TPNAME6= <>
##$TPNAME7= <>
##$TPOAL= (0..7)
0.5 0.5 0.5 0.5 0.5 0.5 0.5 0.5 
##$TPOFFS= (0..7)
0 0 0 0 0 0 0 0 
##$TUNHIN= 0
##$TUNHOUT= 0
##$TUNXOUT= 0
##$USERA1= <user>
##$USERA2= <user>
##$USERA3= <user>
##$USERA4= <user>
##$USERA5= <user>
##$V9= 5
##$VALIST= <valist>
##$VCLIST= <CCCCCCCCCCCCCCC>
##$VD= 0
##$VDLIST= <DDDDDDDDDDDDDDD>
##$VPLIST= <PPPPPPPPPPPPPPP>
##$VTLIST= <TTTTTTTTTTTTTTT>
##$WBST= 1024
##$WBSW= 4
##$XGAIN= (0..3)
0 0 0 0 
##$XL= 0
##$YL= 0
##$YMAX_a= 612103
##$YMIN_a= -629912
##$ZGOPTNS= <>
##$ZL1= 120
##$ZL2= 120
##$ZL3= 120
##$ZL4= 120
##$ABSF1= 15.73697
##$ABSF2= -2.314879
##$ABSG= 5
##$ABSL= 3
##$ALPHA= 0
##$AQORDER= 0
##$ASSFAC= 0
##$ASSFACI= 0
##$ASSFACX= 0
##$ASSWID= 0
##$AUNMP= <proc_1d>
##$AZFE= 0.1
##$AZFW= 0.1
##$BCFW= 0
##$BC_mod= 2
##$BYTORDP= 0
##$COROFFS= 0
##$CY= -3
##$DATMOD= 1
##$DC= 0
##$DFILT= <>
##$DTYPP= 0
##$F1P= 0
##$F2P= 0
##$FCOR= 1
##$FTSIZE= 16384
##$FT_mod= 6
##$GAMMA= 0
##$GB= 0
##$INTBC= 1
##$INTSCL= 0
##$ISEN= 128
##$LB= 0.24
##$LEV0= 0
##$LPBIN= 0
##$MAXI= 10000
##$MC2= 0
##$MEAN= 0
##$ME_mod= 0
##$MI= 1.114404
##$NCOEF= 0
##$NC_proc= -4
##$NLEV= 6
##$NOISF1= 3.799351
##$NOISF2= 2.8
##$NSP= 0
##$NTH_PI= 0
##$NZP= 0
##$OFFSET= 15.73697
##$PC= 1
##$PHC0= -18200.88
##$PHC1= 8.800682
##$PH_mod= 1
##$PKNL= yes
##$PPARMOD= 0
##$PSCAL= 0
##$PSIGN= 0
##$REVERSE= no
##$SF= 200.130006917505
##$SI= 16384
##$SIGF1= 3
##$SIGF2= 2
##$SINO= 5.538805
##$SIOLD= 16384
##$SREGLST= <1H.CDCl3>
##$SSB= 0
##$STSI= 16384
##$STSR= 0
##$SW_p= 3612.71676300578
##$SYMM= 0
##$S_DEV= 0
##$TDeff= 16384
##$TDoff= 0
##$TI= <>
##$TILT= no
##$TM1= 0
##$TM2= 0
##$TOPLEV= 0
##$USERP1= <user>
##$USERP2= <user>
##$USERP3= <user>
##$USERP4= <user>
##$USERP5= <user>
##$WDW= 1
##$XDIM= 16384
##$YMAX_p= 509529545
##$YMIN_p= -128422
$$ End of Bruker specific parameters
$$ ---------------------------------
##NTUPLES= NMR SPECTRUM
##VAR_NAME=  FREQUENCY,     SPECTRUM/REAL,   SPECTRUM/IMAG
##SYMBOL=    X,             R,               I
##VAR_TYPE=  INDEPENDENT,   DEPENDENT,       DEPENDENT
##VAR_FORM=  AFFN,          ASDF,            ASDF
##VAR_DIM=   16384,         16384,           16384
##UNITS=     HZ,            ARBITRARY UNITS, ARBITRARY UNITS
##FACTOR=    0.220516191357247, 1,           1
##FIRST=     3149.43990451677, 0,            0
##LAST=      -463.276858489008, 0,           0
##MIN=       -463.276858489008, -128422,     0
##MAX=       3149.43990451677, 509529545,    0
$$ Real data points
##PAGE= N=1
##DATA TABLE= (X++(R..R)), XYDATA
$$ [...]
9633A2876r327j5086r413m211jp333l74J553m969O808J3428J4278Q946M676N49
9618A2400o425R152k301j7804j1115j1141m669j2661O807M795k008k431K0842
9605a6559K1387Q31R839P007j1626n889p247J323j3318j1416q551p657Q249J2753
9591b0874J0318p74P147J1580k215m245J7348j926j437j4540k993n947p057o502
9577b2117q010o531M520J1590J1214Q62J3590O525k172q178N151O477m780j1726
9563c585j6004r557r883Q115M055O952o386J3360O61Q408L114J1069j1260m638
9549e579l205o59n132o291m02o87q83J635J1325P369J960M785m87J345N803r686
9533A211m236j2718j309p132M407K716M343q234J2176J346L800p547P427k600
$$ plain form
9633 12876 3549 -11537 -20950 -25161 -25162 -32495 -32869 -31316 -36285 -29477 -16049 -1771 7175 11851 12400
9618 12400 5975 15127 12826 -4978 -16093 -27234 -31903 -44564 -37757 -32962 -34970 -37401 -16559
9605 -16559 4828 5659 15498 22505 10879 4990 -2257 -934 -14252 -25668 -34219 -41876 -33627 -20874
9591 -20874 -10556 -11330 -4183 7397 5182 937 18285 16359 14922 382 -2611 -8558 -15615 -22117
9577 -22117 -30127 -36658 -32138 -20548 -9334 -8472 5118 11643 9471 1293 6444 12921 8141 -3585
9563 -3585 -19589 -29146 -39029 -30914 -26859 -19907 -26293 -12933 -12272 -3864 -750 10319 -941 -5579
9549 -5579 -8784 -9443 -14575 -20866 -21268 -21955 -22838 -21203 -9878 -2509 -549 4236 3749 5094 10897 1211
9533 1211 -3025 -15743 -17052 -24184 -19777 -17061 -12718 -20952 -8776 -7430 -3630 -11177 -3750 -6350
9519f350n62r66n492n60k352k235J391J122k48J0462j2104O760L729P92r938O033
9503a0518q216Q911p230m099L167j396l193R876o32r33j95M247J193K082P458
9488E22N681j710q808N812j1853L315j805q843j4290P220J1950J1980j806N169
9474B534L390j092r319M971L138j1475k222K98j2511j701Q911j428M527Q161N017
9459A199p44j388p551N935q120K68n138N223P787p7p345r525O157O302j218O67
9443g568L235N11j1831r44J83r48J0885Q570l109q17L667p952o504j2980k697
9428b8299n085N321J1408J9872q103J351M405J764n662J447M54r525o567K667
9414a4552m083m731R743Q778j09J29R569k61l090L666M608j6828j0475j029O930
$$ plain form
9519 -6350 -6912 -7878 -13370 -13930 -16282 -18517 -17126 -16004 -16252 -5790 -17894 -11134 -7405 -6613 -16551 -10518
9503 -10518 -18734 -9823 -17053 -21152 -17985 -19381 -22574 -12698 -13330 -14263 -14458 -10211 -9018 -6936 522
9488 522 6203 4493 -4315 1497 -10356 -7041 -8846 -17689 -31979 -24759 -12809 -829 -2635 2534
9474 2534 5924 4832 -4487 484 3622 -7853 -10075 -9777 -22288 -23989 -15078 -16506 -11979 -3818 1199
9459 1199 455 -933 -8484 -2549 -10669 -10401 -15539 -10316 -2529 -2606 -9951 -19476 -13319 -7017 -8235 -7568
9443 -7568 -4333 -3822 -15653 -16597 -16414 -17362 -6477 2093 -1016 -1833 1834 -6118 -12622 -25602 -28299
9428 -28299 -33384 -28063 -16655 3217 -4886 -3535 870 2634 -3028 -1581 -1127 -10652 -17219 -14552
9414 -14552 -18635 -23366 -13623 -4845 -4954 -4825 4744 4483 1393 5059 9667 -7161 -17636 -18665 -11735
9399a1735r572J748Q382N629J017Q038Q160m999p634J925o312l286j3384N754
9385a6269l706j0685L034J478J1720J1583P917L30j542n284Q793k966r136j1563
9371a6296m611j1864M432R832q08m188O288L696J0660n05J191R15k930R56o044
9356i276q896N902J964q065n071j033R377j662J1839N063m550j39J3384p023o612
9341d798q031n691j5636L638J7320L960M888j148l715o16R450K074o350J654m826
9326g827j0510j0887J0890Q605J253k842K819R505o889R234o091n971J310P253
9312a48J19M995l481l350k956p873P66R747J367j1707m893n49J570j447M187M247
9296i406l458K246J4029M013o825O415L330j6101O327K484j1780j0561R23l504
$$ plain form
9399 -11735 -21307 -19559 -11177 -5548 -4531 3507 11667 6668 -966 959 -5353 -8639 -22023 -16269
9385 -16269 -19975 -30660 -27626 -26148 -14428 -2845 5072 5402 3860 -1424 7369 4403 -4733 -16296
9371 -16296 -20907 -32771 -28339 -18507 -19315 -23503 -17215 -13519 -2859 -3364 -2173 -1258 -4188 -3232 -9276
9356 -9276 -18172 -12270 -10306 -18371 -23442 -24475 -15098 -16760 -4921 142 -4408 -4547 8837 1814 -4798
9341 -4798 -12829 -18520 -34156 -30518 -13198 -9238 -4350 -5498 -9213 -9829 -379 1695 -4655 -3001 -7827
9326 -7827 -18337 -29224 -18334 -9729 -8476 -11318 -8499 1006 -5883 3351 -2740 -8711 -7401 -148
9312 -148 -29 4966 1485 -1865 -4821 -12694 -11928 -2181 -814 -12521 -17414 -17963 -16393 -17840 -13653 -9406
9296 -9406 -12864 -10618 3411 7424 599 7014 10344 -5757 570 3054 -8726 -19287 -18364 -21868
9282b1868n191J1354J2208K106J158N0l697L536J2397M744j0278o221j330l25
9268a357p664L942n112r330n607O346O917Q277j80K228j627p616L183R277K549
9253D226o587m231M145r417k50Q517q113k356j0370Q290M942K3821L456j1561
9239D512j0924P999m772L535j672j689j1517j4462M191J0838K404r17j379k586
9225a6439q56J5140J4831l180j5325j0289O955o535J4756q400P61o476J305Q70
9211a2882K600Q156L730j8945L943J0188R55l973R214p262n985L94R561O448j827
9196D315j3072q161M448J0776Q902k112j863p044M502j1555J0813K921k786k1053
9182b0969k331J826J0367J5901P099j4955j0717Q966J1877L08o168K994j3789
$$ plain form
9282 -21868 -27059 -15705 -3497 -1391 -233 -183 -3880 -344 12053 16797 6519 298 -1032 -1357
9268 -1357 -9021 -5079 -10191 -19521 -25128 -18782 -11865 -3588 -3768 -1540 -3167 -10783 -7600 1677 4226
9253 4226 -2361 -6592 -2447 -11864 -12114 -3597 -11710 -14066 -24436 -16146 -11204 12617 16073 4512
9239 4512 -6412 1587 -3185 350 -1322 -3011 -14528 -28990 -24799 -13961 -11557 -12474 -13853 -16439
9225 -16439 -17295 -2155 12676 9496 -5829 -16118 -9163 -15698 -942 -9342 -8581 -15057 -13752 -12882
9211 -12882 -10282 -2126 1604 -17341 -13398 -3210 -2255 -6228 2986 -4276 -10261 -9867 -306 6142 4315
9196 4315 -8757 -16918 -12470 -1694 7208 5096 3233 -3811 691 -10864 -51 2870 84 -20969
9182 -20969 -23300 -21474 -11107 4794 11893 -3062 -13779 -4813 7064 7372 1204 4198 -9591
9169i591j6063O649J1822j488j748m233J671Q241P170M125K8j1319J057m40J0048
9154E929O134O80j6804j3275o899J1656R088O35m032n361K573R625J0516L331
9140A3796p228l573M996o346Q79Q005o256j5329o325q106J4764J8832N302r844
9126C567O600K393J4634J475m660p404j5577j0010Q101K125K343q569q471J294
9112a2159k435K2033J5004m372j5413n651m391R664J462p797l221p647L579P342
9098d002J1592M299k961k836L640J353L400j508p567r887p859J1297M137K482
9084E580j794j1192K597O864K880k564r28p425j1691j706K929P766M074J238m131
9069g503K786O047R613J321j1234j852k450n31R44L044j2013q125K979J581J8575
$$ plain form
9169 -9591 -25654 -19005 -7183 -8671 -10419 -14652 -12981 -4740 2430 6555 6583 -4736 -3679 -4119 5929
9154 5929 12063 12743 -4061 -17336 -24235 -12579 -3491 -2856 -6888 -12249 -9676 -51 10465 13796
9140 13796 6568 2995 7991 1645 2524 10529 4273 -11056 -17381 -25487 -10723 8109 13411 3567
9126 3567 10167 12560 27194 28669 24009 16605 1028 -8982 -881 1244 3587 -4982 -13453 -12159
9112 -12159 -14594 7439 22443 18071 2658 -2993 -7384 2280 3742 -4055 -7276 -14923 -11344 -4002
9098 -4002 7590 11889 8928 6092 9732 11085 14485 12977 5410 -4477 -12336 -1039 3098 5580
9084 5580 3786 -7406 -4809 2055 4935 2371 1443 -5982 -17673 -19379 -16450 -8684 -4610 -3372 -7503
9069 -7503 -4717 1330 10943 12264 1030 -822 -3272 -3803 -2859 185 -11828 -19953 -16974 -15393 3182
9054C182O693m150Q53m008R21J3686k436l376r575j5212p307J2100M288o849N580
9039e610M095o74J4527J4323J451l978j0093k0521l869Q403M311m127j4613l540
9025a9915P463J6053N716P709J373M484j0444Q580O911q839j2185l449n413n411
9011g367O205R024p43l663n12j142K200R727N189q497l400o85K127l055J3246
8996A8654j745j0572L894J4345o946J366j0546p323L575K50j652J5162j0645L418
8982A1235J002J517Q443P25L005K33J287m914L665j1325M249o171m842n701L829
8967F237K657N619M822R488N048n062J10J624j276J977m421n983q849j059j752
8952I180l021K036l014J678L716J3797Q294K408j038P687n251j6182j688K198
$$ plain form
9054 3182 9875 5725 6578 2570 3491 17177 14741 11365 1790 -13422 -20729 -8629 -4341 -11190 -5610
9039 -5610 -1515 -2189 12338 26661 28112 24134 14041 -6480 -10349 -1946 2365 -1762 -16375 -19915
9025 -19915 -12452 3601 9317 17026 18399 22883 12439 21019 27930 19091 6906 3457 -1956 -7367
9011 -7367 -1162 7862 7119 3456 2944 1802 4002 13729 18918 10421 7021 6336 8463 5408 18654
8996 18654 16909 6337 10231 24576 17630 18996 8450 1127 4702 4952 3300 18462 7817 11235
8982 11235 12237 13754 22197 22922 25927 26160 27447 22533 26198 14873 19122 12951 8109 2408 6237
8967 6237 8894 14513 19335 28823 33871 28809 28919 30543 29267 31244 26823 20840 11991 10932 9180
8952 9180 6159 8195 5181 6859 10575 24372 32666 35074 34036 41723 36472 20290 18602 20800
8938B0800n927K179l405n98o954P055N585P596P084O872j329k845M847l696O59
8923C7923p319L693p24n393k150k031M248Q117L874J4362L086K098N285n700j1506
8908D7863N368M05M949Q90k134K565N348N775J291L431n177K372J2739J7033L772
8893A06490M259j987n564p580o774M417P114J513r599n121J2379J2210J3322R527
8879A34606l59M831Q213R616O171Q745N071j2836j4350O795O583J3751j16N606
8865A82327J3155K0730J1549K0443K3138J0640J0274K8043J7598J6051J7787K2719
8853C94454L1036L6390M7208M7993N7268M5452N0124L7230K3658J5914J2094q57
8841G97964J017R695m640k0809k6416m3815n2209m6786l6810j6366k7215j3139
$$ plain form
8938 20800 14873 17052 13647 13049 6095 13150 18735 26331 33415 40287 38958 36113 40960 37264 37923
8923 37923 30604 34297 33573 28180 26030 23999 28247 36364 40238 54600 57686 59784 65069 59369 47863
8908 47863 53231 53636 58585 59475 57341 59906 65254 71029 72320 75751 70574 72946 85685 102718 106490
8893 106490 110749 108762 103198 95618 88844 93261 100375 101888 92289 87168 99547 111757 125079 134606
8879 134606 134247 139078 147291 156907 163078 171823 176894 164058 149708 156503 163086 176837 176721 182327
8865 182327 195482 216212 227761 248204 271342 281982 292256 320299 337897 353948 371735 394454
8853 394454 425490 461880 509088 557081 614349 659801 709925 747155 770813 786727 798821 797964
8841 797964 798981 808676 804036 783227 756811 712996 660787 614001 577191 560825 533610 520471
8829E20471p995j2781j476J93k15P172R690J0080J7735L3987L7862L8946M6233
8816F99902M1091N6160N7623M5565K5953J3028k563m947k022J10O288M844k6633
8803I14399k8340m3384m0479m6817m4182l4481k4575k8676j6403k969N666O144
8791F15903M750J9061K9020L3609M4701M5120L7624L6097K3750N761L550P799
8779I06745o743m693o485k7131m1631n0274n7702n2357m0657k3694k7987l0455
8767E36936r422n484M628j482m094j945r26J392R251J5812J3493L1030L6348N3451
8753F78988N9855N2624L9805L0717J6683J0883m761M221q245l443k0345l0025
8741H26957m4510n7080o7208p3194l9999m6634n5484k2541k2496k7459j5711j4760
$$ plain form
8829 520471 512476 499695 498219 498412 498197 505369 515059 525139 542874 576861 614723 653669 699902
8816 699902 740993 797153 854776 900341 926294 939322 936759 931812 929790 929900 936188 941032 914399
8803 914399 886059 842675 802196 755379 711197 676716 652141 623465 607062 604093 609759 615903
8791 615903 620653 639714 668734 702343 747044 792164 829788 865885 889635 895396 898946 906745
8779 906745 900002 895309 888824 861693 820062 769788 712086 659729 619072 595378 567391 536936
8767 536936 527514 522030 526658 525176 521082 519137 518211 519603 528854 544666 558159 589189 625537 678988
8753 678988 738843 791467 831272 861989 878672 889555 884794 889015 880770 877327 856982 826957
8741 826957 782447 725367 658159 584965 544966 498332 442848 420307 397811 370352 354641 339881
8729C39881j1627j1213j0505r959q100k1649j1261j6909j4607m76k87q57M431
8716B26862l917j0261l98P162l613n456l365O924L390k445o936p358K640m390
8702A98839K584k013j601q93N004K725m385P050N062J2994P305N770P454P074
8688B52969k419j73L653K439r93L136R914P278J6853K2155J9712J4044K3936L2220
8674D04724L1564K8816L2985L6040L5592L3349M2085M8320L1277K7235L3454K9700
8662H15141J6755O893O930p774j4317j6213j9715k7903k8638l3879l5894l1187
8650F30199j8575j2766J30k436J5070R169J2760K5619K8193K9650L8161N4220
8638H09394N3677O3329Q5195Q6742P9971P7647Q1925P4238N4077N0000K7860O853
$$ plain form
8729 339881 328254 317041 306536 296577 288477 266828 255567 238658 224051 223575 223288 222431 226862
8716 226862 222945 212684 212286 219448 215835 210379 207014 213938 217328 214883 207947 200589 203229 198839
8702 198839 201423 199410 197809 196916 201920 204645 200260 207310 212372 225366 232671 238441 245895 252969
8688 252969 250550 250377 254030 256469 255476 258612 268526 275804 292657 314812 334524 348568 372504 404724
8674 404724 436288 465104 498089 534129 569721 603070 645155 693475 724752 751987 785441 815141
8662 815141 831896 838789 845719 837945 823628 807415 787700 759797 731159 697280 661386 630199
8650 630199 611624 598858 598988 596552 611622 620791 633551 659170 687363 717013 755174 809394
8638 809394 863071 926400 1011595 1098337 1178308 1255955 1337880 1412118 1466195 1516195 1544055 1550908
8626A550908r407j1897l4651m6715n4827p2645r0734p7547n9795o6716p5817p2440
8614H77717n2084m4068m3377k7670j7763k7580j4914o172j1403P51J2917J5035
8602F61389L3612L1324N7172N4703N6295N4564M0473J5507J0809L632m680j0303
8590A004497k6076l8939m7172m1349l8586m5513o3423n3491o1076m8334m3808
8579D96730k3848m4688m4259l7549k6333l2669k5934l471K641k6917j3696O404
8567B26411j670j0634K9j0365j1962p545J604r173j0042L952j1844j9980j6813
8554A21968M121j975L384j775q353j2817M784N343N344p636K990r096j6634L451
8540I3099Q081l199j1857J764n212m51j0269O480K627j2681K623P417j0837J264
$$ plain form
8626 1550908 1541501 1529604 1494953 1448238 1393411 1320766 1230032 1152485 1092690 1025974 950157 877717
8614 877717 825633 781565 738188 710518 692755 665175 650261 644089 632686 633437 646354 661389
8602 661389 695001 726325 783497 838200 894495 949059 989532 1005039 1015848 1019480 1014800 1004497
8590 1004497 978421 939482 892310 850961 812375 766862 703439 649948 588872 540538 496730
8579 496730 472882 428194 383935 346386 320053 287384 261450 257979 260620 233703 220007 226411
8567 226411 224741 214107 214136 203771 191809 184264 185868 176695 166653 170605 158761 138781 121968
8554 121968 126089 124114 127498 125723 117370 104553 109337 114680 120024 112388 115378 106282 89648 93099
8540 93099 101180 97981 86124 87888 82676 82225 71956 78436 81063 68382 71005 78422 67585 68849
8526F8849K618P94j8946N098J2681r056p334N738K872j1883N93Q460j119p978
8512E1387K736L124q633n884J7578j0495r921O794l380m843j254R022J29l506
8498D2854R034J067n905j6591P270n205p898k559O017J2841j032o54R531j15O875
8483E5530M93n179q374p797p729j0099m35P40o861l580J1492P433L333R668R427
8468D8062Q594r103r349p798q612k165j467M939k444o673P232L275r552J2244
8454B7183R329n771O028J512r315k229J2302J985j5630l931O549q641n310Q56
8440A4917J284n119K582J0315N156p569J4305K022j3483O15R958p414o629q418
8426A2522m274J660k882M520Q067N348M784O744L731k092l389j0867q357J569
$$ plain form
8526 68849 71467 72261 53315 58413 71094 62038 54704 60442 63314 51431 52024 60484 59365 51387
8512 51387 54123 57247 48614 42730 60308 49813 39892 46686 43306 38463 37209 46231 46360 42854
8498 42854 51888 52955 47050 30459 37729 32524 24626 22067 28084 40925 39893 39239 48770 48655 55530
8483 55530 56023 50844 42470 34673 26944 16845 16410 17150 10289 6709 18201 25634 28967 38635 48062
8468 48062 56656 47553 38204 30406 21794 19629 18162 23101 20657 13984 21216 24491 14939 27183
8454 27183 36512 30741 36769 38281 28966 26737 39039 41024 25394 21463 28012 19371 14061 14917
8440 14917 16201 11082 13664 23979 29135 21566 35871 37893 24410 25025 34983 27569 20940 12522
8426 12522 8248 9908 7026 11546 19613 24961 29745 36489 40220 38128 34739 23872 15515 17084
8412A7084k739p381N619j70j0185P234M996J2783j0319J1255l725J0434j0040
8399B4846p027R09K350k589q294j912o819k152J0115J3499R442p700J181J2638
8385C8487K604O20j0274p774l983J148o513K143k388l433O583J0056J1317j992
8371C6601n822L280J201r57M129J2402j1077j7777p974k371J91M234O428j0707
8357A1781N164J1445J5678l542L662R487k03l085p66p233j587j2168m885M636
8343B8384j01J734J0290k909l557P103k924J2770k876J0872l825n275M703Q816
8329F3205o025K90m967J0080o154m017J0722q869K193K602R382L743N237N775
8315H3197o091o119J116n51K348Q0N535m341R394O953L396K936L851M325p009
$$ plain form
8412 17084 14345 6964 12583 12413 2228 9462 14458 27241 16922 28177 24452 34886 24846
8399 24846 17819 18728 21078 18489 10195 8283 1464 -688 9427 22926 32368 24668 25849 38487
8385 38487 41091 41711 31437 23663 19680 20828 14315 16458 14070 10637 17220 27276 38593 36601
8371 36601 30779 34059 35260 34303 38432 50834 39757 21980 14006 11635 11826 16060 22488 11781
8357 11781 16945 28390 44068 40526 44188 53675 53472 50387 49621 42388 40801 28633 23748 28384
8343 28384 28283 30017 40307 37398 33841 40944 38020 50790 47914 58786 54961 49686 54389 63205
8329 63205 57180 57470 52503 62583 56429 52412 63134 54265 56458 59060 68442 72185 77422 83197
8315 83197 77106 70987 72103 71552 73900 73980 79515 75174 84568 91521 94917 97853 101704 106029 99020
8300I9020o991J971m260P175j756J1958Q658L050J3522Q60R863P275J1186o91
8286A60840L566k949r222k690J5600J1124J4506m670J3033O576J6073P384J5981
8273B45152O055j093J2016R574J1031O364J1795O572K785N405L0924L4919K8693
8260D10192L7695J9010L5810N6221N1085N0575L9814M8126M0530L0817L0423M0336
8248H90634J7268R538l23j219M361J0685J5048M868O36P69Q944Q08j4674k1564
8234I25779l2139k2754k6881j3039n07k804n844J2178L8192M4777N8452O7382
8222A042792O5255P3462O7246O6030N3739N0209L1388J1002L93L881K498r959
8210A457936j0707m593M854R473q113p330j9873m8104n6913n5758n9679p8613
$$ plain form
8300 99020 92029 94000 89740 96915 95159 107117 115775 118825 132347 133207 143070 150345 161531 160840
8286 160840 164406 161457 152235 149545 165145 176269 190775 186105 199138 205714 221787 229171 245152
8273 245152 251207 250114 262130 271704 282735 289099 300894 307466 310251 315656 346580 381499 410192
8260 410192 447887 466897 502707 558928 610013 660588 700402 748528 789058 819875 850298 890634
8248 890634 907902 917440 917117 915898 920259 930944 945992 950860 951496 952265 961209 962017 947343 925779
8234 925779 893640 870886 844005 830966 830459 827655 821811 833989 872181 916958 975410 1042792
8222 1042792 1108047 1181509 1248755 1314785 1368524 1418733 1450121 1461123 1461516 1465397 1467895 1457936
8210 1457936 1447229 1442636 1447490 1456963 1448850 1441520 1421647 1373543 1316630 1260872 1201193 1122580
8198A122580o0660n0806m6890m5090j1103K5560R1558r867l2762K9368M0396K5350
8186A077634M1438M9985J5677M6105K9055M8494M7794N5432N8513O5974Q6085
8175A622186P9917O1255L2215j11q208m9467o7707q2219j09100j10791j00993
8164A266977r4918n9490l9926l7571j3694j3389J9271K7827M3494M8892O0042
8153A207515N8149O3859O9179N1461L4822J1128j5536k5416k7228k8511k4372
8142A375050l3318j2477m28J9370J7597J6404j1667j8284m1991m9632o6263o1978
8130A132383o8615q7834o9512m9566l9486l1815k1515j9981j767O580K0451K1655
8118G90978L0139K6744M0988M4425N3982L5651K5228j0780k7846l5951l7506n3613
$$ plain form
8198 1122580 1061920 1011114 964224 919134 908031 933591 1025149 1015282 982520 1011888 1052284 1077634
8186 1077634 1119072 1169057 1184734 1230839 1259894 1308388 1356182 1411614 1470127 1536101 1622186
8175 1622186 1702103 1763358 1795573 1795462 1787254 1737787 1670080 1587861 1478761 1367970 1266977
8164 1266977 1172059 1112569 1072643 1035072 1021378 1007989 1027260 1055087 1098581 1147473 1207515
8153 1207515 1265664 1329523 1398702 1450163 1484985 1496113 1480577 1455161 1427933 1399422 1375050
8142 1375050 1341732 1329255 1328827 1348197 1365794 1382198 1370531 1352247 1310256 1260624 1194361 1132383
8130 1132383 1063768 975934 906422 856856 817370 785555 764040 744059 742292 748872 769323 790978
8118 790978 821117 847861 888849 933274 987256 1022907 1048135 1037355 1009509 973558 936052 882439
8106H82439o5505q4963p6107o8626n4077l5281m4723l9056l2379k7138k6325j7419
8094C10840j7115j2827j9489l560p725o370p02N37j4983j7126j8868m945m500
8081A83167l825k1180r512r430N24M429j12m788M597q840q911n285P421P935k0262
8066A15928j7325q616J1646m530O014J958n087j4337j31j844J661m035r348q149
8052F3805k874o301J2446O087M028J95J843L990l18O73j1757k0369j7320P9n498
8037B8709L235L061l200J759J3080J0405J8666K893m372j2343q258q691l876j8452
8023B2616j1745n380r366R112J188J5587O986J1561P772Q049O118L017j4424k2421
8009B8670j1399L29r257r046M063O440j0775J3828J4886M126J496Q568J5903j8573
$$ plain form
8106 882439 816934 731971 655864 587238 533161 497880 453157 414101 381722 354584 328259 310840
8094 310840 293725 280898 261409 257849 250124 243754 243052 243589 228606 211480 192612 187667 183167
8081 183167 179342 158162 148650 139220 139744 144173 144061 139273 143870 135030 126119 120834 128255 136190 115928
8066 115928 98603 89987 101633 97103 103117 105075 99988 85651 85520 83676 85337 81302 71954 63805
8052 63805 60931 54630 67076 73163 77191 77386 79229 83219 82901 83574 71817 51448 34128 34207 28709
8037 28709 31944 35005 31805 33564 46644 57049 75715 78608 74236 61893 53635 44944 41068 22616
8023 22616 10871 5491 -3875 5237 6425 22012 28998 40559 48331 56380 62498 65515 51091 28670
8009 28670 17271 17600 8343 -703 3360 9800 -975 12853 27739 31865 33361 41929 57832 39259
7995C9259n253M143r50k3944j3677M755r819j444J3496k697l068R867J5035N919
7981C1622m282k655Q456j704j2936r941p2j1906J381O76k956K555J2871R863o046
7966A4926J007L537M961q949l079r045j314Q181l331j4842o66P752k155k74Q858
7951E567K2747L407M08k955j8563j5120r941K962k076J282j599M555L586J6309
7937A0569J3245l53k44K646K740r466j1391O004o061j8211L82m80q01k648M122
7922i947J4229N585Q395O861j1321n697r913n643r3Q983o003r967l964J6452R201
7907G158m284L909N508j1662p068J2780m074r805N444j290j1069j816J2614J3117
7893I462q009k33l364M028q182K738M296l467p292R306P935o766O616N059j5302
$$ plain form
7995 39259 34006 38149 37199 13255 -422 4333 -5486 -6930 6566 3869 801 10668 25703 31622
7981 31622 27340 24685 33141 31437 18501 8560 8488 -3418 -2037 -1361 -4317 -1762 11109 20972 14926
7966 14926 15933 19470 24431 15482 12403 3358 2044 10225 6894 -7948 -8614 -862 -3017 -3291 5567
7951 5567 28314 31721 32129 29174 10611 -4509 -14450 -11488 -13564 -12282 -13881 -9326 -5740 10569
7937 10569 23814 23461 23217 25863 28603 19137 7746 13750 7689 -10522 -10140 -10620 -11421 -14069 -9947
7922 -9947 4282 9867 18262 25123 13802 8105 -1808 -7451 -7544 1439 -4564 -14531 -18495 -2043 7158
7907 7158 2874 6783 12291 629 -6439 6341 2267 -7538 -2094 -3384 -14453 -16269 -3655 9462
7893 9462 1453 1220 -2144 1884 -6298 -3560 736 -2731 -10023 -717 7218 452 7068 12127 -3175
7878c175J104J3122M385m633n092j478j2153j853J1279M505j2675J905n013j8
7864i790K01R841L606j481n268O563o076O852L956O298r665K240O433j949l364
7849H397l531j0999j8615m36K138Q861M622R693P553L842L779J5318q080j2186
7835A0356k529p79j3842p851J820q419p769M150J0020Q739N366J2623Q241K947
7821B3073j3442j242P961m161J151j5266j9298o979L49K0467M237L79M60J985
7807c26O005J2785K670p735J090j1469k963K45L71k871j1106O335P520N326N175
7792A1052N100q839r63On8j881n002l292M115n892k307P318Q642n28M091P093
7776A8655J052m920m133o843j320m830r630n498l015N124o447R541J469K3632
$$ plain form
7878 -3175 -2071 11051 15436 10803 5711 4233 -7920 -9773 1506 6011 -6664 -4759 -9772 -9790
7864 -9790 -9589 252 3858 2377 -2891 3672 -2404 4448 8404 14702 5037 7277 13710 11761 8397
7849 8397 4866 -6133 -24748 -25184 -23046 -14185 -9563 130 7683 11525 15304 30622 22542 10356
7835 10356 7827 7048 -6794 -14645 -12825 -21244 -29013 -24863 -14843 -6104 -738 11885 20126 23073
7821 23073 9631 8389 16350 12189 13340 -1926 -21224 -28203 -27854 -7387 -3150 -2771 -2311 -326
7807 -326 5679 18464 21134 13399 14489 3020 57 302 673 -2198 -13304 -6969 551 5877 11052
7792 11052 16152 7313 6350 6356 6298 4417 -585 -3877 238 -5654 -7961 -643 7999 7471 11562 18655
7776 18655 19707 14787 10654 3811 2491 -2339 -11969 -17467 -20482 -15358 -21805 -12264 -10795 12837
7762A2837J308L616M894m308p592Q40l841j4853l306j2466r132k627L149J2304
7748a9177L501L041J2276J5242l28l265O249l463k778r539k680n398p325o970
7734b0614o30k163R738M712p694J94J0881P79j853J676N809O395j0236m024J282
7719e748k030L8J12q409o286M583K963j1215l803o029J0227J3499J4902K265J416
7704F485P24n15l10n683K106j2974k1104q690M898K885Q716R00J102L602O949
7689a0909Q001J090l645n537j0688l504P489l036Q321o501j2168M737J0002Q159
7675h189j098N460r678M767N497M193k899j067p175m515J14Q012M13p094M667
7660h592L615l973k591J5511Q369j8354j2659K589p92l45O321J0578p202n539
$$ plain form
7762 12837 14145 17761 22655 18347 10755 11595 7754 -7099 -10405 -22871 -32003 -34630 -31481 -19177
7748 -19177 -15676 -12635 -359 14883 14555 11290 17539 14076 11298 1759 -921 -6319 -13644 -20614
7734 -20614 -21244 -23407 -13669 -8957 -16651 -16457 -5576 -4797 -6650 -4974 835 7230 -3006 -7030 -5748
7719 -5748 -7778 -7740 -7628 -16037 -22323 -17740 -14777 -25992 -29795 -35824 -25597 -12098 2804 5069 6485
7704 6485 7209 6694 6384 701 2807 -10167 -31271 -39961 -35063 -32178 -23462 -22562 -21460 -17858 -10909
7689 -10909 -2908 -1818 -5463 -11000 -21688 -25192 -17703 -20739 -12418 -18919 -31087 -26350 -16348 -8189
7675 -8189 -9287 -3827 -13505 -8738 -3241 952 -1947 -3014 -10189 -14704 -14590 -6578 -6165 -13259 -8592
7660 -8592 -4977 -8950 -11541 3970 12339 -6015 -18674 -16085 -16877 -17222 -10901 -323 -7525 -13064
7646a3064J243J2825l146M459q269p975m859J675J7703J830j7086o296j139M613
7632a7486k656J6854l326l786n309q00O118Q746q515J15m36j0882J3098M738J477
7617b050p674o059k126J2600l227L550J168j0908o888J1752L672O407K711k260
7603F68q64K802q2l61m590j3453l697N875j115O565J1891j6499J072R184J355
7588a249J328M046M404k920j5333m938J1280k750l893N52J052j4923K407J4284
7574f653K668j3463M181R613L169n551P877j032n508L982L157r474J579m112k587
7559a2154r628j20P208j020k215Q381O433j583M176J6K454j1300M095K904r57
7544c310J676j338p252K428q021N853j902O911M75N30Q794n093K455M538p825
$$ plain form
7646 -13064 -11821 1004 -2142 2317 -5952 -13927 -18786 -17111 592 2422 -14664 -20960 -22099 -17486
7632 -17486 -20142 -3288 -6614 -10400 -15709 -16509 -10391 -1645 -10160 -10045 -10481 -21363 -8265 -3527 -2050
7617 -2050 -9724 -15783 -17909 -5309 -8536 -4986 -3818 -14726 -21614 -9862 -6190 217 2928 668
7603 668 -196 2606 2524 2163 -2427 -15880 -19577 -13702 -14817 -8252 3639 -12860 -11788 -2604 -1249
7588 -1249 79 4125 8529 5609 -9724 -14662 -3382 -6132 -10025 -9473 -8421 -23344 -20937 -6653
7574 -6653 -3985 -17448 -13267 -3654 -485 -6036 1841 809 -4699 -717 2440 -7034 -5455 -9567 -12154
7559 -12154 -21782 -21902 -14694 -15714 -17929 -9548 -3115 -4698 -522 -506 1948 -9352 -5257 -2353 -3310
7544 -3310 -1634 -2972 -10224 -7796 -15817 -9964 -11866 -4955 -4480 -3950 4844 -249 2206 6744 -1081
7529a081n364p676J033M514j0724J0896Q912J292J58M657j853j0562j2752J0192
7515h358K823J478m201j4890K595Q006R708O322P578n381j264m300q566N536J634
7500a280n496j4891m545J0736M605m590J2615o76m460P829R421J9379j4393o397
7486G857K088q681q502q12L03M844j0516j1190M892J1484P999P01L315n247O562
7471E097M550L177r40j2187j1447l575l321K103N223q590j3952N297J1934O76
7457a5955J3770R925r335l492N894p63r15j1113j0181l533n121M812J2638Q227
7443e142j63k09J3130k033P169j642l132p596j2584r062L649k797K404N24p02
7428a8186R309J2613K411R93j0043o21j0853L140K951m698l550r218J0373O617
$$ plain form
7529 -1081 -6445 -14121 -13088 -8574 -19298 -8402 510 1802 1960 6617 4764 -5798 -18550 -8358
7515 -8358 -5535 -4057 -8258 -23148 -20553 -12547 -2839 3483 11061 5680 4416 116 -8450 -2914 -1280
7500 -1280 -6776 -21667 -26212 -15476 -10871 -15461 -2846 -3522 -7982 -153 9268 28647 14254 7857
7486 7857 9945 1264 -7238 -8050 -7747 -2903 -13419 -24609 -19717 -8233 -234 467 3782 -1465 5097
7471 5097 9647 12824 11884 -303 -11750 -15325 -18646 -16543 -11320 -19910 -33862 -28565 -16631 -15955
7457 -15955 -2185 7740 -1595 -5087 807 44 -871 -11984 -22165 -25698 -30819 -26007 -13369 -5142
7443 -5142 -5305 -5514 7616 5583 12752 11110 7978 382 -12202 -21264 -17615 -20412 -18008 -17484 -18186
7428 -18186 -8877 3736 6147 7140 -2903 -3524 -14377 -11237 -8286 -12984 -16534 -25752 -15379 -8762
7414h762l257K218J5908j795j958q44J9m256N976r748j1875r1J7485K02L763r344
7398f359m345K859O189o076J1315n623p478Q59N555J248P204M375j751j526r238
7383b792l62K687n434p795P325k416L555L83Q475k661k110j379Q072m229l387
7368b068l84L720j267o041M69l284N855L469k088m608j499J0227M31k446n326
7353d840L353M670L808R520k65L88j6177J436K661J763k223k47q855N155r792
7338i645M965L818j036l99K237p470J50J764K589N595l257N031J728J838q194
7323b86Q42j4797O602J2352K868j5001L999L19j651K168L217j220l236N11J0925
7308G612n016n843M237p255j0415M113O543N010j1058J068P251m234L394K174
$$ plain form
7414 -8762 -12019 -9801 6107 4312 2354 1510 1529 -2727 3249 -6499 -18374 -18465 -980 -778 2985 -6359
7398 -6359 -10704 -7845 -1656 -7732 3583 -2040 -9518 -8659 -3104 -1856 5348 9723 7972 6446 -2792
7383 -2792 -3154 -467 -5901 -13696 -6371 -8787 -5232 -4849 3626 965 -1145 -2524 5548 1319 -2068
7368 -2068 -2452 1268 1 -6040 -5571 -8855 -3000 469 -1619 -6227 -7726 2501 2932 486 -4840
7353 -4840 -1487 3183 6991 16511 16246 16634 457 1893 4554 6317 4094 3847 -5008 147 -9645
7338 -9645 -4680 -862 -1898 -2297 -60 -7530 -7380 -5616 -3027 2568 -689 4342 6070 7908 -286
7323 -286 556 -14241 -7639 4713 7581 -7420 -3421 -3102 -4753 -2585 632 -588 -3824 -3313 7612
7308 7612 2596 -3247 990 -6265 -16680 -12567 -6024 -1014 -12072 -11004 -3753 -7987 -4593 -2419
7294b419P881J213L684M220K184q328M20r063k604k314j653P719n882m173k336
7279a1451N331Q93M055M717K258M753n711J557P677j1580K409l85q462o595k294
7264a2828L277P419m443J124M207K219L740k578j701l117K89O144o374p868N443
7249e047L476j63n786R304M707O45m701K471q232q779Q537O953o364l698j229
7234g906L97Q35O902L80r10N086M317O593j773K680P347p377j2827o538k018N213
7218D01k758P235J823q576M007J1777p079o776N737L078P34l38M887j800n252
7203G100l076r09p801j323k383M613o06j760N433K379J5412N284m613j2544k374
7188B832M965o980p86J265n299j0495j033m411R261J0433L13L477N343J0612J3989
$$ plain form
7294 -2419 5462 6675 10359 14579 16763 8435 8855 -208 -2812 -5126 -6779 940 -4942 -9115 -11451
7279 -11451 -6120 -5227 -1172 3545 5803 10556 4845 6402 14079 2499 4908 4523 -3939 -10534 -12828
7264 -12828 -9551 -2132 -6575 -5451 -1244 975 4715 2137 436 -2681 -2392 3752 -2622 -10490 -5047
7249 -5047 -1571 -1734 -7520 1784 6491 7136 2435 4906 -3326 -12105 -3568 3385 -2979 -6677 -7906
7234 -7906 -7509 -6674 228 608 -302 4784 9101 15694 13921 16601 23948 16571 3744 -2794 -4812 401
7218 401 -2357 4878 6701 -1875 2132 13909 6830 54 5791 8869 9603 9265 14152 12352 7100
7203 7100 4024 3115 -4686 -6009 -8392 -3779 -4385 -6145 -712 1667 17079 22363 17750 5206 2832
7188 2832 7797 817 31 1296 -4003 -14498 -15531 -19942 -10681 -248 65 3542 8885 19497 33486
7173C3486k538p167j1310J459j0921J116j039r035J34j400J0193J0404R409Q774
7159C1565j0314j0541O200O797N14k674k046k0304l67j123J0009J739Q76n730
7145D601j3112K29J3826K792N674r763k897j601N612J251m650n16j194j470j509
7130b727j953M931L381N550l519j29O110l407r36k501m001p33J2795O369L880
7115B3110m001k467j0718p6P605m618n212m31j770l368M658J3939M718k191j854
7100A7324O635Q631p30O318k909j2654r364K448q87l678M703l822o230k665R266
7085A2386J1121m939M73Q699q82M218m214L612j394j775K121l945m737Q299p830
7070B1213k176o831M471q928K112M571J050r66N39O975K510n444K056j509k259
$$ plain form
7173 33486 30948 23781 12471 13930 3009 4125 3086 -5949 -5815 -7215 2978 13382 22791 31565
7159 31565 21251 10710 16910 23707 24221 21547 19501 -803 -1170 -2293 7716 9455 10331 4601
7145 4601 -8511 -8282 5544 8336 14010 4247 1350 -251 5361 6612 1962 1446 252 -1218 -2727
7130 -2727 -4680 251 3632 9182 5663 5534 11644 8237 7301 4800 799 66 12861 19230 23110
7115 23110 19109 16642 5924 5848 13453 8835 3623 3192 1422 -1946 2712 16651 21369 19178 17324
7100 17324 23959 32590 31860 38178 35269 22615 13251 15699 14812 11134 15837 12015 5785 3120 12386
7085 12386 23507 18568 19041 27740 26858 31076 26862 30474 29080 27305 29426 25481 20744 29043 21213
7070 21213 19037 12206 16677 7749 9861 14432 15482 14516 15055 22030 24540 19096 21152 19643 17384
7055A7384R734j152o98l563J917n003Q91K361j0280m185N303P552o783q086J1086
7040A6478j98N716K102O951K097R93l883n658j142l999q224j909q961K057Q80
7025C300p089J2353J4561P636j229l960l372N611k199N723o435o390l894m204
7011A0412n84p02O530J359n072J909Q296L915q946n492O362n418L857M836M659
6996B5921j169k883j621p7o821L779p20k904m912R816L789n78L998L535n334L747
6980B7566l959l7k165J0613Q24m468n245P476P567J823m576o023m068J804O516
6965C3648o146O945o697o328q3J7030N431O538p893R225k585J376n661n042j2718
6950B7040j4804K284N909l261O539J7363J367M923Q866J0691J179j0180l446q646
$$ plain form
7055 17384 27118 25966 25268 21705 23622 18619 19510 21871 11591 7406 12709 20261 13478 5392 16478
7040 16478 16280 21996 24098 31049 33146 34139 30256 24598 23456 19457 11233 9324 363 2420 3300
7025 3300 -3789 8564 23125 30761 29532 25572 22200 27811 25612 31335 24900 18510 14616 10412
7011 10412 9828 9126 15656 17015 11943 13852 22148 26063 17117 11625 17987 12569 16426 21262 25921
6996 25921 24752 21869 20248 20171 13350 17129 16409 13505 8593 18409 22198 21620 25618 29153 23819 27566
6980 27566 23607 23570 21405 32018 32842 28374 23129 30605 38172 39995 35419 29396 25328 27132 33648
6965 33648 27502 34447 27750 21422 21339 38369 43800 50338 42445 51670 49085 50461 44800 39758 27040
6950 27040 12236 14520 20429 17168 23707 41070 42437 47360 56226 66917 68096 57916 54470 45824
6936D5824j5802j0395k773L246J630N152M370P953J1105K1957R509m506j3901
6923F3369M208p235j0672o819j1672j7677n904J2040Q038n241N136J0512R537
6910D7620L825M485R853r505j3089p418o386p907k077J832P579o506l052J2046
6896C1300J8286l492m233L519L024o217m415M561N49o884k528L351O36j517o870
6881B9070j256J57N602L310K951k298o896N195L42k280L96n52O054j771P968J550
6865D7542n476L226l773j7397o653J3680Q649L806N925J1249m052P263J470K726
6851F8185m490n581j3925n192j2127L948L070P59j193O662R040J0006N073j71
6837F4064l275N406L470o104j973j7843K708m60j0831n324J0133Q266P535M472
$$ plain form
6936 45824 30022 19627 16854 20100 21730 26882 31252 39205 50310 72267 81776 77270 63369
6923 63369 67577 60342 49670 42851 31179 13502 7598 19638 27676 22435 27571 38083 47620
6910 47620 51445 55930 65783 56278 43189 35771 29385 21478 19401 21233 28812 22306 19254 31300
6896 31300 49586 46094 41861 45380 48404 42187 37772 42333 42882 35998 33470 36821 37457 35940 29070
6881 29070 27814 27971 33573 36883 39834 37536 30640 35835 36177 33897 34293 33741 39795 38024 45992 47542
6865 47542 42066 45292 41519 24122 17469 31149 39798 43604 49529 60778 56726 63989 65459 68185
6851 68185 63695 58114 44189 38997 26870 30818 33888 34647 33454 40116 49156 59162 64235 64064
6837 64064 60789 66195 69665 63561 61588 43745 46453 45993 35162 29838 39971 48237 55772 60244
6823F0244J0903K48J610k517O420o678n737l192l960j0979k079l95j97n097J0642
6808D9236R052L782P437j9L222K065M981j4317l041o620k919o501j1124j35M530
6793C9629R591m444n832M352J198k66K297K050j419l363j2970J379R538R83q64
6778D1859l8O253N30Q803Q442q033m204Q110n422o040M700M039q251l47J125O727
6762E8253j636k532L63K326o655N86J3489k00l648l568j829k619l201K995N371
6747E7495p677P280P949L110o356N044J731n835m848Q915K601k511k106K595p60
6732F6627M576J3467m142j0926j3819L677N241L731k872M123j960k748J535Q389
6718G4899j547o450j54O856k1062K493Q635l209k137O126o11R622k532o214O564
$$ plain form
6823 60244 71147 71395 73005 70488 76908 70230 64493 61301 57341 46362 44283 43888 43691 38594 49236
6808 49236 58288 62070 69507 69488 72710 74775 79756 65439 62398 55778 52859 46358 35234 35099 39629
6793 39629 49220 44776 38944 43296 44494 44228 46525 48575 47156 43793 30823 32202 41740 42723 41859
6778 41859 41821 48074 48604 57407 65849 57816 53612 61722 56300 50260 54960 58999 50748 50401 51526 58253
6762 58253 56617 54085 54448 56774 50119 50705 64194 63994 60346 56778 54949 52330 49129 52124 57495
6747 57495 49818 57098 65047 68157 61801 66845 68576 62741 57893 66808 69409 66898 64792 67387 66627
6732 66627 71203 84670 80528 69602 55783 59460 64701 68432 65560 69683 67723 64975 66510 74899
6718 74899 73352 66902 66748 73604 52542 55035 63670 60461 58324 64450 63839 73461 70929 64715 71279
6703G1279j618K517r431J2271M432r058j4018m719n147J2035J798K167p956J039
6689E5591J0834L315J556l920R357o432r855M869J0143M145j2412K510j2654q772
6675D8275N130O047l592j4455L099M788K609J4309J0826j0357j4895N603J0397
6662F7784k632p309q8q958k0824L57K2090M597k525J0623K618o95M678R945L640
6647H3301n073j705p707j0414q119Q808R07l716R670J2408J0072R64J926J463
6633I2785q572l361J3522M780j409q314p396j937m25Q936O929l857p453J1762
6619I5990R133Q39j949m619K390o296j1185j223J0350o659j1767M456l474K512
6605G8498O232J3885L381j1168l237Q596m569J482O673m33o733k851J0141k720
$$ plain form
6703 71279 69661 72178 62747 75018 79450 70392 56374 51655 46508 58543 60341 62508 54552 55591
6689 55591 66425 69740 71296 67376 76733 70301 60446 65315 75458 79603 67191 69701 57047 48275
6675 48275 53405 59452 55860 41405 44504 49292 51901 66210 77036 66679 51784 57387 67784
6662 67784 65152 57843 57755 48797 27973 28330 50420 55017 52492 63115 65733 65038 69716 79661 83301
6647 83301 78228 76523 68816 58402 50283 59091 59998 56282 65952 78360 88432 89396 91322 92785
6633 92785 84213 80852 94374 99154 97745 89431 82035 80098 79673 88609 95538 91681 84228 95990
6619 95990 105123 105962 104013 99394 101784 95488 84303 83080 93430 86771 75004 79460 75986 78498
6605 78498 84730 98615 101996 90828 87591 96187 91618 93100 99773 99340 92607 89756 99897 97177
6591I7177j4528m369L915k274M8K3748N361j0375j949Q929j14n98L711l746r610
6576I5326j5518m03L808m954J433P229q79M948O844J3327J232O034p381K049j2978
6561A00117Q092l105k1716j6469K616n548K228n46J3360R572J395J2906J0213
6548A13115L728K3q650J617R80j2200J790j208l539l713M970N404O192J1959J9263
6533A39731l849l193L90j298M506l946p321m791p642l91Q266J0273N016k134j893
6518A31724N227k318n521k273O1m566j26l177L225L413Q427J3611o334p159n597
6503A28617n253p383K201l677j7778j108R552j684L212J3623J1059M354o049J9717
6489A49403m997j1459n17l050P988j6203p276R409l080l611M480R521K123J0777
$$ plain form
6591 97177 82649 78280 82195 79921 79969 103717 109078 98703 96754 105683 105569 104971 108682 104936 95326
6576 95326 79808 79405 83213 78259 79692 86921 86042 90990 97834 111161 112393 118427 111046 113095 100117
6561 100117 108209 105104 83388 66919 69535 63987 66215 65669 79029 88601 89996 102902 113115
6548 113115 116843 116866 108216 109833 110813 98613 100403 99195 95656 91943 96913 102317 108509 120468 139731
6533 139731 135882 132689 133079 131781 136287 132341 125020 120229 112587 112196 120462 130735 135751 133617 131724
6518 131724 136951 134633 129112 126839 126900 122334 122208 119031 122256 125669 134096 147707 141373 134214 128617
6503 128617 123364 115981 118182 114505 96727 95619 105171 103487 106699 120322 131381 135735 129686 149403
6489 149403 144406 132947 132430 129380 137368 121165 113889 123298 120218 116607 121087 130608 132731 143508
6475A43508J8328R266r023n677N618r082j1261N514l039Q25p22N691O295M169
6461A60410J1360J4633N093k309J6038L832j0961j23n45K156K924m925L468P693
6447B08744K277J832l512p57M800k713K415j928j1878j436m356q640r451K846
6433A78243o798o958L510J3375L92j4266J590J0735M28o128Q187j541n43l016
6419A77210O41j109r782J2217N467r722P460J7065R237j246K315J2907o030j4861
6405B01769J806r15j6642q564K679m45k8J5883K0129j927m662O936Q574r328n868
6390B09397M775j2590j910k43K621J353m452J6813K295L412N350P183K799O80
6376B37483P08P625K006p567l582O916J910n482Q928J0544j1004q686M631n82
$$ plain form
6475 143508 161836 171102 162079 156402 162020 152938 141677 147191 144152 144977 144255 149946 156241 160410
6461 160410 171770 186403 191496 189187 205225 209057 198096 197973 197428 199584 202508 197583 201051 208744
6447 208744 211021 212853 209341 208584 213384 210671 213086 211158 199280 197844 193488 184848 175397 178243
6433 178243 171445 164487 167997 181372 181764 167498 169088 179823 180251 174123 182310 180769 180226 177210
6419 177210 177851 176742 166960 179177 184644 174922 182382 199447 208684 207438 209753 222660 216630 201769
6405 201769 203575 202660 186018 177454 180133 179688 179660 195543 215672 213745 209083 216019 224593 215265 209397
6390 209397 214172 201582 199672 199429 202050 203403 198951 215764 218059 221471 226821 234004 236803 237483
6376 237483 238191 245816 247822 240255 236673 243589 245499 240017 248945 259489 248485 239799 244430 243848
6362B43848n683j0706P288K884n853P808J1266l910n732j655L815m722j616R798
6348B46830k037o596O579J0362j3006q427N473Q310j3222k134Q462n555j2645
6335B22394J4691J2906k247o549J0255N694o727Q91M213K343R77N264j85j2934
6321B50986k230J7866J9084N184n306L539O365R108J1874J188q795m395p290m874
6307B92304M078R396l600m611p939M790J0479R017N220Q41Q200j0267k949R8q
6292C15049r767j1250o437n555L589K879k264k951r63P952J9863J881M894Q707
6278C25627Q99l189m249J3857Q397j9541j0774m556P621L679K1198J0898k902
6265C46965k448J9723J4275P793J0481l649j5768j0582J2086J2091q869n067j2530
$$ plain form
6362 243848 238165 227459 234747 237631 231778 239586 250852 246942 241210 239555 243370 238648 237032 246830
6348 246830 244793 238197 244776 255138 242132 233705 239178 247488 234266 232132 240594 235039 222394
6335 222394 237085 249991 247744 241195 251450 257144 250417 251308 255521 257864 258841 264105 263920 250986
6321 250986 248756 266622 285706 290890 285584 289123 295488 304596 316470 317658 308863 304468 297178 292304
6307 292304 296382 305778 302178 297567 289628 294418 304897 313914 319134 319975 328175 317908 314959 315057 315049
6292 315049 305282 294032 287595 282040 285629 288508 286244 283293 282330 290282 310145 312026 316920 325627
6278 325627 326526 323337 319088 332945 341342 321801 311027 306471 314092 317771 338969 349867 346965
6265 346965 344517 364240 378515 386308 396789 393140 377372 366790 378876 390967 382098 377031 364501
6252C64501r056M71K2186K3357n152P506O222J4853J2313R266J6341N067q489
6239D59386N416J0694J2848J907j697k385R10M385J0057j050j0977j1881N09L345
6225D81467N795m185K861Q967j1294Q41J5142J5170P09N617Q678p076J766K1700
6211E46158Q702k684j917L235M543J9980J5625P335r094m724J9732K4600J1605
6198F43096M045P241k472N03K2169K2729N963J057J3248J1769l593J1637K0143
6185G57535l024l308j938j341N672M518J2162j200r811N552K0277M367N789N669
6171H00919M800p811K3050K8594J3956n968M888J5305P046M784J7809q50j4535
6158H91987O750O097K1584J1692J4615J1314J2990J674J3829R057J3063m746k180
$$ plain form
6252 364501 355445 355916 378102 401459 396307 403813 410035 424888 437201 446467 462808 467875 459386
6239 459386 464802 475496 488344 490251 488554 486169 487079 491464 501521 500471 489494 477613 478122 481467
6225 481467 487262 483077 485938 494905 483611 484452 499594 514764 515473 521090 529768 522692 524458 546158
6211 546158 554860 552176 550259 553494 558037 578017 593642 600977 591883 587159 606891 631491 643096
6198 643096 647141 654382 651910 652413 674582 697311 703274 704331 717579 729348 725755 737392 757535
6185 757535 754511 751203 749265 747924 753596 758114 770276 769076 759265 764817 785094 789461 795250 800919
6171 800919 805719 797908 820958 849552 863508 857540 862428 877733 884779 889563 907372 906522 891987
6158 891987 898737 904834 926418 938110 952725 964039 977029 978703 992532 1001589 1014652 1009906 1007726
6145A007726J6325R325Q609J8790J18o085N416J3401J6606R626L153l063O68N172
6131A105787J5772J4759J0973o916Q860J5894J7269R058K0418M227j189J7080
6119A231992K9490K6165J2249J0847J3793R132K1657L1984J0648N171P300J4401
6107A424829J8445J4168L4956J2192r307J6399K1996J7616R595J5862J4733L513
6095A594997l34L4392K6318O422P906L487J1258J6892K7221K6954Q497J5120K9470
6082A808600J8197J6647K8771K7678J1434K1152K8587L5296J9856J8576L3701
6071B068495J5388J7530L9303L7238K8476J9485P616J8220K5944K5041J9258J7616
6059B339610J786R952K2272K8328K4181K0288J6729K0839K7510K7969K2774K6805
$$ plain form
6145 1007726 1024051 1033376 1041985 1060775 1060893 1054808 1060224 1073625 1090231 1099857 1103010 1099947 1100615 1105787
6131 1105787 1121559 1136318 1147291 1140375 1149235 1165129 1182398 1191456 1211874 1216101 1214912 1231992
6119 1231992 1261482 1287647 1299896 1310743 1324536 1333668 1355325 1387309 1397957 1403128 1410428 1424829
6107 1424829 1443274 1457442 1492398 1504590 1495283 1511682 1533678 1551294 1560889 1576751 1591484 1594997
6095 1594997 1594663 1629055 1655373 1661795 1669701 1673188 1684446 1701338 1728559 1755513 1764010 1779130 1808600
6082 1808600 1826797 1843444 1872215 1899893 1911327 1932479 1961066 1996362 2016218 2034794 2068495
6071 2068495 2083883 2101413 2140716 2177954 2206430 2225915 2233531 2251751 2277695 2302736 2321994 2339610
6059 2339610 2341396 2351348 2373620 2401948 2426129 2446417 2463146 2483985 2511495 2539464 2562238 2589043
6047B589043R012J6843K9985L7311L2717L5010K5712J6759K1961K9428M6716J9297
6035B909794J2637J0027K0818J2277K7455K7883J3404J6529L4229L0342L0468
6024C145863M2530M9507M1290L4565L9246N0684L2561L1655M1319L2879L0026
6013C572125N3230N3201L0031L1696L7444M1863L0079M0363M4965L2271J4667
6002C981935K9569L2161L5906L8068M5115L7603L5657M9134O4155O1476N6718
5991D467497N6952M7450M5580L9446N6261O0224N4505N5705N3491N6655O8297
5980E062063O4251O6530O9299O1637O6965Q2374Q5725P1713P8204P2782P3386
5969E854929Q2475Q7468R3226Q0920Q2142R3479R3607R0535R4082Q7549P9190
$$ plain form
6047 2589043 2598055 2614898 2644883 2682194 2714911 2749921 2775633 2792392 2814353 2843781 2890497 2909794
6035 2909794 2922431 2932458 2953276 2965553 2993008 3020891 3034295 3050824 3085053 3115395 3145863
6024 3145863 3188393 3237900 3279190 3313755 3353001 3403685 3436246 3467901 3509220 3542099 3572125
6013 3572125 3625355 3678556 3708587 3740283 3777727 3819590 3849669 3890032 3934997 3967268 3981935
6002 3981935 4011504 4043665 4079571 4117639 4162754 4200357 4236014 4285148 4349303 4410779 4467497
5991 4467497 4524449 4571899 4617479 4656925 4713186 4773410 4827915 4883620 4937111 4993766 5062063
5980 5062063 5126314 5192844 5262143 5323780 5390745 5473119 5558844 5630557 5708761 5781543 5854929
5969 5854929 5937404 6024872 6118098 6199018 6281160 6374639 6468246 6558781 6652863 6740412 6819602
5958F819602Q7070R5963J08381Q9462Q8166J02488J01087J04775J17981J19058
5948G834033J33780J15651J25152J33756J22710J24099J41889J41486J32016J45733
5938I150305J76470J77471J85403K08353K04896K11222K18080K32072K20734K14224
5928A1199230J99654K03149K01457J96888K09595K16139K05862K22571K39042
5919A3093587K54001K57743K74053K87930K96625L10499L23505L30286L30002
5910A5758231L33770L56022L72726L97194M14797M29586M53917M75727M97830
5901A9489800N32950N55350N81243N93767O05621O21166O32778O51599O58636
5892B4922910O55597O63454O83078O92265P13690P47803P65709P78242Q08858
$$ plain form
5958 6819602 6906672 7002635 7111016 7200478 7288644 7391132 7492219 7596994 7714975 7834033
5948 7834033 7967813 8083464 8208616 8342372 8465082 8589181 8731070 8872556 9004572 9150305
5938 9150305 9326775 9504246 9689649 9898002 10102898 10314120 10532200 10764272 10985006 11199230
5928 11199230 11398884 11602033 11803490 12000378 12209973 12426112 12631974 12854545 13093587
5919 13093587 13347588 13605331 13879384 14167314 14463939 14774438 15097943 15428229 15758231
5910 15758231 16092001 16448023 16820749 17217943 17632740 18062326 18516243 18991970 19489800
5901 19489800 20022750 20578100 21159343 21753110 22358731 22979897 23612675 24264274 24922910
5892 24922910 25578507 26241961 26925039 27617304 28330994 29078797 29844506 30622748 31431606
5883C1431606Q50944Q86261R14973R41928R86901J013919J059336J106468J161195
5874D0353531J202586J245044J290589J314162J356067J376683J420190J439767
5866E0998619J474935J508697J573023J624502J657576J737269J803756J862497
5858F4240874J948991K040652K148301K247746K375200K537543K686419K869306
5850H3095032L078211L286873L509434L750232M033042M314900M593239M882249
5842A14543212N208786N559970N956227O414487O978042P625066Q372532R291742
5834A69950064J0364432J1597736J3036488J4687902J6506372J8540324K0752744
5827B75436062K3064187K5376612K7488844K9113810K9828839K9157872K6685157
$$ plain form
5883 31431606 32282550 33168811 34083784 35025712 36012613 37026532 38085868 39192336 40353531
5874 40353531 41556117 42801161 44091750 45405912 46761979 48138662 49558852 50998619
5866 50998619 52473554 53982251 55555274 57179776 58837352 60574621 62378377 64240874
5858 64240874 66189865 68230517 70378818 72626564 75001764 77539307 80225726 83095032
5850 83095032 86173243 89460116 92969550 96719782 100752824 105067724 109660963 114543212
5842 114543212 119751998 125311968 131268195 137682682 144660724 152285790 160658322 169950064
5834 169950064 180314496 191912232 204948720 219636622 236142994 254683318 275436062
5827 275436062 298500249 323876861 351365705 380479515 410308354 439466226 466151383
5820D66151383K2042037J5099318O236807l621725j3286145k1642735k7795893
5813D43183047l1270642l2219553l1281462k9211129k6631458k3961271k1421329
5806B47186203j9128281j7072815j5233229j3597232j2147858j0852953r735970
5799A49417865q780186p940307p224741o601379o069325n593289n189236m830453
5791I7188949m504948m199231l918991l675704l457465l236514l059491k896606
5783F8239999k730711k572904k422948k290108k141377k028382j899257j794119
5775E0360193j684075j600513j526921j458465j397786j344681j292629j223656
5767C8831467j178139j159097j118550j090617j064674j039831j005461r77770
$$ plain form
5820 466151383 488193420 503292738 509529545 505907820 492621675 470978940 443183047
5813 443183047 411912405 379692852 348411390 319200261 292568803 268607532 247186203
5806 247186203 228057922 210985107 195751878 182154646 170006788 159153835 149417865
5799 149417865 140637679 132697372 125472631 118871252 112801927 107208638 102019402 97188949
5791 97188949 92684001 88484770 84565779 80890075 77432610 74196096 71136605 68239999
5783 68239999 65509288 62936384 60513436 58223328 56081951 54053569 52154312 50360193
5775 50360193 48676118 47075605 45548684 44090219 42692433 41347752 40055123 38831467
5767 38831467 37653328 36494231 35375681 34285064 33220390 32180559 31175098 30197328
5759C0197328r67806r32630q93900q57030q22763p94279p55109p21927o98571
5750B2753313o50138o15640n92053n70818n45896n22184m97599m75312m55317
5741A7828356m42049m28857m05909l94741l72626l68362l53541l37286l29428
5732A4395557l14420l07055k97212k83924k77022k74763k59488k55860k50241
5723A1875572k32589k24675k22301k11781j98784j96420j94549j87244j87496
5714A0019733j91813j90320j72501j74454j64186j67568j48582j40184j33750
5705H536375j17521r5004r5747j03846q8978q4807j03275p7852r1057j15381j22533
5694G440374j07281j06267j31258j24945j02254j02135j16395r6650r0313q5536
$$ plain form
5759 30197328 29229522 28296892 27402992 26545962 25723199 24928920 24173811 23451884 22753313
5750 22753313 22103175 21487535 20895482 20324664 19778768 19256584 18758985 18283673 17828356
5741 17828356 17386307 16957450 16551541 16156800 15784174 15415812 15062271 14724985 14395557
5732 14395557 14081137 13774082 13476870 13192946 12915924 12641161 12381673 12125813 11875572
5723 11875572 11642983 11418308 11196007 10984226 10785442 10589022 10394473 10207229 10019733
5714 10019733 9827920 9637600 9465099 9290645 9126459 8958891 8810309 8670125 8536375
5705 8536375 8418854 8323850 8228103 8124257 8035279 7950472 7847197 7769345 7678288 7562907 7440374
5694 7440374 7333093 7226826 7095568 6970623 6868369 6766234 6649839 6553189 6462876 6377340
5684F377340j01348r2168q3140q6428q4987q1418r4179j07350q3810p2574r2881
5673E397057q5632o7048n8858p8822p5164n3120n1292o9608n7631n0454o4409
5662D685019n7835n7687o1969o9982o0708n8247n7790n9701n7728o2290n5096
5651D025986n6781o4088n4399n8824o8366n1343n6155n8848n8717n1997n0806
5640C395662n4228n2391m0491k8811m4734m4976m9244m4190n0799m2834n7701
5629B885263m6488n5961n2232n3959m8156l9496k2158k9481k8802k9385r155j0000
5617B459990k1052j5069j3884j6802l1936j9287l0516l9158m3050l0974l1583
5606B166679l2529k9635j9511m3587k7957p419p972l4897j2820q351k4396l7507
$$ plain form
5684 6377340 6275992 6183824 6100684 6014256 5929269 5847851 5753672 5646322 5562512 5489938 5397057
5673 5397057 5311425 5244377 5185519 5106697 5031533 4978413 4927121 4857513 4799882 4749428 4685019
5662 4685019 4627184 4569497 4507528 4437546 4376838 4318591 4260801 4201100 4143372 4081082 4025986
5651 4025986 3969205 3905117 3850718 3791894 3723528 3672185 3616030 3557182 3498465 3446468 3395662
5640 3395662 3341434 3289043 3248552 3219741 3175007 3130031 3080787 3036597 2985798 2942964 2885263
5629 2885263 2838775 2782814 2730582 2676623 2628467 2588971 2566813 2537332 2508530 2479145 2469990 2459990
5617 2459990 2438938 2423869 2409985 2393183 2361247 2341960 2311444 2272286 2229236 2198262 2166679
5606 2166679 2134150 2104515 2085004 2041417 2013460 2006041 1998069 1963172 1950352 1942001 1917605 1880098
5594A880098j9994j4361l9460j6059r948k1402k0514o524l082j2140j8963k147
5582A695504j3482j9159k7305j8091j4983k3986l2651j6436k2284k7722j1017
5571A468388j1154j7400q525m094o196j1997j413r827j2925L143m652j680q932
5558A372736r350j2131j0871p165K831r651r680o492j2256j0587o602m066r704
5545A267012j0180j2843k8115j1364j7355j4403k6760p574k450q384j6728R52
5533A111808k751j4443O793q945p498r346j690j1423j4518k0699J85o804k482
5520A018187N335O307q640k865R158R890j1559O87l795j4836j3874q150q569k1849
5506I55427q168n985m030j8317K835k914j1388j2543L372p366j1784j7745j1447
$$ plain form
5594 1880098 1860104 1845743 1806283 1790224 1780276 1758874 1738360 1731836 1728754 1716614 1697651 1695504
5582 1695504 1682022 1662863 1635558 1617467 1602484 1578498 1545847 1529411 1507127 1479405 1468388
5571 1468388 1457234 1439834 1431309 1427215 1421019 1409022 1407609 1397782 1384857 1388000 1383348 1381668 1372736
5558 1372736 1363386 1351255 1340384 1333219 1336050 1326399 1316719 1310227 1297971 1287384 1280782 1276716 1267012
5545 1267012 1256832 1243989 1215874 1204510 1187155 1172752 1145992 1138418 1135968 1127584 1110856 1111808
5533 1111808 1109057 1094614 1101407 1092462 1084964 1075618 1073928 1062505 1047987 1027288 1027473 1020669 1018187
5520 1018187 1023522 1029829 1021189 1018324 1027482 1037372 1025813 1026500 1022705 1007869 993995 985845 977276 955427
5506 955427 947259 941274 937244 918927 921762 918848 907460 894917 898289 890923 879139 861394 849947
5493H49947j5055j4301j1387n72n266r626q345n64p034m709Q52R78o008m025Q05
5478G65690n710l806j4706n832j5384j095n430l484k523n140m661M127J292j1715
5464F91623n491J668o009q04r73m481j1190q800J144j5538r964L30m354r384j1592
5449F06185n455j2418p594J120K373M25l397J3681P875M301Q750J1908K663r526
5435F20891n808o315r699r832o993o523m452O35L160J124p55M024R609n766M251
5420E87551j043m363j1731K253q81j194j3395r876l131j087m154q919o327j0849
5406E12854p461l688l395j4071n558J38j033l672J148L573l833l979N356m138
5392D72241O071p465Q995J102N113N198J6754r851j2696Q362m68p776j4710j734
$$ plain form
5493 849947 834892 820591 809204 808632 803366 793740 785395 784831 777797 773088 773940 774918 768910 764885 765690
5478 765690 759980 756174 741468 735636 720252 719157 713727 710243 707720 702580 697919 702046 703338 691623
5464 691623 686132 687800 681791 680987 680014 675533 664343 655543 656687 641149 631185 631515 627161 617777 606185
5449 606185 600730 588312 580718 581838 584211 584636 581239 594920 602795 607096 615846 627754 630417 620891
5435 620891 615083 608768 599069 589237 582244 575721 571269 571904 575064 576188 575433 579457 589066 583300 587551
5420 587551 586508 582145 570414 572667 571786 570592 557197 547321 544190 543103 538949 530030 523703 512854
5406 512854 505393 501705 498310 484239 478681 478819 477786 474114 475262 478835 475002 471023 476379 472241
5392 472241 478312 470847 479842 480944 486057 491255 508009 498158 485462 493824 493356 485580 470870 469136
5378D69136j2185r339q390P607J400n840K853M969o085L423K572J23r591n08o349
5363D33796l95p313j695K832m151M707O796m39J763m562J516j8701k2156o78M850
5348C96170l725j2930L131n875N994M840P470o863n487r262j295j5990j4783m866
5334C36529l770j0575p962Q312J161q25J6111k690M826m602o783j164m806j4493
5320C09269r993J4474q364K307o544J2065J0255M995L14l049q790L599J487o751
5306C15274o354n700N015l63m876Q496l562j7146K639J0369J048j5485P231k982
5292B93604q293j2079n781j280P28n639J910l175n9P732J377p044J725m986p878
5277B50862j0220K181j978j6793R60Q635q815j0751N414L85K461m883M823p356
$$ plain form
5378 469136 456951 447612 439222 446829 448229 442389 445242 450211 444126 447549 450121 450244 440653 440145 433796
5363 433796 433401 426088 424393 427225 423074 427781 434577 434138 435901 431339 432855 414154 391998 391320 396170
5348 396170 392445 379515 382646 376771 382765 387605 395075 388212 382725 373463 372168 356178 341395 336529
5334 336529 332759 322184 314222 322534 323695 322870 338981 336291 341117 336515 329732 328568 323762 309269
5320 309269 299276 313750 305386 307693 301149 313214 323469 328464 328778 325729 316939 320538 322025 315274
5306 315274 308920 303220 308235 307872 302996 311492 307930 290784 293423 303792 304840 289355 296586 293604
5292 293604 285311 273232 267451 266171 266899 261260 263170 259995 259936 267668 269045 262001 263726 258740 250862
5277 250862 240642 242823 240845 224052 225012 233647 224832 214081 219495 219880 222341 217458 222281 214925
5263B14925k803L041Q456k769o122j2021J428m765P215J287j187L588M226J4569
5249B29068j023j734r85K340j351J459j3316n796o578j0380p116J5291M131j172
5235B02838N068k777J3560L627m026j0696o620j1569m107K276j3137m716J047
5222A70768o932O384J0114J7333k353r527N946N695j4408n52O223r240n250Q37
5208A75038O576j904L541M117M938r525m272K304k904j6161j1411o77j0215q434
5194A31011m637P073l369k520R771j1123J586O391K444q707o342J0112M834n82
5180A35942O219n165j0718M03J2163R036p693k940Q370J0704k717L628O107r17
5166A62422k362j535J801l246p266M398j344j325N193M975L994l257r632k712
$$ plain form
5263 214925 212122 215163 223619 220850 214728 202707 204135 199370 206585 207872 206685 210273 214499 229068
5249 229068 228045 226311 225326 227666 226315 227774 214458 208662 202084 191704 184588 199879 204010 202838
5235 202838 207906 205129 218689 222316 218290 207594 200974 189405 185298 187574 174437 169721 170768
5222 170768 163836 170220 180334 197667 195314 185787 191733 197428 183020 182468 188691 179451 174201 175038
5208 175038 181614 179710 183251 187368 192306 182781 178509 180813 177909 161748 150337 149660 139445 131011
5194 131011 126374 133447 130078 127558 137329 126206 127792 134183 136627 127920 121578 131690 136524 135942
5180 135942 142161 136996 126278 126681 138844 147880 140187 137247 145617 156321 153604 157232 163339 162422
5166 162422 160060 158525 160326 157080 149814 154212 152868 151543 156736 161711 165705 162448 152816 150104
5152A50104R421j083j217o767r645k981Q605M002l41o955L685R739n148J390J93
5137A53002p219r944L931O095o322r043P399j306k530P89M312J048J107m970q003
5122A28346o077n648M609N140o460J99Q670L524M627M535j0615n780k30K592m396
5107A23036o903o64P659r046m541J6568J4762l218j6830Q065O99K129n499l342
5093A22875n220k5413Q700J3556J0918J537L138Q297L752L8k467P045k1453n887
5079A19416J245r254m915O050l633o340n287Q599J0094N579J0501r499j4226M216
5065A12546j222N751p790l181r890q894m534J4669O335Q39N831q861Q610R469
5051A19678M066q897m994o767j0821o253P937K564m901l758k761j63N937Q882
$$ plain form
5152 150104 159525 158442 157225 150458 140813 137832 146437 150439 150098 143143 146828 156567 151419 152809 153002
5137 153002 145783 135839 139770 145865 139543 130500 137899 136593 134063 134852 139164 140212 141319 136349 128346
5122 128346 122269 116621 121230 126370 119910 120109 128779 132303 136930 141465 130850 125070 124840 127432 123036
5107 123036 116133 115469 123128 114082 109541 126109 140871 137653 120823 128888 129587 131716 126217 122875
5093 122875 117655 92242 100942 114498 125416 126953 130091 138388 142140 142178 139711 146756 125303 119416
5079 119416 120661 111407 106492 112542 108909 102569 97282 105881 115975 121554 132055 122556 108330 112546
5065 112546 111324 117075 109285 106104 96214 87320 82786 97455 103790 104629 110460 101599 110209 119678
5051 119678 123744 114847 109853 103086 92265 86012 93949 96513 91612 87854 85093 84930 90867 99749
5037I9749P091J581n770K20j775k460M135j389j3477n847o87j858m146j906M22
5022G3883M92L399O142J307L425J189j321j350o018R113N148n307j2540N082J587
5007H4231j47o80k414Q4l755J5522J1446R74o494j231N383n893k23R918k083j2961
4991I1677m733J427K250O600N881k396n212L200J1927j957L036L420N72j5783
4977I9909Q41n23n916l375K124o781j809N126o9O551L297k450L708k256N780R184
4961A13341j8398k181j066j3965r582K961L925K381l473l970L879J294M687P982
4947H7815Q304p760o488l37o836K530L71j0220L61L182p228o347l129k471J189
4932E2936K182R292J2828j9359L987J2623J942m588l613O212l602r663M624L726
$$ plain form
5037 99749 106840 108421 102651 102871 101096 98636 102771 101382 87905 82058 81371 79513 75367 73461 73883
5022 73883 74375 77774 83916 85223 88648 89837 88516 87166 81148 90261 95409 90102 77562 82644 84231
5007 84231 84084 83404 80990 81074 77319 92841 104287 105261 98767 97536 102919 97026 96803 106721 104638 91677
4991 91677 86944 88371 90621 97221 103102 100706 95494 98694 110621 108664 111700 115120 115692 99909
4977 99909 100750 100227 94311 90936 93060 86279 84470 89596 89527 96078 99375 96925 100633 98377 104157 113341
4961 113341 94943 92762 91696 77731 68149 71110 75035 77416 73943 69973 73852 75146 79833 87815
4947 87815 96119 88359 81871 81534 74698 77228 77599 67379 67740 70922 63694 57347 54218 51747 52936
4932 52936 55118 64410 77238 57879 61866 74489 76431 71843 68230 74442 70840 61177 65801 69527
4918F9527l356p190k837o483Q60O667M527n20j1828M756N06l44R953J0935j1932
4903F3241j3248R29J004r043n926K898l52p742j571J4744J468M91P184k320k904
4888D8853J2248M287j445q129L685L263j1969L300J1622j1812j2643J0379q308
4875D3331M171P505J289j2981P041J0548R995j983p04k221o341p222l932J660
4861E0156q617Q079j052q454j633K0252J2356K970k054j747m504N228K96r60k5905
4846D4411j0668o802j702p946P68P196N436J2469J8778Q847j4756Q92l770k5781
4832B7372j0854K342m239k0334r469J0855O210J1903K4498J4271n701k760R748
4819E3842m196j3035L478j2680k1985j5646K0234K440J856K1757J3075m491K858
$$ plain form
4918 69527 66171 58981 56144 49661 50521 57188 61715 61195 49367 54123 54629 54285 64238 75173 63241
4903 63241 49993 50922 51926 42883 36957 39855 39503 31761 30190 44934 46402 46893 54077 51757 48853
4888 48853 61101 65388 63943 55814 59499 62762 50793 54093 65715 53903 41260 51639 43331
4875 43331 47502 55007 56296 43315 50356 60904 70899 68916 68212 65991 59650 52428 48496 50156
4861 50156 41539 49618 48566 40112 38479 58731 71087 74057 72003 70256 65752 70980 71276 70316 44411
4846 44411 33743 26941 25239 17293 18061 25257 30693 43162 61940 70787 56031 56923 53153 27372
4832 27372 16518 18860 14621 -5713 -15182 -4327 1883 13786 38284 52555 46854 44094 53842
4819 53842 49646 36611 40089 27409 5424 -10222 10012 12452 14308 36065 49140 44649 47507
4806D7507J9673L146j2694j4191p734j9654j7597R486N288r83m95J4720J2651
4793C9123n02J1609J2476p406j1361m589q887p461o352n279r953N114K1756K548
4779C0836K211Q442O104j1801O691O749m487j1274p396o385j016p48j586N156
4765B1496p1J875J3149K131P74J0300j022q826J939K928j0657m232k018j0618
4751A7148j0400P325J1562M49l847M648R570P126j574J1826l423o287j1219o294
4737B6610j6212p135R94m586M986M688K2486k184n911J0274Q783j570j039l629
4723C6555j3444k7069n274P094n746k301R496O413O55J0187J3983l074r627j216
4709A6632J021m498p418O473o005o282N716K708r395K701M348J2906K686M641
$$ plain form
4806 47507 67180 70326 57632 43441 35707 16053 -1544 7942 13230 12247 11752 26472 39123
4793 39123 38621 50230 62706 55300 43939 39350 30463 23002 16650 11371 1418 6532 28288 30836
4779 30836 33047 41489 47593 35792 42483 49232 44745 33471 26075 19690 18674 17926 16340 21496
4765 21496 21425 23300 36449 38580 39354 49654 48632 39806 41745 44673 34016 29784 27766 17148
4751 17148 6748 14073 25635 26084 22237 26885 36455 43581 42007 53833 50410 44123 32904 26610
4737 26610 10398 3263 4257 -329 4657 9345 31831 29647 23736 34010 42793 41223 40184 36555
4723 36555 23111 -3958 -9232 -2138 -7884 -10185 -689 5724 6379 16566 30549 27475 17848 16632
4709 16632 17653 13155 5737 12210 6205 -77 5639 8347 -1048 1653 6001 18907 21593 26234
4695B6234J3329r225q956Ok536m855m005M003J624k171m055R015l238k8J6103
4680C1245o414r339M535O602J499O052P27l210j0008j0084J0427M596l228n367
4666A8033k265k139J2097J0035k402l084j657L101N45L273p179p855L313n551
4652A8265l042O455J054K550p678p646N102L630J0653L977J194j2795q732J357
4638A4344R209N351p684n526j6680N5K0291P361j0591L815M618J17O461R763k027
4623C8877j5224n139M708k166J010j1976Q084r849q680Q996J2546k539l58Q927
4609B7217m187P030J0790p335k935p339n107K508j0438j144K640j0192l614N816
4595C710O675J2526O756K064m177J553P852J350q479j0171j0133l415r447N005
$$ plain form
4695 26234 39563 30338 21382 21388 18852 13997 9992 13995 15619 13448 9393 18408 15170 15142 31245
4680 31245 24831 15492 20027 26629 28128 34180 34907 31697 21689 11605 22032 26628 23400 18033
4666 18033 15768 13629 25726 35761 33359 30275 28618 31719 32264 35537 28358 20503 23816 18265
4652 18265 15223 21678 22732 25282 17604 9958 15060 18690 29343 33320 34514 21719 12987 14344
4638 14344 23553 28904 21220 15694 -986 -931 19360 26721 16130 19945 24563 24680 31141 40904 38877
4623 38877 23653 18514 23222 21056 22066 10090 18174 8325 -355 8641 21187 18648 18290 27217
4609 27217 23030 30060 40850 33515 30580 23241 18134 20642 10204 9060 11700 1508 -2106 3710
4595 3710 10385 22911 29667 31731 27554 29107 36959 38309 29830 19659 9526 6111 -3336 1669
4581A669R992j0692l963M180N763J1496K101J1227l323K245K338l20k375p568
4567B2770j5576o675l669l86k84N44M464j28K673L337J2776O463j451k172k331
4552B0355N593N087j1670j1280j8865m463Q003M543L898J6260j928K849J0831
4539B9213J7504L595j0186j889j1758j6750n465J0948k545j5899l515R691N306
4526H250J8882J5412q66m683j809J834J0877n988j0955j4565r873K805K820Q356
4512B0497n023L97R518K801K694O942n00L422m371Q12m870q615N941K614j2698
4497A9561l858N842P647j984L04j067k311L916M076P772l074l133n380m026l19
4482B3966N946L640m421p708J711R04O192J963J2691o825j046L454n242R567k967
$$ plain form
4581 1669 11661 969 -2994 1186 6949 18445 20546 31773 28450 30695 33033 32713 30338 22770
4567 22770 7194 519 -3150 -3536 -3820 -3276 1188 1060 3733 7070 19846 26309 24858 22686 20355
4552 20355 25948 31035 19365 8085 -10780 -15243 -7240 -2697 1201 17461 15533 18382 29213
4539 29213 46717 50312 40126 38237 26479 9729 4264 15212 12667 -3232 -6747 2944 8250
4526 8250 27132 42544 41678 36995 35186 37020 47897 41909 30954 16389 6516 9321 12141 20497
4512 20497 15474 15871 25389 28190 30884 37826 37326 40748 36377 37189 32319 23704 29645 32259 19561
4497 19561 15703 21545 29192 27208 27512 26445 24134 28050 32126 39898 36824 33691 28311 24285 23966
4482 23966 29912 33552 29131 21423 23134 24038 30230 32193 44884 38059 37013 40467 35225 44792 41825
4467D1825m705L103k830L021K595P491p414j4931R110O376M638j768N722Q476
4453F0709N453j223J0796O612o787l076L597k204r499J98l552m651J592L307R577
4438G0849R002J6268J2829k654J834M383O757O162m514n140j7218r787Q557L957
4424A01285k962N981K7716J0509N886K1292K4550J764q434o366p251m508j0297
4411A59165o214K2413Q687J0724K8643K7114P664J2663j772J0250J1660L019R710
4398C03726K788J0774J0643K1826J3218L2481L6837M5054L7836N3901O1281N6781
4386F87146N9369P1602N5424M8555N5621N9105M9417O2637Q0492R8701R0992P9804
4374A498865M7070K8856J3262J7953L8257M6452O3220M4580J5725j9602n6991
$$ plain form
4467 41825 37120 40223 37393 40414 43009 50500 43086 28155 37265 43641 48279 46511 52233 60709
4453 60709 66162 64939 75735 82347 75560 72484 76081 73877 64378 64576 61024 56373 57965 61272 70849
4438 70849 79851 96119 108948 106294 108128 112511 119268 125430 120916 115776 98558 88771 97328 101285
4424 101285 98323 104304 132020 142529 148415 169707 194257 196021 187587 181221 173970 169462 159165
4411 159165 152951 175364 184051 194775 223418 250532 258196 270859 269087 279337 290997 294016 303726
4398 303726 306514 317288 327931 349757 362975 395456 432293 477347 515183 569084 630365 687146
4386 687146 746515 818117 873541 922096 977717 1036822 1086239 1148876 1229368 1328069 1419061 1498865
4374 1498865 1545935 1574791 1588053 1606006 1644263 1690715 1753935 1798515 1814240 1794638 1737647
4363A737647o9215n4009m6008l1944k9856m4512o5901q2176j00149q9038q9320
4352A035519n8503n7286l8623m1468n2414o1787o8417o7716n7235m8424n6255
4341D27391l8053m1662l3942k5651k2381o892n492j5197J693M059K01q147n097
4328B30830k981l0452j4746r797k3470j6646j2148n135K687P161N365P274m062
4315A33880m374l949l991R86k325j2291k3518j1409Q54k137j6084R393j31L105
4301F8009K639J3866P613j6934n594J561r272j4152R843l553n860o660N344J1493
4287E8343j457J223j336j0415m285r178O885J292k063m994P845q366O797J501
4273D1792l310k99K907K05p317n826J382q251p091M825K615J7967k417k352n085
$$ plain form
4363 1737647 1668432 1614423 1568415 1536471 1506615 1462103 1396202 1314026 1213877 1124839 1035519
4352 1035519 977016 919730 881107 839639 787225 725438 657021 589305 532070 483646 427391
4341 427391 389338 347676 313734 288083 265702 258810 253318 238121 239814 243873 244074 235927 230830
4328 230830 227849 197397 182651 172854 149384 132738 120590 115455 118142 125303 130668 137942 133880
4315 133880 129506 125557 121566 122552 120227 107936 84418 73009 73863 71726 55642 65035 64904 68009
4301 68009 70648 84514 92127 75193 69599 71160 61888 47736 57579 54026 48166 41506 46850 58343
4287 58343 56886 58109 56773 46358 42073 32895 39780 41072 39009 34015 41860 33494 40291 41792
4273 41792 38482 38183 41090 41295 33978 28152 29534 21283 14192 19017 21632 39599 37182 34830 29745
4258B9745J4266l544J242J924j210j8708M846j011K01k535o171j1184l379o54
4244C828L641K262O894m3P909J449m235R739J844p391j0949J1986r815Q67n364
4229A2622K259j2496q411R152P748o975N804Q775L757l588J4066j547j1059j5583
4215D524Q03J673o376M109J4855p881j2378J6050N442L882o293Q623r702r827
4201G504n341n78p881J506Q391p421K632P344N237L918k713n479J0415o062m651
4186F821N51j0322j0520O582J0805P946j204K760k618M35M361N97o823r909m95
4171a033j802o064J512M653M932j78q693R726J3865J101j4044n146J039j03p111
4156g346N209p97j18j4867P932Q186j159m492J1527p702r119Q989J6197l679k895
$$ plain form
4258 29745 44011 40467 41709 43633 42423 23715 28561 27550 27751 25216 19045 7861 4482 3828
4244 3828 7469 9731 16625 16582 24491 25940 21705 31444 33288 25897 14948 26934 17119 17986 12622
4229 12622 14881 2385 -6026 3126 10874 3899 9703 18478 22235 18647 32713 31166 20107 4524
4215 4524 5327 7000 624 4733 19588 11707 -671 15379 20821 24703 18410 27033 17331 7504
4201 7504 2163 1585 -6296 -4790 3601 -3820 -1188 6156 11393 15311 12598 7119 17534 11472 6821
4186 6821 7372 -2950 -13470 -6888 3917 11863 10659 13419 10801 11236 15597 16194 9371 -538 -1033
4171 -1033 -2835 -8899 -7387 -2734 2198 2020 -6673 3053 16918 18019 3975 -1171 -132 -235 -7346
4156 -7346 -2137 -2934 -3052 -17919 -9987 -1801 -2960 -7452 4075 -3627 -12746 -3757 12440 8761 5866
4141E866K781n056m040n649J0245L367j84j2243l116r145K508Q669m522n985Q978
4126g526J1228J3060l027O47m907q085r265J935O239q062j0090J154J059K070
4112a3570N230N508k334M164O825Q510k39K821m694j8406r246n141R712P90j1380
4097b1450K578M650j641P693J2062K0436j0052o819M817O518o113q629m349K97
4083bn731N41K040j280m973l546R087J252J451Q150j758n099K878R322J43j5461
4067b986J3314l043r109p985R50N431q04n706J9332P07N200M206O07o261l14n570
4051G969r779K764n127Q657m507l26q428K225l309J0549Q285P955L984J0342n918
4036B5336n221j2072J562q230q856K892M255j0020k143l343k410J9663L104M999
$$ plain form
4141 5866 8647 3591 -449 -6098 4147 7514 7330 -4913 -8029 -17174 -14666 -5997 -10519 -16504 -7526
4126 -7526 3702 16762 13735 14382 9475 1390 -7875 -5940 299 -7763 -17853 -16699 -15640 -13570
4112 -13570 -8340 -2832 -5166 -1002 5823 14333 14094 16915 12221 -6185 -15431 -20572 -10860 -10070 -21450
4097 -21450 -18872 -14222 -15863 -8170 3892 24328 14276 7457 12274 18792 12679 4050 -299 -2
4083 -2 -5733 -5192 -3152 -4432 -9405 -12951 -3864 -2612 -1161 6989 5231 132 3010 12332 12475 -2986
4067 -2986 10328 7285 -1824 -9809 -8859 -3428 -4232 -9938 9394 10101 15301 19507 20114 13853 13539 7969
4051 7969 -1810 954 -4173 4484 -23 -349 -8777 -6552 -9861 688 8973 16928 20912 31254 25336
4036 25336 20115 8043 9605 1375 -7481 -4589 -334 -10354 -12497 -15840 -18250 1413 4517 9516
4022I516M29K534j1480J275q688l82M74l255r284J2269P663J254r934n191l74
4007a3174N849M759J046N077k948j312K828K707j2170M578L079Q033k036p27q293
3992b704l712j476l400q447k58l344N360n040J6335P957J379L276l560j001k358
3977i93o89j026j2554j6194J5413m956M104J1986R301r55J2211n073J0477m315
3963A6737k378o480q689r432Q51j1480p903L534R581J2203l105J1723J137J177
3949G476n77M423m635j0761m499k685q45K67q799k415j937J0113r81P750L090
3934e015k06J075N691m615J0531J930o451r29j8547k776M304K59o389Q726j972
3919a4384Q465O464J1007K218k13r454N117j1059m197p875O086M881n965j382
$$ plain form
4022 9516 9945 12479 999 2274 -6414 -6796 -6322 -9577 -18861 -6592 1071 2325 -7609 -12800 -13174
4007 -13174 -7325 -2566 -1520 3557 609 -703 2125 4832 -7338 -2760 319 8352 6316 5589 -2704
3992 -2704 -6416 -7892 -11292 -19739 -19997 -23341 -17981 -23021 -6686 1271 2650 5926 2366 1365 -993
3977 -993 -1682 -2708 -15262 -31456 -16043 -20999 -16895 -4909 4392 3437 15648 10575 21052 16737
3963 16737 14359 7879 -810 -10242 -9391 -20871 -28774 -25240 -15659 -3456 -6561 5162 6299 7476
3949 7476 6899 11322 6687 -4074 -8573 -11258 -12103 -11836 -20635 -23050 -24987 -14874 -15855 -8105 -5015
3934 -5015 -5221 -4146 1545 -3070 7461 9391 2940 2011 -16536 -19312 -15008 -14749 -21138 -12412 -14384
3919 -14384 -5919 545 11552 13770 13557 4103 9220 -1839 -6036 -13911 -7825 -2944 -8909 -10291
3905a0291P672L274P952M043n187R62l906M855o478j0078j2801K330K586J5129
3891F2N951k207k1632J7237j0571R277O012L765j5538k916L773R76j130J869m196
3876i268j485J32O339M891j4229m016m488K155M250J3610M16k760n734P50k226
3861a1663J0110j317L561k5001j1357Q778J8649R900J62l374k815j703J4808Q029
3847A6767j228r623j7804r167l696O287k187k358k11R031J4829J1402P779M001
3833B3822j2484l306j2976l201l140O20j1738j6857m310J0256J0449J0665J8516
3820F316J635j0395P811K0342m786r565o368j1384j9719r34M243o66j1890R480
3806b5880p495J2970J7003L887l298p344K081J0358l651o56J125j2673m831J675
$$ plain form
3905 -10291 -2619 655 8607 12650 7463 8425 4519 9374 2896 -7182 -19983 -17653 -15067 62
3891 62 6013 3806 -17826 -589 -11160 -1883 4129 7894 -7644 -10560 -6787 -5811 -6941 -5072 -9268
3876 -9268 -10753 -10621 -4282 609 -13620 -17636 -22124 -19969 -15719 -2109 -1693 -4453 -10187 -9437 -11663
3861 -11663 -1553 -2870 691 -24310 -35667 -26889 -8240 1660 1822 -1552 -4367 -6070 8738 16767
3847 16767 15539 5916 -11888 -21055 -24751 -18464 -20651 -23009 -23220 -14189 640 12042 19821 23822
3833 23822 11338 8032 -4944 -8145 -11285 -10665 -22403 -39260 -43570 -33314 -22865 -12200 6316
3820 6316 7951 -2444 5367 25709 20923 11358 4990 -6394 -26113 -27047 -22804 -23470 -35360 -25880
3806 -25880 -33375 -20405 -3402 485 -2813 -10157 -8076 2282 -1369 -2025 -900 -13573 -18404 -16729
3792a6729O963n413j2725o408r03n840J9803J1018O859L005j234j697L762N091
3778E552O468p962j1035r766k968k753m612K823k024L776J9044N113O154N810
3764A3620O240l447m534k029j0518o336j2303o090n996J0077k141J594l29J3431
3750h761O314O726O334P302p341r151M13J252j4387p769j0123m247k926M104J2436
3735a9824O013M395J0267O883j039J2356p223r411k2575M202L918n643j5882Q865
3721b4698j1616J846J5028J9032Q00N632k518o456l611L94N669r876j2418p968
3707c0760J814P898J0475O43M865r512J6131K830L731l55j466o891m523j0790
3693a5910K940R54j330l195r575j307K1285J3697J91j0346n058k145M627J1932
$$ plain form
3792 -16729 -9766 -15179 -27904 -34312 -35215 -41055 -21252 -10234 -3375 -370 -1604 -3301 461 5552
3778 5552 12020 4058 -6977 -16743 -19711 -22464 -27076 -24253 -26277 -22501 -3457 1656 7810 13620
3764 13620 19860 16413 11879 9850 -668 -7004 -19307 -25397 -31393 -21316 -23457 -21863 -22192 -8761
3750 -8761 -2447 4279 10613 17915 10574 1423 1836 3088 -11299 -19068 -29191 -33438 -36364 -32260 -19824
3735 -19824 -13811 -9416 851 7734 6695 19051 11828 2417 -20158 -15956 -12038 -17681 -33563 -24698
3721 -24698 -36314 -34468 -19440 -408 392 6024 3506 -2950 -6561 -6167 -498 -10374 -22792 -30760
3707 -30760 -28946 -21048 -10573 -9930 -5065 -14577 1554 4384 8115 7760 6294 -597 -5120 -15910
3693 -15910 -12970 -12016 -13346 -16541 -26116 -27423 -6138 7559 7750 -2596 -7654 -9799 -5172 6760
3679F760r735J66j4185k562K021P545Q428k837j4413R779M204J0685N923n68j4167
3664b956j0392P24J0765L388j39n807m399j694O367J5717r742n519q111L163n466
3649a4101R305O538O49j2329n599M885N673J1894P550j0731j2108n866J199R27
3635a2114L766o877p153p792K678J6615p094J2694R651J56L588L934j664o82j9418
3620i712n330l769M148j557p320l994M528O1R086O030Q145P753J405O220j0523
3605E171n68j1323M51j4141j850q413J038l206M448J4815J6790J954L935m590
3591D511M847m883j920J396r329j2614q497l883j328N74R809J5777k264J4837
3577G033Q756j219n022L109j4693j1216q788J3689r613j980J398j04J821J6255
$$ plain form
3679 6760 -2975 -2809 -16994 -19556 -17535 -9990 -1562 -4399 -18812 -9033 -4829 5856 11779 11211 -2956
3664 -2956 -13348 -12624 -1859 1529 1390 -4417 -8816 -10510 -4143 11574 1832 -3687 -11798 -8635 -14101
3649 -14101 -4796 1742 2391 -9938 -15537 -10652 -4979 6915 14465 3734 -8374 -14240 -13041 -12114
3635 -12114 -8348 -15225 -22378 -30170 -27492 -10877 -17971 -5277 4374 4530 8118 12052 10388 9706 -9712
3620 -9712 -15042 -18811 -14663 -16220 -23540 -27534 -23006 -22945 -13859 -7829 316 8069 9474 15694 5171
3605 5171 4603 -6720 -6269 -20410 -22260 -30673 -29635 -32841 -28393 -13578 3212 5166 9101 4511
3591 4511 9358 4475 2555 3951 -5378 -17992 -26489 -30372 -31700 -31126 -21317 -5540 -7804 7033
3577 7033 15789 14570 9548 12657 -2036 -13252 -22040 -8351 -17964 -19944 -18546 -18650 -16829 -574
3563e74M742j649q348l041O165l6J339n980n394n275J714k456R027J2685j109
3548A810p008q74K988J1171k74j2999k163n542j3857J6733L246Q264l195k992
3534d692l237Q503M030r760l222p361o654q94J2298J4505l787q622l261j119J099
3519a2174J3179K721r595o180j003J2877P135k507m551j7047q907J5027K189n042
3505a3878L980P749m258j843j317Q174k705k88m124j2636J163R341J1242m710
3491d110j4683M250J6427N316o54R68n442r525M34k95L720m476j1066k08l243
3476b2587Q837J809r95M578O15J658L997J49N337J389M97j2569n709n231L550
3461a4675k005P134k738K65K502O503P861j700L120m596M9m387k153N120r243
$$ plain form
3563 -574 4168 2519 -5829 -8870 -2705 -2741 -1402 -7382 -12776 -18051 -16337 -18793 -9766 2919 1810
3548 1810 -5198 -6072 -3084 8087 7813 -5186 -7349 -12891 -26748 -10015 -6769 1495 -1700 -4692
3534 -4692 -7929 574 4604 -5156 -8378 -15739 -22393 -23287 -10989 3516 -271 -8893 -12154 -13273 -12174
3519 -12174 1005 3726 -5869 -12049 -13052 -175 6960 4453 -98 -17145 -26052 -11025 -8836 -13878
3505 -13878 -9898 -2149 -6407 -8250 -9567 -1393 -4098 -4386 -8510 -21146 -19983 -10642 600 -4110
3491 -4110 -18793 -14543 1884 7200 6546 7514 2072 -7453 -7019 -7314 -3594 -8070 -19136 -19344 -22587
3476 -22587 -13750 -11941 -12936 -8358 -7743 -6085 -2088 -1939 3398 4787 5284 -7285 -12994 -18225 -14675
3461 -14675 -16680 -9546 -12284 -12019 -9517 -3014 4847 3147 6267 1671 1720 -2667 -4820 300 -8943
3446h943m479J2368l260j0343L283J1027J399k270m679Q095j0137p799K255J0234
3432c249l992N435J158k5O7N30Q76k821K979Q263l264o261q090k754j1743K895
3416a9996J4477L394j676K105L934q37k51P514L590j4930l563l919M880p207K252
3401a0233N41K012K385J13O999J0816M433m181q768q146q46K119K952n794n700
3386a1298J696l009j0323Q883N610j582j2942O360M286J6383J0350n499n194L975
3372G696n151P855n819m699j0311j2228J679R159M955j714M350r592J6418j882
3358G16J2819P869m698j5493j537k998L231j0090o68m926p618K839J3370Q862
3344A678K243j825Q294M71l725O338k740o832j3421N71m817O466k565K159L40
$$ plain form
3446 -8943 -13422 -1054 -4314 -14657 -11374 -347 1052 -1218 -5897 2198 -7939 -15738 -13483 -3249
3432 -3249 -7241 -1806 -648 -673 -606 -76 800 -2021 958 9221 5957 -304 -8394 -11148 -22891 -19996
3416 -19996 -5519 -2125 -3801 -1696 2238 1401 1150 8664 12254 -2676 -6239 -10158 -5278 -12485 -10233
3401 -10233 -9692 -7680 -5295 -5182 1817 12633 17066 12885 4117 -4029 -4875 -2756 196 -5598 -11298
3386 -11298 -9602 -12611 -22934 -14051 -8441 -10023 -22965 -16605 -12319 4064 14414 8915 3721 7696
3372 7696 2545 10400 4581 -118 -10429 -22657 -20978 -11819 -6864 -8578 -4228 -13820 2598 716
3358 716 13535 21404 16706 1213 -324 -3322 -91 -10181 -10849 -15775 -23393 -20554 -7184 1678
3344 1678 3921 2096 10390 10861 7136 13474 10734 3902 -9519 -8948 -13765 -7299 -9864 -7705 -7365
3329g365M293n082R284R347N477r185r520P57k745R860M515q87j5387q072P809
3314f901K384n158O397p493p996o625J7993R025j523M89L423j0667K719J0104
3300F171P89j3355j254j11p333L096N394k476m081LK576P979L871P183N475o097
3284G830j7193K967k131j2817p064K217M850M033O760J1291j604K357R768K76
3270A1540l706O386j0666m431j3969p142o224N505O557n60M666N413K573P731
3256C673K836J53l347J507P914n988P40j305l27j399l874l300m24q683l493O012
3240i305J0523K363o156P515J442R23P552N01r991m648l747J26j7185j417n629
3225b7133k096k3K0413J3881J922R575L569j85k045N055J981j3777j4351j5232
$$ plain form
3329 -7365 -3072 -8154 1130 10477 15954 6769 -2751 -1994 -4739 5121 9636 8749 -6638 -14710 -6901
3314 -6901 -4517 -9675 -3278 -10771 -18767 -25392 -7399 1626 103 592 4015 -6652 -3933 6171
3300 6171 6960 -6395 -7649 -7760 -15093 -11997 -6603 -9079 -13160 -13157 -10581 -2602 1269 8452 13927 7830
3284 7830 -9363 -6396 -8527 -21344 -28408 -26191 -21341 -17308 -10548 743 -861 1496 11264 11540
3270 11540 7834 14220 3554 -877 -14846 -21988 -28212 -22707 -16150 -16710 -12044 -6631 -4058 3673
3256 3673 6509 6662 3315 4822 12736 6748 7488 6183 5856 4457 583 -2717 -3141 -11824 -15317 -9305
3240 -9305 1218 3581 -2575 4940 6382 7305 14857 15358 5367 719 -3028 -2902 -20087 -21504 -27133
3225 -27133 -29229 -29252 -8839 5042 6964 16539 20108 19923 17878 22933 24914 11137 -3214 -18446
3211a8446q164L048N083L859m323k530J0120O995J2788J4939n684q372j5360Q546
3197B499m785n61o097l082j8987j062J6115R498k411j060J441N878J991K1978
3183B1355n638m169j0329m517n791K080Q376L2q297n753K818J1226J680l697J467
3168H43m511N082N60Q835J775O538o130j2633j1660P925J875n601j2887J7n283
3153b5255O082J4958N973n972l94M601L309L967m538J345k1967o258k354O89O784
3138a9030J2075n529k021L719J2778P720m982P022l477q464q966k751l361l662
3124a8929q187q84O165M584O919J5180o754J1797J68k233o94J1074j5215j2715
3110i724j0791Q962m488J48m6L062L593K792J4426J3126M528q637q819j6442J904
$$ plain form
3211 -18446 -26610 -23562 -18479 -14620 -18943 -21473 -11353 -4358 8430 23369 17685 9313 -6047 2499
3197 2499 -2286 -2847 -8944 -12026 -31013 -32075 -15960 -6462 -8873 -9933 -8492 -2614 -623 21355
3183 21355 15717 11548 1219 -3298 -9089 -7009 1367 1399 -6898 -12651 -9833 1393 3073 -624 843
3168 843 -3668 1414 1974 10809 12584 19122 12992 359 -11301 -3376 -1501 -7102 -19989 -19972 -25255
3153 -25255 -19173 -4215 1758 -4214 -4608 -7 3302 7269 2731 4076 -17891 -24149 -26503 -25814 -19030
3138 -19030 -6955 -12484 -14505 -10786 1992 9712 4730 11752 8275 -189 -9155 -11906 -15267 -18929
3124 -18929 -27116 -28000 -21835 -17251 -10332 4848 -1906 9891 10059 7826 7132 18206 2991 -9724
3110 -9724 -20515 -11553 -16041 -15893 -15939 -12877 -9284 -6492 7934 21060 25588 16951 8132 -8310 -6406
3095f406K529n453j2996R14K349K072n418J4540L370p158p020J1450K470j461
3081f218j391J125L625R40n054Q329j051j016q79n013j676M559k767o847O110
3066g224J741N445K518J2691K276o137q135J1483o203j7822n965K0j1131L86O901
3051a9156p063O838J3707N697N455P735k566p637M17O273k200j7002j4435M571
3037a9366j0477N660J2830J1430k088M658J774j836L334P916N817k2785j7098
3024b0231N268M044M82P09J52J16K587R059R12l103L9O756j2613j0330M580Q04
3008a0769j184N942k062M619J101Q271J1580r989P5Q976n229p030m642k656j3624
2993a6621n500Q21K997J5689j53m48j100J1319R415R758L75J164j0541j1983m560
$$ plain form
3095 -6406 -3877 -9330 -22326 -21412 -19063 -16991 -22409 -7869 -4499 -11657 -18677 -7227 -4757 -6218
3081 -6218 -7609 -6484 -2859 -1919 -6973 1356 305 -711 -1590 -6603 -8279 -3720 -6487 -13334 -7224
3066 -7224 -5483 -38 2480 15171 17447 11310 3175 14658 8455 -9367 -15332 -15312 -26443 -26057 -19156
3051 -19156 -26219 -19381 -5674 23 5478 13213 10647 3010 3427 9700 7500 -9502 -23937 -19366
3037 -19366 -29843 -24183 -11353 77 -2011 2647 4421 2585 5919 13835 19652 -3133 -20231
3024 -20231 -14963 -10919 -10437 -9728 -9576 -9460 -6873 2186 3098 -5 34 6790 -5823 -16153 -11573 -10769
3008 -10769 -11953 -6011 -8073 -3454 -2353 5918 17498 7509 7584 16560 11331 4301 -341 -2997 -16621
2993 -16621 -22121 -21300 -18303 -2614 -2767 -3215 -4315 7004 16419 26177 26552 27716 17175 5192 632
2978F32J384m28j0558j328l038l568N349R960L871Q77L315j916r866J3140K932
2963A0758J801k477j4254n67r358l837j027k366m09n88J4407Q569J715J2445O904
2948B1716m910o441M783k937j2331j82j4669j3399K94Q542K056L619P620O255
2934A6K824j412N559K99j960M98M848q329m669k314j0353k663l721Q07P568P509
2918e493M838Q774j679j1165J0236J342n138j042J738m779j3843J014L107r925
2904b2015q8Q07R051M511P607J3788j0434m063J398r255j387M787p866l917n131
2889b2207j290M905L601Q559N196n500m352k528J6823O960j475j0748o440O195
2875b301O624j934m721m445n407n971P466O629J0029j119o404O682m125J1076
$$ plain form
2978 632 2016 1588 -8970 -10298 -13336 -16904 -11555 -1595 2276 3153 6468 4552 -5314 7826 10758
2963 10758 12559 10082 -4172 -4739 -14097 -17934 -18961 -21327 -21736 -22324 -7917 652 2367 14812 21716
2948 21716 16806 10365 15148 12211 -120 -302 -14971 -28370 -28076 -19534 -17478 -13859 -6239 16
2934 16 2840 1428 6987 7286 5326 5824 10672 2343 -2326 -4640 -14993 -17656 -21377 -20570 -13002 -5493
2918 -5493 -655 8119 6440 -4725 5511 6853 1715 673 2411 -2368 -16211 -15197 -12090 -22015
2904 -22015 -22103 -21296 -12245 -7734 -127 13661 3227 -836 562 -8693 -10080 -5293 -13159 -17076 -22207
2889 -22207 -23497 -18592 -14991 -6432 -1236 -6736 -11088 -13616 3207 10167 8692 -2056 -8496 -2301
2875 -2301 4323 2389 -2332 -6777 -12184 -18155 -10689 -4060 5969 4850 -1554 5128 1003 12079
2861A2079J978r276j7578m511q212k564R161j547K112K114N161J5834Q023L032
2847A5806M228j7455q039m668J0597J898k2071j2083q66N154J0197J3153K298
2834a851M122K191L932P188M415Q62q773n139j3033j1813J740M686K637j0987
2820a9823N615N659O966Q370N767l813M956j2157N410L995j2514l223l635j5013
2806b3440N138N391j3835O256K766N6O72J4925J2837L382J876k373r234O17p419
2791b385j0933j313n042j871P715m48M91N81Q760P846M444L696n697J135L785
2776A0764j2691m288P33p604l839n257l894J6618J3417J388j491J301J3829J807
2762B0793j110n485j6801k854r145q438K655L283n373k764P580J4939J082J0971
$$ plain form
2861 12079 14057 4781 -12797 -17308 -25520 -28084 -18923 -20470 -18358 -16244 -11083 4751 12774 15806
2847 15806 20034 2579 -5460 -10128 469 2367 -19704 -31787 -32653 -27499 -17302 -4149 -1851
2834 -1851 2271 4462 8394 15582 19997 20859 12086 6947 -6086 -17899 -16159 -11473 -8836 -19823
2820 -19823 -14208 -8549 -1583 6787 12554 8741 13697 1540 6950 10945 -1569 -4792 -8427 -23440
2806 -23440 -18302 -12911 -26746 -20490 -17724 -17668 -16996 -2071 10766 14148 16024 13651 4417 5034 -2385
2791 -2385 -13318 -14631 -19673 -21544 -13829 -14277 -13786 -13205 -4445 3401 7845 11541 5844 6979 10764
2776 10764 -1927 -6215 -5482 -13086 -16925 -22182 -26076 -9458 3959 5347 3856 5157 18986 20793
2762 20793 19683 14198 -2603 -5457 -14602 -23040 -20385 -17102 -22475 -25239 -17659 -2720 -1638 9333
2748I333P148j3576K89J0864n804k4984n643m380q849m4J3761Q744p370O228J1574
2733b709P506R549N165J1547j0676j6024p855o519n701O840o850p784k389J6490
2719i410J3122o547N911M687p214j114Q570O700r516r977K762n657k994r34J158
2704a0453p49l970N004L715Q05P480J711r531M588J7418k596p285J84N356l743
2689G934j2550K944r185j4898K210K225J469P977L984O325k371N718N913O028
2675A3723R139m761l161k0286q017n791l427J405J009l233K208Q257J8189J5723
2661B0977L533p292N398j6741o416Q355j3136j8994P49J073K614L904R140J2100
2647E264j0290J68J4239l305o004M109J551q994j5965P675k614k588N974P085
$$ plain form
2748 9333 16481 2905 3194 14058 8254 -16730 -22373 -26753 -35602 -35646 -21885 -13141 -20511 -14283 -2709
2733 -2709 4797 14346 19511 31058 20382 4358 -3497 -10016 -15717 -8877 -15727 -23511 -25900 -9410
2719 -9410 3712 -2835 3076 7763 549 -565 8005 14705 5189 -4788 -2026 -7683 -10677 -11611 -10453
2704 -10453 -11202 -15172 -10168 -6453 -5648 1832 3543 -5988 -1400 16018 13422 6137 6321 11677 7934
2689 7934 -4616 -1672 -10857 -25755 -23545 -21320 -19851 -11874 -7890 -1565 -3936 1782 7695 13723
2675 13723 22862 18101 14940 -5346 -13363 -19154 -22581 -21176 -20167 -23400 -21192 -12935 5254 20977
2661 20977 24510 17218 22616 5875 -541 7814 -5322 -24316 -23567 -22494 -19880 -15976 -6836 5264
2647 5264 -5026 -4858 9381 6076 72 4181 5732 -3262 -19227 -11552 -14166 -16754 -10780 -3695
2633c695j5398R604M447P913O976N251L261j1243n191J475n408j1304l134K859
2619a3587m125l866J4429O977o623K30R335j1308P023N878j945q43p20l481R854
2604G228n577J435o151o451p115M113M588K598R989o600K991m569N360o29l883
2589b673j574J0548q597M287p385k898o408k540N975m03O180P219k050k734L407
2574C54O887J835j3114j517j2431p678R709J6318r548p77O161N345q10j402P389
2559F721m560j5096N417Q537K127j0025P582K863j1248l349P625J870m663J1137
2545D938o740L833O856p206o171j293m98P614q142K052K97l980l568Q952M912
2530A856o593j047Q889j530m596p755J1714O527j5028KM798L315l109o80k320
$$ plain form
2633 -3695 -19093 -9489 -5042 2871 9847 15098 18359 7116 1925 3400 -2008 -13312 -16446 -13587
2619 -13587 -17712 -21578 -7149 -172 -6795 -6565 2770 -8538 -1515 4363 2418 1575 855 -2626 7228
2604 7228 1651 3086 -3065 -9516 -16631 -12518 -7930 -5332 4657 -1943 1048 -3521 1839 1210 -2673
2589 -2673 -4247 6301 -2296 1991 -5394 -8292 -14700 -17240 -11265 -11668 -5488 1731 -319 -3053 354
2574 354 7241 9076 -4038 -5555 -17986 -25664 -15955 363 -9185 -9962 -3801 1544 734 -668 6721
2559 6721 2161 -12935 -7518 1019 3146 -6879 703 3566 -7682 -11031 -3406 -1536 -6199 4938
2545 4938 -1802 2031 8887 1681 -4490 -5783 -6281 1333 -6809 -4757 -4460 -8440 -12008 -3056 1856
2530 1856 -4737 -5784 3105 1575 -3021 -10776 938 7465 -7563 -7561 -2763 552 -2557 -3237 -5557
2515e557J533j851O684p029L325R557k290j55j79m724r971j94R865k334k417J991
2499c746r1J817K767M613n212j0568k976L727j037P087J551q559Q54J260J2478
2484C965r0k991P833m376n240Q60J822r825n028O193J25j0346K116J6358j427
2469e1k948J5130L898j2579K932N830j1662j2077m01N21k011p106J1573O205l921
2454f667J1429J1848j984m586K091j1968m816n53j64J020n828J358N320L766k985
2439b719N917P519j690k655L581K975j2742q957K664o692j209N364L70K215r94
2424g053k3Q708m425l443J775j0856j065K541Q554m849L002J0170P128j567J3587
2409B2184R089k252l379j9523n792k393J413j7333p757n06J866J926J6518J6399
$$ plain form
2515 -5557 -4024 -5875 809 -6220 -2895 6662 4372 4217 4038 -686 -10657 -10851 -986 -3320 -5737 -3746
2499 -3746 -3837 -2020 747 5360 148 -10420 -13396 -9669 -10706 -3619 -2068 -10627 -9773 -8513 3965
2484 3965 3875 884 8717 4341 -899 -39 1783 -8042 -13070 -6877 -6752 -17098 -14982 1376 -51
2469 -51 -2999 12131 16029 3450 6382 12212 550 -11527 -11928 -11407 -13418 -20524 -8951 -2746 -6667
2454 -6667 4762 16610 14626 10040 12131 163 -4653 -5206 -5370 -4350 -10178 -8820 -3500 266 -2719
2439 -2719 3198 10717 9027 6372 9953 12928 186 -8771 -6107 -12799 -14008 -8644 -8274 -6059 -7053
2424 -7053 -7076 1632 -2793 -6236 -4461 -15317 -16382 -13841 -5287 -10136 -7134 3036 10164 8597 22184
2409 22184 31273 29021 25642 6119 327 -2066 -653 -17986 -25743 -26249 -24383 -22457 -5939 10460
2395A0460N397l279M498J415K868m570n693k2049j9367q034O521k063J771J6981
2381a5144N691Q263R253J4762m072J0625k084j3102k4294Q905J557j6647j1131
2368b7418J0731P52n911J0024K0806r821o658J0472J3280L109p01R54j5765k3623
2354a9769L415O106j1178J538L17L76p781J7077J8432L675r821m714m94k332R011
2339C858O771j3793j2954J873K346J731J1217j123J87m13L261J1272l951r98o565
2324B719o729j1614K955R406n878o046O610k608Q5J1844O242l5L293m893j1283
2309e932J732R746O213k0609n974k292M093N983K1602r015j6311Q64J8319J25
2295H544m968J758n718n964n566Q738M157p411j736q36j4680L815J8869J0399
$$ plain form
2395 10460 15857 12578 17076 18491 21359 16789 11096 -10953 -30320 -38354 -31833 -33896 -32125 -15144
2381 -15144 -9453 -1190 8063 22825 18753 29378 27294 14192 -10102 -1197 360 -16287 -27418
2368 -27418 -16687 -15935 -21846 -11822 8984 -837 -7495 2977 16257 19366 18665 19619 3854 -19769
2354 -19769 -16354 -10248 -21426 -19888 -19571 -19195 -26976 -9899 8533 12208 2387 -2327 -2821 -5153 3858
2339 3858 10629 -3164 -16118 -14245 -11899 -10168 1049 -74 113 -300 2961 14233 10282 9284 2719
2324 2719 -4010 -15624 -12669 -3263 -9141 -15187 -8577 -11185 -11100 744 6986 6951 10244 5351 -5932
2309 -5932 -4200 5546 11759 -8850 -14824 -17116 -13023 -7040 14562 5547 -10764 -9900 8419 8544
2295 8544 3576 5334 -384 -6348 -11914 -3176 981 -6430 -8166 -9002 -23682 -19867 -998 9401
2281I401k900J852l354m054L610Q142k778j4839q508P358K317o032M915J136l221
2266f955m30R590J6140n710p017O509m687j0468P869L892q769Q69J380m172l317
2251e276K976l705p211P701N633n205o918N111K273r72M056N798M174k194o041
2236B00J299j1112J3469N311k179n350k459k486m5L992J1732m13q025n043l771
2221d880K13m60N557n239r611P449J4157l96O01k870J285j4834O666J0712o825
2206A525j0630r994K398M683J457R435J2135K255M905K763j0615l626L111j2212
2192b410j4824M905O020L387j0591P172J098q254R836J1200J490j0170Q340L804
2178A1003j0820o513R549J538j0880k503o954N930k994L826r34n514N113P449
$$ plain form
2281 9401 6501 8353 4999 945 4555 12697 9919 -4920 -13428 -6070 -3753 -9785 -4870 -3734 -6955
2266 -6955 -7385 2205 18345 12635 5618 12127 7440 -3028 4841 8733 -36 833 2213 -1959 -5276
2251 -5276 -2300 -6005 -13216 -5515 118 -5087 -12005 -6894 -4621 -5593 -1537 4261 8435 6241 200
2236 200 1499 -9613 3856 9167 6988 1638 -821 -3307 -3352 640 12372 11959 3934 -1109 -4880
2221 -4880 -4667 -5127 430 -4809 -14420 -6971 7186 6790 7391 4521 5806 -9028 -2362 8350 1525
2206 1525 -9105 -19099 -16701 -12018 -10561 -1126 11009 13264 18169 20932 10317 6691 9802 -2410
2192 -2410 -17234 -12329 -6309 -2922 -13513 -6341 -5243 -13497 -3661 7539 9029 -1141 7199 11003
2178 11003 183 -6330 3219 4757 -6123 -8626 -15580 -9650 -12644 -8818 -9752 -15266 -10153 -2704
2164b704N900J2243m008n89L773k949O030j3852j1834p864j1367K21Q632Q717
2150i651J791O819K0205K742K826J0717r079j6066k002n734j2932p550j0901J1170
2136a7645K961o356J2491J5228R630N429l434p897j543n748Q34j3430r697M574
2122a4603l794q71J5093P788l054L911Q037K257l645L936j720j3826n830m807
2108a1128M492N547L767j810k108L779J0184J327Q130J030J216j6500j7206L724
2094e556L506m060n54m084L777J0562O536R89o844o906R930n371M067M974q503
2079B463o696j553L234k769J852L689M088j0728K017m858L784L814o743m643k788
2064a5837K178J1735k396j237K613n997M901O614J5522o689j4309M18N314n875
$$ plain form
2164 -2704 3196 15439 11431 10842 14615 11666 17696 3844 -7990 -15854 -27221 -27000 -18368 -9651
2150 -9651 -7860 -1041 19164 21906 24732 35449 26370 10304 8302 2568 -10364 -17914 -28815 -17645
2136 -17645 -14684 -21040 -8549 6679 16309 21738 18304 10407 8864 3116 3950 -9480 -19177 -14603
2122 -14603 -18397 -19268 -4175 3613 559 4470 12507 14764 11119 15055 13335 -491 -6321 -11128
2108 -11128 -6636 -1089 2678 868 -1240 2539 12723 14050 22180 23210 24426 7926 -9280 -5556
2094 -5556 -2050 -6110 -6664 -10748 -6971 3591 10127 11116 4272 -2634 7296 1925 5992 10966 2463
2079 2463 -4233 -5786 -2552 -5321 -3469 220 4308 -6420 -4403 -9261 -5477 -1663 -8406 -13049 -15837
2064 -15837 -13659 -1924 -4320 -5557 -2944 -8941 -4040 2574 18096 11407 -2902 -2484 2830 -3045
2050c045O22R683p222j2780k242N105J207J1538L597k564j2267M640J4141J0807
2036B1220o721K053p827j2007K834J0844m387q273j654l06n486R229J5183P670
2022B2372j3215k030N724o679L382N986q256j3228R12K297M575j615j499l305
2008d579M999J0198P834o249J434J465m045j3666K963N58j2508n02N480l147k545
1993a2310K0345j175o120K462J690m604m266K829O636k3262q583J8281R059j926
1979i44M579P65q945m465J9597M333q914n026n224j944j802J2681N919j9745l862
1964a2997K5865l151l479K211M257j2180l309j247n774j3649J2088Q618k1278
1951b4025l493K4014J0697L984Q172J821j4473j0436P935n792j3273K626k770
$$ plain form
2050 -3045 -2423 7260 38 -12742 -14984 -9879 -8672 2866 6463 3899 -8368 -3728 10413 21220
2036 21220 14499 16552 8725 -3282 -448 10396 6009 -2264 -3918 -4224 -9710 -481 14702 22372
2022 22372 9157 7127 12851 6172 9554 15540 7284 -5944 -5032 -2735 1840 225 -1274 -4579
2008 -4579 420 10618 18452 12203 13637 15102 11057 -2609 354 912 -11596 -12098 -6618 -9765 -12310
1993 -12310 8035 6860 740 3202 4892 288 -3978 -1149 5487 -17775 -26358 -8077 982 -944
1979 -944 3635 4400 -4545 -9010 10587 14920 6006 980 -4244 -6188 -7990 4691 10610 -9135 -12997
1964 -12997 12868 9717 6238 8449 12706 526 -2783 -4030 -9804 -23453 -11365 -2747 -24025
1951 -24025 -27518 -3504 7193 11177 19349 21170 6697 -3739 4196 -1596 -14869 -12243 -15013
1938a5013k012n343J1664N076m782K0825P326Q9J512J421q110j2416K710K585
$$ plain form
1938 -15013 -17025 -22368 -10704 -5628 -10410 10415 17741 17830 19342 20763 12653 237 2947 5532
$$ [...]
##END NTUPLES=NMR SPECTRUM
##END=
