##TITLE=1H_33-2025
 200.13MHz, CDCl3,
 8 sc
 
 3.3.2025
##JCAMPDX= 6.0         $$ Bruker NMR JCAMP-DX V2.0
##DATA TYPE= NMR FID
##DATA CLASS= NTUPLES
##ORIGIN= UXNMR, Bruker Analytische Messtechnik GmbH
##OWNER= pz
$$ XWIN-NMR		Version 3.5
$$ Mon Mar  3 13:55:00 2025 Russian Standard Time (UT+4h)  she@DPX200
##.OBSERVE FREQUENCY= 200.1313
##.OBSERVE NUCLEUS= ^1H
##.DELAY= (6, 6)
##.ACQUISITION MODE= SIMULTANEOUS
##.ACQUISITION SCHEME= undefined
##.AVERAGES= 8
##.DIGITISER RES= 18
##SPECTROMETER/DATA SYSTEM= spect
##.PULSE SEQUENCE= zg30
##.SOLVENT NAME= CDCl3
##.SHIFT REFERENCE= (INTERNAL, CDCl3, 0, 14.3821)
##AUDIT TRAIL= $$ (NUMBER, WHEN, WHO, WHERE, WHAT)
$$ ##TITLE= Audit trail, XWIN-NMR		Version 3.5
$$ ##JCAMPDX= 5.01
$$ ##ORIGIN= Bruker BioSpin GmbH
$$ ##OWNER= she
$$ F:/spectra/data/she/nmr/H-C/1/audita.txt
$$ ##AUDIT TRAIL=  $$ (NUMBER, WHEN, WHO, WHERE, WHAT)
(   1,<2025-03-03 13:53:54.35 +0400>,<she>,<DPX200>,
      <created by zg, POWCHK disabled, PULCHK disabled
       configuration hash MD5:
       00 E9 B6 7A A2 85 ED C7 34 08 36 98 17 FE 4E 26
       data hash MD5: 16K
       1C B9 79 93 95 CE F3 DD 96 08 7F 51 66 9D DC E1>)
$$ ##END=
$$ 
$$ hash MD5
$$ 61 2B A6 BE 4E A1 F3 54 93 F5 31 C1 DD 94 9D 4B
##$RELAX= 
##$RELAX= 
##$RELAX= 
##$RELAX= 
##$RELAX= 
##$RELAX= 
$$ Bruker specific parameters
$$ --------------------------
##$DU= <F:/spectra>
##$EXPNO= 1
##$NAME= <H-C>
##$PROCNO= 1
##$TYPE= <nmr>
##$USER= <she>
##$AMP= (0..31)
100 100 100 100 100 100 100 100 100 100 100 100 100 100 100 100 100 100 
100 100 100 100 100 100 100 100 100 100 100 100 100 100 
##$AQSEQ= 0
##$AQ_mod= 1
##$AUNM= <au_zg>
##$AUTOPOS= <>
##$BF1= 200.13
##$BF2= 200.13
##$BF3= 200.13
##$BF4= 200.13
##$BF5= 200.13
##$BF6= 200.13
##$BF7= 200.13
##$BF8= 200.13
##$BYTORDA= 1
##$CFDGTYP= 0
##$CFRGTYP= 5
##$CHEMSTR= <none>
##$CNST= (0..31)
1 1 145 1 1 1 1 1 1 1 1 1 1 1 1 1 1 1 1 1 1 1 1 1 1 1 1 1 1 1 1 1 
##$CPDPRG= <>
##$CPDPRG1= <>
##$CPDPRG2= <>
##$CPDPRG3= <>
##$CPDPRG4= <mlev>
##$CPDPRG5= <mlev>
##$CPDPRG6= <mlev>
##$CPDPRG7= <mlev>
##$CPDPRG8= <mlev>
##$CPDPRGB= <>
##$CPDPRGT= <>
##$D= (0..31)
0 0.7 0 0 0 0 0 0 0 0 0 0.03 0 0 0 0 0 0 0 0 0 0 0 0 0 0 0 0 0 0 0 0 
##$DATE= 1740995633
##$DBL= (0..7)
120 120 120 120 120 120 120 120 
##$DBP= (0..7)
150 150 150 150 150 150 150 150 
##$DBP07= 0
##$DBPNAM0= <>
##$DBPNAM1= <>
##$DBPNAM2= <>
##$DBPNAM3= <>
##$DBPNAM4= <>
##$DBPNAM5= <>
##$DBPNAM6= <>
##$DBPNAM7= <>
##$DBPOAL= (0..7)
0.5 0.5 0.5 0.5 0.5 0.5 0.5 0.5 
##$DBPOFFS= (0..7)
0 0 0 0 0 0 0 0 
##$DE= 6
##$DECBNUC= <off>
##$DECIM= 32
##$DECNUC= <off>
##$DECSTAT= 4
##$DIGMOD= 1
##$DIGTYP= 9
##$DL= (0..7)
0 120 120 120 120 120 120 120 
##$DP= (0..7)
150 150 150 150 150 150 150 150 
##$DP07= 0
##$DPNAME0= <>
##$DPNAME1= <>
##$DPNAME2= <>
##$DPNAME3= <>
##$DPNAME4= <>
##$DPNAME5= <>
##$DPNAME6= <>
##$DPNAME7= <>
##$DPOAL= (0..7)
0.5 0.5 0.5 0.5 0.5 0.5 0.5 0.5 
##$DPOFFS= (0..7)
0 0 0 0 0 0 0 0 
##$DQDMODE= 0
##$DR= 18
##$DS= 0
##$DSLIST= <SSSSSSSSSSSSSSS>
$$ [...]
##$SUBNAM0= <"">
##$SUBNAM1= <"">
##$SUBNAM2= <"">
##$SUBNAM3= <"">
##$SUBNAM4= <"">
##$SUBNAM5= <"">
##$SUBNAM6= <"">
##$SUBNAM7= <"">
##$SUBNAM8= <"">
##$SUBNAM9= <"">
##$SW= 18.0517328524113
##$SWIBOX= (0..15)
0 0 2 0 0 0 0 0 0 0 0 0 0 0 0 0 
##$SW_h= 3612.71676300578
##$TD= 16384
##$TD0= 1
##$TE= 0
##$TE2= 300
##$TE3= 300
##$TEG= 300
##$TL= (0..7)
0 120 120 120 120 120 120 120 
##$TP= (0..7)
150 150 150 150 150 150 150 150 
##$TP07= 0
##$TPNAME0= <>
##$TPNAME1= <>
##$TPNAME2= <>
##$TPNAME3= <>
##$TPNAME4= <>
##$TPNAME5= <>
##$TPNAME6= <>
##$TPNAME7= <>
##$TPOAL= (0..7)
0.5 0.5 0.5 0.5 0.5 0.5 0.5 0.5 
##$TPOFFS= (0..7)
0 0 0 0 0 0 0 0 
##$TUNHIN= 0
##$TUNHOUT= 0
##$TUNXOUT= 0
##$USERA1= <user>
##$USERA2= <user>
##$USERA3= <user>
##$USERA4= <user>
##$USERA5= <user>
##$V9= 5
##$VALIST= <valist>
##$VCLIST= <CCCCCCCCCCCCCCC>
##$VD= 0
##$VDLIST= <DDDDDDDDDDDDDDD>
##$VPLIST= <PPPPPPPPPPPPPPP>
##$VTLIST= <TTTTTTTTTTTTTTT>
##$WBST= 1024
##$WBSW= 4
##$XGAIN= (0..3)
0 0 0 0 
##$XL= 0
##$YL= 0
##$YMAX_a= 500949
##$YMIN_a= -570911
##$ZGOPTNS= <>
##$ZL1= 120
##$ZL2= 120
##$ZL3= 120
##$ZL4= 120
##$ABSF1= 10
##$ABSF2= 0
##$ABSG= 5
##$ABSL= 3
##$ALPHA= 0
##$AQORDER= 0
##$ASSFAC= 0
##$ASSFACI= 0
##$ASSFACX= 0
##$ASSWID= 0
##$AUNMP= <proc_1d>
##$AZFE= 0.1
##$AZFW= 0.1
##$BCFW= 1
##$BC_mod= 2
##$BYTORDP= 1
##$COROFFS= 0
##$CY= -3
##$DATMOD= 1
##$DC= 2
##$DFILT= <>
##$DTYPP= 0
##$F1P= 0
##$F2P= 0
##$FCOR= 0.5
##$FTSIZE= 0
##$FT_mod= 4
##$GAMMA= 1
##$GB= 0.15
##$INTBC= 1
##$INTSCL= 1
##$ISEN= 128
##$LB= 0.25
##$LEV0= 0
##$LPBIN= 0
##$MAXI= 10000
##$MC2= 0
##$MEAN= 0
##$ME_mod= 0
##$MI= 1.114404
##$NCOEF= 0
##$NC_proc= 0
##$NLEV= 6
##$NOISF1= 3.799351
##$NOISF2= 2.8
##$NSP= 1
##$NTH_PI= 0
##$NZP= 0
##$OFFSET= 14.38212
##$PC= 1
##$PHC0= -464.5904
##$PHC1= 11.99222
##$PH_mod= 1
##$PKNL= yes
##$PPARMOD= 0
##$PSCAL= 0
##$PSIGN= 0
##$REVERSE= no
##$SF= 200.129724274929
##$SI= 16384
##$SIGF1= 3
##$SIGF2= 2
##$SINO= 400
##$SIOLD= 16384
##$SREGLST= <1H.CDCl3>
##$SSB= 0
##$STSI= 0
##$STSR= 0
##$SW_p= 3205.1282051282
##$SYMM= 0
##$S_DEV= 0
##$TDeff= 0
##$TDoff= 0
##$TI= <>
##$TILT= no
##$TM1= 0
##$TM2= 0
##$TOPLEV= 0
##$USERP1= <user>
##$USERP2= <user>
##$USERP3= <user>
##$USERP4= <user>
##$USERP5= <user>
##$WDW= 1
##$XDIM= 8192
##$YMAX_p= 0
##$YMIN_p= 0
$$ End of Bruker specific parameters
$$ ---------------------------------
##NTUPLES= NMR FID
##VAR_NAME=  TIME,          FID/REAL,        FID/IMAG
##SYMBOL=    X,             R,               I
##VAR_TYPE=  INDEPENDENT,   DEPENDENT,       DEPENDENT
##VAR_FORM=  AFFN,          ASDF,            ASDF
##VAR_DIM=   8192,          8192,            8192
##UNITS=     SECONDS,       ARBITRARY UNITS, ARBITRARY UNITS
##FACTOR=    0.0002768,     1,               1
##FIRST=     0,             0,               0
##LAST=      2.2672688,     0,               0
##MIN=       0,             -570911,         0
##MAX=       2.2672688,     500949,          0
$$ Real data points
##PAGE= N=1
##DATA TABLE= (X++(R..R)), XYDATA
$$ plain form
0 0 0 0 0 0 0 0 0 0 0 0 0 0 0 0 0 -4 7 -4 8 -8 8 -8 8 -12 16 -16 18 -20 24 -28 29 -34 36 -43 46 -51 59 -62 69
39 69 -77 85 -93 105 -114 125 -137 150 -165 180 -199 219 -242 268 -298 331 -374 420 -479 549 -639
60 -639 753 -907 1120 -1429 1904 -2701 4198 -7577 18178 -113305 -570911 -39956 330525
73 330525 -109218 -173517 244456 171588 -187885 -17760 184409 -191940 -317116 182142
83 182142 320079 -53094 -150391 53215 83215 -95876 -165028 -23381 86276 111843 122745
94 122745 1669 -148054 -115600 15782 90918 18380 -78321 36087 167939 50861 -142360
105 -142360 -178481 -22495 125186 60811 -12113 31898 5769 -36293 -12922 -56818 -105782
116 -105782 9982 196959 143030 -131397 -147953 71924 48077 -78292 -18941 27604 28314
$$ packed form
0@%%%%%%%%%%%%%%%mJ1j1J2j6J6j6J6k0K8l2L4l8M4n2N7o3P0p9Q9r7J10j21J31
39F9j46J62j78J98k19K39k62K87l15L45l79M18m61N10n66O29p05P94q99J028j188
60f39J392j660K027k549L333m605O899j1775K5755j31483m57606N30955L70481
73C30525m39743o4299M17973p2868l59473J70125K02169l76349j25176M99258
83A82142J37937l73173r7297K03606L0000j79091o9152J41647J09657K5567J0902
94A22745j21076j49723L2454J31382P5136p2538r6701J14408J31852j17078j93221
105a42360l6121J55986J47681o4375p2924M4011k6129m2062K3371m3896m8964
116a05782J15764J86977n3929k74427j6556K19877k3847j26369N9351M6545P10
$$ plain form
127 28314 96361 70109 -114001 -188257 7543 152354 12629 -63268 43116 32886 -19052
138 -19052 171 -65652 -98972 51917 167309 50676 -124458 -63704 87777 17393 -85715
149 -85715 -26161 27418 49592 73455 9614 -95925 -112507 15222 127631 18741 -99031
160 -99031 2001 98029 30925 -77939 -93023 10534 79231 47851 14319 -35901 -56193
171 -56193 24115 47178 -36099 -76445 -5970 111359 83016 -86174 -110120 10775 59157
182 59157 25141 -23720 -25016 22324 37590 28029 -26005 -100193 -17665 116830 59721 -64168
194 -64168 -62379 24814 56372 -21847 -61103 -9461 17690 48552 52681 -50197 -91200 8811
206 8811 80421 28565 -66222 -41531 68966 56676 -28698 -49595 -36442 18167 67530 19105
$$ packed form
127B8314O8047k6252j84110p4256J95800J44811j39725p5897J06384j0230n1938
138a9052J9223o5823l3320J50889J15392j16633j75134O0754J51481p0384j03108
149h5715N9554N3579K2174K3863o3841j05539j6582J27729J12409j08890j17772
160i9031J01032R6028o7104j08864j5084J03557O8697l1380l3532n0220k0292
171e6193Q0308K3063q3277m0346P0475J17329k8343j69190k3946J20895M8382
182E9157l4016m8861j296M7340J5266r561n4034p4188Q2528J34495n7109j23889
194f4168J789Q7193L1558p8219l9256N1642K7151L0862M129j02878m1003J00011
206H811P1610n1856r4787K4691J10497j2290q5374k0897J3153N4609M9363m8425
$$ plain form
218 19105 -49070 -48156 17020 65710 -6483 -79610 -18293 54270 52174 -3200 -65677 -32636 46251
231 46251 46749 -1627 -47989 -29838 52159 50223 -28836 -55106 -18803 46980 54321 -28444 -59217
244 -59217 -9953 32854 42008 -13879 -58515 -2469 51373 32833 -25356 -63275 -1417 68632
256 68632 29850 -28118 -40078 -10118 43115 25372 -38045 -39549 7049 54624 33434 -53576
268 -53576 -58418 14194 40329 22800 -18382 -35639 14238 44440 10938 -41658 -56035 22691
280 22691 80378 10837 -49844 -24619 12669 24695 -6412 -35010 -11807 20670 46149 23858
292 23858 -58592 -62264 25728 54542 7180 -36586 -12256 48583 26335 -35469 -38552 -17407
304 -17407 21472 54080 14741 -35519 -30808 8519 31235 -19291 -55636 8708 60535 35923
$$ packed form
218A9105o8175R14O5176M8690p2193p3127O1317P2563k096n5374o2477L3041P8887
231D6251M98m8376m6362J8151Q1997j936p9059k6270L6303O5783P341q2765l0773
244e9217M9264M2807R154n5887m4636N6046N3842j8540n8189l7919O1858P0049
256F8632l8782n7968j1960K9960N3233j7743o3417j504M6598M7575k1190q7010
268e3576m842P2612K6135j7529m1182j7257M9877L0202l3502n2596j4377P8726
280B2691N7687o9541o0681K5225L7288J2026l1107k8598K3203L2477K5479k2291
292B3858q2450l672Q7992K8814m7362m3766K4330O0839k2248o1804l083K1145
304a7407L8879L2608l9339n0260M711L9327K2716n0526l6345O4344N1827k4612
$$ plain form
316 35923 -17999 -56298 -24858 29216 22405 156 -9857 -2705 35969 27311 -38803 -60574 -13513
329 -13513 53310 49931 -21869 -29942 9477 4489 -8431 -20108 -29205 13653 57717 36459 -26134
342 -26134 -59931 -10595 37998 7363 -17548 -1039 21240 39637 2326 -57742 -43271 8729
354 8729 38272 30549 -9025 -18769 3610 6951 -6662 -36750 -30781 43455 65509 5080 -35331
367 -35331 -31079 -407 16010 -6496 -11087 10221 25950 35508 -7497 -64931 -39208 22301 39616
380 39616 13124 -17111 323 21269 -5459 -24961 -28261 -16366 40399 60070 1301 -40088
392 -40088 -22272 13471 6912 -27965 -9182 29536 28071 18579 -13502 -54992 -29215 24775 31915
405 31915 3270 -15439 11923 30081 -10648 -38752 -26472 2455 42319 39433 -8027 -24631
$$ packed form
316C5923n3922l8299L1440N4074o811k2249j0013P152L8674q658o6114k1771M7061
329a3513O6823l379p1800q073L9419m988j2920j1677r097M2858M4064k1258o2593
342b6134l3797M9336M8593l0635k4911J6509K2279J8397l7311o0068J4471N2000
354H729K9543p723l9574r744K2379L341j3613l0088N969P4236K2054o0429m0411
367c5331M252L0672J6417k2506m591K1308J5729R558m3005n7434K5723O1509J7315
380C9616k6492l0235J7434K0946k6728j9502l300J1895N6765J9671n8769m1389
392d0088J7816L5743o559l4877J8783L8718j465r492l2081m1490K5777N3990P140
405C1915k8645j8709K7362J8158m0729k8104J2280K8927L9864k886m7460j6604
$$ plain form
417 -24631 -11079 4806 -515 -26873 -11985 33020 36616 10205 -27190 -45420 -8103 22943
429 22943 12797 -1393 -3381 18391 27242 -14982 -42391 -22031 12077 40728 23211 -17667
441 -17667 -14353 2761 315 -11608 -25815 -4416 34083 31304 3647 -27866 -34848 4485 21938
454 21938 -2165 -6933 8864 24235 17797 -22072 -37104 -12002 14477 31834 11878 -20001
466 -20001 -5329 11119 -3580 -19563 -22798 4142 35390 22983 -5060 -23832 -21751 10818
478 10818 15808 -11593 -7548 15160 25448 10165 -27606 -31909 -550 16324 18160 1744 -15689
491 -15689 2746 12809 -6155 -19773 -19284 8154 35811 15534 -14459 -18036 -5769 13374 4603
504 4603 -17116 -1824 18555 17761 3116 -24496 -25379 5293 16635 9310 -6469 -11692 10697
$$ packed form
417b4631J3552J5885n321k6358J4888M5005L596k6411l7395j8230L7317L1046
429B2943j0146j4190j988K1772Q851m2224k7409K0360L4108K8651j7517m0878
441a7667L314J7114k446j1923j4207K1399L8499k779k7657l1513o982L9333J7453
454B1938k4103m768J5797J5371o438l9869j5032K5102K6479J7357j9956l1879
466b0001J4672J6448j4699j5983l235K6940L1248j2407k8043j8772K081L2569
478A0818M990k7401M045K2708J0288j5283l7771m303L1359J6874J836j6416j7433
491a5689J8435J0063j8964j3618M89K7438K7657k0277k9993l577J2267J9143q771
504D603k1719J5292K0379p94j4645k7612q83L0672J1342p325j5779n223K2389
$$ plain form
517 10697 13873 -12031 -19271 -9917 12558 29183 5385 -17602 -10320 3139 11868 -2604 -19058
530 -19058 1604 19881 11701 -3550 -22218 -15850 12365 13292 -361 -9167 -5975 15276 12419
543 12419 -13834 -16568 -2132 15261 20729 -4572 -17826 -984 8531 7119 -6660 -16773 3836
556 3836 17732 5369 -7954 -18047 -6268 16982 8502 -7853 -8364 -560 14696 8816 -14800
569 -14800 -11582 5289 14589 11079 -12285 -16088 6159 10246 2181 -7689 -12850 5695 14463 -651
583 -651 -10600 -12167 2411 19846 4217 -12927 -6792 3624 13166 3543 -15432 -5284 11068
596 11068 10134 1704 -15026 -12700 8989 10418 532 -7707 -9784 7432 11784 -7616 -12079 -3703
610 -3703 9103 17642 92 -13491 -4457 3702 9186 526 -13924 780 15262 5392 -6828
$$ packed form
517A0697L176k5904p240R354K2475J6625k3798k2987P282J3459Q729j4472j6454
530a9058K0662J8277q180j5251j8668O368K8215R27j3653q806L192K1251k857
543A2419k6253k734J4436J7393N468k5301j3254J6842R515j412j3779j0113K0609
556C836J3896j2363j3323j0093J1779K3250q480j6355n11P804J5256n880k3616
569a4800L218J6871R300l510k3364l803K2247M087q065r870n161J8545Q768j5114
583f51r949j567J4578J7435j5629j7144O135J0416R542r623j8975J0148J6352
596A1068r34q430j6730K326K1689J429r886q239k077J7216M352j9400m463Q376
610c703J2806Q539j7550j3583R034Q159N484q660j4450J4704J4482r870j2220
$$ plain form
623 -6828 -16145 -8127 10534 7625 -334 -3820 -5598 7576 8588 -12041 -12905 2564 14507 14918
637 14918 -5355 -13442 -474 3214 2945 -2397 -9980 5276 16011 2364 -10574 -15439 -5336
650 -5336 12194 7429 -2561 -1715 389 8001 2447 -15471 -9902 7465 14215 11503 -6021 -12518
664 -12518 724 2314 -2405 -5296 -5430 10167 15364 -2079 -11749 -12959 -3907 12114 5986 -3790
678 -3790 1753 4839 6571 -2451 -17897 -6587 10863 12356 7750 -6330 -9708 2209 37 -6317
692 -6317 -5579 -1776 12895 14664 -4969 -12735 -9571 -466 10420 3283 -3955 4706 7476 4336 -6620
707 -6620 -17955 -3910 12484 9508 3701 -5015 -6698 2115 -2278 -8082 -4530 1015 13903 13678
721 13678 -6959 -12709 -5695 967 8058 371 -2981 8370 8054 -139 -9189 -16195 -2181 12491
$$ packed form
623f828r317Q018J8661k909p959l486j778J3174J012k0629q64J5469J1943M11
637A4918k0273q087J2968L688k69n342p583J5256J0735j3647j2938m865J0103
650e336J7530m765r990Q46K104P612n554j7918N569J7367O750k712j7524o497
664a2518J3242J590m719k891j34J5597N197j7443r670j210R052J6021o128r776
678c790N543L086J732r022j5446J1310J7450J493m606j4080l378J1917k172o354
692f317P38L803J4671J769j9633p766L164R105J0886p137p238Q661K770l140j0956
707f620j1335J4045J6394k976n807q716j683Q813m393n804L552N545J2888k25
721A3678k0637n750P014O662P091p687l352J1351l16q193r050p006J4014J4672
$$ plain form
735 12491 7493 1608 -4341 -3677 3799 -3561 -10460 -2605 4803 13657 10900 -8120 -11211 -2621 2247
750 2247 4236 -2750 -2185 10819 7935 -3238 -10158 -13383 -553 11296 4988 286 -2674 -1625
764 -1625 4190 -4423 -11733 -1251 8025 12785 7432 -8593 -8370 -122 474 831 -3411 -808 11437
779 11437 7179 -5987 -10505 -10600 1738 10394 2341 -1047 220 1147 4272 -5409 -12119 477 9415
794 9415 10697 4072 -8996 -5445 2604 -640 -2635 -3461 646 11399 5593 -7162 -9062 -6792 3098
809 3098 9403 -56 -1960 2395 3416 3069 -7061 -11262 2913 9504 6776 1021 -8084 -3477 3577
824 3577 -1917 -4212 -2991 1626 10942 3885 -8246 -6918 -3166 4447 7101 -2536 -2202 4804 4428
839 4428 1457 -7758 -9406 4777 8672 2817 -1505 -6237 -1007 4565 -2851 -5010 -2392 2460 9872
$$ packed form
735A2491m998n885n949O64P476p360o899P855P408Q854k757j9020l091Q590M868
750B247J989o986N65J3004k884j1173o920l225J2830J1849o308m702k960J049
764a625N815q613p310J0482R276M760n353j6025K23Q248N96L57m242K603J2245
779A1437m258j3166m518r5J2338Q656q053l388J267R27L125r681o710J2596Q938
794I415J282o625j3068L551Q049l244j995q26M107J0753n806j2755j900K270R890
809C098O305r459j904M355J021l47j0130m201J4175O591k728n755r105M607P054
824C577n494k295J221M617R316p057j2131J328L752P613K654r637L34P006l76
839D428k971r215j648J4183L895n855m322m732N230N572p416k159K618M852P412
$$ plain form
854 9872 2417 -8778 -4762 1138 4859 3922 -4684 -1315 6239 3591 -751 -7177 -7338 5811 7594
869 7594 -689 -3435 -4590 1598 5092 -3979 -5360 -256 3474 8186 690 -8780 -2695 3719 4693
884 4693 1158 -6282 -722 7324 1949 -2938 -6374 -4569 6544 5343 -3585 -4198 -2196 2853 4977
899 4977 -3873 -5433 928 5030 6480 -2777 -8982 1487 5955 1570 -857 -5168 -843 6527 1459
914 1459 -4628 -5722 -1096 7979 2798 -6254 -3152 -33 3602 4896 -4405 -4907 3594 4910 2773
929 2773 -4227 -7042 3176 6551 406 -3006 -5276 474 6098 -1676 -4838 -2180 997 7107 1829
944 1829 -7621 -3140 2845 4727 2961 -4831 -2664 5185 4016 -20 -5936 -5963 5738 6435 -1962 -3432
960 -3432 -3594 943 4992 -2642 -5730 12 4649 6641 -1039 -8120 -1117 3436 3682 1725 -5285 -1472
$$ packed form
854I872p455j1195M016N900L721r37q606L369P554k648m342o426j61J3149J783
869G594q283k746j155O188L494r071j381N104L730M712p496r470O085O414R74
884D693l535p440N560Q046n375m887l436J805J1113j201q928o13K002N049K124
899D977q850j560O361M102J450r257o205J0469M468m385k427m311M325P370n068
914A459o087j094M626R075n181r052L102L119L635J294r301n02Q501J316k137
929B773p000k815J0218L375o145l412k270N750N624p774l162K658L177O110n278
944A829r450M481N985J882j766p792K167P849j169m036n916k7J1701O97q397j470
960c432j62M537M049p634l088N742M637J992p680p081P003M553K46j957p010L813
$$ plain form
976 -1472 7532 2565 -4763 -5925 -3195 5731 5341 -2221 -3641 -2877 2255 4372 -4993 -5290 3679 5294
992 5294 4115 -1200 -7291 -961 4837 2418 -1638 -4822 1677 7819 -831 -6437 -4389 -1120 6088
1007 6088 4506 -3688 -3269 3 3192 2102 -5977 -4496 5394 6223 2811 -3043 -6550 1293 4409
1022 4409 -582 -2423 -2671 2679 7103 -2276 -7643 -3234 1138 6090 2674 -4681 -1446 2603 2790
1037 2790 347 -6535 -3437 6969 5853 365 -4226 -5244 2517 3507 -2996 -2892 -378 3784 5262
1052 5262 -3757 -7112 -1390 2557 5319 940 -5576 350 4943 1420 -2542 -6043 -934 7859 4169
1067 4169 -2252 -4398 -3318 3424 2923 -4633 -2921 1908 4589 3657 -4905 -6479 1102 3685 3762 -286
1083 -286 -4330 2358 5394 -477 -4428 -5464 956 7953 1644 -4096 -3359 -1317 3339 1417 -5905
$$ packed form
976a472R004m967p328j162K730Q926l90p562j420P64N132K117r365k97Q969J615
992E294j179n315o091O330N798k419m056l184O499O142q650n606K048L269P208
1007F088j582q194M19L272L189j090q079J481R890Q29l412n854l507P843L116
1022D409m991j841k48N350M424r379n367M409M372M952l416p355L235M049J87
1037B790k443o882L098J0406j116n488m591j018P761R90o503J04K514M162J478
1052E262r019l355N722L947K762m379o516N926M593l523l962l501N109Q793l690
1067D169o421k146J080O742n01p556J712M829K681r32q562j574P581K583P7m048
1083b86m044O688L036n871l951j036O420O997o309n740P37K042M656j922p322
$$ plain form
1098 -5905 -1937 3981 4642 2000 -5197 -5053 2517 3578 1430 -1582 -3438 3948 5265 -3157 -5561
1113 -5561 -3264 2617 7025 -661 -4926 -1393 817 3223 -670 -6220 -484 5817 4179 158 -5893
1128 -5893 -3638 4496 3203 -1015 -2571 -1632 4700 3712 -4755 -4989 -1228 3201 5030 -1709 -4686 240
1144 240 2052 2034 -2058 -5602 1368 6528 2327 -1649 -4605 -1497 5224 1786 -2994 -2278 264 4693
1160 4693 2328 -6233 -4603 851 3648 3296 -3259 -3955 2416 2939 672 -2449 -4534 2734 6644 473
1176 473 -3392 -3599 369 5155 -298 -4220 -1247 1444 4344 711 -6321 -3019 3153 3191 1178 -3303
1192 -3303 -2758 3946 3314 -843 -3419 -3038 4167 5383 -2104 -3766 -1702 1479 4071 -1727 -5230 141
1208 141 2851 3309 -1005 -5821 -561 4562 2204 -601 -3322 -1370 4918 2151 -2713 -2973 -1460 4461
$$ packed form
1098e905L968N918O61k642p197J44P570J061k148l012j856P386J317q422k404
1113e561K297N881M408p686m265L533K210K406l893n550N736O301j638m021o051
1128e893K255Q134j293m218j556R39O332r88q467k34L761M429J829o739k977M926
1144B40J812j8m092l544O970N160m201l976k956L108O721l438m780P16K542M429
1160D693k365q561J630N454K797l52o555o96O371N23k267l121k085P268L910o171
1176D73l865k07L968M786n453l922K973K691K900l633p032L302O172L8k013m481
1192c303N45O704o32m157k576L81P205J216p487j662K064L181K592n798l503N371
1208A41K710M58m314m816N260N123k358k805k721J952O288k767m864k60J513N921
$$ plain form
1224 4461 4140 -3938 -4324 377 2872 2071 -3075 -3888 1415 2933 2238 -1706 -5385 1080 5787 494
1240 494 -2615 -2508 407 4724 866 -3638 -2439 332 4302 1878 -5552 -2727 2319 2347 962 -3419
1256 -3419 -3622 3021 3559 286 -2877 -3178 2965 4801 -977 -3236 -1520 1459 4408 -793 -4564 -1048
1272 -1048 2051 2975 -531 -5350 -1164 3682 2290 -41 -3384 -2123 4388 2765 -1805 -2640 -1655 3567
1288 3567 3790 -2550 -3154 -396 2011 3305 -1760 -4622 760 2996 1737 -1380 -4763 -106 4517
1303 4517 1326 -1231 -2982 -655 4838 1426 -3313 -2467 540 3865 2683 -3992 -3168 1185 2519
1318 2519 1780 -2929 -3687 2423 3543 180 -2309 -3591 1653 4279 213 -2155 -1930 485 4160 161
1334 161 -4394 -1347 1798 2932 632 -4314 -1967 2466 1794 368 -3131 -2525 4121 3063 -1265 -2400
$$ packed form
1224D461l21q078l86M701K495q01n146q13N303J518o95l944l679O465M707n293
1240D94l109J07K915M317l858m504J199K771L970k424p430K825N046K8j385m381
1256c419k03O643N38l273l163l01O143J836n778k259J716K979K949n201l771L516
1272a048L099R24l506m819M186M846j392k331l343J261O511j623m570q35R85N222
1288C567K23o340o04K758K407J294n065k862N382K236j259l117l383M657M623
1303D517l191k557j751K327N493l412m739Q46L007L325j182o675Q24M353J334
1318B519p39m709p58O110J120l363k489j282N244K626m066k368K25K415L675l999
1334A61m555L047L145J134k300m946K347M433o72j426l499O06O646j058m328j135
$$ plain form
1350 -2400 -2402 2495 4027 -1282 -2374 -523 1519 3129 -1416 -4346 63 2208 1913 -557 -4224 -1065
1366 -1065 3393 1083 -943 -2905 -669 4047 2167 -2339 -2049 -663 2816 2869 -2407 -2601 605 2190
1382 2190 1828 -2537 -4079 1507 3025 976 -1759 -3508 432 3480 182 -1970 -1733 660 4061
1397 4061 1023 -3474 -1749 678 2679 1464 -3362 -1917 2136 1638 582 -3307 -3002 2538 3141 -317
1413 -317 -1857 -2313 1631 3871 -730 -2311 -634 1742 3655 -237 -3841 -474 1656 2056 239 -3440
1429 -3440 -898 3014 1252 -1099 -3053 -1430 3257 2341 -1801 -1744 -660 2180 2684 -1985 -2601 666
1445 666 2331 2309 -1419 -3947 367 2428 995 -999 -2959 232 2836 505 -1858 -2001 -215 3599
1461 3599 1538 -2349 -1403 526 1951 1501 -2998 -2148 1915 1864 1075 -2307 -2857 1474 2391 -363 -1417
$$ packed form
1350b400kM897J532n309j092J851K042J610m545k930M409K145k95k470l667L159
1366a065M458k310k026j962K236M716j880m506K90J386L479N3n276j94L206J585
1382B190l62m365j542N586J518k049k735j749L940L048l298k152K37K393L401
1397D061l038m497J725K427K001j215m826J445M053m98j056l889L05N540O03l458
1413c17j540m56L944K240m601j581J677K376J913l892l604L367K130M00j817l679
1429c440K542L912j762k351j954J623M687r16m142N7J084K840N04m669o16L267
1445F66J665k2l728k528M314K061j433j994j960L191K604k331k363j43J786L814
1461C599k061l887R46J929J425m50m499Q50M063n1p89l382n50M331R17k754j054
$$ plain form
1478 -1417 -2320 961 3478 -543 -2487 -934 1109 3195 388 -3126 -708 1408 1856 648 -3156
1493 -3156 -1366 2324 1458 -305 -2474 -2181 2457 2304 -1142 -1438 -798 1994 2754 -1404 -2579 -17
1509 -17 1688 2530 -651 -3163 -291 1546 1074 -537 -2770 -378 2901 731 -1471 -1927 -559 2604
1525 2604 1517 -1904 -1217 217 1935 2089 -2209 -1936 1263 1772 1362 -1347 -2633 990 2035 365
1541 365 -1007 -2330 222 2693 -123 -1981 -1129 385 2675 869 -2016 -751 1069 1555 1090 -2249
1557 -2249 -1392 1776 1619 65 -1568 -1921 1362 1591 -947 -1610 -1196 1329 2570 -1041 -2077 -82
1573 -82 1327 2221 158 -2212 90 1643 997 -87 -2355 -675 2184 733 -765 -1473 -1219 1747
1589 1747 1453 -1824 -954 -116 1495 1770 -1665 -1955 834 1488 1536 -352 -2286 507 1748 186 -797
$$ packed form
1478a417r03L281K517m021j944J553K043K086k807l514K418K116M48j208l804
1493c156J790L690q66j763k169K93M638j53l446k96O40K792P60m158j175K562
1509a7J705Q42l181k512K872J837m72j611k233K392L279k170k202m56J368L163
1525B604j087l421O87J434J718J54m298K73L199N09m10k709j286L623J045j670
1541C65j372j323K552K471k816j858Q52J514K290j806k885J265J820M86m65l339
1557b249Q57L168j57j554j633l53L283K29k538o63M14K525J241l611j036J995
1573h2J409Q94k063k370K302J553o46j084k268J680K859j451j498p08K54K966
1589A747k94l277Q70Q38J611K75l435k90K789O54M8j888j934K793J241j562r83
$$ plain form
1606 -797 -2048 27 2323 173 -1736 -1224 -646 1869 801 -2073 -885 673 1329 1471 -1983 -1884 1388
1623 1388 992 509 -552 -1849 799 1583 -823 -1035 -1378 226 2285 -207 -1766 -455 315 1756
1639 1756 459 -1863 85 1339 1142 146 -1760 -829 1756 1099 55 -1088 -1379 1162 1148 -1337 -1096
1656 -1096 -200 1207 1843 -827 -1708 -107 594 1239 -124 -1552 538 1374 347 -238 -1740 -667 2006
1673 2006 573 -608 -930 -821 1411 656 -1737 -732 261 1244 1300 -1216 -1593 854 822 539 -49 -1198
1691 -1198 977 1870 -395 -681 -1540 -289 1882 6 -1089 -538 -367 935 202 -1929 -544 1053
1707 1053 1230 1086 -1315 -1032 1219 600 92 -446 -872 1023 1304 -829 -1171 -1226 236 1858 -529 -1345
1725 -1345 169 372 691 165 -1646 427 1528 974 530 -1111 -906 936 322 -421 -350 -362 1190 908
$$ packed form
1606g97j251K075K296k150j909N12N78K515j068k874J188J558O56J42l454R9L272
1623A388l96m83j061j297K648P84k406k12l43J604K059k492j559J311P70J441
1639A756j297k322J948J254j97r96j906R31K585o57j044j143k91K541j4k485K41
1656a096Q96J407O36k670q81J601P01O45j363j428K090Q36j027n85j502J073K673
1673B006j433j181l22J09K232p55k393J005R93R83N6k516l77K447l2k83n88j149
1691a198K175Q93k265k86q59J251K171j876j095N51J71J302p33k131J385J597
1707A053J77j44k401K83K251o19n08n38m26J895K81k133l42n5J462J622k387q16
1725a345J514K03L19n26j811K073J101n54m44j641K05J842o14p43P1j2J552k82
$$ plain form
1743 908 -1678 -961 -489 426 1322 -528 -1243 496 588 493 -610 -1591 634 1552 273 -80 -1116 -654
1761 -654 1032 122 -860 -299 -64 1211 661 -1606 -663 330 682 1114 -368 -704 1322 472 -21 -311
1779 -311 -1190 877 1254 23 -334 -896 -583 1014 -309 -1205 133 90 1111 295 -1706 -451 941
1796 941 547 430 -404 -445 1068 308 -449 -477 -997 888 1292 -560 -600 -346 -182 552 -881 -943 570 754
1816 754 529 194 -1439 -45 834 279 281 -472 -274 1330 -234 -704 -200 -554 627 1176 -797 -591 -29
1835 -29 -132 604 -827 -745 779 760 640 99 -1228 -144 1513 -81 -121 -395 -94 1128 -288 -1032 66
1854 66 -334 649 529 -964 -289 200 -261 442 -583 -683 1061 631 -28 -89 -914 52 895 -228 80
1873 80 12 -119 644 -532 -1284 -177 32 416 391 -878 157 451 28 94 -227 -679 1029 310 -109 9
$$ packed form
1743I08k586P17M72R15Q96j850p15J739R2r5j103r81K225R18j279l53j036M62
1761f54J686r10r82N61K35J275n50k267R43R93L52M32j482l36K026q50m93k90
1779c11q79K067L77j231l57n62L13J597j323q96J338m3J021q16k001J255J392
1796I41l94j17q34m1J513p60p57k8n20J885M04j852m0K54J64P34j433o2J513J84
1816G54k25l35j633J394Q79n55Kp53J98J604j564m70N04l54J181N49j973K06N62
1835b9j03P36j431Q2J524j9j20n41j327J084J657j594m0k74L01J222j416p44J098
1854F6m00R83j20j493O75M89m61P03j025j00J744m30o59o1q25R66Q43j123L08
1873H0o8j31P63j176p52J107K09L84k5j269J035K94m23O6l21m52J708p19m19J18
$$ plain form
1893 9 -712 313 831 -424 190 5 93 564 -661 -726 53 139 630 -20 -892 82 898 -267 224 -184
1913 -184 -492 1174 40 -389 -386 -499 197 433 -649 59 25 -264 529 -468 -539 738 338 204 480 -752
1933 -752 44 798 -256 -97 28 -147 882 173 -933 68 -189 -269 422 -844 -271 350 -195 -60 -601
1952 -601 -632 845 442 -136 274 -674 -241 421 -491 -33 83 -164 771 -149 -773 -243 -265 284 332 -518 -31
1973 -31 652 -394 336 -277 -390 670 517 116 55 -863 107 495 -521 60 39 -143 690 -379 -1023 55
1993 55 37 312 579 -174 93 864 -429 -118 -222 -293 722 449 -183 222 -466 -397 421 -658 -130 220
2013 220 -9 489 -392 -754 168 124 269 678 -436 225 720 -351 -212 -277 -324 792 667 -328 -51 -594
2033 -594 -335 421 -103 11 302 197 327 -100 -1221 379 663 -190 557 -239 49 561 -465 -271 69
$$ packed form
1893Ip21J025N18j255O14j85Q8M71j225o5P79Q6M91o50q72R74Q16j165M91m08
1913a84l08J666j134m29Lj13O96K36j082P08l4k89P93r97p1J277m00j34K76j232
1933g52P96P54j054J59J25j75J029p09j106J001k57q0O91j266N73O21n45J35n41
1952f01l1J477m03n78M10r48M33O62r12M58J16k47R35r20o24N30k2N49M8q50M87
1973c1O83j046P30o13j13J060j53m01o1r18R70L88j016N81k1j82Q33j069o44J078
1993E5j8K75K67p53K67P71j293L11j04p1J015k73o32M05o88O9Q18j079N28L50
2013B20k29M98q81l62R22m4J45M09j114O61M95j071J39o5m7J116j25r95K77n43
2033e94K59P56n24J14K91j05J30m27j121J600K84q53P47p96K88N12j026J94L40
$$ plain form
2052 69 -119 921 259 -914 321 -514 -243 182 -564 -17 718 174 378 -128 -646 369 559 53 192
2071 192 -115 -112 446 -582 -581 -37 -115 572 317 -676 -31 -228 -178 442 -392 3 952 70 359 125 -893
2092 -893 463 499 -82 451 -257 41 555 -492 -624 165 19 496 458 -830 37 -114 -365 463 -353 -23
2112 -23 676 25 -150 -190 -720 373 274 -242 354 -155 -138 471 -604 -675 382 40 243 63 -808 90 227
2133 227 -62 530 -133 81 785 40 -329 -276 -743 396 612 -506 99 221 0 524 -811 -826 496
2152 496 170 561 293 -479 145 250 -204 310 -103 133 826 -140 -265 -123 -504 252 104 -633 253 -129
2172 -129 -55 -34 -841 -265 610 170 352 235 -318 143 202 -493 153 -274 136 525 -402 -469 -8 -76 263 72
2194 72 -544 436 -39 -367 26 -477 -199 557 244 255 450 -797 58 203 -555 -19 415 55 462 -354
$$ packed form
2052F9j88J040o62j173J235q35K71M25p46N47P35n44K04n06n18J015J90n06J39
2071A92l07LN58j028JN44p8O87k55r93O45j97N0O20q34L95R49q82K89k34j018
2092h93J356L6n81N33p08K98N14j047j32P89j46M77l8j288Q67j51k51Q28q16L30
2112b3O99o51j75m0n30J093r9n16N96n09J7O09j075p1J057l42K03j80q71Q98J37
2133B27k89N92o63K14P04p45l69N3m67J139K16j118O05J22k21N24j335j5J322
2152D96l26L91k68p72O24J05m54N14m13K36O93r66j25J42l81P56j48p37Q86l82
2172a29P4K1q07N76Q75m40J82j17n53M61N9o95O46m27M10L89r27o7M61o8L39j91
2194G2o16R80m75l28L93n03K78P56l13J1J95j247Q55J45p58N36M34l60M07q16
$$ plain form
2214 -354 -488 180 -429 266 32 -419 145 812 -182 -322 -516 -146 952 344 -294 137 -259 174 36 -355
2234 -355 -129 61 156 427 -422 -522 239 33 439 45 -348 490 575 -28 -130 -357 193 918 45 -260 -153
2255 -153 -213 171 48 -581 91 401 -25 51 -605 -597 156 -275 46 -11 -409 763 153 -453 154 326 162
2276 162 589 -131 -465 129 -300 345 233 -748 278 581 -78 508 -435 -297 593 574 -55 199 -437 369
2296 369 491 -722 -240 17 212 445 -326 -224 263 -218 156 -121 -537 107 685 155 119 -247 -29 529
2316 529 46 -58 -42 -61 284 146 -672 -78 313 52 383 -384 -239 338 136 -84 -185 -402 384 782 -216
2337 -216 -62 -365 -240 411 -122 -410 203 360 253 2 -703 -37 444 232 365 -123 -142 242 118 -143
2357 -143 -115 -199 424 793 -384 -304 -140 52 588 17 -243 294 26 84 -79 -508 186 282 199 357 -267 -331
$$ packed form
2214c54j34O68o09O95k34m51N64O67r94j40j94L70J098o08o38M31l96M33j38l91
2234c55K26J90R5K71q49j00P61k06M06l94l93Q38Q5o03j02k27N50P25q73l05J07
2255a53o0L84j23o29O72L10m26P6o56QP53m31L21n7l98J172o10o06O07J72j64
2276A62M27p20l34N94m29O45j12r81J026L03o59N86r43J38Q90j9o29K54o36Q06
2296C69J22j213M82K57J95K33p71J02M87m81L74k77m16O44N78n30l6l66K18N58
2316E29m83j04J6j9L45j38q18N94L91k61L31p67J45N77k02k20j01k17P86L98r98
2337b16J54l03J25O51n33k88O13J57j07k51p05O66M81k12J33m88j9L84j24k61
2357a43K8q4O23L69j177Q0J64J92N36n71k60N37k68N8j63m29O94R6q3J58o24o4
$$ plain form
2379 -331 377 81 -177 -173 157 720 375 -478 -212 209 139 315 -186 -453 333 -29 -115 7 -540 421 568
2400 568 -404 49 -141 35 468 -220 -303 -98 210 319 366 -473 -466 335 -277 472 -168 -192 522 163 -129 -156
2422 -156 -13 403 320 -220 -202 -48 -142 261 -113 -301 393 150 244 -142 -739 -591 243 -40 -56 -283 -137 320
2444 320 -100 -117 -346 -431 247 605 -159 -149 159 109 357 -289 -289 359 263 104 202 -339 -175 425 -67 168 -182
2467 -182 287 523 -313 -569 20 225 400 396 -369 -52 121 111 19 -466 -213 561 277 194 -23 -177 86 345
2489 345 -211 46 101 120 305 33 -134 -17 104 129 353 -299 -269 397 36 86 -292 -439 498 23 -493 -132
2511 -132 -212 -74 381 -141 4 188 26 519 -104 -518 324 312 39 -104 -715 -151 97 -240 -121 -95 -137
2532 -137 271 116 -40 240 -127 143 255 -326 74 190 21 246 -225 -351 379 -81 -180 106 -249 286
$$ packed form
2379c31P08k96k58ML30N63l45q53K66M21p0J76n01k67P86l62q6J22n47R61J47
2400E68r72M53j90J76M33o88q3K05L08J09M7q39PQ01o12P49o40k4P14l59k92k7
2422a56J43M16q3n40J8J54r4M03l74j88O94k43R4l86n97J48Q34k83j6k27J46M57
2444C20m20j7k29q5O78L58p64J0L08n0K48o46%O48r6j59R8n41J64O00m92K35l50
2467a82M69K36q36k56N89K05J75mp65L17J73j0r2m85K53P74k84q3k17j54K63K59
2489C45n56K57N5J9J85k72j67J17J21K5K24o52L0O66l61N0l78j47R37m75n16L61
2511a32q0J38M55n22J45J84j62M93o23m14Q42j2k73j43o11N64K48l37J19K6m2
2532a37M08j55j56K80l67K70J12n81M00J16j69K25m71j26P30m60r9K86l55N35
$$ plain form
2552 286 20 -255 -371 -86 -44 444 218 -267 184 -78 29 222 -428 443 236 -113 -32 -379 -516 219 188
2573 188 72 122 -492 290 328 -416 -71 203 -44 464 193 -144 -76 321 202 -118 -373 49 221 -82 -312
2594 -312 -262 -467 430 4 -108 318 -225 268 181 -375 -325 172 170 262 -51 -471 50 28 -233 78 -267 441
2616 441 639 -290 33 95 -64 164 339 -14 231 -11 229 29 -372 59 474 -26 34 83 -408 255 76
2637 76 -230 137 -201 12 364 -117 48 -123 -230 77 -39 -246 243 370 -162 194 -398 179 231 53 -111
2658 -111 -60 -343 118 -56 -314 55 -217 225 229 -231 -95 -120 -89 58 214 -74 298 -24 -106 -17 -315 138
2680 138 90 214 -2 -109 -129 127 91 -86 15 28 261 -11 -384 -214 70 315 66 88 -310 114 116 -255
2702 -255 -156 -275 39 430 -100 -141 49 -186 166 121 -402 -79 246 125 389 -225 -215 159 63 143 -32 -180
$$ packed form
2552B86k66k75j16K85M2M88k26m85M51k62J07J93o50Q71k07l49Q1l47j37P35l1
2573A88j16N0o14P82L8p44L45K74k47N08k71l37O8L97j19l20k55M22J72l03k30
2594c12N0k05Q97m26j12M26n43M93q7n56N0M97kR2l13m20N21k2k61L11l45P08
2616D41J98r29L23O2j59K28J75l53K45k42K40k00m01M31M15n00O0M9m91O63j79
2637G6l06L67l38K13L52m81J65j71j07L07j16k07M89J27n32L56n92N77N2j78j64
2658a11N1k83M61j74k58L69k72M42Mm60J36k5L1J47J56k88L72l22q2Q9k98M53
2680A38m8J24k16j07k0K56l6j77J01J3K33k72l73J70K84K45k49K2l98M24Kl71
2702b55R9j19L14L91n30m1J90k35L52m5n23L23L25j21K64o14J0L74r6Q0j75j48
$$ plain form
2724 -180 78 224 -86 -207 -169 -157 47 -91 -100 326 -173 -237 203 -337 114 -153 344 129 -68 -101 256 -62
2746 -62 121 -230 -93 44 -156 -204 -70 -215 66 260 -91 -365 -92 -154 -287 331 -181 57 128 -223 -32
2767 -32 -99 -128 159 -39 -224 27 9 -151 7 -90 145 11 78 -29 -281 -115 246 16 170 -195 -199 323 292
2790 292 18 -136 24 50 236 -135 308 197 -107 -138 13 -78 87 344 112 173 11 -16 138 -45 -105 135
2812 135 -80 149 126 -14 -69 4 -189 -62 -186 -165 137 86 87 -233 49 186 138 -26 305 -8 149 164 30
2835 30 -145 -66 -28 178 -28 -30 203 -235 105 -14 62 102 149 -79 93 102 -36 57 -76 -166 -19 22 -198 95
2859 95 -69 -302 86 91 125 180 -25 70 -50 -101 184 -73 -93 86 -327 -158 35 209 214 -31 63 -86 -2 -153
2883 -153 -169 -152 -220 274 102 -37 43 -49 176 333 49 -113 189 11 367 63 -65 313 -324 -81 -7 -106
$$ packed form
2724a80K58J46l10j21L8J2K04j38rM26m99o4M40n40M51k67M97k15j97l3L57l18
2746f2J83l51J37J37k00m8J34j45K81J94l51k74K73o2j33O18n12K38P1l51J91
2767c2o7k9K87j98j85K51j8j60J58r7K35j34O7j07k52J66L61k30J54l65mN22l1
2790B92k74j54J60K6J86l71M43j11l04l1J51r1J65K57k32O1j62k7J54j83o0K40
2812A35k15K29k3j40n5P3j93J27j24K1L02n1Jl20K82J37m8j64L31l13J57J5j34
2835C0j75P9L8K06k06kK33m38L40j19P6M0M7k28J72Rj38R3j33r0J47M1k20K93
2859I5j64k33L88NL4N5k05R5j20n1K85k57k0J79m13J69J93J74Nk45R4j49Q4j51
2883a53j6J7o8M94j72j39Q0r2K25J57k84j62L02j78L56l04j28L78o37K43P4r9
$$ plain form
2905 -106 -194 67 16 87 -251 53 -52 -91 -24 -58 -158 -226 104 -207 130 -138 10 253 89 -128 334 -126
2927 -126 117 -223 -296 104 -1 -86 -246 -146 -4 103 244 338 165 44 -70 9 -311 -125 -93 -15 93 -150
2949 -150 -237 73 -42 -9 3 -79 -354 277 -238 -19 -286 -4 271 -30 23 127 -49 -41 -67 165 -157 120 -16
2972 -16 24 -370 -26 -234 22 -259 29 -287 3 103 -109 116 -151 -58 139 43 -133 91 -327 1 -28 -164
2994 -164 311 85 -238 35 -81 166 171 -42 86 -266 229 267 -153 -216 -219 108 -166 80 -220 -36 256 -16
3016 -16 -65 -198 185 141 61 -70 155 -239 -47 -252 205 80 245 -113 -78 -148 -12 128 40 -106 210 3
3038 3 -169 5 -96 -64 266 -193 -248 -13 -148 -11 -233 -253 -90 71 -127 201 -9 71 -148 79 -55 -109
3060 -109 -72 -233 72 -32 93 -194 20 -88 -83 83 196 -71 19 -29 -263 117 85 277 -89 -93 47 90 -100
$$ packed form
2905a06q8K61n1P1l38L04j05l9O7l4j00o8L30l11L37k68J48K43j64k17M62m60
2927a26K43l40p3M00j05q5j60J00J42J07J41R4j73j21j14P9l20J86L2P8J08k43
2949a50q7L10j15L3J2q2k75O31n15K19k67K82K75l01N3J04j76Qk6K32l22K77j36
2972a6M0l94L44k08K56k81K88l16K90J00k12K25k67R3J97r6j76K24m18L28k9j36
2994a64M75k26l23K73j16K47Nk13J28l52M95L8m20o3lL27k74K46l00J84K92k72
3016a6m9j33L83m4q0j31K25l94J92k05M57j25J65l58L5p0J36J40q8j46L16k07
3038Cj72J74j01L2L30m59n5K35j35J37k22k0J63J61j98L28k10Q0k19K27j34n4
3060a09L7j61L05j04J25k87K14j08NJ66J13k67R0m8k34L80l2J92l66mJ40M3j90
$$ plain form
3083 -100 -107 -54 239 108 -79 108 157 -175 38 302 -53 68 -119 -14 -213 -128 -113 -16 -105 8 -54 -240 -30
3106 -30 22 -264 -29 19 282 115 -59 84 -343 -5 -96 -27 108 -23 526 -262 159 -242 -98 124 211 -89
3128 -89 -54 213 36 17 -58 97 -71 146 18 -117 22 43 -120 -7 54 -42 -75 54 -165 -167 -208 -270 89 30
3152 30 146 29 0 -12 -174 -110 83 332 -45 58 411 29 54 20 -187 -121 -265 34 12 85 101 81 -30 -62
3176 -62 -5 -318 341 228 -73 192 -224 134 -260 -94 -57 -196 341 -92 246 12 9 159 166 -143 -16 -127
3198 -127 19 -149 138 295 -200 36 172 81 119 -224 131 45 -90 285 42 111 4 26 302 -185 -59 111
3220 111 161 -191 127 15 -37 -46 -69 65 -207 61 73 66 -64 -334 39 -113 10 -296 124 171 203 -313 -62
3243 -62 292 -165 -65 -139 118 167 176 26 323 -111 -37 12 -137 353 -166 10 64 119 78 17 43 -34 -54 161 211
$$ packed form
3083a00pN3K93j31j87J87M9l32K13K64l55J21j87J05j99Q5J5R7q9J13o2j86K10
3106c0N2k86K35M8K63j67j74J43m27L38r1O9J35j31N49p88M21m01J44K22Q7l00
3128h9L5K67j77j9p5J55j68K17j28j35J39K1j63J13O1r6l3J29k19km1o2L59n9
3152C0J16j17k9j2j62O4J93K49l77J03L53l82K5l4k07O6j44K99k2P3J6k0j11l2
3176f2N7l13O59j13l01K65m16L58l94J66L7j39N37m33L38k34lJ50Pl09J27j11
3198a27J46j68K87J57m95K36J36r1L8l43L55q6j35L75k43O9j07K2K76m87J26J70
3220A11N0l52L18j12n2rk3J34k72K68J2pj30k70L73j52J23l06M20M7L2n16K51
3243f2L54m57J00p4K57M9Rj50K97m34P4M9j49M90n19J76N4N5m1o1K6p7k0K15N0
$$ plain form
3268 211 -8 -207 -68 -54 272 -33 139 -116 -14 23 73 139 51 87 74 55 64 87 -293 50 -83 -98 -114 77
3292 77 66 13 87 -112 24 -298 -102 104 -224 13 199 -329 60 -54 -142 192 61 -247 42 -61 -69 -236
3314 -236 46 94 144 -151 133 -241 10 -27 -186 -31 -24 -60 169 -204 129 119 -292 -251 77 131 -213 -103 45
3337 45 -31 114 -16 149 167 92 207 82 168 59 -44 71 22 -94 129 -107 37 145 -137 5 -65 209
3359 209 200 20 139 95 -135 -40 21 125 -95 66 167 113 -353 -156 72 -187 8 92 99 131 -244 -97 -19 -197
3383 -197 -25 40 89 128 -37 87 122 -70 11 -7 241 -128 146 -160 -113 92 8 -235 143 32 -123 -148 91
3406 91 -131 -181 92 -87 375 193 132 345 -78 -10 42 24 58 -113 65 -138 -212 -58 89 162 94 89 -33 81
3430 81 -60 259 109 19 229 -186 -114 67 166 47 91 52 207 -128 79 177 80 -96 -17 98 -127 -49 138
$$ packed form
3268B11k19j99J39J4L26l05J72k55J02L7N0O6q8L6j3j9RK3l80L43j33j5j6J91
3292G7j1n3P4j99J36l22J96K06l28K37J86n28L89j14q8L34j31l08K89j03qj67
3314b36K82M8N0k95K84l74K51l7j59J55Pl6K29l73L33j0m11M1L28N4l44J10J48
3337D5p6J45j30J65J8p5J15j25Q6j09j03J15m9j16K23k36J44J08k82J42p0K74
3359B09rj80J19m4k30R5O1J04k20J61J01n4m66J97K28k59J95Q4PL2l75J47P8j78
3383a97J72O5M9L9j65J24L5j92Q1j8K48l69K74l06M7K05q4k43L78j11j55k5K39
3406I1k22n0K73j79M62j82o1K13m23O8N2j8L4j71J78k03p4J54J47P3o8nj22J14
3430H1j41L19j50r0K10m15P2J81R9j19M4l9J55l35K07R8r7j76P9J15k25P8J87
$$ plain form
3453 138 -174 -186 -59 -239 -301 -115 296 -87 -222 -216 184 -393 151 97 -96 103 101 -117 294 -336 28 25 -25
3476 -25 -63 -205 88 68 7 -152 -223 -187 74 -188 -185 250 -22 -34 85 -35 57 -3 135 260 97 198 28 -9
3500 -9 37 -16 39 284 -189 32 241 19 -229 31 73 -271 88 -48 -157 -211 104 15 292 259 102 -116 108
3523 108 175 101 73 45 -164 167 61 -228 152 -385 -209 10 -36 61 150 -38 114 33 -83 -109 75 -134 -31
3546 -31 -109 157 236 353 -154 -280 -149 -200 205 252 161 -45 -179 -20 283 129 -137 -33 -74 -133 -134 -54 -76 75
3570 75 6 36 -123 25 54 -82 236 180 -43 46 -11 -120 -90 1 -117 45 -16 40 89 196 -45 -47 20 -50 13 -146
3596 -146 -158 150 81 178 48 155 22 -67 -9 4 155 -89 -43 -474 71 24 33 -40 164 -118 -177 103 113 -16
3620 -16 -94 -249 -132 -8 -183 -45 -26 42 -314 79 374 102 206 -112 406 140 8 -5 -284 163 -127 0
$$ packed form
3453A38l12j2J27j80o2J86M11l83j35OM00n77N44n4j93J99kk18M11o30L64ln0
3476b5l8j42K93k0o1j59p1L6K61k62LM35k72j2J19j20R2o0J38J25j63J01j70l7
3500iM6n3N5K45m73K21K09k22k48K60M2l44L59j36j09n4L15q9K77l3j57k18K24
3523A08O7p4k8k8k09L31j06k89L80n37J76K19m6R7Q9j88J52q1j16k6J84k09J03
3546c1p8K66P9J17n07j26J31n1M05M7r1k06j34J59L03j54k66J04m1n9jQ0k2J51
3570G5o9L0j59J48K9j36L18n6k23Q9n7j09L0R1j18J62o1N6M9J07k41kO7p0O3j59
3596a46j2L08o9R7j30J07j33q9N8J3J51k44M6m31N45m7Rp3K04k82n9K80J0j29
3620a6p8j55J17J24j75J38J9O8l56L93K95k72J04l18N18k66j32j3k79M47k90J27
$$ plain form
3642 0 -245 166 141 -67 21 -210 90 67 -149 79 250 86 -123 106 -101 23 114 121 176 152 -282 196 -65
3665 -65 -112 8 -126 80 -125 -165 60 -99 115 131 -161 70 -90 -28 113 -45 -90 -131 11 -154 -94 -94 -379
3688 -379 -79 -31 -67 369 -164 -65 -65 -9 -136 -104 -166 -104 -30 101 -33 82 73 61 45 118 174 -243 29 -190 75
3713 75 -2 152 151 -26 -161 50 265 -335 233 167 141 -88 110 -112 -149 226 335 171 -159 78 -38 -31 -133
3736 -133 -35 177 90 160 203 64 -155 -243 -56 -252 -199 126 -60 235 -236 -174 5 255 174 -2 -391 198 254
3759 254 -166 -213 -157 -23 108 134 -141 167 -276 268 -295 -214 197 265 -164 352 -232 -12 27 106 -43 -50 -31
3782 -31 -70 -164 -1 -135 120 -212 265 144 -166 -36 -116 -47 -112 -130 44 -147 28 -183 -189 -104 -164 85 -98 74
3806 74 -84 137 175 -71 36 105 -66 -324 109 8 113 -73 -56 -216 -2 -119 58 -296 39 61 -110 185
$$ packed form
3642@k45M11k5k08Q8k31L00k3k16K28J71j64k09K29k07J24R1PN5k4m34M78k61
3665f5m7J20j34K06k05m0K25j59K14J6k92K31j60O2J41j58m5m1J42j65O0%k85
3688c79L00M8l6M36n33R9%N6j27L2o2O2P4J31j34J15rj2j6P3N6m17K72k19K65
3713G5p7J54jj77j35K11K15o00N68o6k6k29J98k22l7L75J09j64l30K37j16Pj02
3736a33R8K12q7P0M3j39k19q8J87j96N3L25j86K95m71O2J79K50q1j76l89N89N6
3759B54m20m7N6J34J31K6k75L08m43N44n63Q1M11O8m29N16n84K20L9P9j49pJ9
3782c1l9r4J63j34K55l32M77j21l10J30q0O9o5j8J74j91J75k11oQ5o0K49j83J72
3806G4j58K21L8k46J07O9j71k58M33j01J05j86J7j60K14j17J77l54L35K2j71K95
$$ plain form
3828 185 -83 51 8 263 -32 34 -178 40 90 -73 204 -326 -144 112 -64 38 247 17 -21 -50 -23 -119
3850 -119 -116 -305 -34 -74 21 91 -174 40 60 55 -79 -17 37 1 -22 -54 88 69 -221 269 65 -16 22 -94 -17 -167
3876 -167 -291 171 242 -132 -146 149 182 -217 67 -112 12 -235 29 119 73 42 121 -27 -20 -303 -29 103 -143
3899 -143 165 27 8 95 103 144 -123 28 252 -180 114 -157 38 -72 -297 -140 73 -62 -89 -29 1 -41 -210
3922 -210 -94 -219 -68 -166 19 62 10 227 247 -20 46 -195 -148 -12 -148 -44 -94 -19 28 -194 -166 -72 173 -34
3946 -34 -136 127 -126 131 174 182 -182 -103 -157 -191 -232 96 226 -9 -138 160 178 -230 -24 -233 -29 123 224
3969 224 -293 93 -81 -54 -53 -57 29 132 -106 17 -158 -257 -160 82 -174 58 38 12 -276 21 -226 -3 31 -10
3993 -10 214 10 -25 190 -51 -175 153 -130 82 238 -72 6 -53 -10 205 -269 190 -44 -198 42 163 -55
$$ packed form
3828A85k68J34m3K55k95O6k12K18N0j63K77n30J82K56j76J02K09k30l8k9K7r6
3850a19Lj89K71m0R5P0k65K14K0nj34O2N4l6k3l2J42j9k90M90k04q1L8j16P7j50
3876a67j24M62P1l74j4K95L3l99K84j79J24k47K64R0m6l1P9j48Pk83K74J32k46
3899a43L08j38j9Q7QM1k67J51K24m32K94k71J95j10k25J57K13j35k7O0L0m2j69
3922b10J16j25J51r8J85M3n2K17K0k67O6k41M7J36j36J04n0P5M7k22K8R4K45k07
3946c4j02K63k53K57M3Ql64P9n4l4m1L28J30k35j29K98J8m08K06k09K04J52J01
3969B24n17L86j74K7JmQ6J03k38J23j75r9R7K42k56K32k0k6k88K97k47K23L4m1
3993a0K24k04l5K15k41j24L28k83K12J56l10P8n9M3K15m74M59k34j54K40J21k18
$$ plain form
4015 -55 18 203 -202 -221 96 145 177 60 174 285 71 -24 -63 -56 -41 -27 160 50 -61 -261 53 176 -53 -218
4039 -218 -155 -71 41 151 27 148 108 160 69 58 -116 217 -27 145 -64 -189 9 268 -11 167 380 -87
4061 -87 23 31 31 64 40 124 77 -115 -9 -97 -154 1 -68 92 255 -203 -43 155 -108 99 79 326 74 86 -329
4086 -329 -156 267 -123 66 -180 -148 219 124 66 -33 -66 137 -234 -22 -165 -104 -16 -13 309 -98 -52 300 30
4109 30 -103 262 138 127 -146 339 -17 64 374 -316 257 -140 -46 229 -19 -187 -50 66 -41 -29 256 10
4131 10 -83 12 104 184 -25 -387 200 183 -46 243 -153 212 -263 18 247 -117 -167 59 194 -147 56 109 -98
4154 -98 148 -71 136 -22 -325 257 55 92 40 -201 214 -70 198 -144 -109 -142 -76 -156 -204 104 160 -32 13
4177 13 24 -287 -6 194 -58 -47 135 -209 42 193 19 -270 -151 -265 -49 -5 -62 52 77 -40 106 62
$$ packed form
4015e5P3J85m05j9L17M9L2j17J14J11k14r5l9PJ5J4J87j10j11k00L14J23k29j65
4039b18O3Q4J12J10j24J21m0N2r1j1j74L33k44J72k09j25J98K59k79J78K13m67
4061h7J10Q%L3k4Q4m7j92J06q8n7J55o9J60J63m58J60J98k63K07k0K47k52J2m15
4086c29J73M23l90J89k46L2L67r5n8r9l3K03l71K12j43O1Q8LL22m07M6L52k70
4109C0j33L65j24j1k73M85l56Q1L10o90N73l97R4K75k48j68J37J16j07J2K85k46
4131A0r3R5R2Q0k09l62N87j7k29K89l96L65m75K81K29l64n0K26J35l41K03N3k07
4154i8K46k19K07j58l03N82k02L7n2k41M15k84K68l42L5l3O6q0m8L08N6j92M5
4177A3J1l11K81K00k52J1J82l44K51J51j74k89J19j14K16M4n7J14K5j17J46m4
$$ plain form
4199 62 -179 183 16 -273 -4 23 -341 -50 -377 -91 -26 -141 251 25 44 27 -168 150 114 183 -13 182
4221 182 179 -88 150 -7 251 -248 119 173 66 201 35 -39 -58 -346 91 -242 -141 331 -69 -21 -146 -52
4243 -52 126 -36 -267 -1 -180 292 -82 -6 -119 226 391 140 -205 -334 -98 137 -111 175 -43 -213 69
4264 69 121 0 9 120 104 223 136 -41 31 147 -386 166 323 -62 -173 -76 106 38 -42 89 54 202 193 -13
4288 -13 -36 21 -70 267 139 128 -123 177 99 68 -4 -258 -112 -149 185 -35 -270 -5 -266 18 -19 -15 138 88
4312 88 -188 -227 97 -189 -2 -159 106 62 95 150 -181 -218 183 161 112 -158 128 -84 151 222 -329 187 167
4335 167 -172 92 -133 166 33 -41 -123 3 -60 -71 105 -244 199 18 7 -153 33 -40 -317 -90 106 -251
4357 -251 2 111 -55 -79 -159 -237 -91 218 -4 -91 238 -99 78 63 173 31 -59 -169 65 -130 -44 -125 -36
$$ packed form
4199F2k41L62j67k89K69K7l64K91l27K86O5j15L92k26J9j7j95L18l6O9j96J95
4221A82lk67K38j57K58m99L67N4j07J35j66p4j9k88M37l33J01M72m00M8j25R4
4243e2J78j62k31K66j79M72l74P6j13L45J65k51l45j29K36K35k48K86k18j70K82
4264F9N2j21RJ11j6J19q7j77P2J16n33N52J57l85j11R7J82o8q0J31l5J48rk06
4288a3k3N7r1L37j28j1k51L00p8l1p2k54J46l7L34k20k35K65k61K84l7MJ53n0
4312H8k76l9L24k86J87j57K65m4L3N5l31l7M01k2m9k70K86k12K35P1n51N16k0
4335A67l39K64k25K99j33p4q2J26o3j1J76l49M43j81j1j60J86p3k77K27J96l57
4357b51K53J09j66k4q0p8J46L09k22q7L29l37J77j5J10j42r0j10K34j95Q6q1Q9
$$ plain form
4380 -36 268 5 -89 -45 -7 78 -16 102 -135 9 96 68 3 -13 -72 -362 84 161 -315 -171 -44 -113 -8 -28 -27
4405 -27 80 220 -8 44 -88 -158 126 138 -231 195 -42 -47 -174 -297 123 -61 -36 -66 -265 340 -108 103 -67
4428 -67 89 -222 -201 304 142 -28 89 227 -64 -226 -278 -420 -306 -51 148 -20 151 140 -137 -65 89 -112
4450 -112 295 -24 108 264 246 120 206 211 177 156 -90 -117 -25 103 -63 192 -191 157 274 -247 -58 -154 3
4473 3 -34 -68 134 121 -51 128 -53 -70 -127 19 95 259 -50 70 149 176 66 164 -74 175 219 -259 -36 -249
4497 -249 -105 -270 -87 -211 -160 -71 111 -66 34 144 66 46 81 287 128 159 238 222 181 15 -339 253 -5
4520 -5 -348 167 -143 -7 58 -271 -48 366 107 -203 160 -6 -210 94 121 185 279 -100 -1 -1 -72 -152 -135 45
4544 45 -102 261 79 53 -50 -216 -97 177 187 4 -117 362 -128 -206 -289 -202 -152 346 -76 -173 238 119 -271
$$ packed form
4380c6L04k63r4M4L8Q5r4J18k37J44Q7k8o5j6n9k90M46P7m76J44J27o9J05k0J
4405b7J07J40k28N2j32p0K84J2l69M26k37nj27j23M20j84K5l0j99O05m48K11j70
4428f7J56l11K1N05j62j70J17J38k91j62n2j42J14K55J99j68J71j1k77P2J54k01
4450a12M07l19J32J56j8j26Q6Nl4k1k46k7R2J28j66K55l83L48J17n21J89r6J57
4473Cl7l4K02j3j72J79j81j7n7J46P6J64l09J20P9K7j10R8k38K49M4m78K23k13
4497b49J44j65J83j24N1Q9J82j77J00J10p8k0L5K06j59L1P9j6m1j66l54N92k58
4520el43N15l10J36O5l29K23M14k59l10L63j66k04L04K7O4R4l79R9%p1q0J7J80
4544D5j47L63j82k6j03j66J19K74J0j83j21M79m90p8q3Q7N0M98m22r7M11j19l90
$$ plain form
4567 -271 -16 30 -211 38 -243 -113 -55 228 -20 235 169 -261 -132 -365 -6 154 -189 41 231 190 143 306
4589 306 1 23 -13 -50 -270 63 -189 -66 -126 -36 226 -25 195 73 216 95 -112 157 42 -170 146 54
4611 54 59 -53 -14 -146 2 128 -104 18 -271 118 -173 131 -7 -96 -112 -258 168 137 64 97 31 -4 -156 -62
4635 -62 -222 -34 40 363 -130 -34 -129 -226 135 324 88 26 -32 197 -42 -103 -260 -41 85 38 -34 140 -124
4658 -124 176 196 -178 67 205 152 344 88 73 -116 -21 17 9 -217 112 283 -84 212 337 175 -42 -59 109
4681 109 -19 -29 62 -418 -139 191 -65 -16 9 -93 -130 203 192 -107 -46 -21 -44 -168 92 -72 122 19 -23
4704 -23 -134 -174 117 96 286 -40 149 146 -44 -115 -64 119 212 149 -74 -163 -26 -111 -48 108 142 -321 -10 -201
4728 -201 -59 39 243 -48 36 207 32 39 190 27 -24 -91 -184 -102 -245 -28 358 -1 109 -15 -83 255 262 66
$$ packed form
4567b71K55M6k41K49k81J30N8K83k48K55o6m30J29k33L59J60l43K30J90m1m7J63
4589C06l05K2l6l7k20L33k52J23o0R0K62k51K20j22J43j21k07K69j15k12L16r2
4611E4Nj12L9j32J48J26k32J22k89L89k91L04j38q9j6j46M26l1p3L3o6l5j52R4
4635f2j60J88P4L23m93R6r5r7L61J89k36o2n8K29k39o1j57K19J26m7p2J74k64
4658a24L00K0l74K45J38n3J92k56j5j89R5L8qk26L29J71l67K96J25j62k17j7J68
4681A09j28j0R1m80K79L30k56M9K5j02l7L33j1k99O1K5k3j24K60j64J94j03m2
4704b3j11m0K91k1J90l26J89lj90p1N1J83R3o3k23q9J37q5O3J56L4m63L11j91
4728b01J42R8K04k91Q4J71j75PJ51j63n1o7r3Q2j43K17L86l59J10j24o8L38Pj96
$$ plain form
4752 66 39 -78 -53 -85 -263 299 4 -76 -150 -146 -60 16 -99 -312 -122 -60 -226 89 134 23 -255 34 110 -46
4776 -46 101 -8 118 152 -73 245 -171 26 249 -138 -235 27 -128 -238 -124 -82 24 17 89 -254 88 340
4798 340 -131 147 94 -186 200 232 8 324 96 224 111 64 -232 -35 -69 -221 -51 -201 -82 -115 -10 48
4820 48 142 -132 -187 -101 21 233 132 6 78 -214 -42 137 70 -119 -37 -194 14 104 237 -112 88 96 51 -33
4844 -33 -21 -106 15 -59 359 1 5 -15 134 231 293 270 306 -6 48 39 -177 -87 -20 -136 124 7 -27 -28 61 -109 56
4871 56 -283 -54 -13 -219 136 57 -73 -160 157 165 -14 75 -205 110 -162 150 20 -140 89 138 93 -67 -178
4894 -178 -301 -31 212 -177 20 48 20 -6 -165 252 -103 -40 -240 109 -233 -228 -200 -293 -3 -68 229 33 -156
4917 -156 420 151 -38 -47 75 -175 -52 152 -366 98 113 -213 127 320 -33 117 -277 -22 183 -40 89
$$ packed form
4752F6k7j17K5l2j78N62k95q0p4MQ6P6j15k13J90O2j66L15M5j11k78K89P6j56
4776d6J47j09J26L4k25L18m16J97K23l87r7K62j55j10J14M2J06pP2l43L42K52
4798C40m71K78n3k80L86L2k24L16k28J28j13m7k96J97l4j52J70j50J19l3J05N8
4820D8R4k74n5Q6J22K12j01j26P2k92J72J79o7j89Q2j57K08R0J33l49K00Qm5q4
4844c3J2q5J21p4M18l58Mk0J49R7O2k3L6l12N4rk16R0O7j16K60j17l4jQ9j70J65
4871E6l39K29M1k06L55p9j30q7L17Qj79Q9k80L15k72L12j30j60K29M9m5j60j11
4894a78j23K70K43l89J97K8k8k6j59M17l55O3k00L49l42NK8r3K90o5K97j96j89
4917a56N76k69j89rJ22k50J23K04n18M64J5l26L40J93l53J50l94K55K05k23J29
$$ plain form
4938 89 -259 42 -73 -13 -116 -62 141 -18 -88 37 132 -212 69 50 -168 80 84 -21 -207 -90 -14 -119 4
4961 4 -91 86 109 -87 -22 3 -146 -456 -358 96 -124 302 -13 99 131 115 -70 -174 282 77 20 -180 355
4984 355 91 86 -46 -191 -15 93 213 -109 -167 30 -285 28 219 -178 -123 -187 26 122 384 -35 37 0 1
5007 1 -127 -137 -252 34 72 182 -167 210 241 -44 98 -89 -44 156 313 -305 -203 201 -106 -6 90 -293
5029 -293 267 32 -10 -22 -16 14 157 19 -45 67 -288 134 185 164 75 -111 194 104 -5 136 37 143 122 -108
5053 -108 117 99 -278 -1 90 -17 218 183 -44 184 75 63 -25 -247 -45 -273 6 84 1 10 -11 -109 -243 174
5077 174 -102 -138 100 -26 -13 -23 119 -78 270 -338 -207 65 39 168 -119 19 -125 -142 -89 81 45 58 151
5100 151 -174 183 405 -254 -26 27 50 -9 -113 -260 318 57 -310 -99 21 -6 -97 8 157 -168 -112 -255
$$ packed form
4938H9l48L01j15O0j03N4K03j59p0J25R5l44K81j9k18K48Mj05j86J17P6j05J23
4961Dr5J77K3j96O5K5j49l10R8M54k20M26l15J12L2j6j85j04M56k05n7k00N35
4984C55k64nj32j45J76J08J20l22n8J97l15L13J91l97N5o4K13R6K62m19P2l7J
5007Aj28j0j15K86L8J10l49L77L1k85J42j87M5K00J57o18J02M04l07J00R6l83
5029b93N60k35m2j2OL0J43j38o4J12l55M22N1k1q9j86L05r0j09J41r9J06k1k30
5053a08K25j8l77K77R1j07K35l5k27K28j09j2q8k22K02k28K79P8q3Rk1r8j34M17
5077A74k76l6K38j26J3j0J42j97L48o08J31K72k6J29k87J38j44j7N3J70l6J3R3
5100A51l25L57K22o59K28N3K3n9j04j47N78k61l67K11J20k7r1J05J49l25N6j43
$$ plain form
5122 -255 -133 -27 229 -48 65 -124 -100 112 -249 -43 22 -55 156 -216 211 91 215 -216 77 93 -292
5143 -292 52 57 423 307 212 -143 138 -105 -20 199 -207 -204 -210 -33 -166 -139 290 -10 67 148 259 -164 -205 42
5167 42 -76 358 -6 -35 -20 201 34 119 91 218 -263 1 31 -56 208 52 -175 -281 -126 1 132 169 -224
5190 -224 -96 63 -39 -22 132 -269 198 -19 28 -170 -35 183 -81 -332 215 61 24 104 -126 -156 159 -157
5212 -157 -292 -78 -100 74 -126 33 -96 71 -14 320 179 208 245 -38 -159 63 -159 22 242 -73 17 -134
5234 -134 247 95 58 96 204 58 181 -238 8 -238 48 -50 12 190 -307 -55 -41 100 -218 -96 143 366
5256 366 -12 32 -133 28 -40 -97 -44 -116 -42 20 -4 -128 74 -26 -232 80 -103 112 184 -20 26 7 -59 -245
5280 -245 -263 -7 44 17 -135 -87 57 65 16 -77 -228 -113 -148 85 51 85 -59 -157 -127 93 -184 -46 -47 -205 166
$$ packed form
5122b55J22J06K56k77J13j89K4K12l61K06O5p7K11l72M27j20J24m31K93J6l85
5143b92L44NL66j16r5l55K81k43Q5K19m06LoJ77j33K7M29l00P7Q1J11m23m1K47
5167D2j18M34l64k9J5K21j67Q5k8J27m81K64L0q7K64j56k27j06J55J27J31L7l93
5190b24J28J59j02J7J54m01M67k17M7j98J35K18k64k51N47j54l7Q0k30l0L15l16
5212a57j35K14k2J74k00J59j29J67q5L34j41K9L7k83j21K22k22J81K20l15R0j51
5234a34L81j52l7L8J08j46J23m19K46k46K86r8O2J78m97K52J4J41l18J22K39K23
5256C66l78M4j65J61o8n7N3p2P4O2k4j24K02j00k06L12j83K15P2k04M6j9o6j86
5280b45j8K56N1k7j52M8J44Qm9r3j51J15l5K33l4L4j44r8L0K20k77J38jj58L71
$$ plain form
5305 166 -28 15 -36 1 -303 72 -57 27 -71 -139 -67 -44 105 -25 164 -42 -89 -355 -276 -295 -62 95 -374 -176
5329 -176 -45 -111 -81 -121 4 -30 66 -87 69 305 -246 14 30 -56 -234 -26 169 76 -159 -183 -46 363 -204
5352 -204 117 14 -120 185 -55 52 8 -29 -209 97 -24 -247 -88 -97 -42 22 11 291 256 -278 98 -11 -169
5375 -169 -10 10 -156 -203 -227 -9 86 334 -114 -73 -9 -150 156 -30 240 -257 -285 179 75 104 -30 -198 -31
5398 -31 -181 -29 -397 -184 116 -180 -43 43 -39 82 55 -51 -168 98 -94 -177 -35 -246 35 -126 -269 99
5420 99 -109 104 -100 370 48 90 228 -122 90 22 182 101 -42 141 11 273 -132 126 -124 43 -77
5441 -77 52 -102 -103 29 -100 -153 20 -244 133 -112 -109 167 52 -113 188 -71 -76 -3 -154 77 6 114 10
5464 10 -151 26 -211 -118 -27 -21 -53 -87 -89 -100 92 -11 -94 176 -127 -89 70 -60 -96 -69 36 -119 345 118 -264
$$ packed form
5305A66j94M3n1L7l04L75j29Q4r8o8P2K3J49j30J89k06m7k66P9j9K33J57m69J98
5329a76J31o6L0m0J25l4R6j53J56K36n51K60J6q6j78K08J95r3k35k4J37M09n67
5352b04L21j03j34L05k40J07m4l7j80L06j21k23J59rN5O4j1K80l5n34L76j09j58
5375a69J59K0j66m7k4K18R5K48m48M1O4j41L06j86K70m97k8M64j04K9j34j68J67
5398c1j50J52l68K13L00k96J37Q6q2J21k7j06j17K66j92q3J42k11K81j61j43L68
5420I9k08K13k04M70l22M2J38l50K12o8J60q1j43J83j30K62m05K58k50J67j20
5441g7J29j54jJ32j29n3J73k64L77k45LK76j15j65L01k59nP3j51K31p1J08j04
5464A0j61J77k37R3R1Ol2l4kj1J92j03q3K70l03L8J59j30l6K7J05j55M64k27l82
$$ plain form
5489 -264 -41 -83 -70 -157 -43 4 -337 40 -28 -57 -99 -33 106 -12 -125 -162 -99 -171 53 115 236 15 168 -329
5513 -329 25 -297 52 34 67 -79 -115 99 -203 -83 145 -6 112 159 220 14 76 149 112 -322 284 -28 -78
5536 -78 -33 51 288 -133 93 -125 -67 -99 73 20 15 23 148 113 -17 -73 -53 -224 -40 350 -188 -106 30 84 342
5561 342 157 259 179 19 16 39 58 -62 112 -13 216 -90 -202 57 42 -122 -77 133 264 381 18 -296
5583 -296 -84 -143 34 -65 -74 153 -32 -31 174 -176 11 226 49 -361 -12 -22 194 -38 -52 -78 55 4 112
5606 112 87 -39 193 -72 38 -192 199 73 1 17 -69 -6 -68 224 152 -94 -142 -128 13 70 -19 -188 81 205
5630 205 -266 241 -170 99 -121 62 83 -309 110 12 106 -65 111 -3 181 -42 -136 158 39 -354 90
5651 90 7 58 76 4 19 -121 215 233 -24 -127 94 -239 86 -137 -182 -117 6 -116 81 -74 -164 144 -15
$$ packed form
5489b64K23m2J3q7J14M7l41L77o8k9m2O6J39j18j13l7O3p2K24O2J21k21J53m97
5513c29L54l22L49j8L3j46l6K14l02J20K28j51J18M7O1k06O2P3l7m34O06l12n0
5536g8M5Q4K37m21K26k18N8l2J72n3nQJ25l5j30n6K0j71J84L90n38Q2J36N4K58
5561C42j85J02q0j60lK3J9j20J74j25K29l06j12K59j5j64M5K10J31J17l63l14
5583b96K12n9J77r9rK27j85JK05l50J87K15j77m10L49j0K16k32j4k6J33n1J08
5606A12k5j26K32k65J10k30L91j26p2J6q6O3o2K92p2k46m8J4J41N7q9j69K69J24
5630B05m71N07m11K69k20J83K1l92M19r8R4j71J76j14J84k23r4K94j19l93M44
5651I0q3N1J8p2J5j40L36J8k57j03K21l33L25k23m5O5J23j22J97j55r0L08j59
$$ plain form
5674 -15 90 -13 -51 84 229 76 53 69 58 -129 -33 -264 37 -16 -154 -156 200 -260 -25 -61 152 -55 -160
5697 -160 278 -52 -31 37 -144 4 -165 -18 155 34 -256 -251 74 -119 275 34 348 -67 175 256 -211 -73
5719 -73 -138 163 -305 -129 121 -271 -237 93 206 -68 -114 110 48 -39 140 -36 -88 29 -322 -75 15 -92 5
5742 5 -56 12 -394 -137 -47 167 -136 131 -86 63 193 -378 195 71 21 76 -214 -286 70 131 -71 8 -141
5765 -141 85 -66 38 -155 286 183 -28 200 86 -84 -90 -49 206 -5 70 308 220 34 -24 -5 129 158 48
5788 48 -17 -51 -98 193 -100 52 69 41 345 -83 84 -404 -115 -48 23 254 -36 191 139 -241 -18 -273 -106
5811 -106 -71 83 -43 39 217 -69 -117 -77 -112 -34 46 -235 96 57 188 -46 -192 80 -66 56 -51 -16 21
5834 21 201 53 -342 -38 -174 -252 -180 80 -177 -264 -98 -100 203 186 165 -338 313 108 -35 -125 88 30 104 80
$$ packed form
5674a5J05j03l8J35J45j53k3J6j1j87R6k31L01n3j38kL56m60K35l6K13k07j05
5697a60M38l30K1O8j81J48j69J47J73j21k90NL25j93L94k41L14m15K42Q1m67J38
5719g3o5L01m68J76K50l92L4L30J13k74m6K24o2q7J79j76n2J17l51K47R0j07R7
5742Eo1O8m06K57R0K14l03K67k17J49J30n71N73j24n0N5k90p2L56O1k02P9j49
5765a41K26j51J04j93M41j03k11K28j14j70oM1K55k11P5K38q8j86n8J9J34K9j10
5788D8o5l4m7K91k93J52J7k8L04m28J67m88K89O7P1K31k90K27n2l80K23k55J67
5811a06L5J54j26Q2J78k86m8M0l5P8Q0k81L31l9J31k34j46K72j46J22j07L5L7
5834B1J80j48l95L04j36p8P2K60k57q7J66kL03j7k1n03O51k05j43r0K13n8P4k4
$$ plain form
5858 80 29 217 -7 268 76 -169 58 271 -17 139 -134 5 138 -166 182 115 -173 111 -58 32 297
5879 297 -42 -57 149 -17 -177 17 -146 -293 38 29 81 207 119 184 -363 203 1 71 241 -141 -38 -43 -76
5902 -76 -109 47 -132 -29 227 65 189 98 -209 -104 151 69 -16 111 -291 191 -292 142 17 -171 -5 -38
5924 -38 31 67 181 159 444 -54 -46 -60 -69 -65 -9 -113 69 -94 -56 240 18 21 -48 60 80 -72 125 -122 54 179
5950 179 64 72 65 42 -97 -328 158 -45 -127 176 -41 65 -114 -77 -56 -6 -16 172 73 -96 261 -24 -99 288
5974 288 -44 -2 412 163 -23 103 -184 210 -96 127 78 -43 -153 25 -175 -87 245 -80 89 46 -39 259
5996 259 31 -155 -49 -306 -75 -14 199 -291 27 -56 159 -95 -39 221 -6 -211 -106 -158 19 187 -102
6017 -102 -171 -34 -115 -31 -159 343 276 28 -40 61 -41 -173 72 -253 252 -128 -24 98 -312 94 -273 37
$$ packed form
5858H0n1J88k24K75j92k45K27K13k88J56k73J39J33l04L48o7k88K84j69R0K65
5879B97l39j5K06j66j60J94j63j47L31rN2J26q8O5n47N66k02P0J70l82J03nl3
5902g6l3J56j79J03K56j62J24r1l07J05K55q2q5J27m02M82m83M34j25j88J66l3
5924c8O9L6J14k2K85m98Qj4rMN6j04J82j63L8K96k22Lo9J08K0j52J97k47J76J25
5950A79j15Qpk3j39k31M86k03q2L03k17J06j79L7K1N0j0J88r9j69L57k85p5L87
5974B88l32M2M14k49j86J26k87L94l06K23m9j21j10J78k00Q8L32l25J69m3q5K98
5996B59k28j86J06k57K31O1K13m90L18q3K15k54N6K60k27k05J05n2J77J68k89
6017a02o9J37q1Q4j28N02o7k48o8J01j02j32K45l25N05l80J04J22m10M06l67L10
$$ plain form
6039 37 244 440 -36 158 62 -88 -49 -74 -45 -39 135 127 -48 -326 191 227 -191 272 122 -11 -60 109 -112 222
6063 222 241 -514 66 215 321 -9 -120 203 -174 -144 110 193 -108 124 -166 169 63 16 96 47 -14 169
6085 169 178 -53 36 153 101 -181 -15 -203 16 68 52 78 84 105 -43 -244 -220 -62 275 -137 -65 -147 -14 -82 109
6110 109 119 105 38 78 217 124 33 -130 114 -26 22 91 47 -72 33 -52 304 186 -50 32 -101 -70 74 -242
6134 -242 -216 46 -99 -174 -64 -58 -127 148 -33 221 20 172 12 -31 149 132 344 88 14 140 -249 -11 -139
6157 -139 -51 -85 175 83 98 -164 -190 -382 326 -71 -57 334 -236 54 -147 -13 96 134 320 139 163 -134 -165
6180 -165 -320 -1 275 6 -17 -11 -34 -196 -132 -28 138 113 237 86 173 338 263 -139 -66 -139 85 98 300 -337
6204 -337 163 -156 135 7 -106 192 66 -208 144 36 -34 154 -138 -3 -90 -235 188 -173 10 -88 -93 -160
$$ packed form
6039C7K07J96m76J94r6j50L9k5K9OJ74qj75k78N17L6m18M63j50j33m9J69k21L34
6063B22J9p55N80J49J06l30j11L23l77L0K54Q3l01K32k90L35j06m7Q0m9o1J83
6085A69Rk31Q9J17n2k82J66j88K19N2j6K6OK1j48k01K4J58L37m12P2q2J33o8J91
6110A09J0j4o7M0J39r3r1j63K44j40M8O9m4j19J05q5L56j18k36Q2j33L1J44l16
6134b42K6K62j45p5J10Oo9K75j81K54k01J52j60m3J80j7K12k56p4J26l89K38j28
6157a39Q8l4K60r2J5k62k6j92P08l97J4L91n70K90k01J34J09L8J86j81K4k97l1
6180a65j55L19K76k69k3Ok3j62O4J04J66k5J24j51Q7J65p5m02P3p3K24J3K02o37
6204c37N00l19K91j28j13K98j26k74L52j08p0J88k92J35q7j45M23l61J83r8no7
$$ plain form
6226 -160 -64 50 -227 241 -210 162 219 294 85 -338 151 39 66 -18 -199 -83 49 146 -22 50 -299 150
6248 150 -30 9 293 83 -21 41 -37 93 21 -232 120 61 -59 32 -122 131 -138 138 82 31 306 148 295
6271 295 -266 57 -75 -217 -215 -52 -290 -16 238 -65 -121 223 41 -165 179 -1 219 128 140 210 68 68 220
6294 220 -248 -82 -28 -380 127 144 -275 111 -19 -127 59 -66 140 78 -78 -172 121 -115 65 22 33 -231
6316 -231 116 142 56 -102 68 28 -80 -20 162 -29 170 -61 -189 146 -121 -148 134 14 -221 -220 -322 28
6338 28 63 -145 69 -119 -88 48 -144 -60 -143 5 -162 -76 -110 -259 -52 -34 -20 -168 -105 44 -96 55 75 -285
6362 -285 -278 -75 168 50 11 20 -101 -182 202 66 -39 142 37 -64 -91 -42 32 114 -433 -224 -171 141 -189 -184
6386 -184 -159 57 -192 -232 67 53 92 53 -5 277 -75 -25 -4 -68 8 213 235 -160 35 0 -227 75 26 186
$$ packed form
6226a60R6J14k77M68m51L72N7P5k09m23M89j12K7q4j81J16J32R7j68P2l49M49
6248A50j80L9K84k10j04O2p8J30p2k53L52n9j20R1j54K53k69K76n6n1K75j58J47
6271B95n61L23j32j42KJ63k38K74K54l03n6L44j82k06L44j80K20r1J2P0j42%J52
6294B20m68J66N4l52N07J7m19L86j30j08J86j25K06o2j56r4K93k36J80m3J1k64
6316b31L47K6q6j58J70m0j08O0J82j91J99k31j28L35k67k7K82j20k35Jj02L50
6338B8L5k08K14j88L1J36j92Q4q3J48j67Q6l4j49K07J8J4j48O3J49j40J51K0l60
6362b85PK03K43j18l9Rj21q1L84j36j05J81j05j01k7M9P4Q2n47K09N3L12l30N
6386a84K5K16k49m0K99j4L9l9n8K82l52N0K1o4P6K05K2l95J95l5k27L02m9J60
$$ plain form
6410 186 10 -30 9 79 -274 -162 303 -105 9 117 -147 83 -169 182 69 -67 73 -38 -128 -10 -154
6431 -154 -21 -58 -126 -4 84 20 98 200 191 -250 -19 -113 90 122 6 68 30 -70 11 10 -39 67 -325 67 131
6456 131 -58 -99 -56 -9 33 -15 212 -27 -171 127 -72 -107 72 -79 -115 -127 -95 -254 154 -333 27 170 -144
6479 -144 158 227 -206 324 192 -60 -135 -321 51 -265 113 132 262 201 105 187 -356 -55 48 52 106 -150 316
6502 316 64 -3 230 274 -53 -47 -40 -149 -21 -143 59 113 -127 277 144 -447 -4 -45 -110 62 -165 -111 -130 130
6526 130 110 21 -103 134 -87 -254 147 12 27 -248 -39 2 -239 -6 -103 112 -119 -26 227 -129 285 3
6548 3 -223 -254 124 -61 22 128 -123 185 162 150 133 -43 145 -147 -63 105 -157 -107 -71 2 5 -43 69 114 -18
6573 -18 -83 13 -138 29 17 0 24 103 19 -255 -43 139 -185 185 119 18 110 88 226 -11 73 -283 88 145
$$ packed form
6410A86j76m0L9P0l53J12M65m08J14J08k64K30k52L51j13j36J40j11r0J18j44
6431a54J33l7o8J22Q8o4P8J02rm41K31r4K03L2j16O2l8j00Q1jm9J06l92L92O4
6456A31j89m1M3M7M2m8K27k39j44K98j99l5J79j51l6j2L2j59M08m87L60J43l14
6479a44L02O9m33N30j32k52p5j86L72l16L78J9J30o1r6Q2n43L01J03MN4k56M66
6502C16k52o7K33M4l27OPj09J28j22K02N4k40M04j33n91M43m1o5J72k27N4j9K60
6526A30k0q9j24K37k21j67M01j35J5k75K09M1k41K33r7K15k31R3K53l56M14k82
6548Ck26l1L78j85Q3J06k51L08k3j2j7j76J88k92Q4J68k62N0L6P3Lm8J12M5j32
6573a8o5R6j51J67j2j7K4P9q4k74K12J82l24L70o6j01R2k2J38k37Q4l56L71N7
$$ plain form
6597 145 245 -73 -168 129 -236 -271 -97 -89 -27 -231 112 -127 -181 70 -53 82 -90 -50 -71 56 -77 164 -122
6620 -122 -1 -275 -176 -140 -55 -197 46 76 -174 120 82 -89 33 68 -4 112 220 171 29 -282 -20 127 -237
6643 -237 37 84 186 67 556 42 -211 -171 3 -385 -101 108 75 -63 12 209 144 0 -144 -158 145 146 116
6666 116 -74 134 -173 18 -285 -119 -149 -100 177 -65 27 45 -189 -155 -21 75 -204 -45 -35 174 0 -134
6688 -134 137 -112 -51 -116 139 26 223 -114 -142 -203 -32 58 73 -83 -4 -117 -178 -25 -189 156 -25 -265 218
6711 218 163 -170 209 -56 -163 287 -219 83 151 -216 136 281 -163 11 -178 -78 -103 117 -35 -159 201
6732 201 -361 -6 -140 108 -160 -106 -100 -78 -46 0 14 63 58 -144 72 -66 6 192 -217 -56 -77 22 5 227 -82
6757 -82 4 138 137 174 -195 144 113 233 161 92 -113 38 56 -311 -86 96 -7 296 -84 -133 182 -272 -92
$$ packed form
6597A45J00l18r5K97l65l5J74QO2k04L43k39n4K51j23J35j72M0k1J27j33K41k86
6620a22J21k74R9L6Q5j42K43L0k50K94l8j71J22L5p2J16J08m9j42l11K62J47l64
6643b37K74M7J02j19M89n14k53M0J74l88K84K09l3j38P5J97o5j44j44j4L03Jl0
6666A16j90K08l07J91l03J66l0M9K77k42R2J8k34L4J34R6k79J59J0K09j74j34
6688a34K71k49O1o5K55j13J97l37k8o1J71R0J5j56P9j13o1J53j64L45j81k40M83
6711B18n5l33L79k65j07M50n06L02O8l67L52J45m44J74j89J00k5K20j52j24L60
6732B01n62L55j34K48k68N4OK2L2M6J4M9nk02K16j38P2J86m09J61k1R9j7K22l09
6757h2Q6J34jL7l69L39l1J20p2o9k05J51J8l67K25J82j03L03l80m9L15m54J80
$$ plain form
6780 -92 19 32 -154 308 94 30 -187 -190 193 -158 -130 -100 -80 -142 58 -330 58 83 133 13 71 -100 110 178
6804 178 209 -54 -90 -177 251 -298 -129 -122 -50 -73 -109 -86 20 -147 228 126 199 -151 121 146 94 151 106 55 -99
6829 -99 4 -53 -3 -88 231 -94 -321 -14 159 -106 21 -50 -51 -78 -156 -117 1 170 -230 -149 -87 -257 190 -200
6853 -200 -158 -333 -15 -130 -64 183 -213 -52 -36 -362 25 44 259 271 260 -242 -131 12 86 134 -186 -22 50
6876 50 216 81 58 -363 3 -70 -78 242 126 -14 89 60 56 70 -39 -165 2 174 130 68 16 344 14 -99
6900 -99 -242 163 -12 -82 -21 96 -181 -123 266 -143 190 -18 109 -5 -73 -50 186 -23 5 -216 -86 47
6922 47 33 66 -31 -258 -253 -78 -73 -100 -59 146 -173 23 42 -266 221 -235 104 -89 -80 -103 -102 -143 -84 117 -217 388
6948 388 -61 -26 -8 76 -83 117 19 166 298 -31 101 17 -34 -174 -91 -214 27 246 -235 -40 -89 140 -108
$$ packed form
6780i2J11J3j86M62k14o4k17lL83l51K8L0K0o2K00l88L88K5N0j20N8j71K10O8
6804A78L1k63l6q7M28n49J69PP2k3l6K3J06j67L75j02P3l50K72K5n2N7m5n1j54
6829i9J03n7N0q5L19l25k27L07J73k65J27p1jk7p8L9J18J69m00Q1O2j70M47l90
6853b00M2j75L18j15O6K47l96J61J6l26L87J9K15J2j1n02J11J43P4M8l20J64P2
6876E0J66j35k3m21L66p3qL20j16j40J03k9mJ4j09j26J67J72m4o2n2L28l30j13
6900i9j43M05j75p0O1J17k77N8L89m09L33k08J27j14o8K3K36k09K8k21J30J33
6922D7j4L3r7k27NJ75Nk7M1K05l19J96J9l08M87m56L39j93Rk3Jm1N9K01l34O05
6948C88m49L5J8Q4j59K00r8J47J32l29J32q4n1j40Q3j23K41K19m81J95m9K29k48
$$ plain form
6971 -108 -22 34 -24 -138 -14 202 27 -88 -142 -29 -23 109 -11 -107 -411 -207 -40 -63 202 -183 -125 -159 -183 -102
6995 -102 43 -501 -277 85 -56 160 84 55 -4 280 50 143 95 193 130 10 184 -258 -36 -172 -54 253
7017 253 397 -64 -162 105 -248 28 21 105 233 206 -65 108 -170 45 -155 2 343 164 66 155 -218 211
7039 211 -169 135 61 -106 158 72 82 103 -171 149 -204 120 -21 263 101 295 -85 -214 -32 202 32
7060 32 192 18 -167 -109 52 134 159 128 -161 307 23 -186 67 -106 -37 143 12 -116 207 -221 -270 -127
7082 -127 -180 37 -337 74 240 354 -219 135 141 -122 143 -2 162 -46 -86 21 137 -22 121 -259 103
7103 103 202 130 -172 308 -133 206 80 126 199 120 -94 -104 -322 -77 127 -111 -98 -184 -213 -90 -40 86 16 -159
7127 -159 30 -225 -42 168 151 306 -293 -66 -347 -231 175 -210 174 -259 -147 53 66 55 -58 -29 -57 -337
$$ packed form
6971a08Q6N6n8j14J24K16j75j15n4J13OJ32j20r6l04K04J67k3K65l85N8l4k4Q1
6995a02J45n44K24L62j41K16p6k9n9K84k30R3m8R8o3j20J74m42K22j36J18L07
7017B53J44m61r8K67l53K76pQ4J28k7k71J73k78K15k00J57L41j79r8Q9l73M29
7039B11l80L04p4j67K64q6J0K1k74L20l53L24j41K84j62J94l80j29J82K34j70
7060C2J60j74j85N8J61Q2K5l1k89M68k84k09K53j73O9J80j31j28L23m28m9J43
7082a27n3K17l74M11J66J14n73L54Ok63K65j45J64k08m0J07J16j59J43l80L62
7103A03R9p2l02M80m41L39j26M6P3p9k14j0k18K45K04k38J3q6k9J23N0J26p0j75
7127a59J89k55J83K10j7J55n99K27k81J16M06l85L84m33J12K00J3j1j13K9k8k80
$$ plain form
7149 -337 64 178 50 -85 -85 -273 34 -42 315 132 18 -256 -198 -129 -196 -141 -86 -281 73 15 147 -76 64
7172 64 -94 -21 20 420 110 -50 311 -375 -73 64 249 164 69 -111 51 -92 -311 -66 -240 -10 -131 252
7194 252 -197 -12 -356 -131 143 203 54 49 -137 88 -18 102 -51 -199 12 123 -247 84 21 -209 203
7215 203 123 262 78 -99 -28 -69 184 -216 132 -55 2 -102 80 113 -179 -164 -84 -158 -244 39 144 431 -117
7238 -117 -230 -13 -53 -147 155 -55 27 -194 -419 185 123 -23 86 96 -300 -34 -104 1 -72 120 -79 -41 -69
7261 -69 -107 -138 399 338 297 -89 327 -179 -31 22 -195 14 -69 3 73 215 -265 -8 -359 -126 297 -20 279
7284 279 25 145 -163 285 -324 -234 -43 -20 311 59 33 122 -26 -81 199 -90 -20 178 -23 210 -5 111
7306 111 55 124 -272 -133 -39 -89 149 156 204 218 42 201 -323 6 234 -161 -82 -11 95 -100 -20 -267 35 193
$$ packed form
7149c37M01J14j28j35%j88L07p6L57j83j14k74N8O9o7N5N5j95L54n8J32k23J40
7172F4j58P3M1M00l10j60L61o86L02J37J85q5r5j80J62j43k19K45j74K30j21L83
7194B52m49J85l44K25K74O0j49nj86K25j06J20j53j48K11J11l70L31o3k30M12
7215B03q0J39j84j77P1m1K53m00L48j87N7j04J82L3k92J5Q0p4q6K83J05K87n48
7238a17j13K17m0r4L02k10Q2k21k25O04o2j46J09J0l96K66p0J05p3J92j99L8k8
7261f9l8l1N37o1m1l86M16n06J48N3k17K09q3P2P0J42m80K57l51K33M23l17K99
7284B79k54J20l08M48o09R0J91K3L31k52k6Q9j48n5K80k89P0J98k01K33k15J16
7306A11n6O9l96J39R4n0K38PM8J4j76J59n24L29K28l95P9P1J06j95Q0k47L02J58
$$ plain form
7330 193 -2 47 -105 -340 122 -42 -237 71 -160 120 -144 -53 154 57 -11 -102 -42 -7 88 -57 -159 139 98
7353 98 71 65 -103 141 190 -378 178 -224 -107 14 -180 19 -88 -77 -83 101 -143 -155 -82 -65 -91 -250 -211 -178 -223
7378 -223 3 166 -121 -122 8 -200 -139 -278 87 373 243 25 -24 75 -109 278 -65 -99 41 -25 84 -67
7400 -67 49 219 -128 151 -112 193 82 43 30 -137 47 -118 227 -55 197 13 -196 288 -198 -290 23
7421 23 -91 105 -2 26 195 -192 193 -26 -115 -285 131 -157 96 201 167 75 -173 240 -114 142 -8 43
7443 43 -17 48 99 183 -151 51 99 -120 334 -30 -147 40 -146 116 -3 143 291 -108 179 -115 175 -64
7465 -64 53 -35 11 -29 118 92 72 -137 -20 123 -89 218 -267 30 -19 167 -45 -83 -117 49 -120 143 242
7488 242 155 233 174 -49 -33 -8 -121 180 -78 175 37 -137 -15 53 -193 197 76 -85 7 -16 24 -70 -32 273
$$ packed form
7330A93j95M9j52k35M62j64j95L08k31K80k64R1K07r7o8r1O0L5R5j45j02K98m1
7353I8k7oj68K44M9n68N56m02J17J21j94J99j07J1oJ84k44j2P3J7k6j59L9L3m5
7378b23K26J63k87jJ30k08O1j39L65K86j30k18m9R9j84L87l43l4J40o6J09j51
7400f7J16J70l47K79k63L05j11l9j3j67J84j65L45k82K52j84k09M84m86r2L13
7421B3j14J96j07K8J69l87L85k19q9j70M16k88K53J05l4r2k48M13l54K56j50N1
7443D3o0O5N1Q4l34K02M8k19M54l64j17J87j86K62j19J46J48l99K87k94K90k39
7465f4J17q8M6m0J47k6k0k09J17J43k12L07m85K97m9J86k12l8l4J66j69K63R9
7488B42q7P8n9k23J6K5j13L01k58K53j38j74J22O8k46L90j21j61R2k3M0r4L8L05
$$ plain form
7512 273 -27 33 83 53 -65 47 180 -115 16 -21 -170 193 25 51 75 -54 294 315 139 -47 58 118 66
7535 66 160 -79 121 -259 9 -120 -63 -264 119 -41 118 -239 -154 -143 -164 -53 152 -50 -9 -164 -55 -48 90
7558 90 349 -141 24 22 -140 -209 81 16 -75 33 276 17 65 149 63 14 -49 193 -147 116 -3 14 -40 -208
7582 -208 -343 -92 24 -152 131 112 218 -3 265 -344 -149 -32 -62 121 214 -117 201 259 -179 242 -134
7603 -134 -164 82 -146 -70 138 298 93 102 -166 -19 -37 -140 59 172 -130 -117 33 138 116 80 246 211 122
7626 122 236 -51 121 -301 -94 208 131 29 83 -113 -128 -31 -99 -55 -224 -23 161 124 -85 -22 86 90 -33
7649 -33 116 -217 -142 4 193 97 -275 120 62 -69 102 189 -33 12 48 67 -11 -99 -3 4 78 -160 -179 -341 -101
7674 -101 -10 -174 179 -167 0 186 -301 -142 -49 -215 62 88 -17 -119 -193 241 51 -195 8 -60 262 -211
$$ packed form
7512B73l00O0N0l0j18J12J33k95J31l7j49L63j68K6K4j29L48K1j76j86J05O0n2
7535F6R4k39K00l80K68j29N7k01L83j60J59l57Q5J1k1J11K05k02M1j55J09PJ38
7558I0K59m90J65kj62o9K90o5r1J08K43k59M8Q4q6m9o3K42l40K63j19J7n4j68
7582b08j35K51J16j76K83j9J06k21K68o09J95J17l0J83R3l31L18N8m38M21l76
7603a34l0K46k28P6K08J60k05Rk68J47j8j03J99J13l02J3J50J05k2l6J66l5q9
7626A22J14k87J72m22K07L02p7j02N4j96j5R7o8M4j69K01J84l7k09O3J08Mj23
7649c3J49l33P5J46J89r6l72L95n8j31J71Q7k22M5L6J9p8q8R6PP4k38j9j62K40
7674a01R1j64L53l46J67J86m87J59R3j66K77K6j05j02p4M34j90k46K03o8L22m73
$$ plain form
7696 -211 95 83 -3 360 -19 -23 -174 47 161 128 -67 -285 64 6 307 210 -39 12 -215 12 212 -257 90
7719 90 -143 375 213 -89 40 23 -131 108 78 -48 257 112 383 60 55 41 152 -134 -151 -47 -223 53
7741 53 124 -165 -33 -75 17 109 37 142 -7 -81 57 96 -6 -42 -211 230 407 32 184 -144 -47 5 210 111
7765 111 254 84 43 26 32 -73 -39 -112 262 -13 -1 -138 46 -138 10 42 67 72 224 18 -159 -284 44 11
7789 11 -236 -45 -149 82 74 154 33 -14 48 -131 205 13 -256 -106 -299 -28 67 -9 38 218 -173 81 205
7812 205 -69 142 38 -29 259 204 245 -128 123 -43 -86 213 -145 -244 -104 -15 210 197 204 -38 335 36 86
7835 86 129 61 26 78 -128 -90 -66 -244 117 -108 -67 175 296 95 160 224 90 170 -54 140 110 29 141 71 -119
7860 -119 167 -59 -65 129 60 17 29 42 -101 70 40 61 -336 -71 -167 -88 178 26 127 60 175 387 -183 257
$$ packed form
7696b11L06j2q6L63l79mj51K21J14l3j95k18L49n8L01r7k49N1k27K27K00m69L47
7719I0k33N18j62l02J29j7j54K39l0j26L05j45K71l23nj4J11k86j7J04j76K76
7741E3P1k89J32m2R2R2p2J05j49p4J38L9j02l6j69M41J77l75J52l28R7N2K05r9
7765A11J43j70m1j7Oj05L4p3L74k75J2j37J84j84J48L2K5NJ52k06j77j25L28l3
7789A1k47J91j04K31qQ0j21m7O2j79L36j92k69J50j93K71R5p6M7J80l91K54J24
7812B05k74K11j04o7K88n5M1l73K51j66m3K99l58r9J40Q9K25j3Pk42L73k99N0
7835H6M3o8l5N2k06L8K4j78L61k25M1K42J21k01O5O4j34Q0k24J94l0q1J12p0j90
7860a19K86k26oJ94o9m3J2J3j43J71l0K1l97K65r6P9K66j52J01o7J15K12n70M40
$$ plain form
7884 257 15 -101 -258 -40 86 114 -126 -131 20 -119 2 -234 295 430 -245 -46 173 -288 98 -236 -66
7905 -66 -244 -59 8 -351 129 38 101 -62 183 77 -158 39 26 214 242 4 101 11 9 -146 115 35 -154 -129
7929 -129 58 -1 -89 327 286 52 73 -109 52 -84 -69 1 -41 -13 147 265 -171 -122 -135 46 -75 46 79 113
7953 113 37 -95 14 319 20 119 46 -72 28 -122 161 -251 -58 249 167 -46 -149 178 -77 -19 96 -42
7975 -42 -125 -91 123 151 174 195 182 50 -122 -134 -109 -82 44 -257 30 42 42 -107 -171 -328 -156 -43 72 42 116
8000 116 73 36 -45 -282 -358 210 21 -237 -32 -97 -70 -57 52 -136 -113 -212 37 -2 179 58 162 267 -215
8023 -215 3 147 -219 -43 54 -150 131 197 13 -197 -84 82 -133 -178 75 17 -59 106 3 -147 64 21
8045 21 -184 37 -72 28 -53 -278 56 34 51 26 -81 -75 127 -92 -113 61 0 -121 167 199 -41 -180 71
$$ packed form
7884B57k42j16j57K18J26K8k40nJ51j39J21k36N29J35o75J99K19m61L86l34J70
7905f6j78J85O7l59M80r1O3j63K45j06k35J97j3J88K8k38R7r0kj55K61q0j89K5
7929a29J87n9q8M16m1k34K1j82J61j36J5P0m2K8J60J18m36M9j3J81j21J21L3L4
7953A13p6j32J09L05k99R9p3j18J00j50K83m12J93L07q2k13j03L27k55N8J15j38
7975d2q3L4K14K8K3K1j3j32j72j2K5K7J26l01K87J2%j49o4j57J72J13J15l0P4
8000A16m3l7q1k37p6N68j89k58K05o5K7J3J09j88K3r9K49l9J81j21J04J05m82
8023b15K18J44l66J76R7k04K81O6j84k10J13J66k15m5K53n8p6J65j03j50K11m3
8045B1k05K21j09J00q1k25L34k2J7k5j07OK02k19k1J74o1j21K88L2k40j39K51
$$ plain form
8068 71 137 -54 -148 -93 -205 43 -158 33 234 8 163 183 162 -39 -197 198 -494 -116 104 7 42 65 146
8091 146 -206 -40 -255 113 4 50 105 -87 -118 -32 -220 -81 -112 -20 9 -78 -37 -130 -62 -125 -159 6 -19 21 -179
8116 -179 -31 44 -260 -47 -19 101 -163 33 20 55 -64 -37 24 -200 195 -312 99 -218 60 147 122 174 -101
8139 -101 -37 103 -48 173 3 -68 188 180 -82 -116 162 9 -204 49 28 111 221 -125 -91 -127 -147 -127 60 -150
8163 -150 275 -35 -263 -42 6 33 66 121 -32 -196 -177 318 -287 -51 185 -47 -52 62 -10 67 188 -36 110
8186 110 58 63 -277 -130 -72
$$ packed form
8068G1O6j91r4N5j12K48k01J91K01k26J55K0k1k01j58L95o92L78K20r7L5K3Q1
8091A46l52J66k15L68j09M6N5j92l1Q6j88J39l1R2K9q7M1r3O8o3l4J65k5M0k00
8116a79J48P5l04K13K8J20k64J96j3L5j19K7O1k24L95n07M11l17K78Q7k5N2k75
8139a01O4J40j51K21j70p1K56qk62l4K78j53k13K53k1Q3J10l46L4l6k0K0J87k10
8163a50M25l10k28K21M8K7L3N5j53j64J9M95o05K36K36k32nJ14p2P7J21k24J46
8186A10n2Nl40J47N8
8191g2
$$ Imaginary data points
##PAGE= N=2
##DATA TABLE= (X++(I..I)), XYDATA
$$ plain form
0 0 0 0 0 0 0 0 0 0 0 -8 8 -8 16 -16 24 -24 32 -40 48 -62 72 -88 104 -120 144 -168 193 -224 257 -297 338
31 338 -386 438 -496 559 -630 708 -793 888 -990 1104 -1225 1357 -1504 1663 -1837 2028
47 2028 -2235 2464 -2715 2990 -3295 3631 -4007 4429 -4902 5441 -6061 6779 -7628 8645
61 8645 -9894 11464 -13512 16301 -20342 26752 -38489 66940 -284867 -102776 500949 -46703
73 -46703 -203363 181523 187819 -241267 -107566 158159 -89824 -249563 230386 348042 -103874
84 -103874 -243256 38050 85053 -86350 -129562 52033 150638 88546 16309 -76555 -174041
95 -174041 -76422 81407 116905 23057 -65882 17025 125730 -10099 -176408 -124530 66030
106 66030 177487 70256 -60489 -17509 -7112 -58140 -25752 -17603 -38864 54993 166159
$$ packed form
0@%%%%%%%%%qJ6j6K4l2M0m8N6p2Q8j10J34j60J92k24K64l12L61m17M81n54O35
31C38p24Q24r34J055j189J338j501J681j878K094k329K582k861L167l500L865
47B028m263M699n179N705o285O926p638Q436r331J0343j1502J2840j4407J6273
61H645j8539K1358k4976K9813l6643M7094o5241J05429l51807J82091O03725n47652
73d6703j56660L84886O296m29086J33701K65725k47983j59739M79949J17656m51916
84a03874j39382K81306M7003j71403m3212J81595R8605o2092p2237r2864r7486
95a74041R7619J57829L5498r3848q8939Q2907J08705j35829j66309N1878J90560
106F6030J11457j07231j30745M2980J0397n1028L2388Q149k1261R3857J11166
$$ plain form
117 166159 68220 -179282 -170793 90802 99436 -70531 -16260 71666 34853 39451 9659 -124978
129 -124978 -139429 64061 188886 19110 -105744 13212 36838 -50477 -27940 -29878 -47226
140 -47226 75296 145798 1157 -153638 -70663 101914 42261 -83996 -9162 71138 46717
151 46717 26796 -31480 -101678 -66892 57799 130011 10367 -115435 -11728 92024 1718
162 1718 -96537 -66613 48033 101428 27999 -31459 -44732 -42504 28571 55164 -28851 -53626
174 -53626 25445 98787 44349 -110579 -110302 45298 85783 11476 -37704 -28061 21955 29019
186 29019 -5856 -36825 -64887 9203 122240 45357 -91259 -62003 41458 59845 -21493
197 -21493 -60067 10571 45611 29245 15114 -59144 -82276 29078 86821 10843 -71822 -36752
$$ packed form
117A66159r7939k47502Q489K61595Q634j69967N4271Q7926l6813M598k9792j34637
129a24978j4451K03490J24825j69776j24854J18956K3626q7315K2537j938j7348
140d7226J22522P0502j44641j54795Q2975J72577n9653j26257P4834Q0300k4421
151D6717j9921n8276p0198L4786J24691P2212j19644j25802J03707J03752r0306
162A718r8255K9924J14646N3395p3429n9458j3273K228P1075K6593q4015k4775
174e3626P9071P3342n4438j54928K77J55600M0485p4307m9180R643N0016P064
186B9019l4875l0969k8062P4090J13037p6883j36616K9256J03461J8387q1338
197b1493l8574P0638L5040j6366j4131p4258k3132J11354N7743p5978q2665L5070
$$ plain form
209 -36752 69206 50413 -53917 -54793 -1682 38686 61942 4288 -60866 -33458 32081 56759
221 56759 -11907 -77137 -5042 70007 33142 -31963 -65294 -20599 58659 41419 -24360 -46739
233 -46739 -14614 52847 43943 -42150 -51669 9041 54752 41788 -38868 -61228 10105 46230
245 46230 25909 -23862 -55484 4005 55486 13750 -41185 -50454 11553 71901 18101 -50451
257 -50451 -34670 8904 44695 22301 -40404 -29866 26801 48146 13339 -59167 -52111 34984
269 34984 51200 4973 -29383 -33465 13729 38910 -6687 -44980 -31802 36436 76852 -2985
281 -2985 -68213 -18982 29977 25950 -6176 -28854 911 32464 27443 -2552 -60292 -49981 43974
294 43974 61471 -7645 -44110 -11831 40711 17562 -47364 -33158 13852 36711 44420 -496
$$ packed form
209c6752J05958j8793j04330q76N3111M0368K3256n7654o5154K7408O5539K4678
221E6759o8666o5230P2095P5049l6865o5105l3331M4695P9258j7240o5779k2379
233d6739L2125O7461q904q6093r519O0710M5711j2964q0656k2360P1333L6125
245D6230k0321m9771l1622N9489N1481m1736n4935r269O2007O0348n3800o8552
257e0451J5781M3574L5791k2394o2705J0538N6667K1345l4807p2506P056Q7095
269C4984J6216m6227l4356m082M7194K5181m5597l8293J3178O8238M0416p9837
281b985o5228M9231M8959m027l2126k2678K9765L1553n021k9995n7740J0311R3955
294D3974J7497o9116l6465L2279N2542k3149o4926J4206M7010K2859P709m4916
$$ plain form
306 -496 -48692 -25552 18994 29696 -11989 -42030 18565 62541 9994 -45932 -54605 -10108 44929
319 44929 28050 -11089 -12000 -1592 21141 12144 -42896 -44180 18949 64907 40215 -36463 -44854
332 -44854 11780 11921 -12959 -11104 -8514 21699 47935 7499 -50031 -56660 3083 52324 13970
345 13970 -22901 2101 20692 18407 -12486 -55137 -23238 40114 48547 17722 -23103 -30363 637
358 637 6569 -9970 -21374 -8851 46292 52975 -22868 -57728 -24443 13692 26838 2745 -7495
371 -7495 15726 21226 10453 -21809 -57412 -17406 49831 45925 980 -28289 -11969 13541 -10507
384 -10507 -28916 -10444 8869 41473 43834 -22025 -55961 -16963 23877 17483 -15286 -1923
396 -1923 36585 21182 -9132 -27047 -44805 -9972 44676 35363 -6734 -23307 -250 17561
$$ packed form
306d96m8196K3140M4546J0702m1685l0041O0595M3976n2547n5926q673M4497N5037
319D4929j6879l9139r11J0408K2733q997n5040j284O3129M5958k4692p6678q391
332d4854N6634J41k4880J855K590L0213K6236m0436n7530o629N9743M9241l8354
345A3970l6871K5002J8591k285l0893m2651L1899O3352Q433l0825m0825p260L1000
358F37N932j6539j1404J2523N5143O683p5843l4860L3285L8135J3146k4093j0240
371g495K3221N500j0773l2262l5603M0006O7237l906m4945k9269J6320K5510k4048
384a0507j8409J8472J9313L2604K361o5859l3936L8998M0840o394l2769J3363
396a923L8508j5403l0314j7915j7758L4833N4648r313m2097j6573K3057J7811
$$ plain form
408 17561 -18507 -39951 -5988 25941 42026 24461 -26811 -36927 -5452 11496 7412 -11099
420 -11099 -264 36692 25550 -15807 -38771 -35826 7209 37764 13736 -8781 -6710 6806
432 6806 11295 -22378 -39297 -916 33095 38882 11227 -30043 -22157 7287 4139 -7150 -10126
445 -10126 7727 35659 18607 -20399 -36401 -25850 14372 31460 -758 -11017 8012 14075
457 14075 1843 -27186 -30678 7950 32048 28204 3002 -27328 -11673 12903 -2866 -16361
469 -16361 -7741 14744 33269 9278 -25141 -29044 -13451 16206 22009 -8609 -8164 16582 16414
482 16414 -4256 -29753 -23484 16717 29169 13648 -4251 -18478 -2407 11564 -8605 -18349
494 -18349 -5435 15928 30400 3281 -29508 -19873 1609 15281 7879 -13078 356 21752
$$ packed form
408A7561l6068k1444L3963L1929J6085j7565n1272j0116L1475J6948m084j8511
420a1099J0835L6956j1142m1357k2964K945M3035L0555k4028k2517K071J3516
432F806M489l3673j6919L8381L4011N787k7655m1270P886K9444l148j1289k976
445a0126J7853K7932j7052l9006j6002J0551M0222J7088l2218j0259J9029O063
457A4075j2232k9029l492L8628K4098l844k5202l0330J5655K4576j5769j3495
469a6361Q620K2485J8525k3991l4419l903J5593K9657N803l0618M45K4746j68
482A6414k0670k5497O269M0201J2452j5521j7899j4227J6071J3971k0169r744
494a8349J2914K1363J4472k7119l2789R635K1482J3672p402k0957J3434K1396
$$ plain form
506 21752 9718 -9021 -23387 -16407 17599 23911 3909 -9963 -11839 5757 10283 -15073 -17960
519 -17960 1936 17300 22212 -3673 -25962 -9038 9492 11407 -60 -13709 4898 22917
531 22917 4754 -13161 -18847 -7990 18530 16139 -6345 -11239 -4682 10067 7967 -17738 -15961
544 -15961 7575 17257 13731 -9451 -21069 2272 13741 4683 -5281 -11351 6657 19238 98
557 98 -14096 -13256 -912 18398 7614 -14288 -8973 2225 10281 4599 -16131 -10622 11822 14026
571 14026 4443 -12960 -14599 10940 14296 -1662 -7620 -7945 6588 14129 -4859 -14217 -6775 5732
585 5732 16523 407 -18595 -6229 7999 10066 951 -14449 -3332 15715 7997 -3781 -12608
598 -12608 -7503 14008 13023 -4456 -8711 -6303 6342 10359 -9772 -13365 2086 10468 11532 -5197
$$ packed form
506B1752j2034j8739j4366O980L4006O312k0002j3872j876J7596M526k5356k887
519a7960J9896J5364M912k5885k2289J6924J8530J915j1467j3649J8607J8019
531B2917j8163j7915n686J0857K6520k391k2484m894O557J4749k100k5705J777
544a5961K3536R682l526k3182j1618K3341J1469r058r964o070J8008J2581j9140
557I8j4194Q40J2344J9310j0784k1902N315J1198Q056n682k0730N509K2444K204
571A4026r583j7403j639K5539L356j5958n958l25J4533P541j8988r358P442J2507
585E732J0791j6116j9002J2366J4228K067r115j5400J1117J9047p718j1778q827
598a2608N105K1511r85j7479m255K408J2645M017k0131l593J5451Q382J064j6729
$$ plain form
612 -5197 -17895 -2471 8976 7406 448 -10364 1420 16866 2018 -11780 -11438 -1202 14866
625 14866 9430 -6154 -6444 -4572 3653 6303 -12062 -11438 8985 14639 7122 -10269 -15826 2114
639 2114 8906 2486 -390 -4456 5404 14226 -2959 -15375 -10127 1933 15456 7774 -7996 -4975
653 -4975 -332 2229 -147 -13611 -5580 14607 13985 3478 -9857 -13993 3317 7812 -790 -1159
667 -1159 383 8724 10931 -8229 -16849 -7259 2803 14092 6332 -8035 -2354 2797 45 -5149
681 -5149 -13037 -1160 18060 12131 -105 -9247 -10552 3510 5055 -4065 -894 3745 10201 8149
695 8149 -12201 -17198 -3818 5244 11164 3802 -6696 1241 5031 -2217 -7767 -11511 3122 19348
709 19348 9092 -3314 -7231 -7423 1991 1793 -5990 243 6380 9671 5797 -13548 -16352 -1033
$$ packed form
612e197j2698J5424J1447j570o958j0812J1784J5446j4848j3798L42J0236J6068
625A4866n436j5584k90J872Q225K650j8365O24K0423N654p517j7391n557J7940
639B114O792o420k876m066R860Q822j7185j2416N248J2060J3523p682j5770L021
653d975M643K561k376j3464Q031K0187o22j0507j3335m136J7310M495q602l69
667a159J542Q341K207j9160q620R590J0062J1289p760j4367N681N151k752n194
681e149p888J1877J9220n929j2236r142j305J4062J545r120L171M639O456k052
695H149k0350m997J3380R062N920p362j0498P937L790p248n550l744J4633J6226
709A9348j0256j2406l917j92R414j98p783O233O137L291l874j9345k804J5319
$$ plain form
723 -1033 6705 8915 1783 -4293 5063 5245 -5568 -9045 -8544 4603 18067 6920 -4798 -6347
737 -6347 -5509 1761 -894 -8157 1898 9308 8862 3005 -13360 -13816 2058 6736 5450 166 -1983
752 -1983 8408 5268 -8900 -10262 -5310 6013 15301 3687 -5549 -4666 -3880 1344 -2937 -9131 2832
767 2832 11781 7610 -147 -12338 -9990 4288 4902 2225 952 551 8660 3983 -10836 -10218 -2791
782 -2791 6609 12562 932 -6104 -1880 -1430 -197 -4112 -9051 4261 12949 6251 -2172 -10963 -6101
797 -6101 6255 2722 -1101 930 2659 8184 1982 -11892 -8830 -822 6087 9757 -1640 -6314
811 -6314 724 1044 -929 -5558 -7563 6566 12672 2969 -3544 -7918 -3552 6151 809 -3391 907
826 907 3641 7311 392 -11736 -6885 1653 5388 6085 -3339 -4982 4000 2822 -2533 -5872 -5266 7793
$$ packed form
723a033P738K210p132o076R356J82j0813l477N01J3147J3464j1147j1718j549
737f347Q38P270k655p263J0055P410m46n857j6365m56J5874M678j286n284k149
752a983J0391l140j4168j362M952J1323R288j1614r236Q83P86N224m281o194J1963
767B832Q949m171p757j2191K348J4278O14k677j273m01Q109m677j4819O18P427
782b791R400N953j1630p036M224M50J233l915m939J3312Q688o698q423q791M862
797f101J2356l533l823K031J729N525o202j3874L062Q008O909L670j1397m674
811f314P038L20j973m629k005J4129O106r703o513m374M366R703n342m200M298
826I07K734L670o919j2128M851Q538L735O97r424j643Q982j178n355l339O06J3059
$$ plain form
842 7793 11184 -393 -4627 -4837 -593 5691 -1294 -5015 860 4041 6039 -511 -11938 -4595 4959
857 4959 4724 2728 -4472 -2423 6012 2494 -3617 -4888 -3311 7854 9007 -3262 -5750 -2695 1832
872 1832 4600 -3136 -5843 2344 3911 3856 -1758 -9617 -2061 6728 3623 -447 -5040 -1025 7674 1632
888 1632 -5028 -3444 -647 7074 6040 -5544 -5348 407 2552 3367 -4234 -5855 2816 4849 2527
903 2527 -4032 -8503 2703 8552 -41 -2523 -2828 170 6968 1241 -5746 -3262 1462 6821 2292
918 2292 -7954 -3659 2773 2909 2546 -4897 -5620 4377 4939 -630 -4473 -4874 4614 8098 -1143 -4417
934 -4417 -2524 1737 6327 -1081 -5959 179 2419 4278 233 -8767 -3267 5288 3813 402 -4998
949 -4998 -2981 5736 3198 -2968 -4389 -2409 6411 7410 -4017 -4948 -1014 1899 4285 -2250 -6063
$$ packed form
842G793L391j1577m234k10M244O284o985l721N875L181J998o550j1427P343R554
857D959k35j996p200K049Q435l518o111j271J577J1165J153j2269k488L055M527
872A832K768p736k707Q187J567n5n614p859P556Q789l105m070m593M015Q699o042
888A632o660J584K797P721j034j1584J96N755K145Q15p601j621Q671K033k322
903B527o559m471J1206N849q593k482l05K998O798n727o987K484M724N359m529
918B292j0246M295O432J36l63p443p23R997N62n569l843m01R488L484r241l274
934d417J893M261M590p408m878O138K240J859m045r000N500Q555j475l411n400
949d998K017Q717k538o166j421J980Q820R99j1427r31L934K913K386o535l813
$$ plain form
964 -6063 1610 4761 3013 -3232 -8496 -868 6319 2620 -143 -3959 -1488 7371 1972 -6565 -3587
979 -3587 1398 6677 5246 -4183 -4758 -693 2295 3163 -4478 -5359 4690 5222 138 -3585 -6725 75
995 75 6393 1940 -2314 -2831 2059 7124 -1441 -7984 -1645 2932 5873 3397 -5589 -4762 1500 2408
1011 2408 823 -5106 -3775 6581 5871 -1641 -4795 -5226 2399 6078 -671 -2461 105 2741 4804
1026 4804 -3119 -8224 -299 4651 4951 931 -6237 -2947 3371 1193 -1291 -4806 -1688 7829 5358
1041 5358 -3446 -4793 -3306 3514 5241 -2344 -2510 1676 3247 3028 -4629 -7982 1031 5021 3092
1056 3092 -766 -5941 -688 5006 -140 -3772 -3676 1130 8499 3391 -5325 -4148 -1021 3887 3872 -4125
1072 -4125 -2841 3773 3392 445 -5746 -6361 2759 5324 1557 -1863 -4227 1233 5322 -1760 -5000
$$ packed form
964f063P673L151j748o245n264P628P187l699k763l816K471Q859n399q537K978
979c587M985N279j431r429n75M065K988Q68p641q81J0049N32n084l723l140O800
995G5O318m453m254n17M890N065q565o543O339M577K941k476q986Q27O262R08
1011B408j585n929J331J0356p10p512l154m31P625L679o749j790K566K636K063
1026D804p923n105P925M950L00m020p168L290O318k178k484l515L118R517k471
1041E358q804j347J487O820J727p585j66M186J571k19p657l353R013L990j929
1056C092l858n175N253N694n146l632R6M806P369n108q716J177L127M908j5p997
1072d125J284O614l81k947o191o15R120K565l767l420k364N460M089p082l240
$$ plain form
1087 -5000 -1907 3323 7771 1234 -6378 -2635 1108 3291 1606 -4747 -1480 5103 2727 -1606 -6132
1102 -6132 -4777 4298 4819 -399 -2032 -2429 2880 4847 -3773 -5381 482 4887 5986 -1203 -6422
1117 -6422 -730 2639 2037 -391 -5001 -83 6242 1854 -3212 -5474 -2574 5325 3856 -2299 -1973
1132 -1973 6 4071 3306 -5305 -4763 2567 4542 3828 -2475 -5687 657 2977 115 -2408 -4456 1568
1148 1568 6652 226 -4288 -3956 -276 5611 2049 -3865 -1379 1900 3733 1554 -6017 -3662 3796
1163 3796 3875 1314 -3972 -4276 2624 3014 -1640 -2734 -2883 2871 6480 -1156 -5003 -1970 2096 4781
1179 4781 183 -4806 63 3077 2547 -297 -6326 -2326 4913 2602 -1334 -3714 -2614 3558 2709
1194 2709 -2750 -2993 -818 4153 5044 -3097 -4619 629 2651 3426 -1335 -5104 1328 4053 1229 -2463
$$ packed form
1087e000L093N230M448o537p612L743L743K183j685o353L267O583k376m333m526
1102f132J355R075N21n218j633l97N309J967q620j608N863M405J099p189n219
1117f422N692L369o02k428m610M918O325m388n066k262K900P899j469o155L26
1132a973J979M065p65q611N42P330J975p14o303l212O344K320k862k523k048O024
1148A568N084o426m514L32L680N887l562n914K486L279J833k179p571K355P458
1163C796P9k561n286l04O900L90m654j094j49N754L609p636l847L033M066K685
1179D781m598m989M869L014n30k844o029M000P239k311l936k380J100O172q49
1194B709n459k43K175M971Q91q141j522N248K022P75m761l769O432K725k824l692
$$ plain form
1210 -2463 -5494 -37 5361 1555 -2773 -3175 -197 4471 1771 -3945 -1961 1150 4036 3626 -4383
1225 -4383 -4277 2670 3425 853 -3260 -3556 2434 3573 -84 -2897 -4192 1360 5916 -595 -4353 -1356
1241 -1356 1525 3810 741 -4180 -1106 2269 4059 1336 -5378 -2239 4199 2445 -772 -3027 -2936
1256 -2936 2994 3232 -1706 -3498 -2059 2879 4739 -2051 -4050 28 2495 3824 -532 -4813 149
1271 149 3724 1997 -1393 -4665 -792 4691 1424 -2273 -3225 -1429 3887 2320 -3421 -2677 106 3232
1287 3232 3345 -3052 -3992 1448 2950 2332 -2063 -4308 1574 3771 356 -2526 -3514 622 4675 153
1303 153 -3181 -2078 -77 3996 1133 -4322 -1592 2074 3400 1374 -3796 -2969 2777 2738 607 -2445
1319 -2445 -3125 2646 3908 -1492 -3090 -2289 1659 3932 -625 -3415 -957 1529 3539 -70 -4335
$$ packed form
1210b463l031N457N398l806m328m02K978M668k700n716J984L111K886m10q009
1225d383J06O947P55k572m113k96N990J139l657k813j295N552M556o511l758K997
1241a356K881K285l069m921L074L375J790k723o714L139O438j754l217k255R1
1256b936N930K38m938j792J439M938J860o790j999M078K467J329m356m281M962
1271A49L575j727l390l272L873N483l267l697r52J796N316j567n741P44K783L126
1287C232J13o397r40N440J502o18m395k245N882K197l415k882r88M136M053m522
1303A53l334J103K001M073k863n455K730L666J326k026n170Q27N746l9k131l052
1319b445o80N771J262n400j598Q01L948K273m557k790K458K486K010l609m265
$$ plain form
1334 -4335 -123 3618 2708 -412 -4099 -1779 3472 1652 -1350 -2605 -1752 3334 2657 -2955 -3196 -902
1350 -902 2399 3373 -1586 -3219 1036 2183 2122 -1195 -3954 1285 4152 1054 -1166 -3552 -432 3920
1366 3920 975 -2604 -2144 -155 3561 1722 -3669 -2073 1042 2598 2264 -2459 -2679 2175 2804 633
1382 633 -2273 -3079 2444 3577 -598 -2644 -2544 393 3592 -749 -3493 -910 1350 3246 377 -4223
1398 -4223 -1317 2542 2190 844 -2811 -1768 3010 1727 -854 -2315 -1916 3013 3138 -1767 -2691 -1306
1414 -1306 1329 3026 -1671 -3199 417 1970 2258 -734 -3994 228 2927 1315 -187 -2664 -784
1429 -784 3618 944 -2354 -2297 -544 3184 1818 -2999 -2192 -30 1556 2196 -2088 -2801 1480 2535
1445 2535 1265 -1518 -2965 1513 3186 367 -1481 -1967 154 3269 82 -2928 -1312 557 2769
$$ packed form
1334d335M212L741r10l120l687K320N251j820l002j255Q53N086o77n612k41K294
1350i02L301R74m959j633M255J147o1l317k759N239K867l098k220k386L120M352
1366C920k945l579M60J989L716j839n391J596L115J556l34m723k20M854O29k171
1382F33k906q06N523J133m175k046J00K937L199m341k744K583K260J896k869m600
1398d223K906L859l52j346l655J043M778j283k581j461L99M929J25m905r24J385
1414a306K635J697m697j528L616J553K88k992l260M222K699j612j502k477J880
1429g84M402k674l298N7J753L728j366m817Q07K162J586O40m284p13M281J055
1445B535j270k783j447M478J673k819j848m86K121L115l187l010J616J869K212
$$ plain form
1460 2769 548 -3427 -1450 1583 1674 1152 -2182 -2124 2577 2311 -294 -1923 -1705 1922 2985 -897 -2164
1477 -2164 -1264 1127 2656 -1243 -3270 -430 1383 2106 -352 -3625 -200 2536 1327 187 -2376
1492 -2376 -736 3179 1600 -1334 -1691 -982 2254 2130 -1977 -2087 104 1180 2105 -1752 -2863 804
1508 804 2035 1326 -952 -2658 425 2746 647 -708 -1907 125 3314 727 -2589 -1470 -112
1523 -112 2284 1196 -2632 -1600 733 1449 955 -2217 -2124 1890 1982 443 -1144 -1903 1172 2674 -335
1540 -335 -1383 -1174 733 2511 -670 -2870 -696 841 1789 293 -2805 -898 1707 1105 206 -2070
1556 -2070 -1324 2760 1797 -932 -1214 -1120 1588 1988 -1236 -1571 -270 1115 1809 -1491 -2936 445 1527
1573 1527 1412 -112 -2600 47 2285 435 -415 -1628 -420 2924 884 -1597 -1422 -301 1899 1501
$$ packed form
1460B769k221l975J977L033R1n22l334N8M701k66k605j629K18L627J063l882j267
1477b164R00K391J529l899k027K840J813P23k458l273L425K736j209j140k563
1492b376J640L915j579k934l57P09L236j24m107j10K191J076R25l857j111L667
1508H04J231p09k278j706L083K321k099j355j199K032L189k587l316J119J358
1523a12K396j088l828J032K333P16m94l172R3M014R2j539j587p59L075J502l009
1540c35j048K09J907J778l181k200K174J537R48j496l098J907K605o02q99k276
1556b070P46M084r63k729k82R4K708M00l224l35J301J385O94l300j445L381J082
1573A527j15j524k488K647K238j850q50j213J208L344k040k481J75J121K200l98
$$ plain form
1589 1501 -1899 -1558 577 1149 771 -1936 -2016 1264 1546 404 -845 -1843 908 2333 -136 -1132 -988
1606 -988 301 2528 -75 -2353 -573 201 1184 387 -2312 -730 1111 994 131 -2138 -1529 1551 1679
1623 1679 -406 -1071 -1187 1239 2200 -856 -1274 -288 700 1977 -722 -2212 -319 602 826 211 -2202
1640 -2202 -193 1722 534 -566 -1483 -533 2638 1236 -737 -869 -595 1252 1435 -1254 -1215 624 916
1657 916 1140 -1316 -2181 351 1186 253 -269 -1912 404 1865 -252 -684 -736 11 2379 940 -1445
1674 -1445 -456 194 1089 971 -2173 -869 1181 834 592 -1590 -1802 1062 980 -134 -476 -1001 892 1918
1692 1918 -654 -1015 -471 690 2057 283 -1708 -127 335 421 362 -2077 -543 1495 278 77 -1093
1709 -1093 -1081 1284 836 -328 -184 -324 1044 1383 -1164 -1277 512 961 1379 -176 -1611 36 269
$$ packed form
1589A501l400L41K135N72l78k707q0L280K82j142j249r98K751J425k469r96J44
1606i88J289K227k603k278J780P74R83p97k699J582J841j17q63k269O09L080J28
1623A679k085o65j16K426R61l056m18R86R88J277k699j490J893R21K24o15k413
1640b202K009J915j188j100r17R50L171j402j973j32K74J847J83k689L9J839K92
1657I16K24k456q65K532Q35r33n22j643K316J461k117m32n2P47K368j439k385
1674a445R89O50Q95j18l144J304K050l47k42k182k12K864q2j114l42n25J893J026
1692A918k572l61N44J161J367j774j991J581M62Q6n9k439J534K038j217k01j170
1709a093J2K365m48j164J44j40J368L39k547j13J789M49M18j555j435J647K33
$$ plain form
1726 269 89 -3 -1507 215 1863 45 -710 -1161 -546 1391 923 -753 -91 -18 939 883 -1555 -1074 521
1745 521 876 892 -624 -1493 514 461 -380 -380 -745 958 1745 -160 -587 -522 -251 1678 403 -1081 269
1764 269 611 817 301 -1694 -833 937 477 512 -641 -1065 562 482 -840 -452 -309 982 1720 -478
1782 -478 -852 -136 -163 952 -99 -920 472 484 138 -114 -1757 -496 970 331 272 -541 -977 1081 218
1801 218 -979 -296 182 917 1164 -663 -867 -127 194 654 -43 -1009 730 846 -238 -648 -1484 -542 1406
1820 1406 -187 -212 -131 -442 794 288 -1114 186 636 1059 927 -1234 -875 367 -269 25 -404 -936
1838 -936 813 681 -680 -559 -854 195 1305 -299 -348 228 -35 848 -124 -1060 356 663 911 669
1856 669 -1112 -730 496 59 -53 -260 -526 803 676 -832 -306 -570 207 1001 -336 -401 162 -127 417
$$ packed form
1726B69j80r2j504J722J648j818p55m51O15J937m68j676O62P3R57n6k438M81J595
1745E21L55J6j516q69K007n3q41%l65J703P87j905m27O5K71J929j275j484J350
1764B69L42K06n16j995Q61J770m60L5j153m24J627q0j322L88J43J291P38k198
1782d78l74P16k7J115j051q21J392J2l46k52j643J261J466o39n9q13m36K058q63
1801B18j197O83M78P35K47j827k04P40L21M60o97r66J739J16j084m10q36R42J948
1820A406j593k5Q1l11J236n06j402J300M50M23j32k161L59J242o36K94m29n32
1838i36J749j32j361J21k95J049J110j604m9N76k63Q83r72r36J416L07K48k42
1856F69j781L82J226m37j12k07k66J329j27j508N26k64P77P94j337o5N63k89N44
$$ plain form
1875 417 1 -966 402 573 82 256 -977 -505 739 -139 -370 -176 -660 1031 655 -865 -158 -3
1893 -3 179 1014 -499 -327 466 -217 192 -312 -880 389 504 -27 67 -878 -368 598 -352 -282 138 -265 844
1914 844 345 -826 -303 -60 -31 948 -375 -490 468 16 62 -101 -1010 409 579 -441 14 -586 -374
1933 -374 962 -134 -266 552 -77 707 81 -1108 186 229 -89 799 -419 -224 505 -303 -275 -383 -717
1952 -717 715 537 -357 6 -214 -125 809 -106 -249 529 -340 298 202 -810 257 159 374 528 -483 -116
1972 -116 264 -393 -358 -179 -266 804 591 -547 -64 170 -138 681 -39 -288 454 144 132 -262 -1100 5
1992 5 693 -189 256 -347 -623 126 -114 -657 211 -249 741 612 -676 18 -93 -110 686 -198 -223 448 -8
2013 -8 -121 -558 -817 268 509 -107 352 -173 -193 542 -257 -413 326 150 732 594 -558 -22 -110 -86 686
$$ packed form
1875D17m16r67J368J71m91J74j233M72J244q78k31J94m84J691l76j520P07J55
1893cJ82Q35j513J72P93o83M09n04n68J269J15n31R4r45N10R66r50P0M20m03J109
1914H44m99j171N23K43K9R79j323j15R58m52M6j63r09J419J70j020M55o00K12
1933c74J336j096j32Q18o29P84o26j189J294M3l18Q88j218J95P29q08K8j08l34
1952g17J432j78q94L63k20Q9R34r15j43P78q69O38r6j012J067r8K15J54j011L67
1972a16L80o57L5J79q7J070k13j138M83K34l08Q19p20k49P42l10j2l94q38J105
1992EO88q82M45o03k76P49k40n43Q68m60R90j29j288O94j11j7P96q84k5O71m56
2013hj13m37k59J085K41o16M59n25k0P35p99j56P39j76N82j38j152N36q8K4P72
$$ plain form
2034 686 -70 -147 533 -405 -399 -251 -688 316 419 -314 311 -191 -251 290 50 -380 439 323 637 381 -945
2055 -945 -212 200 -351 303 -127 -461 737 -315 -309 -204 -664 467 553 -466 401 -40 -481 862 64
2074 64 -400 210 142 723 418 -625 -239 -154 -26 242 -343 -286 684 -121 -502 -545 -758 282 626 -53 58
2095 58 232 -29 311 -494 -705 573 300 223 118 -835 -245 96 -292 38 -184 -111 727 148 -754 -215 -315
2116 -315 565 490 -273 188 459 -419 136 -499 -498 649 367 81 9 -878 -246 386 -24 175 39 -23 797
2137 797 -68 -598 255 -13 428 653 -293 19 338 -369 137 -665 -516 771 386 66 -245 -688 50 345
2157 345 -342 165 199 338 762 18 -586 4 -196 583 452 -531 41 131 -236 -225 -492 -623 863 279 -253
2178 -253 -243 -771 190 396 -300 166 748 197 882 71 -829 217 48 421 108 -627 178 252 -85 -257
$$ packed form
2034F86p56p7O80r38OJ48m37J004J03p33O25n02o0N41k40m30Q19j16L14k56j326
2055i45P33M12n51O54m30l34J198j052OJ05m60J131Q6j019Q67m41m41J343p98
2074F4m64O10o8N81l05j043L86Q5J28K68n85N7R70q05l81m3k13J040L44o79J11
2095E8J74k61L40q05k11J278k73p7j05r53N90L41l88L30k22P3Q38n79r02N39j00
2116c15Q80p5p63M61K71q78N55o35JJ147k82k86p2q87O32O32m10J99j36o2Q20
2137G97q65n30Q53k68M41K25r46L12L19p07N06q02J49J287l85l20l11m43P38K95
2157C45o87N07L4J39M24p44o04N90k00P79j31r83N72R0l67J1k67j31J486n84n32
2178b53J0n28R61K06o96M66N82n51O85q11r00J046j69L73l13p35Q05P4l37j72
$$ plain form
2198 -257 -162 -149 730 224 -645 46 -552 -115 290 -317 -21 369 176 427 -156 -590 456 174 419 77
2218 77 -931 23 260 -446 -303 -112 -234 669 306 -524 -71 -53 -26 438 -533 132 502 167 238 -365 -469
2239 -469 559 377 -41 169 -471 -109 286 -481 -301 155 304 670 293 -586 -21 119 267 160 -588 251
2259 251 943 -175 -26 -312 -819 308 131 -211 -163 -272 141 292 -133 -191 163 145 586 -201 -407 385
2279 385 249 -88 -111 -321 273 865 -138 -320 -439 -326 458 423 -465 34 -134 226 221 -587 -178 439 205
2300 205 541 1 -610 246 -35 -167 -276 -410 388 535 -379 -666 -194 22 627 269 -486 232 400 -36
2320 -36 19 -482 -129 675 170 28 -142 -388 332 296 -399 130 -367 -75 784 -511 -342 81 101 461 301
2341 301 -227 118 232 -285 -54 -328 19 610 -6 -97 -370 -509 589 -18 -351 322 254 537 535 -511 -354
$$ packed form
2198b57R5J3Q79n06q69O91n98M37M05o07K96L90j93K51n83m34J046k82K45l42
2218G7j008R54K37p06J43J91j22R03l63q30M53J8K7M64r71O65L70l35P1o03j04
2239d69J028j82m18K10o40L62L95p67J80M56J49L66l77q79N65J40J48j07p48Q39
2259B51O92j118J49k86n07J127j77l42M8j09M13J51m25n8L54j8M41p87k06P92
2279C85j36l37k3k10N94N92j003j82j19J13P84l5q88M99j68L60nq08M09O17k34
2300B05L36n40o11Q56k81j32j09j34P98J47r14k87M72K16O05l58p55P18J68m36
2320c6N5n01L53Q04n05j42j70k46P20l6o95N29m97K92Q59j295J69M23K0L60j60
2341C01n28L45J14n17K31k74L47N91o16r1k73j39J098o07l33O73o8K83kj046J57
$$ plain form
2362 -354 277 -56 415 -109 -310 540 179 -400 -274 -384 -224 713 -135 -487 -134 -340 306 9 -294 399
2382 399 443 438 -9 -554 -110 476 321 296 -56 -439 317 266 -132 -254 -215 -61 709 -287 -355 -156 -394 315
2404 315 26 -242 167 447 92 24 -266 -301 543 346 105 -217 27 555 276 -436 -23 -195 320 664 -450
2425 -450 -351 -89 -73 191 -211 -380 351 500 190 -50 -615 -57 616 -237 43 -60 79 381 104 -563 63
2446 63 -45 54 299 -264 -237 331 -3 116 -26 -341 201 540 -218 -163 -351 -221 378 -90 -211 -166 -4 60
2468 60 -176 -799 200 164 391 340 -540 -89 286 -118 -109 90 -502 348 398 -193 -167 -198 -49 220 -129 -82 80
2491 80 29 249 -210 -363 83 267 -26 90 -268 -360 490 120 -70 -53 104 209 350 -287 -282 -133 -75 253
2513 253 -174 283 466 146 100 -407 -552 223 305 -10 145 -446 -80 61 -165 -335 -24 68 299 10 -659
$$ packed form
2362c54O31l33M71n24k01Q50l61n79J26j10J60R37q48l52L53k06O46k97l03O93
2382C99M4nm47n45M44N86j55k5l52l83P56n1l98j22L9J54P70r96o8J99k38P09
2404C15k89k68M09K80l55o8k90l5Q44j97k41l22K44N28k79p12M13j72N15L44j114
2425d50R9K62J6K64m02j69P31J49l10k40n65N58O73q53K80j03J39L02k77o67O26
2446F3j08R9K45n63K7N68l34J19j42l15N42L39p58N5j88J30N99m68j21M5J62O4
2468F0k36o23R99l6K27n1q80M51L75m04RJ99n92Q50N0n91K6l1J49K69l49M7J62
2491H0n1K20m59j53M46J84k93J16l58r2Q50l70j90J7J57J05J41o37NJ49N8L28
2513B53m27M57J83l20m6n07j45P75Q2l15J55n91L66J41k26j70L11R2K31k89o69
$$ plain form
2534 -659 -46 95 138 327 -414 91 311 319 70 -150 -202 289 276 -99 -133 -368 -96 195 -358 -505 217 -19
2556 -19 374 -253 -223 -227 299 73 190 79 3 354 -113 81 -210 -236 336 357 -7 -177 91 -47 17 -319 -427
2579 -427 643 369 531 16 -118 87 342 -218 189 90 63 398 0 -53 279 111 227 244 -288 -95 183
2600 183 224 -47 -182 -432 396 49 -153 -166 -98 17 453 -79 37 -74 124 278 -114 -283 -101 73 463
2621 463 98 -503 -84 30 22 -48 -250 -111 321 222 75 -277 -179 158 88 -98 66 -115 85 410 -389 -397 -177
2644 -177 11 172 69 -351 -16 149 60 109 43 -1 284 98 -22 -220 -212 373 188 -192 86 78 124 137 -254
2667 -254 -219 54 -38 318 -34 -261 -116 356 -113 -3 193 109 85 -42 -95 -31 -96 50 -123 -227 0 303
$$ packed form
2534f59O13J41M3J89p41N05K20Qk49k20n2M91j3l75l4k35K72K91n53j47P22k36
2556a9L93o27L0mN26k26J17j11p6L51m67J94k91k6N72K1l64j70K68j38O4l36j08
2579d27J070k74J62n15j34K05K55n60M07r9k7L35l98n3L32j68J16J7n32J93K78
2600A83M1k71j35k50Q28l47k02j3O8J15M36n32J16j11J98J54l92j69J82J74L90
2621D63l65o01M19J14qp0k02J39M32r9j47l52R8L37p0j86J64j81K00L25p99qK20
2644a77J88J61j03m20L35J65q9M9o6m4K85j86j20j98QN85j85l80K78qM6J3l91
2667b54L5K73r2L56l52k27J45M72m69J10J96q4k4j27n3O4o5J46j73j04K27L03
$$ [...]
8191a03
##END NTUPLES=NMR FID
##END=
