##TITLE=1H_33-2022
 CDCl3
 8 sc, 
 30.06.2022
##JCAMPDX= 6.0         $$ Bruker NMR JCAMP-DX V2.0
##DATA TYPE= NMR SPECTRUM
##DATA CLASS= NTUPLES
##ORIGIN= UXNMR, Bruker Analytische Messtechnik GmbH
##OWNER= root
$$ XWIN-NMR		Version 3.5
$$ Thu Jun 30 14:21:55 2022 Russian Standard Time (UT+4h)  she@DPX200
##.OBSERVE FREQUENCY= 200.1313499994
##.OBSERVE NUCLEUS= ^1H
##.ACQUISITION MODE= SIMULTANEOUS
##.ACQUISITION SCHEME= undefined
##.AVERAGES= 8
##.DIGITISER RES= 18
##SPECTROMETER/DATA SYSTEM= spect
##.PULSE SEQUENCE= zg30
##.SOLVENT NAME= D2O
##.SHIFT REFERENCE= (INTERNAL, D2O, 0, 15.7392)
##AUDIT TRAIL= $$ (NUMBER, WHEN, WHO, WHERE, WHAT)
$$ ##TITLE= Audit trail, XWIN-NMR		Version 3.5
$$ ##JCAMPDX= 5.01
$$ ##ORIGIN= Bruker BioSpin GmbH
$$ ##OWNER= she
$$ F:/spectra/data/she/nmr/H-F/1/pdata/1/auditp.txt
$$ ##AUDIT TRAIL=  $$ (NUMBER, WHEN, WHO, WHERE, WHAT)
(   1,<2022-06-30 14:20:38.40 +0400>,<she>,<DPX200>,
      <created by zg, POWCHK disabled, PULCHK disabled
       configuration hash MD5:
       00 E9 B6 7A A2 85 ED C7 34 08 36 98 17 FE 4E 26
       data hash MD5: 16K
       EB 6E 6E 9A CF FD 30 94 97 28 C2 C3 9C 1B 56 E9>)
(   2,<2022-06-30 14:20:41.23 +0400>,<she>,<DPX200>,
      <Start of raw data processing
       efp BC_mod = 2 LB = 0.24 FT_mod = 6 PKNL = 1 PHC0 = -18200.88 PHC1 = 8.800686 SI = 16K 
       data hash MD5: 16K
       18 98 17 8A 95 B4 20 D3 19 F4 E5 4B B6 7D 51 26>)
(   3,<2022-06-30 14:20:58.46 +0400>,<she>,<DPX200>,
      <pk PHC0 = 2.671555 PHC1 = -1 
       data hash MD5: 16K
       5F 25 95 94 C3 DB C5 B1 AE 90 7F 23 B9 57 FD 77>)
(   4,<2022-06-30 14:21:01.70 +0400>,<she>,<DPX200>,
      <abs ABSG = 5 
       data hash MD5: 16K
       F0 E1 66 03 29 B9 16 FA CD E5 31 84 43 7C C2 C4>)
$$ ##END=
$$ 
$$ hash MD5
$$ F0 A9 84 2D 47 8E 24 C7 FC E3 1F D2 79 CF D2 C7
##$RELAX= 
##$RELAX= 
##$RELAX= 
##$RELAX= 
##$RELAX= 
##$RELAX= 
$$ Bruker specific parameters
$$ --------------------------
##$DU= <F:/spectra>
##$EXPNO= 1
##$NAME= <H-F>
##$PROCNO= 1
##$TYPE= <nmr>
##$USER= <she>
##$AMP= (0..31)
100 100 100 100 100 100 100 100 100 100 100 100 100 100 100 100 100 100 
100 100 100 100 100 100 100 100 100 100 100 100 100 100 
##$AQSEQ= 0
##$AQ_mod= 1
##$AUNM= <au_zg>
##$AUTOPOS= <>
##$BF1= 200.13
##$BF2= 200.13
##$BF3= 200.13
##$BF4= 200.13
##$BF5= 200.13
##$BF6= 200.13
##$BF7= 200.13
##$BF8= 200.13
##$BYTORDA= 1
##$CFDGTYP= 0
##$CFRGTYP= 5
##$CHEMSTR= <none>
##$CNST= (0..31)
1 1 145 1 1 1 1 1 1 1 1 1 1 1 1 1 1 1 1 1 1 1 1 1 1 1 1 1 1 1 1 1 
##$CPDPRG= <>
##$CPDPRG1= <>
##$CPDPRG2= <>
##$CPDPRG3= <>
##$CPDPRG4= <mlev>
##$CPDPRG5= <mlev>
##$CPDPRG6= <mlev>
##$CPDPRG7= <mlev>
##$CPDPRG8= <mlev>
##$CPDPRGB= <>
##$CPDPRGT= <>
##$D= (0..31)
0 1.2 0 0 0 0 0 0 0 0.06 0 0.03 0 0 0 0 0.0002 0 0 0 0 0 0 0 0 0 0 0 0 
0 0 0 
##$DATE= 1656584437
##$DBL= (0..7)
120 120 120 120 120 120 120 120 
##$DBP= (0..7)
150 150 150 150 150 150 150 150 
##$DBP07= 0
##$DBPNAM0= <>
##$DBPNAM1= <>
##$DBPNAM2= <>
##$DBPNAM3= <>
##$DBPNAM4= <>
$$ [...]
##$SUBNAM2= <"">
##$SUBNAM3= <"">
##$SUBNAM4= <"">
##$SUBNAM5= <"">
##$SUBNAM6= <"">
##$SUBNAM7= <"">
##$SUBNAM8= <"">
##$SUBNAM9= <"">
##$SW= 18.0517283424941
##$SWIBOX= (0..15)
0 0 2 0 0 0 0 0 0 0 0 0 0 0 0 0 
##$SW_h= 3612.71676300578
##$TD= 16384
##$TD0= 1
##$TE= 0
##$TE2= 300
##$TE3= 300
##$TEG= 300
##$TL= (0..7)
0 120 120 120 120 120 120 120 
##$TP= (0..7)
150 150 150 150 150 150 150 150 
##$TP07= 0
##$TPNAME0= <>
##$TPNAME1= <>
##$TPNAME2= <>
##$TPNAME3= <>
##$TPNAME4= <>
##$TPNAME5= <>
##$TPNAME6= <>
##$TPNAME7= <>
##$TPOAL= (0..7)
0.5 0.5 0.5 0.5 0.5 0.5 0.5 0.5 
##$TPOFFS= (0..7)
0 0 0 0 0 0 0 0 
##$TUNHIN= 0
##$TUNHOUT= 0
##$TUNXOUT= 0
##$USERA1= <user>
##$USERA2= <user>
##$USERA3= <user>
##$USERA4= <user>
##$USERA5= <user>
##$V9= 5
##$VALIST= <valist>
##$VCLIST= <CCCCCCCCCCCCCCC>
##$VD= 0
##$VDLIST= <DDDDDDDDDDDDDDD>
##$VPLIST= <PPPPPPPPPPPPPPP>
##$VTLIST= <TTTTTTTTTTTTTTT>
##$WBST= 1024
##$WBSW= 4
##$XGAIN= (0..3)
0 0 0 0 
##$XL= 0
##$YL= 0
##$YMAX_a= 31052
##$YMIN_a= -35950
##$ZGOPTNS= <>
##$ZL1= 120
##$ZL2= 120
##$ZL3= 120
##$ZL4= 120
##$ABSF1= 15.73697
##$ABSF2= -2.314879
##$ABSG= 5
##$ABSL= 3
##$ALPHA= 0
##$AQORDER= 0
##$ASSFAC= 0
##$ASSFACI= 0
##$ASSFACX= 0
##$ASSWID= 0
##$AUNMP= <proc_1d>
##$AZFE= 0.1
##$AZFW= 0.1
##$BCFW= 0
##$BC_mod= 2
##$BYTORDP= 0
##$COROFFS= 0
##$CY= -3
##$DATMOD= 1
##$DC= 0
##$DFILT= <>
##$DTYPP= 0
##$F1P= 0
##$F2P= 0
##$FCOR= 1
##$FTSIZE= 16384
##$FT_mod= 6
##$GAMMA= 0
##$GB= 0
##$INTBC= 1
##$INTSCL= 0
##$ISEN= 128
##$LB= 0.24
##$LEV0= 0
##$LPBIN= 0
##$MAXI= 10000
##$MC2= 0
##$MEAN= 0
##$ME_mod= 0
##$MI= 1.114404
##$NCOEF= 0
##$NC_proc= -10
##$NLEV= 6
##$NOISF1= 3.799351
##$NOISF2= 2.8
##$NSP= 0
##$NTH_PI= 0
##$NZP= 0
##$OFFSET= 15.73918
##$PC= 1
##$PHC0= -18198.21
##$PHC1= 7.800686
##$PH_mod= 1
##$PKNL= yes
##$PPARMOD= 0
##$PSCAL= 0
##$PSIGN= 0
##$REVERSE= no
##$SF= 200.130006475881
##$SI= 16384
##$SIGF1= 3
##$SIGF2= 2
##$SINO= 5.538805
##$SIOLD= 16384
##$SREGLST= <1H.CDCl3>
##$SSB= 0
##$STSI= 16384
##$STSR= 0
##$SW_p= 3612.71676300578
##$SYMM= 0
##$S_DEV= 0
##$TDeff= 16384
##$TDoff= 0
##$TI= <>
##$TILT= no
##$TM1= 0
##$TM2= 0
##$TOPLEV= 0
##$USERP1= <user>
##$USERP2= <user>
##$USERP3= <user>
##$USERP4= <user>
##$USERP5= <user>
##$WDW= 1
##$XDIM= 16384
##$YMAX_p= 484122627
##$YMIN_p= -6898231
$$ End of Bruker specific parameters
$$ ---------------------------------
##NTUPLES= NMR SPECTRUM
##VAR_NAME=  FREQUENCY,     SPECTRUM/REAL,   SPECTRUM/IMAG
##SYMBOL=    X,             R,               I
##VAR_TYPE=  INDEPENDENT,   DEPENDENT,       DEPENDENT
##VAR_FORM=  AFFN,          ASDF,            ASDF
##VAR_DIM=   16384,         16384,           16384
##UNITS=     HZ,            ARBITRARY UNITS, ARBITRARY UNITS
##FACTOR=    0.220516191357247, 1,           1
##FIRST=     3149.88211751572, 0,            0
##LAST=      -462.834645490058, 0,           0
##MIN=       -462.834645490058, -6898231,    0
##MAX=       3149.88211751572, 484122627,    0
$$ Real data points
##PAGE= N=1
##DATA TABLE= (X++(R..R)), XYDATA
$$ [...]
11756D32663p86129j4046l8276M41155N02113M96837m5575j77354j69232q30748
$$ 432663 -353466 -367512 -405788 35367 537480 1034317 988742 811388 642156 -188592
11746a88592l89682P2498K85397p44684j72691K28235L18157J09611Q27515J97424
$$ -188592 -578274 -505776 -220379 -965063 -1137754 -909519 -591362 -481751 345764 543188
11736E43188j56144L18191J68590n34305R4344m85933o27148l88423N8092P81513
$$ 543188 387044 705235 873825 339520 433864 -52069 -679217 -1067640 -1009548 -228035
11726b28035L26725k80523K1523M18118l62783j9041J76028R51065O09668P8660
$$ -228035 98690 -181833 -160310 257808 -104975 -124016 52012 1003077 1612745 1691405
11716A691405p62836J04601L8923j186260n25789m29364m0557L88751o3314L48000
$$ 1691405 928569 1033170 1072093 -114167 -639956 -1069320 -1109877 -721126 -784440 -436440
11706d36440N89704L56878o3313J46041k53475L96250N22395j23055k8917j147214
$$ -436440 153264 510142 446829 592870 339395 735645 1258040 1134985 1106068 -41146
11696d1146o32151q1859K98300K85029j40002l80835n74957M02784J016200N47941
$$ -41146 -673297 -755156 -456856 -171827 -311829 -692664 -1267621 -864837 151363 699304
11686F99304L03482K33860P72651j40035j153106p07971n32289n13992j64884
$$ 699304 1002786 1236646 2009297 1869262 716156 8185 -524104 -1038096 -1202980
11677a202980k056L03268M04836O85906n4407J6468j74049K50348L12197J14030
$$ -1202980 -1205036 -901768 -496932 188974 134567 151035 -23014 227334 539531 653561
11667F53561N82030l20444k10020q29618m4193K4607p1138q72269m19900k17669
$$ 653561 1235591 915147 705127 -124491 -168684 -144077 -215215 -1087484 -1507384 -1725053
11657a725053L96822J86473O85236P11508Q82482K69302k32343K31717j15280
$$ -1725053 -1328231 -1141758 -456522 254986 1137468 1406770 1174427 1406144 1290864
11648A290864j47524p47322j109017n70561L07106J70622p1285M0088K29602p1713
$$ 1290864 1143340 396018 -712999 -1283560 -976454 -805832 -877117 -837029 -607427 -679140
11638f79140l00808Q7670R10651M26856R67985M18714o24311l45790k28885o49493
$$ -679140 -979948 -892278 18373 445229 1413214 1831928 1207617 861827 632942 -16551
11628a6551m56322k38260l81538N135M52235Q7747j53416j23631n8237M20507
$$ -16551 -472873 -711133 -1092671 -1087536 -635301 -547554 -700970 -824601 -882838 -462331
11618d62331J245220J88261k60664p55719M5159K30329l20508r716N73751j64679
$$ -462331 782889 971150 710486 -45233 -74 230255 -90253 -99969 473782 309103
11608C09103n35979p14545p67515l95732P42493O02337O75838O83229j70000j81548
$$ 309103 -226876 -941421 -1708936 -2104668 -1362175 -759838 -84000 599229 429229 247681
11598B47681j15807l9790J02519M80132l51740k42424K19787K83971o70153p49215
$$ 247681 131874 92084 194603 674735 322995 80571 300358 584329 -85824 -835039
11588h35039O1528q7618L11741K4812m98347l61847Q15953o0803L70650P85835
$$ -835039 -773511 -861129 -549388 -524576 -1022923 -1384770 -568817 -629620 -258970 526865
11578E26865L58704J08556o82726n4801m72061j52621k04245L56887O63281L0291
$$ 526865 885569 994125 311399 256598 -215463 -368084 -572329 -215442 447839 478130
11568D78130n20778p11483J91613K01735J53805L44021q8348L36598m0667K1199
$$ 478130 -42648 -754131 -562518 -360783 -206978 137043 48695 385293 344626 365825
11558C65825m19345Q49328j77364l14005n62852o15291J61385J66426L21218L47829
$$ 365825 -53520 795808 618444 304439 -258413 -873704 -712319 -545893 -224675 123154
11548A23154Q7231K01401m12027j57704K15763K89667k71340j017403M74323N14430
$$ 123154 210385 411786 -241 -157945 57818 347485 76145 -941258 -466935 47495
11538D7495M63994m18061k44934l16184k70287r7662N15395L64434M396k43853
$$ 47495 511489 93428 -151506 -467690 -737977 -835639 -320244 44190 48586 -195267
11528a95267p36532n5160K08018J40804L23699L26475J49293j52862n66945K48327
$$ -195267 -931799 -986959 -778941 -638137 -314438 12037 161330 8468 -558477 -310150
11518c10150R6715M5624K71663j170533J34240J297038M33184Q9417o01397p04186
$$ -310150 -213435 -167811 103852 -1066681 -932441 364597 797781 887198 285801 -418385
11508d18385R4896m4875N15514k3444K25443o26136n54310j60283O33232Q25025
$$ -418385 -323489 -368364 147150 123706 349149 -276987 -831297 -991580 -358348 466677
11498D66677j11525k07300l16799l41500n0218P81523K53766L83788M62941j70428
$$ 466677 355152 147852 -168947 -510447 -560665 220858 474624 858412 1321353 1150925
11488A150925p39057M82785Q6294k97306l81093q74683l32875L8390M15387L39615
$$ 1150925 411868 894653 980947 683641 302548 -572135 -905010 -866620 -451233 -111618
11478a11618M4451K33571l57818J25444L73878O54834l78959k23603l04356J13564
$$ -111618 -67167 166404 -191414 -65970 307908 962742 583783 360180 55824 169388
11468A69388J71393M18631k83295l46116n2133k20956o25958l48800K61445j7319
$$ 169388 340781 759412 476117 130001 77868 -143088 -769046 -1117846 -856401 -873720
11458h73720L33954J50392N39349N09446k21806m01785m30295o23687K28819N89191
$$ -873720 -539766 -389374 149975 659421 437615 35830 -394465 -1018152 -789333 -200142
11448b00142R19970K86024K36241j86375p78657o44162M43740J25489l51816P7898
$$ -200142 719828 1005852 1242093 1055718 277061 -367101 76639 202128 -149688 -71790
11438g1790m55710k39531J85078n9536J047432L33020j15391j02405j25451l76233
$$ -71790 -527500 -767031 -581953 -641489 405943 738963 623572 521167 395716 19483
11428A9483m48606M52425N69927p602N9251r12917q56392j26372p56055k2462
$$ 19483 -429123 23302 593229 585627 644878 -268039 -1124431 -1250803 -2006858 -2029320
11418b029320O37988J026606J553189O12746p6334q53882j33626Q5109j15096
$$ -2029320 -1391332 -364726 1188463 1801209 1724875 870993 737367 822476 707380
11409G07380k08625O7464k9252j194363j173105p24643P43967Q59214J019031
$$ 707380 498755 566219 536967 -657396 -1830501 -2555144 -1811177 -951963 67068
11400F7068P38724j50857m66389m32938J36205Q72230J394613J98205l98900q49081
$$ 67068 805792 654935 188546 -244392 -108187 764043 2158656 2356861 1957961 1108880
11390A108880r69822r43180p47055R4L64114J046390L56141Q7667O27615n2307
$$ 1108880 139058 -804122 -1551177 -1551083 -1186969 -140579 215562 303229 930844 878537
11380H78537k80028N60910J71042K87871L04066p66490m49013j005853p74027
$$ 878537 598509 1159419 1330461 1618332 1922398 1155908 706895 -298958 -1072985
11371a072985L23238n68014O1705M53256o8100n47760L33798Q74141J089244J142043
$$ -1072985 -749747 -1317761 -1256056 -802800 -870900 -1418660 -1084862 -210721 878523 2020566
11361B020566P07575j06092r03151j292113o94423l37136o64381m092m76387j71780
$$ 2020566 2728141 2622049 1718898 426785 -267638 -604774 -1269155 -1273247 -1749634 -1921414
11351a921414Q79749M07791N64566M21052n02384L63380P83218L15901L73627
$$ -1921414 -1041665 -633874 -69308 351744 -150640 212740 995958 1311859 1685486
11342A685486n44241r56244n10393M0167K71017k53009j71275l88666m54676j79431
$$ 1685486 1141245 185001 -325392 -285225 -14208 -267217 -438492 -827158 -1281834 -1461265
11332a461265O68671M42628J134226J348040m66410o54664n72681O3965O4691
$$ -1461265 -792594 -349966 784260 2132300 1665890 1011226 438545 502510 567201
11323E67201o71275K20318p0435m35408L36390j97609l38676L72936j79083J66966
$$ 567201 -104074 116244 45809 -389599 -53209 -250818 -589494 -216558 -395641 -228675
11313b28675L66125j9052O10069M98717m53871q19649j59982m5654P91459K7810
$$ -228675 137450 118398 728467 1227184 773313 -46336 -206318 -251972 539487 567297
11303E67297m47499j41098m03794k34109j98680Q19100K5409K47548m846o85777
$$ 567297 119798 -21300 -425094 -659203 -857883 -38783 -13374 234174 229328 -456449
11293d56449R6836m99883l57110P24442R53546K30325j9148l79142M31213l66120
$$ -456449 -359613 -859496 -1216606 -492164 461382 691707 672559 293417 724630 358510
11283C58510k13478k86631k06178j22094n29980o8577j66657q8649r3998J01589
$$ 358510 145032 -141599 -347777 -469871 -999851 -1068428 -1235085 -1323734 -1417732 -1316143
11273a316143J42272P68776N13800J35779j93519j75360J93404L45227O84851
$$ -1316143 -1173871 -405095 108705 244484 50965 -124395 69009 414236 1099087
11264A099087k3015m15925j123194j106574j76391J44253O60202J408546J29092
$$ 1099087 1076072 660147 -463047 -1569621 -1746012 -1601759 -941557 466989 596081
11255E96081l09858k41279l85697K68648M13979K14266j94542N7620P5428J03068
$$ 596081 286223 44944 -340753 -72105 341874 556140 361598 419218 494646 597714
11245E97714m58736l72033o53110k53838K73315M23966R12083K72363r1268k02692
$$ 597714 138978 -233055 -886165 -1140003 -866688 -442722 469361 741724 650456 447764
11235D47764j13061P1465j60016J29034j05535k36850k33419L51133k97344M244
$$ 447764 334703 406168 246152 375186 269651 32801 -200618 150515 -146829 -142585
11225a42585J36216P3070N87912R1759p73586j15384O58051N25460n08117j09505
$$ -142585 -6369 66701 654613 746372 -27214 -142598 515453 1040913 532796 423291
11215D23291K03100j94330l6617k18852M08836m75428k31119l41162L39219P08633
$$ 423291 626391 432061 395444 176592 585428 110000 -121119 -462281 -123062 585571
11205E85571N82033m74162o61469p00744L13009P49124L05564J03961p49346l51861
$$ 585571 1167604 693442 31973 -668771 -355762 393362 698926 802887 53541 -298320
11195b98320k20056o0706P05555Q4719p9258P6295m19433M25837J09798l93450
$$ -298320 -518376 -579082 126473 211192 131934 208229 -211204 214633 324431 -69019
11185f9019L23058J72570k90677J29382k92663K68414j07553K29721m01837M8243
$$ -69019 254039 426609 135932 265314 -27349 241065 133512 363233 -38604 9639
11175I639J17536M32000N07030o89760l19509Q0629l46616j55602M14753Q46000
$$ 9639 127175 559175 1066205 376445 56936 137565 -209051 -364653 50100 896100
11165H96100j16095n72747k44804o67370K91658P07760j38661p6922K11170J27326
$$ 896100 780005 207258 -37546 -704916 -413258 294502 155841 78919 290089 417415
11155D17415j51474l48241M23404K28771o29457m87526l3207L57873O24826k35295
$$ 417415 265941 -82300 341104 569875 -59582 -547108 -580315 -222442 402384 167089
11145A67089p78615K83900M94126K76764k69203l19774Q18739p20538j227420
$$ 167089 -611526 -327626 166500 443264 174061 -145713 673026 -47512 -1274932
11136a274932L01601Q20737P86031J46524o01761m55837K40853o40596K17275
$$ -1274932 -973331 -152594 633437 779961 178200 -277637 -36784 -677380 -460105
11127d60105J001781O45033J59548q49785p09921L59716O04036m98646m07517
$$ -460105 541676 1186709 1346257 496472 -213449 146267 750303 251657 -155860
11118a55860m74929N93847J07474j38983l03000L2252N25716K55518L836O01050
$$ -155860 -630789 -36942 70532 -68451 -371451 -339199 186517 442035 445871 1046921
11108A046921k6771l17466p80865k22300O29295M93301k69325r0477k43761N133
$$ 1046921 1020150 702684 -78181 -300481 328814 822115 552790 462313 218552 223685
11098B23685o27342p48821Q13648O17220J06544j42219L6939L74835L52928n98279
$$ 223685 -403657 -1152478 -338830 278390 384934 242715 279654 654489 1007417 409138
11088D09138k34899J22475j88809l27259n46280p3565K86115Q40534J7796k24738
$$ 409138 174239 296714 107905 -219354 -765634 -839199 -553084 287450 305246 80508
11078H0508M04200j91582l11173o53537L97712O10770P34188j55139m09309p66596
$$ 80508 484708 293126 -18047 -671584 -273872 336898 1071086 915947 506638 -259958
11068b59958m58200j36857K32925M02223L12309K43869K16672n08925J81787J020970
$$ -259958 -718158 -855015 -622090 -219867 92442 336311 552983 44058 225845 1246815
11058A246815m54707o72548J75801J1557n50107q34447K97052K13604j57055M03055
$$ 1246815 792108 119560 295361 306918 -243189 -1077636 -780584 -566980 -724035 -320980
11048c20980J64928O76366m88667n45388k6673O05501P72440j32026K57908k04875
$$ -320980 -156052 520314 31647 -513741 -540414 65087 837527 705501 963409 758534
11038G58534j60184l04448n61271k99211J30437J52580p03262k70993K45916N75603
$$ 758534 598350 293902 -267369 -566580 -436143 -283563 -986825 -1257818 -1011902 -436299
11028d36299m86048j29725R05365N12521K42245l62562l26810N9340R85747O61454
$$ -436299 -922347 -1052072 -146707 365814 608059 245497 -81313 -21973 963774 1625228
11018A625228m93252l01843q11142n03134m74375j83548N37835P15541j41494
$$ 1625228 1131976 830133 18991 -484143 -958518 -1142066 -604231 111310 -30184
11009c0184j41141L6395O31411O48304J75301M59050L59680r50125p94397j0687
$$ -30184 -171325 -134930 496481 1144785 1320086 1779136 2138816 1188691 394294 383607
10999C83607m58066N4049k67497o00343l7096J07916K3424J57088j00151M18919
$$ 383607 -74459 -20410 -287907 -888250 -925346 -817430 -794006 -636918 -737069 -318150
10989c18150J208179k7619J31015O81061j01031m58055q44113K62053l27334L08423
$$ -318150 890029 862410 993425 1674486 1573455 1115400 271287 533340 206006 514429
10979E14429l62750p87913k42920j07502l113M85496R26745O72732K64238j58025
$$ 514429 151679 -636234 -879154 -986656 -989769 -504273 422472 1095204 1359442 1201417
10969A201417k79274K19024J55933m33289m3719j3518p43322o57352q73881J37796
$$ 1201417 922143 1141167 1297100 863811 820092 806574 63252 -594100 -1467981 -1330185
10959a330185N68855J36991p2025J059020Q66310K48771m55264K03634j82680
$$ -1330185 -761330 -624339 -696364 362656 1228966 1477737 1022473 1226107 1043427
10950A043427j7931N4909m90095o60114o44247K60920j005503L00900M29003P72074
$$ 1043427 1025496 1080405 590310 -69804 -714051 -453131 -1458634 -1157734 -728731 43343
10940D3343k838K21207K06722J61437L1572K2064m6587L13169p22172j065640
$$ 43343 40505 261712 468434 629871 661443 683507 636920 950089 227917 -837723
10930h37723o00129J88484K13787J07827l9521M07579L89204J75947l0211N1767
$$ -837723 -1437852 -1249368 -1035581 -927754 -967275 -559696 -170492 5455 -24756 27011
10920B7011Q84767M45133j59175p45136j90231o5598l2q35605r09869M56901K73931
$$ 27011 911778 1356911 1197736 452600 262369 196771 196739 -638866 -1548735 -1091834 -817903
10909h17903L11050M95487Q38499M39036o85371j03157N35753L37914l38435q34213
$$ -817903 -506853 -11366 827133 1266169 580798 477641 1013394 1351308 1012873 178660
10899A78660o72707j59016K14434P683L37295M97848k96187p20028p56497M17493
$$ 178660 -494047 -653063 -438629 -430946 -93651 404197 108010 -612018 -1368515 -951022
10889i51022J192698N35666L53323l37046k53549J29258l94425L9641M30034P42108
$$ -951022 241676 777342 1130665 793619 540070 669328 274903 314544 744578 1486686
10879A486686m12148j321635p58020K27082O76892O92155k54910J9683K9279o03762
$$ 1486686 1074538 -247097 -1005117 -778035 -101143 591012 336102 355785 385064 -218698
10869b18698j68605K5089M52716K74330k03831J55372M59414L6573m96084n79239
$$ -218698 -387303 -362214 90502 364832 161001 316373 775787 812360 316276 -262963
10859b62963q10275O43235N58392N12571J04909m24314n06180k23012J62932R90251
$$ -262963 -1073238 -430003 128389 640960 745869 321555 -184625 -407637 -244705 745546
10849G45546N11379P4967j111732l89372K94593n02591p03404Q20153J183419
$$ 745546 1256925 1331892 220160 -169212 125381 -377210 -1080614 -260461 922958
10840I22958k94922p67361j000451j30483N4098P89832Q18885Q40597K14088J14414
$$ 922958 628036 -139325 -1139776 -1270259 -1216161 -426329 392556 1233153 1447241 1561655
10830A561655m45942o87104Q8584m81278o70387J47486P51064N44111n70391p48997
$$ 1561655 1115713 428609 517193 35915 -634472 -486986 264078 808189 237798 -511199
10820e11199n462K35321N97964J26178l5197K27258J14871o60168l58918M50347
$$ -511199 -516661 -281340 316624 442802 407605 634863 749734 89566 -269352 180995
10810A80995J69048L87556j220523p31922k76767P41705n1005Q36849M27883K30338
$$ 180995 350043 737599 -482924 -1214846 -1491613 -749908 -800913 35936 463819 694157
10800F94157K92906j75908Q4929k36779m93073P1229k86382j36389j27839q81584
$$ 694157 987063 811155 896084 659305 166232 237461 -48921 -185310 -313149 -1194733
10790a194733q3291L24128K76956n72444j77281R61719O82066M23450L86777k42232
$$ -1194733 -1278024 -953896 -676940 -1249384 -1426665 -464946 217120 640570 1027347 785115
10780G85115L18434K50119k73008m64583o10250m34010r7144j216562o3476L07832
$$ 785115 1103549 1353668 1080660 616077 5827 -428183 -525327 -1741889 -1805365 -1497533
10770a497533M64632N6330j23936P99950N29904M67299K36994j69057j36900J34215
$$ -1497533 -1032901 -976571 -1100507 -300557 229347 696646 933640 764583 627683 761898
10760G61898l83972J59789O0852k36716j94272j563652k22847N02507j49226J65416
$$ 761898 377926 537715 598567 361851 167579 -1396073 -1618920 -1116413 -1265639 -1100223
10750a100223R83591J064874R9099p70291q10562K94123O94059N87838J26008
$$ -1100223 -116632 948242 1047341 277050 -533512 -239389 454670 1042508 1168516
10741A168516l46643Q0218k96225p18627l045J17663K6121n68552K4241m8828
$$ 1168516 821873 902091 605866 -112761 -115806 1857 27978 -540574 -516333 -565161
10731e65161J59793K71205J22694O80744K12068k40589O21576j68719m21443L97760
$$ -565161 -405368 -134163 -11469 669275 881343 640754 1262330 1093611 672168 1069928
10721A069928m73919j46791M51595K56644n79707j173883p36309J70088P19578
$$ 1069928 596009 449218 900813 1157457 577750 -596133 -1332442 -1162354 -442776
10712d42776k53644M01092O34935K66837m46988o20435K52448R26924J071373
$$ -442776 -696420 -295328 339607 606444 159456 -460979 -208531 718393 1789766
10703A789766p88978m37772k45807j02534l43465L12136P45753R57r94333l45978
$$ 1789766 1000788 563016 317209 214675 -128790 183346 929099 930056 -64277 -410255
10693d10255K6097O42230R3722J60085J03619P32133J61614k08925l29155o54411
$$ -410255 -384158 258072 351794 511879 615498 1347631 1509245 1300320 971165 316754
10683C16754Q4553N2298l78520O05954M16026o21489l02713o36625J28239N99421
$$ 316754 401307 453605 75085 681039 1097065 475576 172863 -463762 -335523 263898
10673B63898J18674k77488p1446M86819k06203R0717K3046L87157M28145n55309
$$ 263898 382572 105084 33638 520457 314254 404971 428017 815174 1243319 688010
10663F88010o53981n36447O0952k37782j28352N99718P28846j50315k85646m06855
$$ 688010 34029 -502418 -441466 -679248 -807600 -207882 520964 370649 85003 -321852
10653c21852j00332L24644K71386M23695L39315M55363k29208p43400j12856j25802
$$ -321852 -422184 -97540 173846 597541 936856 1392219 1163011 419611 306755 180953
10643A80953n7533m7879r6929M29195j27598r82008n12650m7088J085107O67527
$$ 180953 123420 75541 -21388 407807 280209 -701799 -1214449 -1261537 -176430 491097
10633D91097O80450J59896m26268q28500l37181l06224P8425R29920Q90851O8033
$$ 491097 1171547 1331443 905175 76675 -260506 -566730 -488305 441615 1332466 1400499
10623A400499p24550o43090m89727n71796J058997K40330P57375L52140P4707
$$ 1400499 675949 32859 -456868 -1028664 30333 270663 1028038 1380178 1454885
10614A454885j001060m62490K00366k91120N1142M62309m21094l71346o1957m8834
$$ 1454885 453825 -8665 191701 -99419 -48277 414032 -7062 -378408 -440365 -489199
10604d89199J13923j17935K4618M79795N71017J14971k95064k60679K78822J92094
$$ -489199 -375276 -493211 -468593 11202 582219 697190 402126 141447 420269 612363
10594F12363M27192l83216n24283p88442m74679k82376L85950J84718Q35431M25664
$$ 612363 1039555 656339 132056 -656386 -1131065 -1413441 -1027491 -842773 -7342 418322
10584D18322J52687M3899j63732o6445l9321J1554k2061M45016m36869n78409
$$ 418322 571009 614908 451176 384731 345410 356964 334903 779919 343050 -235359
10574b35359L99661K46284l48400o8100J78719K22950J8779j56040J25437M54505
$$ -235359 164302 410586 62186 -5914 172805 395755 414534 258494 383931 838436
10564H38436L97709n81890j19684k37315j44800k62480K73319P5321J21425m40035
$$ 838436 1236145 654255 534571 297256 152456 -110024 163295 238616 360041 -79994
10554g9994k72953j5213M01698N05061M50222o3203m97691l93020m36387q9577
$$ -79994 -352947 -368160 33538 538599 988821 925618 427927 34907 -401480 -491057
10544d91057J71453L93645L37124K734j6750m02392m37753K78095j43253j17179
$$ -491057 -319604 74041 411165 413899 397149 -5243 -442996 -164901 -308154 -425333
10534d25333P53648P85779q9709m75251k32043m65021l34111K99068O64474J02182
$$ -425333 328315 1114094 1024385 549134 317091 -147930 -482041 -182973 481501 583683
10524E83683k91834n82498j1668J84996M05727P3487N91198K06925l09516n94317
$$ 583683 291849 -290649 -302317 -117321 288406 361893 953091 1160016 850500 256183
10514B56183k10779j8313p9136M64428k44411K93390q53673n12654l89065k28935
$$ 256183 45404 27091 -52045 412383 167972 461362 -392311 -904965 -1294030 -1522965
10504a522965P29488J191857N46426k79188l83490O01786m2390n19377O6111l9555
$$ -1522965 -793477 398380 944806 665618 282128 883914 841524 322147 388258 348703
10494C48703l98963k14821P52964j91349o16523M05819O31459k90972k83616l8713
$$ 348703 -50260 -265081 487883 296534 -319989 85830 717289 426317 142701 103988
10484A03988m91654l32975J43133N51544N31062K62544K51516q07883l85844O66484
$$ 103988 -387666 -720641 -577508 -25964 505098 767642 1019158 211275 -174569 491915
10474D91915L02128k16516n31020O6618J18648k18774o45897N28310M05690M72157
$$ 491915 794043 577527 46507 113125 231773 12999 -632898 -104588 301102 773259
10464G73259l16249l71251j45343l05224M24050J75893K68372N50167o71177J98019
$$ 773259 457010 85759 -59584 -364808 59242 235135 503507 1053674 382497 580516
10454E80516m6579j92326J98400L1235P9529L1140l77922L21275k19755p53237
$$ 580516 533937 341611 540011 571246 650775 681915 303993 625268 405513 -347724
10444c47724k2633J57153O71034L02264o3378k3752j47806o03682j59435N7992
$$ -347724 -370357 -213204 457830 760094 696716 672964 525158 -78524 -237959 -179967
10434a79967Q23046j0525l34458o48798l98983k24385M0822Q73500K97411L79084
$$ -179967 643079 632554 298096 -350702 -749685 -974070 -933248 -59748 237663 616747
10424F16747N16373m08292l84333O33828J18482k57214L83558j43351J0471o09435
$$ 616747 1133120 724828 340495 974323 1092805 835591 1219149 1075798 1086269 476834
10414D76834R4635p19354n24597N36454k2825P58673O13886l73334j64509J22961
$$ 476834 571469 -147885 -672482 -136028 -158853 599820 1213706 840372 675863 798824
10404G98824j20301l8713k5096M5725K16005l41212o5331m47861j41354M0689
$$ 798824 678523 639810 614714 660439 876444 535232 469901 22040 -119314 -78625
10394g8625J75183Q58372j47045p21920q4589L0244N8553N33445K64320K37222
$$ -78625 96558 954930 807885 85965 1376 31620 90173 623618 887938 1125160
10384A125160j94271k26257J66808m10267m80827j66230j1618P8267L16784J17454
$$ 1125160 930889 704632 871440 461173 -19654 -185884 -197502 -119235 197549 315003
10374C15003L28496m04427m17562k80991K76356J287978J28991k70790o6940j6094
$$ 315003 643499 239072 -178490 -459481 -183125 1104853 1233844 963054 896114 880020
10364H80020r37098M37784J61930l93228J82522P4733m26967k25966j09384Q5534
$$ 880020 -57078 380706 542636 149408 331930 406663 -20304 -246270 -355654 -270120
10354b70120P5379k7479j1597N43108j39417k65622j19150J25307O97088l15954
$$ -270120 -194741 -222220 -233817 309291 169874 -95748 -214898 -89591 607497 291543
10344B91543J19603K29493N49740o94606j054871L0022K26322M5958L30369M50541
$$ 291543 411146 640639 1190379 495773 -559098 -529076 -302754 -256796 73573 524114
10334E24114j04442M21544k56505m63954M09609O3067l85813L18545J38865l47262
$$ 524114 419672 841216 584711 120757 530366 593433 207620 526165 665030 317768
10324C17768m61207l18865l96434L50209K06409l51266M15062M85485l1676K55918
$$ 317768 -143439 -462304 -858738 -508529 -302120 -653386 -238324 247161 215485 471403
10314D71403k31798k68390L87609N38125J46648K44427q31247p00480n42586K72425
$$ 471403 239605 -28785 358824 896949 1043597 1288024 456777 -243703 -786289 -513864
10304e13864M01423N3302R84184l85899n49080M0340M29540J0817L18058l92870
$$ -513864 -112441 -59139 925045 539146 -9934 30406 459946 470763 788821 395951
10294C95951k45461M63068l64295m41012k26764J42112Q6203k13395N51061m16059
$$ 395951 150490 613558 249263 -191749 -418513 -276401 -190198 -403593 147468 -268591
10284b68591l26499N37037N11552P38914K0801k27792M93365j16150p93355J64659
$$ -268591 -595090 -58053 453499 1192413 1213214 985422 1478787 1362637 569282 733941
10274G33941q49716N1105O31742o35479L29833p08924k90679m4165Q05788K95690
$$ 733941 -115775 -64670 567072 -68407 261426 -447498 -738177 -782342 23446 319136
10264C19136l7697N49068J52515r2132o74082k3087N61211M17263n08752p87280
$$ 319136 281439 830507 983022 890890 216808 193721 754932 1172195 663443 -123837
10254a23837l56669j025924N99271R68496L63788M84711K44809n03392n26640
$$ -123837 -480506 -1506430 -907159 61337 425125 909836 1154645 651253 124613
10245A24613P23882O79988r8067j13678n38462m29137q10394K8113K6131j83135
$$ 124613 848495 1528483 1430416 1316738 778276 349139 -461255 -433142 -407011 -590146
10235e90146j71577L43783O46189p271M8003J36654K78976M18420j14529l36739
$$ -590146 -761723 -417940 228249 220978 268981 405635 684611 1103031 988502 651763
10225F51763p5387l9844n41351o4237L05253k37111Q08865J86446m90633q7324
$$ 651763 576376 536532 -4819 -69056 236197 -914 807951 994397 503764 416440
10215D16440L10066j023245K53568J050229J010244K7974r52194n93332k25551
$$ 416440 726506 -296739 -43171 1007058 2017302 2045276 1093082 499750 274199
10206B74199m34672m58706q61074k37061J212523N92070O7974O10810l14087m28569
$$ 274199 -160473 -619179 -1480253 -1717314 -504791 87279 155253 766063 451976 23407
10196B3407K91187l7330K52252K84553P4378o587n57019o68935k85864P13124
$$ 23407 314594 277264 529516 814069 888447 881860 324841 -344094 -629958 83166
10186H3166l49403l34999N6584M77085K37217M01634l8806N81318L11336m41379
$$ 83166 -266237 -601236 -544652 -67567 169650 571284 532478 1113796 1425132 983753
10176I83753J13993J31272k87291o68279n96116j69189M3223M23424J77567J15207
$$ 983753 1097746 1229018 941727 273448 -322668 -491857 -448634 -25210 152357 267564
10166B67564m99966k20948j09204K29437J323729N4838J02660o6105K38760j35160
$$ 267564 -232402 -453350 -562554 -333117 990612 1045450 1148110 1082005 1320765 1185605
10156A185605o35352p58782j81238M66033j18773q733p5866m68725J097090L24107
$$ 1185605 550253 -208529 -389767 76266 -42507 -51240 -127106 -595831 501259 825366
10146H25366j02064m50059j38458M42703q1238k0929K06755k11818k01285k14803
$$ 825366 723302 273243 134785 577488 496250 475321 682076 470258 268973 54170
10136E4170P26475M62148M7121L1767j230981q55467r8854M81030Q12887K75912
$$ 54170 780645 1242793 1289914 1321681 90700 -764767 -863621 -382591 430296 706208
10126G06208Q05562k92314j5203p30620n19193M2355j8925j70241J29109P06755
$$ 706208 1511770 1219456 1204253 473633 -45560 -3205 -22130 -192371 -63262 643493
10116F43493m0647j97147k08547P10783j59316j05327o8659J5428l13561n88600
$$ 643493 602846 405699 197152 907935 748619 643292 574633 590061 276500 -312100
10106c12100M4450j17620K75429J141836K77556m07813k79474n64250n38651J76214
$$ -312100 -267650 -385270 -109841 1031995 1309551 901738 622264 58014 -480637 -304423
10096c04423M88592Q32852j08722n2958n40600m12405k23383L74216K04121R38834
$$ -304423 184169 1017021 908299 855341 314741 -97664 -321047 53169 257290 1196124
10086A196124P4702o77948o18368N6857J66368N3131j66978K61361O40761m78663
$$ 1196124 1270826 592878 -25490 31367 197735 250866 83888 345249 986010 507347
10076E07347k36686m24140l08777j77973L0001N02557R93810k08730l30830o49065
$$ 507347 270661 -153479 -462256 -640229 -610228 -107671 886139 677409 346579 -302486
10066c02486k2826k94278M84670J354025P34526k43220j118372l92053j77827
$$ -302486 -325312 -619590 -134920 1219105 1953631 1710411 592039 199986 22159
10057B2159Q0201M64559N52771j79648p47788k55111j55957L18422K25187O48623
$$ 22159 102360 566919 1119690 940042 192254 -62857 -218814 99608 324795 973418
10047I73418L35398n39564n82063L91815M5643k83497J08872J91776q2093l15288
$$ 973418 1308816 769252 187189 579004 624647 341150 450022 641798 559705 244417
10037B44417R506j96138k23945L9517L60625M10807L41097K78574m25973j257349
$$ 244417 253923 57785 -166160 -126643 233982 644789 985886 1264460 838487 -418862
10027d18862n7447P42976P93990N65167m46593J18262m57438p96654n46991N17822
$$ -418862 -476309 266667 1060657 1625824 1179231 1297493 840055 43401 -503590 14232
10017A4232P24746M55182j337768k37956J19775L67449M26309J77063J65604J6888
$$ 14232 738978 1194160 -143608 -381564 -261789 105660 531969 709032 874636 891524
10007H91524K25898o96547j17507Q19701J48148j14235k73899q40842k12289M2890
$$ 891524 1117422 420875 303368 1123069 1271217 1156982 883083 42241 -170048 -127158
9997a27158p827M649l836R2931M38852J52118N7310k31055m79094J93281N60339
$$ -127158 -134985 -130336 -134172 -41241 397611 549729 607039 375984 -103110 90171 650510
9986F50510K23190P38610p4826k77136Q8240q10629n67155j98509K58250N61573
$$ 650510 873700 1612310 1537484 1260348 1348588 537959 -29196 -227705 30545 592118
9976E92118o05867p3251j92077j13718o7826L03494M35073J26349P3417O5734
$$ 592118 -13749 -87000 -279077 -392795 -460621 -157127 277946 404295 477712 543446
9966E43446O10869P79379j66781M4619l80175n75935L81425M15462q00437l83939
$$ 543446 1154315 1933694 1766913 1811532 1431357 855422 1236847 1652309 851872 467933
9956D67933k16864m11653o12497J78981M23747M63006L520m19440K88043M97594
$$ 467933 251069 -160584 -773081 -594100 -170353 292653 296173 -123267 164776 662370
9946F62370M4912L17379j85488J17863q6370q95053l80395j3016l34633L84633
$$ 662370 707282 1024661 839173 957036 870666 -24387 -404782 -417798 -752431 -367798
9936c67798P0636m0014J7336L71732K55347l623M59427N73523O8465l89389j90077
$$ -367798 -297162 -337176 -319840 51892 307239 303616 763043 1336566 1405031 1015642 825565
9925H25565M67247n5834o28015m51732j59955N92022J52519o10992k74244J15034
$$ 825565 1292812 1236978 608963 157231 -2724 589298 741817 130825 -143419 -28385
9915b8385l60275L0832N79389M00821J307810l89198r73976K6855K34791l50450
$$ -28385 -388660 -357828 221561 622382 1930192 1540994 567018 593873 828664 478214
9905D78214k91778J44306p1263N1715l88889M95381n50000J04002K497J65207
$$ 478214 186436 330742 259479 311194 -77695 417686 -132314 -28312 -25815 139392
9895A39392L67843k24206n75837M79771J35385l7670m8920J65770J57508K72152
$$ 139392 507235 283029 -292808 186963 322348 284678 235758 401528 559036 831188
9885H31188K76698o91290r59635n4743L60240R91005j09L70546M05977m19306
$$ 831188 1107886 416596 -543039 -597782 -237542 753463 753354 1123900 1529877 1110571
9875A110571j322649q2369N1534l6226Q61838K17202k89876M25960J90364o94757
$$ 1110571 -212078 -294447 -242913 -279139 582699 799901 510025 935985 1126349 431592
9865D31592j36167M35556R37393Q794l81544o67353l10330J0935k34191r0849
$$ 431592 295425 730981 1668374 1677168 1295624 628271 317941 328876 94685 3836
9855C836J162028L36614p47833q45144l59297O40958J05278M66226O52392M35143
$$ 3836 1165864 1502478 754645 -90499 -449796 191162 296440 762666 1415058 1850201
9845A850201Q1095j139030j032888l63905O90790N40914l18323K72138K06875
$$ 1850201 1931296 792266 -240622 -604527 86263 627177 308854 580992 787867
9836G87867j76009o98493p59204R39189J291770J29948J4619k71887m15089m65035
$$ 787867 611858 -86635 -845839 93350 1385120 1515068 1529687 1257800 842711 377676
9826C77676n76765Q0859K83963k70212K17887N2254j83652k9144R2552K26018
$$ 377676 -199089 -118230 165733 -104479 113408 165662 -17990 -47134 45418 271436
9816B71436Q72036N37491j78775l67249o69151k2467l43572l84086L48143L73529
$$ 271436 1143472 1680963 1502188 1134939 465788 443321 99749 -284337 63806 437335
9806D37335K4833O91350k27053j44207N31375n32639Q8136K7950n9297j77072
$$ 437335 462168 1153518 926465 782258 1313633 780994 869130 897080 837783 660711
9796F60711m33418j35165J21221j55280k21720K77395J59782M4937k43548j74662
$$ 660711 227293 92128 213349 58069 -163651 113744 273526 318463 74915 -99747
9786i9747j18214L81279P29128N77778Q1868M25421m38682p53502m64290k28020
$$ -99747 -217961 163318 892446 1470224 1552092 1977513 1538831 785329 321039 93019
9776I3019K92365N11732o05490l50152N57832k26770k74976m72183J10278J376081
$$ 93019 385384 897116 291626 -58526 499306 272536 -2440 -474623 -364345 1011736
9766A011736O49738j31690P78316m25006j075244l03166L25845o57350P21006
$$ 1011736 1661474 1529784 2308100 1883094 807850 504684 830529 173179 894185
9757H94185N97363j024376n92566j61028J09160p4808N96504L12692P33784k26752
$$ 894185 1491548 467172 -125394 -286422 -177262 -252070 344434 657126 1390910 1164158
9747A164158m94667K49059P8820j94312J9275M25323N9635o91569l24268p56711
$$ 1164158 669491 918550 997370 803058 822333 1247656 1307291 615722 291454 -465257
9737d65257J01861O073Q56705K38629N23688L36720n13132o3640n29316L77916
$$ -465257 -363396 -357323 499382 738011 1261699 1598419 1085287 1021647 492331 870247
9727H70247R36401L39424K01744r28112q46700m96172Q5644N8319K21466M804
$$ 870247 1806648 2146072 2347816 1419704 573004 76832 162476 220795 442261 447065
9717D47065m02823l86192J3467N22236O00529P16219L27144J45685p3688j48219
$$ 447065 44242 -341950 -328483 193753 794282 1510501 1837645 1983330 1909642 1761423
9707A761423K17742o22715n61245N9201l22506l12431m0429l19835n17104N76847
$$ 1761423 1979165 1356450 795205 854406 531900 219469 179040 -140795 -657899 -81052
9697h1052q631M18675J018662O15801J47859P6280r51296j39984P0818J58944
$$ -81052 -89683 328992 1347654 1963455 2111314 2187594 1236298 1096314 1167132 1326076
9687A326076n69199l45669l34158L43952j6923o92231j91468O46604P45413J92358
$$ 1326076 756877 411208 77050 421002 404079 -288152 -479620 166984 912397 1104755
9677A104755J54341K39569L47282J70444o94337j18877K22623J99239p2495p96073
$$ 1104755 1259096 1498665 1845947 2016391 1322054 1203177 1425800 1625039 1552544 756471
9667G56471k83471r33707j091784N01333J001379R49996K24318M40915M05187
$$ 756471 473000 -460707 -1552491 -1051158 -49779 900217 1124535 1565450 1970637
9658A970637k16198n08250l36759J06087J052228K47486j180874r71112k41295
$$ 1970637 1754439 1246189 909430 1015517 2067745 2315231 1134357 163245 -78050
9649g8050k74612q4526L9556N02150P22543L87415l43809n7885K63829q4208K75259
$$ -78050 -352662 -437188 -397632 104518 827061 1214476 870667 812782 1076611 992403 1267662
9638A267662o2807P89992j51200n99365q51895r10691L52120P35877L7044L47553
$$ 1267662 1204855 1994847 1843647 1244282 392387 -518304 -166184 569693 606737 954290
9628I54290Q87663l270q68140n71627m47139Q97909J176112N3207o20475n99801
$$ 954290 1841953 1838683 970543 398916 -48223 849686 2025798 2079005 1458530 858729
9618H58729p69912k21689k62678J56467Q75842Q25928N8048n23913N30751L11525
$$ 858729 88817 -132872 -395550 -239083 636759 1462687 1520735 996822 1527573 1839098
9608A839098j89117O54654J97373k74906o49760j064872o29996j099725j15611
$$ 1839098 1649981 2304635 2502008 2227102 1577342 512470 -117526 -1217251 -1332862
9599a332862K59576J172168J069229N71495l53099n66951k87957J18254O4358
$$ -1332862 -1073286 98882 1168111 1739606 1386507 819556 531599 649853 714211
9590G14211Q61173J088246j8877n72959j832755l18194n1542M38825N29094L9335
$$ 714211 1575384 2663630 2644753 2071794 239039 -79155 -130697 308128 837222 876557
9580H76557n2135J17892J83489j25527N23629J011732R5786j18148J36096L0044
$$ 876557 824422 942314 1125803 1000276 1523905 2535637 2631423 2513275 2649371 2679415
9570B679415j145312j199617j107815l64681J157774P49415o0402J7636n2869
$$ 2679415 1534103 334486 -773329 -1138010 19764 769179 708777 726413 673544
9561F73544o70283l02848l8262J507046K128857M67951m49586j164993r64619
$$ 673544 3261 -299587 -337849 1169197 3298054 3766005 3316419 2151426 1186807
9552A186807p82468L09844O06723M81501j93998k82158m50797k41506M9892k5142
$$ 1186807 404339 714183 1320906 1802407 1608409 1326251 875454 633948 683840 658698
9542F58698O88207J68331R92354j25495k61232n36615r7001L85170K93580j42285
$$ 658698 1346905 1515236 2507590 2382095 2120863 1584248 1487247 1872417 2165997 2023712
9532B023712m3347R2307o86503p20612j069307O98649J373299N15221Q13752J81830
$$ 2023712 1980365 2072672 1386169 665557 -403750 294899 1668198 2183419 2997171 3179001
9522C179001q53060q71290n21856j1706J183824Q69550K5107n92936j127045j23853
$$ 3179001 2325941 1454651 932795 921089 2104913 2974463 2999570 2406634 1279589 1155736
9512A155736O9080N9537J95096L34245k38891n83884J41746O59541K27905J17665
$$ 1155736 1224816 1284353 1479449 1813694 1574803 990919 1132665 1792206 2020111 2137776
9502B137776L82710K82266m75770P9589k7820J17004J11453o04146J37003J16403
$$ 2137776 2520486 2802752 2326982 2406571 2378751 2495755 2607208 2003062 2140065 2256468
9492B256468k66397K39366K8656r49584r2730L46736L05275J005183N65396n98138
$$ 2256468 1990071 2229437 2258093 1308509 1215779 1562515 1867790 2872973 3438369 2840231
9482B840231o4555j65089n56666L80052Q43423j032521k72282N92420K40067O26742
$$ 2840231 2775676 2610587 2053921 2433973 3277396 2244875 1972593 2565013 2805080 3431822
9472C431822m79461m41269R6187N15610o50664J47179P54291L76727K28718p14806
$$ 3431822 2952361 2511092 2607279 3122889 2472225 2619404 3373695 3750422 3979140 3264334
9462C264334p40457J47736K72898O4043J23989r7970j37020n62421r5097N47487
$$ 3264334 2523877 2671613 2944511 3008554 3132543 3034573 2897553 2335132 2240035 2787522
9452B787522P91803N379J73487n38509k99353M12102m17291M98707J50962m95668
$$ 2787522 3579325 3584704 3758191 3219682 2920329 3332431 2915140 3413847 3564809 3069141
9442C069141m26972l05552M96162Q6645k90059M10226m41007J40407l76287J54188
$$ 3069141 2642169 2336617 2832779 2919424 2629365 3039591 2598584 2738991 2362704 2516892
9432B516892M02344K63781j89141j2152L03538J1942j33090m61907n45576n39892
$$ 2516892 2919236 3183017 2993876 2981724 3285262 3297204 3164114 2702207 2156631 1616739
9422A616739R3675Q79449R59269j69457n54333k82677o42881K45732Q70721Q14365
$$ 1616739 1710414 2589863 3549132 3379675 2825342 2542665 1899784 2145516 3016237 3830602
9412C830602M90180r83990j084881k14393O29427m21188L81481N87893K76092
$$ 3830602 4320782 3336792 2251911 2037518 2666945 2245757 2627238 3215131 3491223
9403C491223m93719k65931O9106j56249J01780P78327r0606l19881K02041m34824
$$ 3491223 2997504 2731573 2800679 2644430 2746210 3524537 3433931 3114050 3316091 2881267
9393B881267q29757l03919M69885L53828j14928Q28710J24711k93109p18958l31001
$$ 2881267 2051510 1747591 2217476 2571304 2456376 3285086 3409797 3116688 2397730 2066729
9383B066729M87588N54697R22260L94209M63359q83328j015109j01075j72496
$$ 2066729 2554317 3109014 4031274 4425483 4888842 4005514 2990405 2889330 2716834
9374B716834O82789j42148M4696J7583n7818k91620J85212K88823k0217K21510
$$ 2716834 3399623 3257475 3302171 3319754 3261936 2970316 3155528 3444351 3424134 3645644
9364C645644N25739M89741j52156m02425o5433l04978j31110N43703K98504J9067
$$ 3645644 4171383 4661124 4508968 4106543 4041110 3736132 3605022 4148725 4447229 4466296
9354D466296q6406l42815j09273l56935K00391J101335O03103j01798o89541l75271
$$ 4466296 4379890 4037075 3927802 3570867 3771258 4872593 5475696 5373898 4684357 4309086
9344D309086r25052l16559K77436L69494N88719P56079K33680r1243o55256j26711
$$ 4309086 3384034 3067475 3344911 3714405 4303124 5059203 5292883 5201640 4546384 4419673
9334D419673K66184N27743l7358M60867K86038k346p61115r0852O65632K49253
$$ 4419673 4685857 5213600 5176242 5637109 5923147 5920801 5159686 5068834 5734466 5983719
9324E983719L0477p06593J1590K15909n85243m88080J19694J077189J037697j21537
$$ 5983719 6014196 5307603 5319193 5535102 4949859 4461779 4581473 5658662 6696359 6574822
9314F574822J47243n19436o24988j86480O00825J109957Q0447J00941j79528q76539
$$ 6574822 6722065 6202629 5577641 5391161 5991986 7101943 7182390 7283331 7103803 6227264
9304F227264o00108K25889M2027J79714J09963M24534l66823l41090L60042O20017
$$ 6227264 5627156 5853045 5895072 6074786 6184749 6609283 6242460 5901370 6261412 6881429
9294F881429L02488O3817l5065J46906N37119P8988k21312L66741P39350J12071
$$ 6881429 7183917 7247734 7212669 7359575 7896694 7975682 7754370 8121111 8860461 8972532
9284H972532k51301O40756L25041m68282j046397k33197M97104R84789R79826
$$ 8972532 8721231 9361987 9687028 9218746 8172349 7939152 8436256 9421045 10400871
9275A0400871K07780J95929J68079n64637p81281k66685M27180M15856m70172
$$ 10400871 10608651 10804580 10972659 10408022 9626741 9360056 9787236 10203092 9732920
9266I732920l48911M43650O03614o0276K498K19955J63279K8804j26360O28827
$$ 9732920 9384009 9827659 10431273 10370997 10373495 10593450 10756729 10785533 10659173 11288000
9256A1288000P97461J67701Q99773K99786J15577N40845L87767p70948l19673
$$ 11288000 12085461 12253162 13152935 13452721 13568298 14109143 14496910 13725962 13406289
9247A3406289K70588L70718O87237N78232Q24164J68982j57596r11608k42566
$$ 13406289 13676877 14047595 14734832 15313064 16137228 16306210 16148614 15237006 14994440
9238A4994440k20885N4922N59027P17721J62408l34437J39402k05299j74138L87698
$$ 14994440 14773555 14828477 15387504 16105225 16267633 15933196 16072598 15867299 15693161 16080859
9228A6080859k3603m23137R05949N74788Q05748O10062O0165L33408K32004p85204
$$ 16080859 16057256 15634119 16540068 17114856 17920604 18530666 18590831 18924239 19156243 18371039
9218A8371039K33579L79378L19312J062126N41681o04197K07604M36489P7127
$$ 18371039 18604618 18983996 19303308 20365434 20907115 20302918 20510522 20947011 21024138
9209B1024138j50338K39387N59418J268779P52082N5177J27404p33713k64625
$$ 21024138 20873800 21113187 21672605 22941384 23693466 23748643 23876047 23142334 22877709
9200B2877709j43779M84050J054191N46344J816L39052O11840N79198P03516J021409
$$ 22877709 22733930 23217980 24272171 24818515 24820331 25159383 25771223 26350421 27053937 28075346
9190B8075346J237779P96344K04967r974k0591K81719Q57943K62322R46660O48770
$$ 28075346 29313125 30109469 30314436 30304462 30283871 30565590 31423533 31685855 32632515 33281285
9180C3281285R63527j0409K92835J516223P10984J088425K042264J855654J462612
$$ 33281285 34244812 34234403 34527238 36043461 36754445 37842870 39885134 41740788 43203400
9171D3203400Q76650N06572J940035K583738L150041L559293L765655K420044
$$ 43203400 44080050 44586622 46526657 49110395 52260436 55819729 59585384 62005428
9163F2005428L78863j8889R03116K656296L969978M238998K479763N14604n42364
$$ 62005428 62384291 62365402 63268518 65924814 69894792 74133790 76613553 77128157 76585793
9154G6585793n6694Q21019J267847K416980L179763K052756J873858K178536L726017
$$ 76585793 76529099 77350118 78617965 81034945 84214708 86267464 88141322 90319858 94045875
9145I4045875M660353N932655P875122Q892643P639455K872317Q07823K22293
$$ 94045875 98706228 104638883 112514005 121406648 129046103 131918420 132726243 132948536
9137A32948536L383007O254666Q468106P803386J765510o39200j318086j309666
$$ 132948536 136331543 142586209 151054315 158857701 160623211 159984011 158665925 157356259
9129A57356259P89741J637244J716722J182281K555131L480778L305291L708956
$$ 157356259 158146000 159783244 161499966 162682247 165237378 168718156 172023447 175732403
9121A75732403L834615K716151L829529M377529N855779O191001N283507N199930
$$ 175732403 179567018 182283169 186112698 190490227 196346006 202537007 207820514 213020444
9113B13020444O182854Q088149R838624J0033371Q736275N568391L379718L73947
$$ 213020444 219203298 227291447 237130071 247163442 255899717 261468108 264847826 265221773
9105B65221773k162015k854374k719071j411229m55294J506037J600076p22832
$$ 265221773 263059758 260205384 257486313 256075084 255619790 257125827 258725903 258003071
9097B58003071n543476q616593p990381n178233k834942j087248K148896M116305
$$ 258003071 252459595 243843002 235852621 230674388 227839446 226752198 228901094 233017399
9089B33017399N425746L845453R76763J398611K342027L881817O858955O542097
$$ 233017399 238443145 242288598 243265361 244663972 247005999 250887816 257746771 264288868
9081B64288868J872368j410676k749626l734451m413588m169401n100637n279459
$$ 264288868 266161236 264750560 262000934 258266483 253852895 249683494 244582857 239303398
9073B39303398m970346o550992p328530p338443o806480o331014o795708q192663
$$ 239303398 234333052 227782060 220453530 213115087 206308607 199977593 193181885 184989222
9065A84989222q492615p279299o954232o579107n821861l376094j497263M63577
$$ 184989222 176496607 169217308 162263076 155683969 149862108 146486014 144988751 145452328
9057A45452328J962853L026109K640003L81369k991520o327790o757624n000278
$$ 145452328 147415181 150441290 153081293 153462662 150471142 144143352 137385728 132385450
9049A32385450k014438l52026N08189J068390k662233q388239j0531496j0484115
$$ 132385450 130371012 130018986 130527175 131595565 128933332 120545093 110013597 99529482
9041I9529482r099146q537682p535760n753714l803230k880416l283125k107022
$$ 99529482 90430336 81892654 74356894 68603180 64799950 61919534 58636409 56529387
9033E6529387k194953j879916j784666j985568j783667p10219r62923j249350
$$ 56529387 54334434 52454518 50669852 48684284 46900617 46190398 45227475 43978125
9025D3978125j121232j507373m95241r46751q33455l05448K04631o11640p08208
$$ 43978125 42856893 41349520 40854279 39907528 39074073 38768625 38973256 38361616 37653408
9016C7653408m94457Q8198l62567r08672o04510o0771M25440n71958l97193n46734
$$ 37653408 37158951 37247149 36884582 35975910 35371400 35310629 35736069 35164111 34766918 34220184
9006C4220184o96827M27767K78453O33639K79668l72615m84172m46505k73821
$$ 34220184 33523357 33951124 34229577 34863216 35142884 34770269 34286097 33839592 33565771
8997C3565771M4687P63626N98999L57508l14394m52676j32404M89343P80981R98667
$$ 33565771 33610458 34374084 34973083 35330591 35016197 34563521 34431117 34920460 35701441 36700108
8987C6700108O52928L05928O08923R75117L57206O74286P29804Q35393L40002
$$ 36700108 37353036 37658964 38267887 39243004 39600210 40274496 41004300 41839693 42179695
8978D2179695Q1885Q60738K056998J980975K299224J792410J836262J997717J525486
$$ 42179695 42261580 43122318 45179316 47160291 49459515 51251925 53088187 55085904 56611390
8969E6611390J740967K434458K227202K296859L002367K429492J599862Q95765
$$ 56611390 58352357 60786815 63014017 65310876 68313243 70742735 72342597 73238362
8961G3238362J412681J323743R12605J972693K473446J181223N73595P53811J285394
$$ 73238362 74651043 75974786 76887391 78860084 81333530 82514753 83088348 83842159 85127553
8952H5127553Q15212Q19373J949579J203885N03031O24554P26332J931430L093408
$$ 85127553 85942765 86762138 88711717 89915602 90418633 91043187 91769519 93700949 96794357
8943I6794357K822804K716995L348777L386436L646186M191778O089659O918815
$$ 96794357 99617161 102334156 105682933 109069369 112715555 116907333 122996992 129915807
8935A29915807P776212Q909044R626184J0251005Q562414Q682512R860354P765210
$$ 129915807 137692019 146601063 156227247 166478252 175040666 183723178 193583532 201348742
8927B01348742M710144L449492K586687q589j429074j620954k421610j726119
$$ 201348742 206058886 209508378 212095065 212086476 210657402 209036448 206614838 204888719
8919B04888719K19191L164455O231250R107109J1112808J1661556R378816P058361
$$ 204888719 205107910 208272365 214503615 223610724 234723532 246385088 255763904 262822265
8911B62822265P456497R872523R436034R370583J2028236J5148186J7743565J7561204
$$ 262822265 270278762 280151285 289587319 298957902 310986138 326134324 343877889 361439093
8903C61439093J7618815J8950211J8263247J4523479J3827613J4109533J0287879
$$ 361439093 379057908 398008119 416271366 430794845 444622458 458731991 469019870
8896D69019870O311307L307216K978760K505474k307968o776414p939542p795412
$$ 469019870 475331177 478638393 481617153 484122627 481814659 475038245 467098703 459303291
8888D59303291r442104j1817239j3417361j4413626j4096912j4085538j8386633
$$ 459303291 449861187 438043948 424626587 410212961 396116049 382030511 363643878
8881C63643878k1407531k0599535j7881444j3799137j0930568p997558o982091
$$ 363643878 342236347 321636812 303755368 289956231 279025663 271028105 264046014
8874B64046014n700654j787008R99592M324230M326845M267640M056918O076944
$$ 264046014 258345360 256558352 257557944 261882174 266209019 270476659 274533577 280610521
8866B80610521P983002P881326O916908M088254J136732j898007k665230j268432
$$ 280610521 288593523 296474849 303391757 307480011 308616743 306718736 304053506 302785074
8858C02785074r49082k334900n398498r779787j2188182j0428156q810890r855210
$$ 302785074 301835992 299501092 294102594 284322807 272134625 261706469 252895579 243040369
8850B43040369j0540954j2057698j3524993j3311021j2807629j0926907q202568
$$ 243040369 232499415 220441717 206916724 193605703 180798074 169871167 161668599
8843A61668599o974966o688625n496371m128983k903465j892468j480678k215466
$$ 161668599 154693633 148005008 142508637 138379654 135476189 133583721 132103043 129887577
8835A29887577k773073l420813k054532r32420j90618K78j237862k315615k902595
$$ 129887577 127114504 123693691 121639159 120706739 120516121 120516399 119278537 116962922 114060327
8826A14060327k309686j933197j686624k026831l198378l897819l203287l488840
$$ 114060327 111750641 109817444 108130820 106103989 102905611 99007792 95804505 92315665
8818I2315665l190514l444255l812771m268997l505098k561576k239795k577806
$$ 92315665 89125151 85680896 81868125 77599128 74094030 71532454 69292659 66714853
8810F6714853l556632l908672l862987l339668k261971k281566k605758k348854
$$ 66714853 63158221 59249549 55386562 52046894 49784923 47503357 44897599 42548745
8802D2548745j841836j390558p6289J2605O3410n14027p28566m67186p71632o49830
$$ 42548745 40706909 39316351 39240062 39252667 39316077 38802050 38073484 37606298 36834666 36184836
8792C6184836j351946q97347n85721m94938n04298l71383q07199q94353j154810
$$ 36184836 34832890 33935543 33349822 32854884 32350586 31979203 31172004 30277651 29122841
8783B9122841r49769l66579j10922k11688o01692r25256k61346m51373j49035
$$ 29122841 28173072 27806493 27695571 27483883 26882191 25956935 25695589 25244216 25095181
8774B5095181N94818p2144o41990j300882j016075O7976k44013j78827p4254P54855
$$ 25095181 25689999 25617855 24975865 23674983 22658908 22726884 22482871 22304044 22229790 22984645
8764B2984645k44846m74775M5333J18396L61511O49792O41438N00468l3259m08383
$$ 22984645 22739799 22265024 22310357 22428753 22790264 23440056 24081494 24581962 24548703 24140320
8754B4140320r52777j777073m72757l76125q14956l16390K88924l52990n05552
$$ 24140320 23187543 21410470 20937713 20561588 19746632 19430242 19719166 19366176 18860624
8745A8860624l54581J1841n98923N78814l09703m66815j59476O1881l74205j16315
$$ 18860624 18506043 18517884 17918961 18497775 18188072 17721257 17561781 17623662 17249457 17133142
8735A7133142Q4828K17676J11114m40945j166593l60774n47893M59655R01111
$$ 17133142 17217970 17435646 17546760 17105815 15939222 15578448 15030555 15490210 16391321
8726A6391321P37313N26259J11910j1715M46313K24470M54487j64862N55172J51620
$$ 16391321 17128634 17654893 17766803 17755088 18201401 18425871 18880358 18715496 19270668 19422288
8716A9422288r1466j43683K74770M13399J073560J154998O79517J572373J968104
$$ 19422288 19330822 19187139 19461909 19875308 20948868 22103866 22783383 24355756 26323860
8707B6323860K831121L678328M077055N598696O842341Q840285J1684161J6754775
$$ 26323860 29154981 32833309 36910364 42509060 49351401 58191686 69875847 86630622
8699H6630622R365878j4671956j6997712j5597729j0689536n868706m813376l287745
$$ 86630622 95996500 81324544 64326832 48729103 38039567 32170861 27357485 24069740
8691B4069740k997327j789341j237338j015435j347827m58719p89933j367991
$$ 24069740 21072413 19283072 18045734 17030299 15682472 15223753 14433820 13065829
8683A3065829q09156L12253j87579k89500l60272q53863m68003o03982q35226
$$ 13065829 12256673 12568926 12381347 12091847 11731575 10877712 10409709 9805727 8970501
8674H970501J66154K75888j19258m81466l77710o12615q71698J36805J39284J79137
$$ 8970501 9136655 9412543 9293285 8811819 8434109 7821494 6949796 7086601 7225885 7405022
8664G405022K51720J63614o00006m85473M14068j73510m06481k91431K94849j99008
$$ 7405022 7656742 7820356 7220350 6734877 7148945 6975435 6568954 6277523 6572372 6373364
8654F373364n27711k48519l30324L52118K97629K48432M30426M13462l60212m37573
$$ 6373364 5845653 5597134 5266810 5618928 5916557 6164989 6595415 7008877 6648665 6211092
8644F211092j84798P73897N8639n20828m50965R4817j92879k08493p94572n42656
$$ 6211092 6026294 6800191 6858830 6338002 5887037 5981854 5788975 5580482 4785910 4243254
8634D243254k94893J84773o27400j31127O62547P63003l32606n60141r53623J6090
$$ 4243254 3948361 4133134 3505734 3374607 4037154 4800157 4467551 3907410 2953787 2969877
8624B969877M4318m3238N32849Q95565Q10386r29692j41282L4106J5238k74160
$$ 2969877 3014195 2970957 3503806 4399371 5209757 4280065 4138783 4172889 4188127 3913967
8614C913967K89801o19891J5250j04268p89680k99189L3042p1783l0181J4261
$$ 3913967 4203768 3583877 3599127 3494859 2705179 2405990 2439032 2367249 2337068 2351329
8604B351329j13133l87297P29214k83129J15912R41450Q40157L02001n78620n16412
$$ 2351329 2238196 1850899 2580113 2296984 2412896 3354346 4194503 4496504 3917884 3401472
8594C401472o45212l76939q9221j2036J223639m3611J46015o14026p12039o36422
$$ 3401472 2756260 2379321 2290100 2278064 3501703 3458092 3604107 2990081 2278042 1641620
8584A641620L48223L25563J1649N73088j95947l90391p74628O92809l5224l66809
$$ 1641620 1989843 2315406 2327055 2900143 2704196 2313805 1539177 2231986 2196762 1829953
8574A829953k08187q12304K103560l03121r74485k62098M83190M00698j84855
$$ 1829953 1621766 809462 2913022 2609901 1635416 1373318 1856508 2257206 2072351
8565B072351N76485K49278J83270q00482n83144L53018J144743R2463N82676J02371
$$ 2072351 2648836 2898114 3081384 2280902 1697758 2050776 3195519 3287982 3870658 3973029
8555C973029q67563j34836m57001p88926N51865J41169j86761J13850r086j71777
$$ 3973029 3105466 2970630 2513629 1724703 2276568 2417737 2230976 2344826 2335740 2163963
8545B163963j22252q2270k71730M72187L31979l95394J96059p6106L67853K2090
$$ 2163963 2041711 1959441 1687711 2159898 2491877 2096483 2292542 2216436 2584289 2606379
8535B606379p96717L07906J179801j97766r03911k74955J94334k69634n43204
$$ 2606379 1809662 2117568 3297369 3099603 2195692 1920737 2115071 1845437 1302233
8526A302233N65442K68946m4044n5880p2179K90044N64782M68451k1337o22740
$$ 1302233 1867675 2136621 2092577 2036697 1964518 2254562 2819344 3287795 3266458 2643718
8516B643718K95509r6229o0796o8800J22927m58835o55451n08259K34226N88303
$$ 2643718 2939227 2842998 2782202 2713402 2836329 2377494 1722043 1213784 1448010 2036313
8506B036313k2876N9597l91860K8098J70894L90444K5422Q14993J01058k78754
$$ 2036313 2013437 2073034 1681174 1709272 1880166 2270610 2296032 3111025 3212083 2933329
8496B933329j60832k55802P7263J92703q20112m30841L68044N81258m10058r20159
$$ 2933329 2772497 2516695 2593958 2786661 1966549 1535708 1903752 2485010 2074952 1154793
8486A154793o77066N7280Q50706J89567K02114Q02823K8700l88898r56358l02469
$$ 1154793 477727 535007 1385713 1575280 1777394 2580217 2608917 2220019 1263661 961192
8476I61192l55008M34915Q69215m94707j16318o66773j135348n58376N96818J099749
$$ 961192 606184 1041099 1910314 1415607 1299289 632516 -502832 -1061208 -464390 635359
8466F35359L15090O07881l99880j57316k24739n8732N70641Q66914J97061j21655
$$ 635359 950449 1558330 1158450 1001134 776395 717663 1288304 2155218 2352279 2230624
8456B230624p00436r01136O8883k31362j27305L36148L12063J58330J71949j339002
$$ 2230624 1530188 629052 697935 466573 339268 675416 987479 1145809 1317758 -21244
8446b1244m04579k01509q5847N82035P98093P33421q32868q23867n25460R4412
$$ -21244 -425823 -627332 -713179 -131144 666949 1400370 567502 -256365 -781825 -687413
8436f87413J199942P12967K99194L70756k09315n56651j205933n91855R25601
$$ -687413 512529 1225496 1524690 1895446 1686131 1129480 -76453 -668308 257293
8427B57293J28059m14589m86602o90775j95414N25838L75344N11019j59019o4301
$$ 257293 385352 -29237 -515839 -1206614 -1402028 -876190 -500846 10173 -148846 -213147
8417b13147n12090J24795M28752j5768M16096M08420J83979o8991n76587q55164
$$ -213147 -725237 -600442 -171690 -187458 228638 637058 821037 752046 175459 -679705
8407f79705p65922l68219N81104O10336P40530N63070k5363l22987l26621L79287
$$ -679705 -1445627 -1813846 -1232742 -622406 118124 681194 655831 332844 6223 385510
8397C85510J12277J95565k71468n34135r01209n03928j72825J27787J208531M05523
$$ 385510 497787 693352 421884 -112251 -1013460 -1517388 -1690213 -1562426 -353895 51628
8387E1628p12589m66344j05083L45029Q66906P31933N2599M32646j27805r76173
$$ 51628 -660961 -1127305 -1232388 -887359 -20453 711480 764079 1196725 1068920 92747
8377I2747M7942j79870k69328p25191K77029K28748j29493L09582p95190L02872
$$ 92747 140689 -39181 -308509 -1033700 -756671 -527923 -657416 -347834 -1143024 -840152
8367h40152O04200M01716m99067k29194M96380R204K98895l88176K03387Q40132
$$ -840152 -235952 165764 -333303 -562497 -66117 -56913 241982 -146194 57193 897325
8357H97325m23303q32181n4334m99792j77652k15048J37208J272459M47376l71673
$$ 897325 474022 -358159 -412493 -912285 -1089937 -1304985 -1167777 104682 552058 180385
8347A80385r82416L92364M79532K35566Q804l00561k31496k68000j45534N03326
$$ 180385 -802031 -409667 69865 305431 314235 13674 -217822 -485822 -631356 -128030
8337a28030R07124l78577k20124j065550m73433J5071M61653P90727O60730K55789
$$ -128030 779094 400517 180393 -885157 -1358590 -1343519 -881866 -91139 569591 825380
8327H25380k45211J89051n60097o73619j63482m62240J70745K22280p0517m006
$$ 825380 580169 769220 209123 -464496 -627978 -1090218 -919473 -697193 -767710 -771716
8317g71716j587J76885O24912l25062j93649K24855L09960J5695j35358k4540
$$ -771716 -773303 -596418 28494 -296568 -490217 -265362 44598 60293 -75065 -99605
8307i9605l54633N14342O97057L12996j318739p24037m48128k00512N74366P69958
$$ -99605 -454238 60104 757161 1070157 -248582 -972619 -1420747 -1621259 -1046893 -276935
8297b76935O86768J46684n73136r41506K82182j0407K60099O44112k6724R5391
$$ -276935 409833 556517 -16619 -958125 -675943 -686350 -426251 217861 191137 286528
8287B86528j38796n47640j50473l4994N23723M5896j80159n34056N23172N35722
$$ 286528 147732 -399908 -550381 -585375 -61652 -15756 -195915 -729971 -206799 328923
8277C28923p11421m07659K32657K37167L05010K04779L8668q77413j015130K38148
$$ 328923 -382498 -790157 -557500 -320333 -15323 189456 228124 -649289 -1664419 -1426271
8267a426271P84234K44045K66222P49996n28820k32593p55889r41853R81346J000998
$$ -1426271 -642037 -397992 -131770 618226 89406 -143187 -899076 -1840929 -859583 141415
8257A41415r3374J56788r19779q28904K61538R87989M48398P5241l98985L06485
$$ 141415 48041 204829 -714950 -1543854 -1282316 -294327 154071 229312 -169673 136812
8247A36812j70480n60491j96263k63869J80741N97452L3204j06769K80880m19621
$$ 136812 -33668 -594159 -790422 -1054291 -873550 -276098 -242894 -349663 -68783 -488404
8237d88404l43380q60839O02975P99026J276663l9203n96043n37203q26728L00842
$$ -488404 -831784 -1692623 -1089648 -290622 986041 946838 350795 -186408 -1013136 -712294
8227g12294O53052J074199N29305l54468n94341m88872n50706P63413k85984K75620
$$ -712294 -59242 1014957 1544262 1189794 595453 106581 -444125 319288 33304 308924
8217C08924K03704l42049n68466O1525Q6553M10966l66897l98949L18329O84999
$$ 308924 512628 170579 -397887 -336362 -249809 161157 -205740 -604689 -286360 398639
8207C98639l92181l07164L48224K65387J2969j90057L84593M31284P7915j221174
$$ 398639 6458 -300706 47518 312905 325874 135817 520410 951694 1029609 -191565
8197a91565n46525l29338n9832O4732n53868n281835K445769L119476n6825L91342
$$ -191565 -738090 -1067428 -1127260 -1062528 -1616396 -6898231 -4452462 -1332986 -1389811 -998469
8187i98469k0369R44526K00792n28960o83612N0726M29591J89564k86842L4945
$$ -998469 -1018838 -74312 126480 -402480 -1086092 -1035366 -605775 -416211 -703053 -668108
8177f68108o61594L11077K86729K87524L7309J12153m79857N63766j45219N48521
$$ -668108 -1329702 -1018625 -731896 -444372 -407063 -294910 -774767 -211001 -356220 192301
8167A92301K65543k23181n13666n99025l01133R9151j30624O22610Q2585q40388
$$ 192301 457844 234663 -279003 -878028 -1179161 -1080010 -1210634 -588024 -505439 -1345827
8157a345827k33898O22126P02442J75609l03304M51500M46783j48781m73161m29291
$$ -1345827 -1579725 -957599 -255157 -79548 -382852 68648 515431 366650 -106511 -535802
8147e35802J20299P7740R2595m70622K25602L98650k08724p93502l61179l50857
$$ -535802 -415503 -337763 -245168 -715790 -490188 -91538 -300262 -1093764 -1454943 -1805800
8137a805800M22489P19587K25626J40288N50606n03695o24187k50682R67780P88378
$$ -1805800 -1383311 -663724 -438098 -297810 252796 -250899 -875086 -1125768 -157988 630390
8127F30390J70181l84095p42389k60248M98241j32886L14770K39404m05255j19224
$$ 630390 800571 416476 -325913 -586161 -87920 -220806 93964 333368 -71887 -191111
8117a91111o53162n87447L90242Q17839N24706N57190n7401j08213m70087n83995
$$ -191111 -844273 -1431720 -1041478 -223639 301067 858257 800856 692643 222556 -361439
8107c61439K048j24522j08006j19304N33381L95917q41838p09172j71079N01806
$$ -361439 -359391 -483913 -591919 -711223 -177842 218075 -623763 -1332935 -1504014 -1002208
8097a002208N72916M41511q58192l78635O5198K6094N38503J008461J116222K67747
$$ -1002208 -429292 12219 -845973 -1224608 -1159410 -1133316 -594813 413648 1529870 1797617
8087A797617j278824k146987j250921Q72284P35738O61415O65239m39n66770j122323
$$ 1797617 518793 -1628194 -2879115 -2006831 -1271093 -609678 55561 55122 -511648 -1633971
8077a633971k5187N60193N85040N63781l83721r9782N2329m95575o99532L1209
$$ -1633971 -1659158 -1098965 -513925 49856 -333865 -433647 -381318 -876893 -1576425 -1545216
8067a545216N57672L61322J29266m87263n49920l79871l06273J86245Q97006J174554
$$ -1545216 -987544 -626222 -496956 -984219 -1534139 -1914010 -2220283 -2034038 -1137032 37522
8057C7522Q71496o36166l94174q17970p20021K87690L86504P83740Q28825r05871
$$ 37522 909018 272852 -121322 -939292 -1659313 -1371623 -985119 -201379 627446 -278425
8047b78425n34566o08800k61483J42313M70170L56392N15590K66981m50142k46182
$$ -278425 -812991 -1421791 -1683274 -1540961 -1070791 -714399 -198809 68172 -381970 -628152
8037f28152M22388O87325j11403n54604p88936P0335q3657m4388m89284Q9799
$$ -628152 -205764 481561 370158 -184446 -973382 -903047 -986704 -1031092 -1520376 -1430577
8027a430577P09938L7099R2146N46587O32279o62551o80322j83953J43529M23974
$$ -1430577 -720639 -683540 -591394 -44807 587472 -75079 -755401 -939354 -795825 -371851
8017c71851K20563J62263M31000n48746p83454p47186o1495J189024j38118n91042
$$ -371851 -151288 10975 441975 -106771 -890225 -1637411 -1698906 -509882 -648000 -1239042
8007a239042J65562P05983L23172p735m52464l76351J98356L70313L92198K5483
$$ -1239042 -1073480 -367497 -44325 -52060 -504524 -880875 -682519 -312206 79992 105475
7997A05475l43035p99786j100525M87156P11710O50962M50822J97158q13436j41216
$$ 105475 -237560 -1037346 -2137871 -1650715 -939005 -288043 162779 359937 -453499 -594715
7987e94715p4181o0853K23389M75681L16851R821m49960l90710L14047n03933
$$ -594715 -668896 -729749 -506360 -30679 286172 295993 -153967 -544677 -230630 -734563
7977g34563J7309K54834N7350N56673m67253r3351L42777k41601o12270L8175
$$ -734563 -717254 -462420 -405070 151603 -315650 -409001 -66224 -307825 -920095 -881920
7967h81920O19486L13483j6048n35299n98261j18819N88415P78505p1379K88413
$$ -881920 -262434 51049 35001 -500298 -1098559 -1217378 -628963 149542 78163 366576
7957C66576J20977p82261p11060j80437K03489J068359K08349n43681n76053l17595
$$ 366576 487553 -294708 -1005768 -1186205 -982716 85643 293992 -249689 -825742 -1143337
7947a143337j31036j073754P84240J209874P6288J93601l71276n09315P09901
$$ -1143337 -1274373 -2348127 -1563887 -354013 -277725 -84124 -455400 -964715 -254814
7938b54814r5033j25029L7494j8227P9377k69452q59454k36677K64122Q0613k3338
$$ -254814 -349847 -474876 -437382 -455609 -376232 -645684 -1505138 -1741815 -1477693 -1397080 -1420418
7927a420418N46732J012394k59812l43836K40691K5102L32238j41857M66883J0785
$$ -1420418 -873686 138708 -121104 -464940 -224249 -199147 133091 -8766 458117 468902
7917D68902n38709j300850m28371J81972P76051Q78435j25072m36221m16944O52226
$$ 468902 -69807 -1370657 -1799028 -1617056 -841005 37430 -87642 -523863 -940807 -288581
7907b88581j7417L82290K16258j3321R2648L6537n39534o20333O9171o12054k2599
$$ -288581 -305998 76292 292550 279229 371877 408414 -131120 -751453 -682282 -1294336 -1316935
7896a316935L64118O21874p1734n51814L68756k80625J98765P79029K18577N46876
$$ -1316935 -952817 -330943 -402677 -954491 -585735 -866360 -667595 111434 330011 876887
7886H76887m4484q46656m53797j54853r3417J128517q4357k64331n93735j046374
$$ 876887 832403 -14253 -468050 -622903 -716320 412197 327840 63509 -530226 -1576600
7876a576600n95664K60965J021486J661792M4607k87134m2187r12446L88803J36678
$$ -1576600 -2172264 -1911299 -889813 771979 816586 529452 487265 -425181 -36378 100300
7866A00300k50419j83807K80254l11107k53328L41244q77264q3797r8231J49794
$$ 100300 -150119 -333926 -53672 -364779 -618107 -276863 -1154127 -1237924 -1336155 -1186361
7856a186361P15983J69526j12147p2095n87631J00086L72857L86668l6350l74732
$$ -1186361 -470378 -300852 -412999 -485094 -1072725 -972639 -599782 -213114 -249464 -624196
7846f24196J43911m68155n71728J4330R10508N34919N0425r6144k86885k11642
$$ -624196 -480285 -948440 -1520168 -1505838 -595330 -60411 -9986 -106130 -393015 -604657
7836f04657O9999k38205j77230L50700K08676n5879N45013l09199l72604m36568
$$ -604657 -534658 -772863 -950093 -599393 -390717 -446596 98417 -210782 -583386 -1019954
7826a019954r8044q49Q8550N00827L78830R3788j28514p01841n77002Q33892M16276
$$ -1019954 -1117998 -1118847 -1030297 -529470 -150640 -56852 -185366 -887207 -1464209 -630317 -214041
7815b14041M36860n4024K33740j812351k359683K078897K59938N87887Q78888
$$ -214041 222819 168795 402535 -1409816 -3769499 -1690602 -1430664 -842777 36111
7806C6111K82424m86729k41047j65757o37780o36021N98328K21049R50096P3107
$$ 36111 318535 -168194 -409241 -574998 -1212778 -1848799 -1250471 -1029422 -79326 -6219
7796f219r6239k26795k14774k57359O91905Q33721N45564L9910j583490q11046
$$ -6219 -102458 -329253 -544027 -801386 -109481 724240 1269804 1309714 -273776 -1084822
7786a084822o04037M97068L59617K73553k14445j29447o216l83679l24235L00347
$$ -1084822 -1688859 -1191791 -832174 -558621 -773066 -902513 -908729 -1292408 -1616643 -1316296
7776a316296J409373J713748o4895o19646o39834j031340q77387J58751J098061
$$ -1316296 93077 1806825 1741930 1122284 482450 -548890 -1426277 -1267526 -169465
7767a69465K7220k1648p39086m53495k38169J24433M02546Q95299K064575N13350
$$ -169465 -142245 -163893 -902979 -1356474 -1594643 -1470210 -1067664 -172365 1892210 2405560
7757B405560p87574j147616m55043l38428K17175N22722J5705m32338p84929j157732
$$ 2405560 1617986 470370 15327 -323101 -105926 416796 432501 163 -784766 -1942498
7747a942498k37837K60224O42838J367059Q09142J05107L69416q76447k16037
$$ -1942498 -2180335 -1920111 -1277273 89786 898928 1004035 1373451 497004 280967
7738B80967M14652j68225l4183J05548l05728q03833r54111n46151o49614N78757
$$ 280967 695619 527394 493211 598759 293031 -510802 -1464913 -2011064 -2660678 -2081921
7728b081921J211789O56960K06870l29342K53221j75185l7897N87583J1585L92514
$$ -2081921 -870132 -213172 -6302 -335644 -82423 -257608 -295505 292078 303663 696177
7718F96177n81140k27744o10191l50901l84521j17547k74639K19192O11131j81184
$$ 696177 115037 -112707 -722898 -1073799 -1458320 -1575867 -1850506 -1631314 -1020183 -1201367
7708a201367j79565N97427P11127J99044L20726N32100j30838l50087l52950r06443
$$ -1201367 -1380932 -783505 -72378 126666 447392 979492 848654 498567 145617 -760826
7698g60826q18528N15111O96481J76324j30141K79021j90633n90933k9389L78966
$$ -760826 -1579354 -1064243 -367762 -191438 -321579 -42558 -233191 -824124 -853513 -474547
7688d74547l24095N94640N13699J70624J12021m13374j69138m21290m48800J49030
$$ -474547 -798642 -204002 309697 480321 592342 178968 9830 -411460 -860260 -711230
7678g11230m72303k39459N78326K63529O22745n24961r0397J77634K73371J5235
$$ -711230 -1183533 -1422992 -844666 -581137 41608 -483353 -573750 -396116 -122745 -107510
7668a07510L69506p0370o19472j44549M60003L38892J48816l94221m00985k88359
$$ -107510 261996 191626 -427846 -572395 -112392 226500 375316 -18905 -419890 -708249
7658g08249M0236M64664m42251k3074Q43760k87852L25038m23117M93530o35270
$$ -708249 -668013 -203349 -645600 -668674 175086 -112766 212272 -210845 282685 -352585
7648c52585j10833M2253m32546O72780L09313K938r60448j97066R08803l69654
$$ -352585 -463418 -421165 -853711 -180931 128382 131320 -829128 -1026194 -117391 -487045
7638d87045m47853K03342l7250L64019j46102r670N68630K2421R5727m67487n49410
$$ -487045 -934898 -731556 -768806 -404787 -550889 -560559 8071 30492 126219 -341268 -890678
7627h90678J13625l84365L07797j90704l65451M67426L27449J53902n06935O66371
$$ -890678 -777053 -1161418 -853621 -1044325 -1409776 -942350 -614901 -460999 -967934 -301563
7617c01563L40201l36473Q39824N93675o47729n79631L6991N2529J5422o59962
$$ -301563 38638 -297835 541989 1135664 487935 -91696 -54705 -2176 13246 -646716
7607f46716p18718j43181L62972j82020K12485K3608P1165M8448J49549O52897
$$ -646716 -1365434 -1508615 -1145643 -1327663 -1115178 -1091570 -1020405 -971957 -822408 -169511
7597a69511P07391K45606q09690O6147J22886k41110j27974J3483j48743j78901
$$ -169511 537880 783486 -26204 39943 162829 -78281 -206255 -192772 -341515 -520416
7587e20416j55818o38985o12474K86224R76892L35758j94642J92710L68785L48537
$$ -520416 -676234 -1315219 -1927693 -1641469 -664577 -328819 -523461 -330751 38034 386571
7577C86571K77776k58045k40072K68522k39396r87142m45854K33766j163o13538
$$ 386571 664347 406302 166230 434752 195356 -791786 -1237640 -1003874 -1005037 -1618575
7567a618575J77086N98737j23378J68706R8000M39040P46071M05158l13151L90349
$$ -1618575 -1441489 -842752 -966130 -797424 -699424 -260384 485687 890845 577694 968043
7557I68043K58542m46706r50467o67675j72371k28696k27109O22003j37956o08058
$$ 968043 1226585 779879 -170588 -838263 -1010634 -1239330 -1466439 -844436 -982392 -1590450
7547a590450k79226J66554O61701N02350R89712L57211m21830l6841k53409N0838
$$ -1590450 -1869676 -1703122 -1041421 -539071 450641 807852 386022 349181 95772 146610
7537A46610R8470j47657O33168l04837o16928n74769j60165J5687k3101L4707
$$ 146610 245080 97423 730591 425754 -191174 -765943 -926108 -910421 -933522 -898815
7527h98815J66518K23882l13730K41269M46800q6302L97082j31389j063N27301
$$ -898815 -732297 -508415 -822145 -580876 -134076 -220378 176704 45315 44252 571553
7517E71553q7774r1270o08936o18596R31729q6486n32370j43467L27602j63376
$$ 571553 483779 392509 -216427 -835023 96706 10220 -522150 -665617 -338015 -501391
7507e01391K49027n31468m09209L50724K27870M95315O4315l92469L32906L17099
$$ -501391 -252364 -783832 -1193041 -842317 -614447 -119132 -54817 -447286 -114380 202719
7497B02719r2545n2037K32016o60632l63293o14920O71101j28557o15756L73563
$$ 202719 110174 58137 290153 -370479 -733772 -1348692 -677591 -806148 -1421904 -1048341
7487a048341K48721L89445P568l0811M53449L97643l37144l49659m1356N44689
$$ -1048341 -799620 -410175 -402607 -433418 20031 417674 80530 -269129 -310485 234204
7477B34204K26366L43783j95341p14805n76134p84806p3914O03073M1762j23782
$$ 234204 460570 804353 609012 -105793 -681927 -1466733 -1540647 -937574 -895812 -1019594
7467a019594M5023L75540K99022m5561O5498j18638K12125O12405P1217n7138
$$ -1019594 -974571 -599031 -300009 -345570 -280072 -398710 -186585 425820 497037 439899
7457D39899L3696K20018n12051k93042o20317n1026p31256j16740L1929J07932
$$ 439899 473595 693613 181562 -111480 -731797 -782823 -1514079 -1630819 -1598890 -1490958
7447a490958M04457L19484L69782M74877P51479L25796m56532q49543L5938l5452
$$ -1490958 -1086501 -767017 -397235 77642 829121 1154917 698385 -151158 -115220 -150672
7437a50672L59986R3957m87828r6465j06580o21301m60432P2137J15041q5585
$$ -150672 209314 303271 -184557 -281022 -387602 -1008903 -1469335 -1397198 -1282157 -1367742
7427a367742L62958N25742O29240l5538l981J35509L09270j95495J00977m81982
$$ -1367742 -1004784 -479042 150198 114660 110679 246188 555458 359963 460940 -21042
7417b1042o2460l58834P3646M60601l92838m21595p7684M78797l73571J30208
$$ -21042 -83502 -442336 -368690 91911 -300927 -722522 -800206 -321409 -694980 -564772
7407e64772K40166K98222p2162J28493k93088J22983k45619K02079m26959j55400
$$ -564772 -324606 -26384 -98546 29947 -263141 -140158 -385777 -183698 -610657 -766057
7397g66057k52112L70972J5232J17251L85055j3311K07401N8587k48967J99630
$$ -766057 -1018169 -647197 -631965 -514714 -129659 -142970 64431 123018 -125949 73681
7387G3681k14861k51508n66432M62702M84571n23756j482L09901K45785L9484
$$ 73681 -141180 -392688 -959120 -496418 -11847 -535603 -537085 -227184 18601 58085
7377E8085J55889j73308O4970l46196n97120q7340J63069m04238N3828j59716
$$ 58085 213974 40666 105636 -240560 -837680 -925020 -761951 -1166189 -1112361 -1272077
7367a272077M94116M15283K45865r2177J12342Q54512O41950n63411n32618K10680
$$ -1272077 -777961 -362678 -116813 -208990 -96648 757864 1399814 836403 303785 514465
7357E14465Q387o30561j112534Q9411J30129O1257m92617K64666O07596k43129
$$ 514465 522852 -107709 -1220243 -1130832 -1000703 -939446 -1432063 -1167397 -559801 -802930
7347h02930j09656j16495K87115J23870R47592J29652k19213R4189n72075m08753
$$ -802930 -912586 -1029081 -741966 -618096 329496 459148 239935 334124 -237951 -646704
7337f46704k09181O24302j69400n16116l3274l03674j09714j33446L61532J082287
$$ -646704 -855885 -231583 -400983 -917099 -950373 -1254047 -1363761 -1497207 -1135675 -53388
7327e3388J091120J71773j27872p05283q90736k98962k21689N70569J86904J25721
$$ -53388 1037732 1209505 1081633 376350 -514386 -813348 -1035037 -464468 -277564 -151843
7317a51843l49211j082408k75690M07681N20636J212815M41467n02008l23818
$$ -151843 -501054 -1583462 -1859152 -1451471 -930835 281980 723447 221439 -102379
7308a02379m16266q6684r368O22488P74761N40649j339414q11614n95571j95271
$$ -102379 -518645 -605329 -614697 7791 782552 1323201 -16213 -827827 -1423398 -1618669
7298a618669N33953M91722O33359j08512n38814k6479J89664L07321K7984k05174
$$ -1618669 -1084716 -592994 40365 -68147 -606961 -633440 -443776 -136455 -108471 -313645
7288c13645K70967K85431m25902k4880j3572J54196k8869P27515j4356j51590
$$ -313645 -42678 242753 -183149 -208029 -221601 -67405 -96274 631241 616885 465295
7278D65295k97053j78063o20366o43358L71706P09370N36742n84705p09027q098
$$ 465295 168242 -9821 -630187 -1273545 -901839 -192469 344273 -240432 -949459 -957557
7268i57557K72201m73955M94322J059684M24951j56836n56940l52248K96926q30617
$$ -957557 -685356 -1159311 -664989 394695 819646 662810 105870 -246378 50548 -780069
7258g80069K50387j3822K30905M04774j028009k55319l90605L18159Q06504P97954
$$ -780069 -529682 -543504 -312599 92175 -935834 -1191153 -1581758 -1263599 -457095 340859
7248C40859Q6614L47368m62158l59241l04509K5759J42078n3842K0782k39722
$$ 340859 427473 774841 312683 -46558 -351067 -325308 -183230 -237072 -216290 -456012
7238d56012l35423n89539K56454P09878M18521N290N33561m47014j61766j51423
$$ -456012 -791435 -1380974 -1124520 -414642 3879 9169 542730 95716 -66050 -217473
7228b17473l41566N84465N93236K15240n99338r55595k87488q6272J53689L88981
$$ -217473 -559039 25426 618662 833902 234564 -721031 -1008519 -1094791 -941102 -552121
7218e52121K77521j66473k99166P0098L85188m68439J54212N29022j13550K98157
$$ -552121 -274600 -441073 -740239 -670141 -284953 -753392 -599180 -70158 -183708 114449
7208A14449N31005n38527j50285m25086P9120J24623l36615l72379n8426M3517
$$ 114449 645454 106927 -43358 -468444 -389324 -264701 -601316 -973695 -1032121 -988604
7198i88604K08596o2295M73551K94087K42520n02228q5314M39783k37099j0540
$$ -988604 -780008 -842303 -368752 -74665 167855 -334373 -419687 20096 -217003 -227543
7188b27543m1856K88819M08256m56973p60042K98913O17515R7253m74378K78719
$$ -227543 -269399 19420 427676 -29297 -789339 -490426 127089 224342 -250036 28683
7178B8683N16192k42086l31209M4909q2978k53707n34341m48851K08886K73968
$$ 28683 544875 302789 -28420 16489 -66489 -320196 -854537 -1303388 -1094502 -820534
7168h20534k43582O16710M09895K27730L54980K6381k77218K4389r3308r61441
$$ -820534 -1064116 -447406 -37511 190219 545199 571580 294362 318751 225443 -735998
7158g35998j16591J39324j1583J11026l51381J50640N68574K09031k4095K04763
$$ -735998 -852589 -713265 -724848 -613822 -965203 -814563 -245989 -36958 -61053 143710
7148A43710L41958J59707K3023k19261l38495M56871l21517j347599l11989l04087
$$ 143710 485668 645375 668398 449137 110642 567513 245996 -1101603 -1413592 -1717679
7138a717679j4161n8867K5286J041356O60290k63513K41652N94971J76422R497
$$ -1717679 -1731840 -1790707 -1765421 -724065 -63775 -327288 -85636 509335 685757 695254
7128F95254J48685m7190J11700n31204k35064n88339m33716K50346p6949o10741
$$ 695254 843939 796749 908449 377245 142181 -446158 -879874 -629528 -706477 -1317218
7118a317218k2936K3310n59229j28972P43350J225776Q41249M83222k50127m24728
$$ -1317218 -1340154 -1316844 -1876073 -2005045 -1261695 -35919 805330 1288552 1038425 613697
7108F13697l59066k15252o21238m78909J85071M71353k29061j5110l91622J85326
$$ 613697 254631 39379 -581859 -1060768 -875697 -404344 -633405 -648515 -1040137 -854811
7098h54811n41222Q91156Q99124M48811J28667n46227k53737m01024K08742L02192
$$ -854811 -1396033 -504877 394247 843058 971725 425498 171761 -229263 -20521 281671
7088B81671m59810k34035n54654r99475m76966Q7518P03936J165363M46223N76914
$$ 281671 -178139 -412174 -966828 -1966303 -2443269 -2355751 -1651815 -486452 -40229 536685
7078E36685r9896k62868p5195R2082R4012j8884K3578r55643l02897k20738n06725
$$ 536685 436789 173921 98726 190808 284820 265936 289514 -666129 -969026 -1189764 -1696489
7067a696489K58268O38096O09887R34515l0275R687j95105k18149q48J45685m3153
$$ -1696489 -1438221 -800125 -190238 744277 714002 723689 528584 310435 309587 455272 412119
7056D12119j35549k70180q38975l54845o68268J95252K45886N70741L14737N94281
$$ 412119 276570 6390 -832585 -1187430 -1855698 -1660446 -1414560 -843819 -529082 65199
7046F5199J32030q17729M201M69819M41153K5624l12373n87533m85958p33650
$$ 65199 197229 -620500 -616299 -146480 294673 320297 7924 -579609 -1065567 -1799217
7036a799217m25423J07489P39863O05157J065917j29350O318J04449J52159Q82681
$$ -1799217 -2224640 -2117151 -1377288 -772131 293786 164436 170754 275203 427362 1310043
7026A310043K282k61654l67163r08570m44767p27065k29800K1199J79699J66460
$$ 1310043 1312325 1050671 683508 -225062 -669829 -1396894 -1626694 -1605495 -1425796 -1259336
7016a259336q7559N36566k12875K16199J189896N36188K83398Q1184l25789o94646
$$ -1259336 -1346895 -810329 -1023204 -807005 382891 919079 1202477 1283661 957872 263226
7006B63226m14574l27080j59268n70917r1653J97944k51509L5683M45243L83715
$$ 263226 -151348 -478428 -637696 -1208613 -1300266 -1102322 -1353831 -1318148 -872905 -489190
6996d89190O03981P62792K5059L92288j24682n18145j92297j10755q64786o57806
$$ -489190 114791 877583 902642 1294930 1170248 652103 459806 349051 -515735 -1173541
6986a173541o49828n93171K59652M30770P59454P93131R08068j35753n3849P21755
$$ -1173541 -1823369 -2416540 -2156888 -1726118 -966664 -173533 734535 598782 544933 1266688
6976A266688l73649j062462Q6848L00474j43515n67613m1717Q7539p10590n8785
$$ 1266688 893039 -169423 -82575 217899 74384 -493229 -534946 -447407 -1157997 -1216782
6966a216782n9470O87251J18056K12396K950k14471p1226j99137L40797J53617
$$ -1216782 -1276252 -589001 -470945 -258549 -255599 -470070 -541296 -740433 -399636 -246019
6956b46019k87931M09892k29227n85308K3128L19579M82285j44677k37881j17052
$$ -246019 -533950 -124058 -353285 -938593 -915465 -595886 -113601 -258278 -496159 -613211
6946f13211L75360J58174M44326j88828l4256p2666r78535j77768M68125L64807
$$ -613211 -237851 -79677 364649 175821 141565 68899 -909636 -1087404 -619279 -254472
6936b54472L24m78315J43381L9556k71014q1703O85547M07663Q13200n08676l25789
$$ -254472 -254148 -732463 -589082 -549526 -820540 -902243 -216696 190967 1004167 495491 169702
6925A69702M26555k77601j79207n80046l37209L52857j7064k59076k6258M3767
$$ 169702 596257 318656 139449 -440597 -777806 -424949 -442013 -701089 -727347 -683580
6915f83580L71303K40395k08947j3296K88028n635n76923k73501P81922N52942
$$ -683580 -312277 -71882 -280829 -294125 -6097 -11732 -588655 -862156 -80234 472708
6905D72708P21171l24005j22049p05609j055725j66094K14570L44482j43154K15833
$$ 472708 1193879 869874 747825 42216 -1013509 -1179603 -965033 -620551 -763705 -547872
6895e47872K92217l63040l07316K53509J37926M07682r380n39799J21618M46157
$$ -547872 -255655 -618695 -926011 -672502 -534576 -126894 -136274 -676073 -554455 -108298
6885a08298K20020n25833r27392M72452P31241N00051m31730r23472l975k15928
$$ -108298 111722 -414111 -1341503 -869051 -137810 362241 -69489 -992961 -996936 -1212864
6875a212864N90984R53738J224727K75032k55037r94133r81889k92526M79312
$$ -1212864 -621880 331858 1556585 1831617 1576580 582447 -399442 -691968 -212656
6866b12656P697Q3205J16886J8315j332201p51987Q77626R36001K26897J5769
$$ -212656 -204959 -121754 -4868 13447 -1318754 -2070741 -1193115 -257114 -30217 -14448
6856a4448M72932k10368m95183k00163N86660J15040k30316J5964j33465o22579
$$ -14448 458484 248116 -247067 -447230 139430 254470 24154 40118 -93347 -715926
6846g15926L35310o10526m83914J43083L60710J314955O46142l98697r03482k00288
$$ -715926 -380616 -991142 -1475056 -1331973 -971263 343692 989834 591137 -312345 -512633
6836e12633k80156p3927M65785Q50855M44242j276170p70041j44077K5561N33021
$$ -512633 -792789 -866716 -400931 449924 894166 -382004 -1152045 -1296122 -1270561 -737540
6826g37540J116308M71962O36152l44463q46114n09827L33878M29177o13291l42468
$$ -737540 378768 850730 1486882 1142419 296305 -213522 120356 549533 -63758 -406226
6816d06226L31970L63151l58023m48912q9977M66453M18301j10135L98067J6246
$$ -406226 -74256 288895 -69128 -518040 -608017 -141564 276737 166602 564669 580915
6806E80915n47616l89117l06830l4244L06821k5289K92412j74168p04060O32473
$$ 580915 33299 -355818 -662648 -696892 -390071 -415360 -122948 -297116 -1001176 -368703
6796c68703J29102M06069L73831L24418q22925m96802l37607R04144L63185K48317
$$ -368703 -239601 166468 540299 864717 41792 -455010 -792617 111527 474712 723029
6786G23029M4199l16011k43978o50526R3254O83727M75913N4969o5821p16540
$$ 723029 767228 451217 207239 -443287 -350033 333694 809607 864576 798755 82215
6776H2215J51112n8610r9789J38419n5476p68169R0334k13208R40093Q9355m60240
$$ 82215 233327 174717 74928 213347 157871 -610298 -519964 -733172 206921 296276 -163964
6765a63964l87049l37642M36517j03452j17197K81893O1718n81515P7759N0812
$$ -163964 -551013 -888655 -452138 -555590 -672787 -390894 -329176 -910691 -832932 -782120
6755g82120m9021L44022K53374K00653r9586M17377P51587L501l76252j024397
$$ -782120 -831141 -487119 -233745 -33092 -132678 284699 1036286 1039787 663535 -360862
6745c60862n72011J35070K07771m15833M79856l81607Q3504j18851Q1067R58917
$$ -360862 -932873 -797803 -590032 -1005865 -526009 -907616 -824112 -942963 -861896 97021
6735I7021N53241N9642M679n34123l06190K67441l01512M62209N48867j016890
$$ 97021 650262 709904 714583 180460 -125730 141711 -159801 302408 851275 -165615
6725a65615j399829J26070L47233Q2827Q51214R67483l82129K07098K13065m70891
$$ -165615 -1565444 -1439374 -1092141 -1009314 -158100 809383 427254 634352 847417 376526
6715C76526j27365L23398m97089p18771Q4932P17943q36600j077737l28544J2055
$$ 376526 249161 572559 75470 -643301 -558369 159574 -677026 -1754763 -2083307 -2071252
6705b071252M52815Q22267P42864J275429m00034q6754n78676N40681J478683
$$ -2071252 -1618437 -796170 -53306 1222123 822089 735335 156659 697340 2176023
6696B176023n32046n13141p87364j522805n04863k51401m5901J126556J246771
$$ 2176023 1643977 1130836 343472 -1179333 -1684196 -1935597 -1981498 -854942 391829
6687C91829J99417r39685m23348L02662P94289K50502N04753J889o8680p04602
$$ 391829 591246 -348439 -771787 -469125 325164 575666 1080419 1082308 1013628 309026
6677C09026m45731k41433k85023k24795m74045J926M00768N42930j13557J73858
$$ 309026 -136705 -378138 -663161 -887956 -1362001 -1360075 -959307 -416377 -529934 -356076
6667c56076M46937K65971L28912M42039M6112j31471m75483j019316q54738N57198
$$ -356076 90861 356832 685744 1127783 1173895 1042424 566941 -452375 -1307113 -749915
6657g49915N55355K97138k96693p13954m07923k02663M13941J093045R83529l96840
$$ -749915 -194560 102578 -194115 -908069 -1315992 -1518655 -1104714 -11669 971860 575020
6647E75020q988k68226k34623K87483P60439M28566m78672n94608o05078n83367
$$ 575020 566032 297806 63183 350666 1111105 1539671 1060999 466391 -138687 -722054
6637g22054m63084m53417N11326J7846L60983O13736J36682l6800p6133n0489
$$ -722054 -1185138 -1638555 -1127229 -1109383 -748400 -134664 2018 -34782 -110915 -161404
6627a61404K41093R33751J036193k60394l21352p92362p30342r69918m7232L5131
$$ -161404 79689 1013440 2049633 1789239 1467887 675525 -54817 -1024735 -1071967 -1036836
6617a036836R2524K65468l34252l4439l804L6105O30669P61622j68622o00198
$$ -1036836 -944312 -678844 -1013096 -1047535 -1051339 -1015234 -384565 377057 208435 -391763
6607c91763Q7220r1613k99464L29262R0979m87904p59307k25504j91829j2427
$$ -391763 -304543 -396156 -695620 -366358 -275379 -763283 -1522590 -1748094 -1939923 -1952350
6597a952350Q02050N75337J24775L12964O66372R22134q3359j37890p56973l72867
$$ -1952350 -1150300 -574963 -450188 -137224 529148 1451282 1367923 1230033 473060 100193
6587A00193m92040m62218j49347l88265L51729j95316k35607O40500K07126O6218
$$ 100193 -391847 -854065 -1003412 -1391677 -1039948 -1235264 -1470871 -830371 -623245 -557027
6577e57027K72662O28996j37043O2338O27560J45455q37511l82567j252791o50553
$$ -557027 -284365 344631 207588 269926 897486 1042941 205430 -177137 -1429928 -2080481
6567b080481P87700P90889Q4513m569j81021n61917K24083L35670J275186R89523
$$ -2080481 -1292781 -501892 -417379 -421948 -602969 -1164886 -940803 -605133 670053 1659576
6557A659576K02232p25858q41366r30043l74733k96929P18951L7224n4898q9840
$$ 1659576 1861808 1135950 294584 -635459 -1010192 -1307121 -588170 -550946 -605844 -695684
6547f95684j09036l3417O6988N36427j7529M05911N59236n1163l82932p00806
$$ -695684 -804720 -838137 -771149 -234722 -252251 153660 712896 661733 278801 -422005
6537d22005o22362L7007J44701O52615K34111p11321m45291k27461J2055O91595
$$ -422005 -1044367 -1007360 -862659 -210044 24067 -687254 -1132545 -1360006 -1347951 -656356
6527f56356Q42797J178228L251n53163q51568q40960k13818P52069M98941L5271
$$ -656356 186441 1364669 1367920 814757 -36811 -877771 -1091589 -339520 159421 194692
6517A94692k57576k55461L24931R4874N08933K44219k57177Q08102m68103p38747
$$ 194692 -62884 -318345 6586 101460 610393 854612 597435 1405537 937434 198687
6507A98687j142817j03956P56799k75431k4915L17431K32234N3569m38372r1632
$$ 198687 -944130 -1048086 -291287 -566718 -591633 -274202 -41968 11601 -426771 -518403
6497e18403J95588L20702M86595O26048L03224k05228r35690l09800l9388j27766
$$ -518403 -322815 -2113 484482 1110530 1413754 1208526 272836 -36964 -76352 -204118
6487b04118j17357m3472n28088o30882J78840N96465M99738K04370P12575m05773
$$ -204118 -321475 -364947 -893035 -1523917 -1345077 -748612 -248874 -44504 668071 262298
6477B62298l03661n5091J94958J94677Q9457l09834m50724Q7465J87788n46279
$$ 262298 -41363 -96454 98504 293181 382638 72804 -377920 -290455 -102667 -648946
6467f48946j09663J51012j8958q4642j13595R97922O90150q723j78018n39461
$$ -648946 -758609 -607597 -626555 -711197 -824792 173130 863280 854557 676539 137078
6457A37078L87212m81246M5734n3644p11787m47361l66889l37267O01229J198239
$$ 137078 524290 43044 88778 35134 -676653 -1124014 -1490903 -1828170 -1226941 -28702
6447b8702K19584K29616j05445n7045k89825J00213r5369O60656K19175l34764
$$ -28702 190882 420498 315053 258008 -31817 68396 -26973 633683 852858 518094
6437E18094j53500o85739J5725n96107m53085n94289K89784P18904J163932O45577
$$ 518094 364594 -321145 -305420 -901527 -1354612 -1948901 -1659117 -940213 223719 869296
6427H69296L51062N217r57504j10646J52752O65678O5588n39896r77943J23362
$$ 869296 1220358 1225575 268071 157425 310177 975855 1041443 501547 -476396 -353034
6417c53034k01480k6659k09286K9017J44833l08644K41990J74937K92234K71904
$$ -353034 -554514 -581173 -790459 -761442 -616609 -925253 -683263 -508326 -216092 55812
6407E5812O28906J23269M53056J09343j48392p04778j114694r79901j4089K38986
$$ 55812 684718 807987 1261043 1370386 1221994 517216 -597478 -1577379 -1591468 -1352482
6397a352482L38393K88823K96034o10615l54101O90221Q28444N92030K48056m02292
$$ -1352482 -1014089 -725266 -429232 -1039847 -1393948 -703727 124717 716747 964803 562511
6387E62511l36288k4554P2316k52335r0622K83259k05774m41000o21488k36197
$$ 562511 226223 201669 273985 21650 -68972 214287 8513 -432487 -1053975 -1290172
6377a290172R0800O24914L32311N72912K08671L97771L75874p49434l83634p80126
$$ -1290172 -1199372 -574458 -242147 330765 539436 937207 1313081 563647 180013 -600113
6367f00113L8632K95985O6061j51940n00495j26290j03047K26716M96385M80926
$$ -600113 -561481 -265496 -199435 -351375 -851870 -978160 -1081207 -854491 -358106 122820
6357A22820M6613j81406k24424m65056m63392K955J58743L20140N71138j41436
$$ 122820 169433 -11973 -236397 -701453 -1164845 -1161890 -1003147 -683007 -111869 -253305
6347b53305l72523n69356K22431N42519R34036Q19378m24591k35541j71629p74527
$$ -253305 -625828 -1195184 -972753 -430234 503802 1323180 898589 663048 491419 -283108
6337b83108n37676j74962J98201K84338R3910K69335m86867k52870j17875N65452
$$ -283108 -820784 -995746 -797545 -513207 -419297 -149962 -636829 -889699 -1007574 -442122
6327d42122O03912P33617N01683m42858o74060l44232k79284M04653J82284M04154
$$ -442122 161790 895407 1397090 954232 280172 -64060 -343344 61309 243593 647747
6317F47747r9935q77834n61568l69730J50118J042137R0570J15269L78504M82211
$$ 647747 547812 -330022 -891590 -1261320 -1111202 -69065 21505 136774 515278 997489
6307I97489q0323m13793O5058m5113k28931p6419k23831m23640n83692o29553
$$ 997489 917166 503373 568431 523318 294387 217968 -5863 -429503 -1013195 -1642748
6297a642748m33641O74332J101738L72577L77645M84576q96032m92421P80542
$$ -1642748 -2076389 -1402057 -300319 72258 449903 934479 38447 -453974 326568
6288C26568M95406M97701O8942k70670p21222r59963q24861j35669L09727K41476
$$ 326568 821974 1319675 1388617 1117947 396725 -563238 -1388099 -1523768 -1214041 -972565
6278i72565p1818k04403m5539N35544O15675N68867M53055q34570M11841j44657
$$ -972565 -1044383 -1248786 -1294325 -758781 -143106 425761 878816 44246 456087 311430
6268C11430o56127O2245N39814q05n38347k69553K04398K76327m0231k21534l23871
$$ 311430 -344697 -282452 257362 256557 -281790 -551343 -346945 -70618 -110849 -332383 -656254
6257f56254j19541N08025r9174l7122P95089J50110n78756o31582n9740K06536
$$ -656254 -775795 -267770 -366944 -404066 391023 541133 -37623 -669205 -728945 -522409
6247e22409Q83935j82052m38881J57759R43600M4637l52826k37420m98465k49965
$$ -522409 361526 179474 -259407 -101648 841952 886589 533763 296343 -202122 -452087
6237d52087L86702K11913J106483L07492o56232j405542l48728M26530N07279
$$ -452087 -65385 146528 1253011 1560503 904271 -501271 -849999 -423469 83810
6228H3810P31183M11620m96344l99193o43916O5279j9295J40312j30243K20592
$$ 83810 814993 1226613 730269 331076 -312840 -247561 -266856 -126544 -256787 -36195
6218c6195J94501L73p81307o89226q1293O89452K73915J03564l06978P38940M88382
$$ -36195 158306 158679 -622628 -1311854 -1393147 -703695 -429780 -326216 -633194 105746 594128
6207E94128m95418m25510K8548k3578j35911L18100n1389l7380k07677J11836
$$ 594128 98710 -326800 -298252 -321830 -457741 -139641 -191030 -228410 -436087 -324251
6197c24251k43050O72976K27288J65770m44325k59133J24798M04358j14178L37951
$$ -324251 -567301 105675 332963 498733 54408 -204725 -79927 324431 210253 548204
6187E48204k04688m57116o79807P5863k403J68521P78577l71474p71173L91811
$$ 548204 343516 -113600 -793407 -717544 -719947 -551426 227151 -144323 -915496 -523685
6177e23685J04396J177734p1125n33651L0032l05363n21748O4516Q48278K72989
$$ -523685 -419289 758445 687320 153669 183701 -121662 -643410 -578894 269384 542373
6167E42373p26535n49011k20693M19454Q39978j82483o53386o767M83349j48960
$$ 542373 -184162 -733173 -953866 -534412 305566 123083 -530303 -537070 -53721 -202681
6157b02681L79783O77054K49774k71848o12453o96204q1073J91712j51233j65533
$$ -202681 177102 854156 1103930 832082 219629 -476575 -557648 -365936 -517169 -682702
6147f82702q8586L46861M49070q6316r723J36098O1715n06963j88948Q72153L47555
$$ -682702 -771288 -424427 24643 -61673 -71396 64702 126417 -380546 -569494 302659 650214
6136F50214M33593p29971q70253Q7454N03030J40665n68731M62959L11943m87311
$$ 650214 1083807 353836 -516417 -428963 74067 214732 -353999 108960 420903 -66408
6126f6408K03430J74378L06517Q2186o90431k02123p32155L9789N30212O26546
$$ -66408 137022 311400 617917 700103 9672 -192451 -924606 -884817 -354605 271941
6116B71941K97844n22460k82964n05175O8784J017610L73742m19598m37007o95892
$$ 271941 569785 47325 -235639 -740814 -672030 345580 719322 299724 -137283 -833175
6106h33175K80110L44233O1414L60916k30380l71278l71150M3712r4510K68343
$$ -833175 -553065 -208832 -147418 213498 -16882 -388160 -759310 -715598 -810108 -541765
6096e41765L80803M39907l43770k55594P17854N79819m44658o65304n62951K92447
$$ -541765 -160962 278945 -64825 -320419 397435 977254 532596 -132708 -695659 -403212
6086d03212L91643O31736j73751m85079l92406m01281N24886J8939J59499L21772
$$ -403212 -11569 620167 446416 -38663 -431069 -832350 -307464 -288525 -129026 192746
6076A92746m495l14936p09701M10584L79735N17107L35322l52092m66110n12982
$$ 192746 188251 -126685 -836386 -425802 -46067 471040 806362 454270 -11840 -524822
6066e24822J43476j3393M04466P33228k64716q70556J58401k63502N52501j45326
$$ -524822 -381346 -394739 9727 742955 478239 -392317 -233916 -497418 55083 -90243
6056i0243q14144J73275L3574N80978K19642L57930M30611q3670n43678j85062
$$ -90243 -904387 -731112 -697538 -116560 103082 461012 891623 807953 264275 79213
6046G9213J8893j37359m62432p8188L44388k76683l53294L9260p0407L67736N02791
$$ 79213 98106 -39253 -501685 -579873 -235485 -512168 -865462 -826202 -896609 -528873 -26082
6035b6082N30633L90190k72079M53490J57899l93122m78312n401O6326R1334J7367
$$ -26082 504551 894741 622662 1076152 1234051 840929 362617 357216 423542 514876 532243
6024E32243r03305j278055j27193N54959J010254P46487L20124q70886j84394
$$ 532243 -371062 -1649117 -1776310 -1221351 -211097 535390 855514 -15372 -199766
6015a99766Q4112O68211M50862M71597J85515o80597k44989r79881o11115m54734
$$ -199766 -115654 552557 1003419 1475016 1660531 979934 734945 -244936 -856051 -1310785
6005a310785N10806M2472K56990n0533M62123K50195m01152r0478M21329N81961
$$ -1310785 -799979 -757507 -500517 -551050 -88927 161268 -239884 -330362 90967 672928
5995F72928J062802J09099j044435p09582p79245L79381j38355j15504J301412
$$ 672928 1735730 1844829 800394 90812 -688433 -309052 -447407 -562911 738501
5986G38501J25404q01686l09628J88859R1957L25384n971Q08089J2385n97732
$$ 738501 863905 62219 -247409 -58550 33407 358791 352820 1160909 1173294 575562
$$ [...]
##END NTUPLES=NMR SPECTRUM
##END=
