##TITLE=1H_32-2022
 CDCl3
 8 sc, 
 29.06.2022
##JCAMPDX= 6.0         $$ Bruker NMR JCAMP-DX V2.0
##DATA TYPE= NMR SPECTRUM
##DATA CLASS= NTUPLES
##ORIGIN= UXNMR, Bruker Analytische Messtechnik GmbH
##OWNER= root
$$ XWIN-NMR		Version 3.5
$$ Wed Jun 29 13:48:40 2022 Russian Standard Time (UT+4h)  she@DPX200
##.OBSERVE FREQUENCY= 200.1313499994
##.OBSERVE NUCLEUS= ^1H
##.ACQUISITION MODE= SIMULTANEOUS
##.ACQUISITION SCHEME= undefined
##.AVERAGES= 8
##.DIGITISER RES= 18
##SPECTROMETER/DATA SYSTEM= spect
##.PULSE SEQUENCE= zg30
##.SOLVENT NAME= CDCl3
##.SHIFT REFERENCE= (INTERNAL, CDCl3, 0, 15.7359)
##AUDIT TRAIL= $$ (NUMBER, WHEN, WHO, WHERE, WHAT)
$$ ##TITLE= Audit trail, XWIN-NMR		Version 3.5
$$ ##JCAMPDX= 5.01
$$ ##ORIGIN= Bruker BioSpin GmbH
$$ ##OWNER= she
$$ F:/spectra/data/she/nmr/H-F/1/pdata/1/auditp.txt
$$ ##AUDIT TRAIL=  $$ (NUMBER, WHEN, WHO, WHERE, WHAT)
(   1,<2022-06-29 13:45:58.56 +0400>,<she>,<DPX200>,
      <created by zg, POWCHK disabled, PULCHK disabled
       configuration hash MD5:
       00 E9 B6 7A A2 85 ED C7 34 08 36 98 17 FE 4E 26
       data hash MD5: 16K
       FF A2 E3 48 97 9C 84 A4 11 25 5B 90 19 91 E9 5A>)
(   2,<2022-06-29 13:46:00.81 +0400>,<she>,<DPX200>,
      <Start of raw data processing
       efp BC_mod = 2 LB = 0.24 FT_mod = 6 PKNL = 1 PHC0 = -18067.74 PHC1 = 26.00069 SI = 16K 
       data hash MD5: 16K
       B6 4C BE F2 0C CF F0 17 BC 65 85 44 E2 21 5A C9>)
(   3,<2022-06-29 13:46:17.17 +0400>,<she>,<DPX200>,
      <pk PHC0 = 21.54579 PHC1 = -12 
       data hash MD5: 16K
       D1 9C D6 40 86 57 A7 05 37 E0 C8 F3 56 11 3B AF>)
(   4,<2022-06-29 13:46:20.85 +0400>,<she>,<DPX200>,
      <abs ABSG = 5 
       data hash MD5: 16K
       11 B7 0B F7 83 AC 95 1B FC 14 A6 23 60 E4 19 B8>)
$$ ##END=
$$ 
$$ hash MD5
$$ 08 95 68 49 0B 53 FB EA 67 E1 6C 6B 25 CA 56 0C
##$RELAX= 
##$RELAX= 
##$RELAX= 
##$RELAX= 
##$RELAX= 
##$RELAX= 
$$ Bruker specific parameters
$$ --------------------------
##$DU= <F:/spectra>
##$EXPNO= 1
##$NAME= <H-F>
##$PROCNO= 1
##$TYPE= <nmr>
##$USER= <she>
##$AMP= (0..31)
100 100 100 100 100 100 100 100 100 100 100 100 100 100 100 100 100 100 
100 100 100 100 100 100 100 100 100 100 100 100 100 100 
##$AQSEQ= 0
##$AQ_mod= 1
##$AUNM= <au_zg>
##$AUTOPOS= <>
##$BF1= 200.13
##$BF2= 200.13
##$BF3= 200.13
##$BF4= 200.13
##$BF5= 200.13
##$BF6= 200.13
##$BF7= 200.13
##$BF8= 200.13
##$BYTORDA= 1
##$CFDGTYP= 0
##$CFRGTYP= 5
##$CHEMSTR= <none>
##$CNST= (0..31)
1 1 145 1 1 1 1 1 1 1 1 1 1 1 1 1 1 1 1 1 1 1 1 1 1 1 1 1 1 1 1 1 
##$CPDPRG= <>
##$CPDPRG1= <>
##$CPDPRG2= <>
##$CPDPRG3= <>
##$CPDPRG4= <mlev>
##$CPDPRG5= <mlev>
##$CPDPRG6= <mlev>
##$CPDPRG7= <mlev>
##$CPDPRG8= <mlev>
##$CPDPRGB= <>
##$CPDPRGT= <>
##$D= (0..31)
0 1.2 0 0 0 0 0 0 0 0.06 0 0.03 0 0 0 0 0.0002 0 0 0 0 0 0 0 0 0 0 0 0 
0 0 0 
##$DATE= 1656495958
##$DBL= (0..7)
120 120 120 120 120 120 120 120 
##$DBP= (0..7)
150 150 150 150 150 150 150 150 
##$DBP07= 0
##$DBPNAM0= <>
##$DBPNAM1= <>
##$DBPNAM2= <>
##$DBPNAM3= <>
##$DBPNAM4= <>
$$ [...]
##$SUBNAM2= <"">
##$SUBNAM3= <"">
##$SUBNAM4= <"">
##$SUBNAM5= <"">
##$SUBNAM6= <"">
##$SUBNAM7= <"">
##$SUBNAM8= <"">
##$SUBNAM9= <"">
##$SW= 18.0517283424941
##$SWIBOX= (0..15)
0 0 2 0 0 0 0 0 0 0 0 0 0 0 0 0 
##$SW_h= 3612.71676300578
##$TD= 16384
##$TD0= 1
##$TE= 0
##$TE2= 300
##$TE3= 300
##$TEG= 300
##$TL= (0..7)
0 120 120 120 120 120 120 120 
##$TP= (0..7)
150 150 150 150 150 150 150 150 
##$TP07= 0
##$TPNAME0= <>
##$TPNAME1= <>
##$TPNAME2= <>
##$TPNAME3= <>
##$TPNAME4= <>
##$TPNAME5= <>
##$TPNAME6= <>
##$TPNAME7= <>
##$TPOAL= (0..7)
0.5 0.5 0.5 0.5 0.5 0.5 0.5 0.5 
##$TPOFFS= (0..7)
0 0 0 0 0 0 0 0 
##$TUNHIN= 0
##$TUNHOUT= 0
##$TUNXOUT= 0
##$USERA1= <user>
##$USERA2= <user>
##$USERA3= <user>
##$USERA4= <user>
##$USERA5= <user>
##$V9= 5
##$VALIST= <valist>
##$VCLIST= <CCCCCCCCCCCCCCC>
##$VD= 0
##$VDLIST= <DDDDDDDDDDDDDDD>
##$VPLIST= <PPPPPPPPPPPPPPP>
##$VTLIST= <TTTTTTTTTTTTTTT>
##$WBST= 1024
##$WBSW= 4
##$XGAIN= (0..3)
0 0 0 0 
##$XL= 0
##$YL= 0
##$YMAX_a= 675160
##$YMIN_a= -550188
##$ZGOPTNS= <>
##$ZL1= 120
##$ZL2= 120
##$ZL3= 120
##$ZL4= 120
##$ABSF1= 15.73918
##$ABSF2= -2.31267
##$ABSG= 5
##$ABSL= 3
##$ALPHA= 0
##$AQORDER= 0
##$ASSFAC= 0
##$ASSFACI= 0
##$ASSFACX= 0
##$ASSWID= 0
##$AUNMP= <proc_1d>
##$AZFE= 0.1
##$AZFW= 0.1
##$BCFW= 0
##$BC_mod= 2
##$BYTORDP= 0
##$COROFFS= 0
##$CY= -3
##$DATMOD= 1
##$DC= 0
##$DFILT= <>
##$DTYPP= 0
##$F1P= 0
##$F2P= 0
##$FCOR= 1
##$FTSIZE= 16384
##$FT_mod= 6
##$GAMMA= 0
##$GB= 0
##$INTBC= 1
##$INTSCL= 0
##$ISEN= 128
##$LB= 0.24
##$LEV0= 0
##$LPBIN= 0
##$MAXI= 10000
##$MC2= 0
##$MEAN= 0
##$ME_mod= 0
##$MI= 1.114404
##$NCOEF= 0
##$NC_proc= -6
##$NLEV= 6
##$NOISF1= 3.799351
##$NOISF2= 2.8
##$NSP= 0
##$NTH_PI= 0
##$NZP= 0
##$OFFSET= 15.73587
##$PC= 1
##$PHC0= -18046.2
##$PHC1= 14.00069
##$PH_mod= 1
##$PKNL= yes
##$PPARMOD= 0
##$PSCAL= 0
##$PSIGN= 0
##$REVERSE= no
##$SF= 200.130007137704
##$SI= 16384
##$SIGF1= 3
##$SIGF2= 2
##$SINO= 5.538805
##$SIOLD= 16384
##$SREGLST= <1H.CDCl3>
##$SSB= 0
##$STSI= 16384
##$STSR= 0
##$SW_p= 3612.71676300578
##$SYMM= 0
##$S_DEV= 0
##$TDeff= 16384
##$TDoff= 0
##$TI= <>
##$TILT= no
##$TM1= 0
##$TM2= 0
##$TOPLEV= 0
##$USERP1= <user>
##$USERP2= <user>
##$USERP3= <user>
##$USERP4= <user>
##$USERP5= <user>
##$WDW= 1
##$XDIM= 16384
##$YMAX_p= 287252399
##$YMIN_p= -1624443
$$ End of Bruker specific parameters
$$ ---------------------------------
##NTUPLES= NMR SPECTRUM
##VAR_NAME=  FREQUENCY,     SPECTRUM/REAL,   SPECTRUM/IMAG
##SYMBOL=    X,             R,               I
##VAR_TYPE=  INDEPENDENT,   DEPENDENT,       DEPENDENT
##VAR_FORM=  AFFN,          ASDF,            ASDF
##VAR_DIM=   16384,         16384,           16384
##UNITS=     HZ,            ARBITRARY UNITS, ARBITRARY UNITS
##FACTOR=    0.220516191357247, 1,           1
##FIRST=     3149.21984773058, 0,            0
##LAST=      -463.496915275197, 0,           0
##MIN=       -463.496915275197, -1624443,    0
##MAX=       3149.21984773058, 287252399,    0
$$ Real data points
##PAGE= N=1
##DATA TABLE= (X++(R..R)), XYDATA
$$ [...]
6187f86849M88330L55834K95396n23612l73202L97766l37084j69110K29972j99583
6177e22142j48796J71197R37128J33621j58263L3836n3697L69487o00993m09627
6167b48249P17J9110L54398J25294l16546K08787J85973J74325l46944K0246J48765
6156C25876l86359j54482Q877Q1337j5173J16094J63491J0860J47072J88562k58196
6145B27959m04131k71169K23730n63358P0380K09470m53813M04924J12936K28257
6135b14815J03448K61313P15192j04151p59055k34771K08124K08657M8672j33019
6125I9595l85249M0965N11709M28528M2053j93854m38343j59739J71193m28509
6115c11651L20737P2759j22006K74214K34945q0167l42730k51574m44375L79087
$$ plain form
6187 -686849 -198519 157315 452711 -70901 -444103 -46337 -383421 -552531 -322559 -522142
6177 -522142 -670938 -499741 437387 571008 412745 446581 392884 762371 161378 -248249
6167 -248249 -247532 -228422 125976 251270 -65276 143511 329484 503809 156865 177111 325876
6156 325876 -60483 -214965 -206088 -124751 -139924 -23830 139661 150521 297593 486155 227959
6145 227959 -176172 -447341 -223611 -786969 -716589 -507119 -960932 -556008 -443072 -214815
6135 -214815 -111367 149946 865138 760987 1932 -232839 -24715 183942 232614 99595
6125 99595 -285654 -244689 267020 695548 737601 543747 105404 -54335 116858 -311651
6115 -311651 9086 81845 -40161 234053 468998 388831 46101 -205473 -649848 -270761
6105b70761J97310j16584K65166k94940L21599j67123J74668K77454q5129j89562
6095A12098l53690j34280L02040j99517j66508J00917K28029K1883J17366m46001
6085d17663N03837L86261m77352K07376l39422J54745J0404k01488N71221M80868
6075H78787o95166J55661M2442k67456J45397o45410j79120M58991Q8215J48174
6065A30515k50311J16558M29297m43697m51541l55791q3803J55933L64089P2590
6055c16161K55807L51601m15184j7880J8156l38409K90648J18056j24377K67033
6045H9290l28242k78965M61368L99542k86901m57814L97325n3749j78826L59036
6035A22064l19493K04304J75324o711P9168k32327o985r7722Q1975L83391L74129
$$ plain form
6105 -270761 -73451 -190035 75131 -219809 101790 -65333 109335 386789 301660 112098
6095 112098 -241592 -375872 -73832 -273349 -439857 -338940 -110911 -89028 28338 -417663
6085 -417663 86174 472435 -4917 202459 -136963 17782 28186 -173302 397919 878787
6075 878787 183621 339282 381724 114268 259665 -385745 -564865 -105874 -17659 130515
6065 130515 -119796 -3238 426059 -17638 -469179 -824970 -908773 -752840 -388751 -316161
6055 -316161 -60354 291247 -123937 -141817 -123661 -462070 -171422 -53366 -177743 89290
6045 89290 -238952 -517917 -56549 342993 56092 -401722 -4397 -58146 -236972 122064
6035 122064 -197429 6875 182199 175488 254656 22329 15344 -82378 -403 382988 757117
6024G57117q6300j049740l4138K04779M37248m00600K76402K06121k26899m4602
6014C9388o4408k65811K4492K00176q17431K03343M98254K26190Q9318j6548M82957
6003E99920n41189r551J11756m16529M72547L9432n3676L1705J44889J88986j06007
5992D62283L80102m05601k90340j63096K1656R5134o55791O85024K86408l23656
5982I2123N37141J7091L29050L6508n89886L2713k45667o30134j48512n3752K08984
5971d14341L49702J86966J42786m43996P13O11879l09960K90745N2560q32617
5961c65563M77501k8621l01111j45977L51509R6893l14830j45457K69906N76586
5951D70836J8190p23836J89106r4559K06003P2080k44963Q225l83928M4475J12000
$$ plain form
6024 757117 670817 -378923 -413061 -208282 228966 -171634 104768 310889 83990 39388
6014 39388 -25020 -290831 -266339 -66163 -883594 -680251 -181997 44193 133511 116963 599920
6003 599920 58731 49180 160936 -255593 216954 256386 202710 234415 379304 568290 462283
5992 462283 842385 436784 146444 -16652 5004 100138 -555653 129371 415779 92123
5982 92123 629264 646355 975405 1011913 422027 454740 209073 -421061 -569573 -623325 -414341
5971 -414341 -64639 122327 265113 -178883 -178170 433709 123749 414494 467054 -365563
5961 -365563 111938 83317 -217794 -363771 -12262 84631 -230199 -375656 -105750 470836
5951 470836 489026 -234810 -45704 -140263 65740 137820 -107143 -98918 -482846 -438371 -326371
5940c26371r8839K60673j61426r0002O54441j28026l03532l2071k28560j2653
5930d66366k1547M86943K29585k83732J25831J60882k26807M11142L56412l40374
5920D31969m78170Q5304q6072o0729J6939J54932J36109P8163n48657L31507L06193
5909C67488l54650K85035k94988o3170J18638J59647j02416K27050K81478j16395
5899E07717m72759K22668J00047l41903K06733n39053J09909J01016k03686N46949
5889B37638j15119K99374k20844k52603q5077j16290L74027M0720k47845n500
5879i1519j31546J30316L30815L72643N80712o86334k50672K03944q28553o6805
5869d36999K95086J0832L58628m29077J54376K03239j89008M1168l73010K18106
$$ plain form
5940 -326371 -425210 -164537 -325963 -415965 238476 110450 -193082 -225153 -453713 -466366
5930 -466366 -487913 -970 228615 -55117 70714 231596 4789 415931 772343 431969
5920 431969 -46201 39103 -46969 -107698 -90759 64173 200282 278445 -270212 61295 367488
5909 367488 12838 297873 2885 -60285 58353 218000 115584 342634 624112 507717
5899 507717 34958 257626 357673 15770 222503 -316550 -206641 -105625 -309311 237638
5889 237638 122519 421893 201049 -51554 -136631 -252921 121106 161826 -86019 -91519
5879 -91519 -223065 -92749 238066 610709 1191421 505087 254415 458359 -370194 -436999
5869 -436999 -141913 -131081 227547 -201530 -47154 156085 -32923 8245 -364765 -146659
5859a46659L08453K7264K96435k81759j68617K44523j51907k32227J64144l1091
5849B8559K2954j02760l12803K40351L72544K20778j24583l66208J0501N05016
5839D94349j48109O0160l65775J81246J99597J89076J63300l38976m59583M44278
5829D19563l39265k02724O83700k99746j92632m69198K55970L17903j62848P30367
5819G41090J06414l24520J5845l63354k54774k1948j02743k4816J96256L28500
5809B95950L0m32573N54121K33661m0974j44716p1480K99941q17115k82549K36424
5798a69280L21702J08412l09912J83488Q9620l92827L66440L8330j24022j06599
5788E352J40671L72260l46997k07819P34995P6055m98222k47623j09351J26801
$$ plain form
5859 -146659 161794 189058 485493 203734 35117 279640 127733 -104494 59650 28559
5849 28559 51513 -51247 -364050 -123699 248845 469623 345040 -21168 -10667 494349
5839 494349 346240 406400 40625 221871 421468 610544 773844 434868 -24715 419563
5829 419563 80298 -122426 561274 261528 68896 -400302 -144332 173571 10723 741090
5819 741090 847504 522984 538829 175475 -79299 -101247 -203990 -228806 -32550 295950
5809 295950 295980 -136593 417528 651189 610215 465499 394019 693960 -123155 -405704 -169280
5798 -169280 152422 260834 -49078 134410 224030 -168797 197643 235973 111951 5352
5788 5352 146023 518283 171286 -36533 698462 774517 276295 28672 -80679 46122
5778D6122K03689J21519j54003k55012l5442N5294m0225J93575K60717l78177
5768A8057J20058M53713k71472O4517K89020m32796k32948K21052m75745J02818
5758a43726M08169K5725L00455m0679p6130M88133n90997j88721L25907j51106
5748C57030J92330j69879j37434N6700p44454P8498J24370l61670Q02173P14356
5738I12020p51421j93923J90947k2972J38489K24240k89849k69506K87084o9649
5728A55460m26630N78449M10695n39729m36517K99829q8680n4661J97063k94830
5718a99551K49518N23232n0763k34746l2283K0889J29972p8413k47801J10054
5708A90108J07918J37323K89730J46561m36310k06200O76953p36221k03797P13033
$$ plain form
5778 46122 249811 371330 217327 -37685 -73127 -17833 -58058 135517 396234 18057
5768 18057 138115 591828 320356 384873 673893 241097 8149 229201 -246544 -143726
5758 -143726 264443 290168 590623 549944 473814 961947 370950 182229 508136 357030
5748 357030 549360 379481 242047 298747 -445707 -367209 -242839 -604509 197664 912020
5738 912020 160599 -33324 157623 134651 273140 497380 207531 -61975 225109 155460
5728 155460 -271170 307279 717974 178245 -258272 41557 -47123 -101784 95279 -199551
5718 -199551 49967 573199 522436 287690 255407 276296 406268 327855 80054 190108
5708 190108 298026 435349 725079 871640 435330 229130 906083 169862 -33935 679098
5698F79098j78628Q2633n04593k608L84245j76775J11283M80984o52486k56270
5688c3117j36665R6384J019858J20483k69964k28394m86376L36015J14511l1853
5678E00882K9701l6197O4377P317J06503l98164J00590K33622N54980k61071j84524
5667G18016k69012j31648P68166k38611m7222m35909n72462O27337k39923K03250
5657C81982P8218N6211J16110l63269N9424J00371m69283K44803N6729k77577
5647a6281O75213l8877l2283K34191q26033j68060N63556j84680J90085L14203
5637G11034M1591J61475O31716m66007q90326J8372L47522m0453L62424K38551
5627A115899r77580L97997K44549n42999O138j8004j74210L42780j05008P9343
$$ plain form
5698 679098 500470 583103 78510 75902 460147 283372 394655 875639 223153 -33117
5688 -33117 -169782 -73398 946460 1066943 796979 568585 82209 418224 532735 500882
5678 500882 530583 494386 558763 566080 672583 274419 375009 608631 1163611 902540 718016
5667 718016 449004 317356 1085522 846911 799689 363780 -208682 418655 178732 381982
5657 381982 460200 516411 632521 269252 328676 429047 -40236 204567 261296 -16281
5647 -16281 658932 620055 587772 821963 -4070 -172130 391426 206746 396831 711034
5637 711034 752625 914100 1545816 1079809 189483 207855 555377 514924 877348 1115899
5627 1115899 138319 536316 780865 237866 244004 226000 51790 394570 289562 368905
5617C68905L43676j65431l33694O51713l2670J44933J76632l23282j32302N0208
5607G48688J25447n97259J03271K5662m32832M82995L93808l27452N02919L588
5597A028835n5758M62064o05800j17103L20242l99096r9061K84630M41476K36998
5587A497427k90245l50517r611N5072l1931m51595j54320L61086J0952K29243
5577H65561Q0734o9066L29581M00721k60421k19679k68251L63214L14120k83756
5567A252758l79565J32361N95643k66189J73828k17494j02519k60023k55333P7593
5557G51060K60306p5746R5447L97520o1520p1475m49283M795J14994K84391N9207
5546A309696j32381o002M10911N04768M3025m84229l04842K25206k4738J65274
$$ plain form
5617 368905 712581 547150 213456 865169 832499 977432 1154064 830782 698480 748688
5607 748688 874135 276876 380147 405809 -27023 455972 849780 522328 1025247 1028835
5597 1028835 973077 1435141 829341 712238 1032480 633384 534323 818953 1260429 1497427
5587 1497427 1207182 856665 847054 902126 870195 418600 264280 625366 636318 865561
5577 865561 946295 877229 1206810 1607531 1347110 1127431 859180 1222394 1536514 1252758
5567 1252758 873193 1005554 1601197 1335008 1508836 1291342 1188823 928800 673467 751060
5557 751060 1011366 935620 1031067 1428587 1367067 1295592 846309 851104 966098 1250489 1309696
5546 1309696 1177315 1171313 1582224 2086992 2130017 1645788 1340946 1566152 1541414 1706688
5536A706688j4614j62254l70333O09405O56888j33628m32906K32875N06017m8313
5526B549825N5249P234k58198j40182k10482K80337L84608J09282j65991N9029
5516B670711K88277N66500j58036m96689J68151N96230m68545r6222L62728r9279
5506C333826M02619j98316J77346m2017J44673K8426k68495J92400K75938k25234
5496C821166O19534K55184J88495K30727n19958J52563N1384L05089J81475j57770
5486E127889K22761M41532j13609M49446M77348Q9999j78534k23272p07255Q23320
5476F409625O50997k7972k337l1344M95611r236l8236J29171K82548J25042M06120
5465H389989N34471j84805k06494L25159R0764K19680m25701L98021L58136k08032
$$ plain form
5536 1706688 1692074 1529820 1159487 1768892 2425780 2292152 1859246 2092121 2598138 2549825
5526 2549825 2605074 2612308 2354110 2213928 2003446 2283783 2668391 2777673 2611682 2670711
5516 2670711 2958988 3525488 3367452 2870763 3038914 3635144 3166599 3070377 3433105 3333826
5506 3333826 3736445 3538129 3715475 3673458 3818131 3846557 3578062 3770462 4046400 3821166
5496 3821166 4440700 4695884 4884379 5115106 4595148 4747711 4799095 5104184 5285659 5127889
5486 5127889 5350650 5792182 5678573 6128019 6605367 6695366 6516832 6293560 5586305 6409625
5476 6409625 7060622 7032650 7030313 6998969 7494580 7485344 7447108 7576279 7858827 7983869 8389989
5465 8389989 8924460 8739655 8533161 8858320 8949084 9168764 8743063 9141084 9499220 9291188
5455I291188M55117l10498j80380O69259M46316M72214K54087J12753O4882L83785
5445A1658723j34960K04291J76272L85280N831L52912L83700R5490m77176M5416
5435A2695779N66818J68245l26178J74390O27215J22755M06856m46299J76847
5426A4166428K46600J08712M82769m27262K86207P64717K46355J74733q3217L61959
5416A6328001j16096j37991O03714J1822J09745j85896J1601K71112l95778l7828
5406A6462406J34083J04371L11858q9294l77737N93788n9016J44039n36407q942
5396A6679149Q44626k69790L59440N47302j21584M34392k1543l39916Q35969L57518
5386A9305563k54856o50074j93919M88823M61978k40912K56979k47201j24395
$$ plain form
5455 9291188 9746305 9435807 9255427 9924686 10371002 10843216 11097303 11210056 11274938 11658723
5445 11658723 11523763 11728054 11904326 12289606 12295437 12648349 13032049 13127539 12650363 12695779
5435 12695779 13262597 13430842 13104664 13279054 13906269 14029024 14435880 13989581 14166428
5426 14166428 14413028 14521740 15004509 14577247 14863454 15628171 15874526 16049259 15966042 16328001
5416 16328001 16211905 16073914 16677628 16689450 16799195 16613299 16624900 16896012 16500234 16462406
5406 16462406 16596489 16700860 17012718 16923424 16545687 17139475 17080459 17224498 16688091 16679149
5396 16679149 17523775 17253985 17613425 18160727 18039143 18473535 18451992 18112076 18948045 19305563
5386 19305563 19050707 18400633 18206714 18695537 19157515 18916603 19173582 18926381 18801986
5377A8801986J09638m79398k77921p07524m5918l88260k63675N0608k95463k64627
5367A6239446r5373l13574k98922m20020j38521m52942J5334K00458K23888k66718
5357A4693056n34559j91510m8627k67994K7119J57726p47803J99887M99324O9662
5347A3856281l38390m87504k1302l13687J99200k63405p13736K94790o61704l56629
5337A1193914J91272o218o7105j75182l15926N7885k72305o78287j62751J047
5327I766344k3748l36152n88615k09751Q0973O56089L1287n88868j33456l85094
5317H269009m18447K6639P9548m77756j73959j1465J0465L54631j48518L07838
5307G817985J15403n19571m8657j26183p80305K29795J12018q0267P44354K17770
$$ plain form
5377 18801986 18911624 18432226 18154305 17446781 17400863 17012603 16748928 16799536 16504073 16239446
5367 16239446 16144073 15830499 15531577 15111557 14973036 14520094 14535428 14735886 14959774 14693056
5357 14693056 14158497 13966987 13918360 13650366 13677485 13835211 13087408 13287295 13786619 13856281
5347 13856281 13517891 13030387 13009085 12695398 12894598 12631193 11917457 12212247 11550543 11193914
5337 11193914 11385186 11378968 11311863 11136681 10820755 10878640 10606335 9928048 9765297 9766344
5327 9766344 9742596 9406444 8817829 8608078 8689051 9345140 9376427 8787559 8654103 8269009
5317 8269009 7850562 7877201 7956749 7478993 7305034 7293569 7304034 7658665 7510147 7817985
5307 7817985 7933388 7413817 7365160 7238977 6458672 6688467 6800485 6720218 7464572 7682342
5297G682342k56385l20115Q2377K62362k68243L2551O3653l54812L99774M17128
5287G740632q4845K72324j96212l87318L4199L0191K86782j19433J00267O90827
5277H367414K4458k21585K3499M0011N88489j29813j6952r8089j07644j69944
5267H299844n70L49955J64573k23476O80488L57920m95561K15466M70079j69532
5257I649186M85918M06822j1628Q48029K76068n3053L10292K06054j17641p6637
5247A1923410N06579L06701N68337J0398L2561j8601k66009M66464J44847N42405
5237A4217092L06710q931N4215L51709N30259l17141l25726N54407L23871L9814
5227A5726279Q615k885Q2777M11098j48728j26022Q89087L94856k26708O94159
$$ plain form
5297 7682342 7425957 7105842 7188219 7450581 7182338 7214889 7278542 6923730 7323504 7740632
5287 7740632 7655787 7928111 7731899 7344581 7378780 7408971 7695753 7576320 7676587 8367414
5277 8367414 8391872 8170287 8193786 8233797 8822286 8692473 8675521 8577432 8469788 8299844
5267 8299844 8299274 8649229 8813802 8590326 9270814 9628734 9133173 9348639 9818718 9649186
5257 9649186 10135104 10541926 10530298 11378327 11654395 11601342 11911634 12117688 12000047 11923410
5247 11923410 12429989 12736690 13305027 13315425 13347986 13329385 13063376 13529840 13674687 14217092
5237 14217092 14523802 14514871 14569086 14920795 15451054 15133913 14808187 15362594 15686465 15726279
5227 15726279 15734894 15732009 15814786 16225884 16077156 15951134 16840221 17235077 17008369 17702528
5217A7702528j18412M050M88206K36646N64374J54310n57824K51464J37152R54824
5207A9817318N08616j67304J32743L66625L57814l66306j39020K5203j40494q47999
5197A9547196N18710P14418o46333k27754j67159j85112J07113l0369O1957l32951
5187A9359716N3243m17032K01812J12085k24335M68029j01494m15213p0130M91000
5177A9457681j75177j0993L91059k83713l38694K79147o27045O23563K56446n11643
5167A9060631j59464J90586k19118j00311J1470m19056k23234k06435L56546J49066
5157A8440681p0750k68375K27091m98953l2540J7359o66857J34546K20337o58348
5147A6844191r9479K10986R196M0727k04548q110L82836J69352m44973n74162
$$ plain form
5217 17702528 17584116 17588166 18076372 18313018 18877392 19031702 18473878 18725342 18862494 19817318
5207 19817318 20325934 20158630 20291373 20657998 21015812 20649506 20510486 20535689 20395195 19547196
5197 19547196 20065906 20780324 20133991 19906237 19739078 19553966 19661079 19630710 19692667 19359716
5187 19359716 19412959 18995927 19197739 19309824 19085489 19553518 19452024 19036811 18966681 19457681
5177 19457681 19282504 19271511 19662570 19378857 19040163 19319310 18692265 19315828 19572274 19060631
5167 19060631 18901167 19091753 18872635 18772324 18783794 18364738 18141504 17935069 18291615 18440681
5157 18440681 18369931 18101556 18328647 17829694 17797154 17814513 17147656 17282202 17502539 16844191
5147 16844191 16744712 16955698 16964894 17005621 16801073 16792963 17175799 17345151 16900178 16326016
5137A6326016j25836L33061n3807K531j05257k50813L08018n1449j70348Q1015
5127A6293131J54102k63547j94495J29764p2317j30500k95804L49499J064132
5118A7033965l02759j36607m23676K28666K81077l13666r4390o8442J52169K00850
5108A6557187K68458J92574j92785L18607p01863J94816Q30812l83000j53489
5099A6931317n8696J32534k4609O76015J38637N5185L95297L87059q8182K01193
5089A8745750o4123M80507P72321l37421K7357N46648m3695j94799M99441N37288
5079B0969274L31049Q4232l19789J68705M43022J21185q1963m74525k39189k49368
5069B0752633M4203K89280k1638J37040P9801N68309K47905k21070k65621L50023
$$ plain form
5137 16326016 16200180 16533241 16479434 16481965 16376708 16125895 16433913 16382464 16212116 16293131
5127 16293131 16447233 16183686 15989191 16118955 16046638 15916138 15620334 15969833 17033965
5118 17033965 16731206 16594599 16170923 16399589 16680666 16367000 16272610 16204168 16356337 16557187
5108 16557187 16825645 17018219 16825434 17144041 16442178 16636994 17467806 17084806 16931317
5099 16931317 16872621 17005155 16980546 17656561 17795198 17850383 18245680 18632739 18544557 18745750
5089 18745750 18681627 19162134 19934455 19597034 19624391 20171039 20127344 19932545 20431986 20969274
5079 20969274 21300323 21384555 21064766 21233471 21676493 21797678 21715715 21241190 21002001 20752633
5069 20752633 20796836 21086116 21064478 21201518 21281319 21849628 22097533 21876463 21610842 21960865
5059B1960865J24214P68320O26305n83679M18161J005757R7538L25991R91561
5050B5735033k72131N70940R40153j74908N74181j06818l60161O18470j13288
5041B7411471l47898j68100J5974k97197j27086K19126l19990m37738k07810M3558
5031B5784310k82408p0591Q6844k28885k62608j53631p3185K81274L1525J33700
5021B5246345M39849l3564k23609M77568J63961L15357O66301L373j80000j13315
5011B6762266N24084L89341J42599M52301l47411m43607M1943k17246l89621r1410
5001B6823239k65565k1824k20544n64741j82756m5048j44710M8625j32328p75093
4991B4519255J33101J82313l88930J62743K70577j8358M85640M86608l18642Q9566
$$ plain form
5059 21960865 22085079 22853399 23479704 22896025 23314186 24319943 24417481 24743472 25735033
5050 25735033 25462902 26033842 26973995 26799087 27373268 27266450 26906289 27524759 27411471
5041 27411471 27063573 26895473 26911447 26614250 26487164 26706290 26386300 25948562 25740752 25784310
5031 25784310 25501902 25431311 25518155 25289270 25026662 24873031 24799846 25081120 25112645 25246345
5021 25246345 25686194 25652630 25429021 25906589 26070550 26385907 27052208 27055581 26875581 26762266
5011 26762266 27286350 27675691 27818290 28270591 27923180 27479573 27521516 27304270 26914649 26823239
5001 26823239 26557674 26535850 26315306 25750565 25567809 25522761 25378051 25426676 25294348 24519255
4991 24519255 24652356 24834669 24445739 24608482 24879059 24860701 25346341 25832949 25514307 25603873
4981B5603873L52298K54016J54371j01430L83582j75244l60880o5508j2283K5012
4971B6057807J5450j97883p87750o59598m2256j21121m17730o83703o21702k06831
4961B2334683P7658j71714J53335j150493p34536K56897m51667k36761n65501
4952A9511901j48317J94682n57919N03692K98863k56802K60520o89008o70129
4943A8447483K98899k4844l01184m42151l11223N49132n22381o04966K59919o9404
4933A7279280q44513p80094l83126m00260k32986k92646n2847k37484K6247l06831
4923A3774740n32338r3950k07932l97515q38436K7838q766p45642m0885L72116
4913A1309230J7256k20798o11456k43804J5358J06079l2452r86893p16578J83724
$$ plain form
4981 25603873 25956171 26210187 26364558 26263128 26646710 26471466 26110586 26045078 26032795 26057807
4971 26057807 26073257 25875374 25087624 24428026 24385770 24264649 23846919 23163216 22541514 22334683
4961 22334683 22412341 22240627 22393962 21243469 20508933 20765830 20314163 20077402 19511901
4952 19511901 19363584 19558266 19000347 19504039 19802902 19546100 19806620 19117612 18447483
4943 18447483 18746382 18721538 18420354 17978203 17666980 18216112 17693731 17088765 17348684 17279280
4933 17279280 16434767 15654673 15271547 14871287 14638301 14345655 14292808 14055324 14081571 13774740
4923 13774740 13242402 13148452 12940520 12543005 11704569 11732407 11723641 10977999 10937114 11309230
4913 11309230 11326486 11105688 10494232 10250428 10265786 10371865 10339413 9352520 8635942 8819666
4903H819666j93487k6103J03392l14021j98850l05136L47657J81976r81234m57686
4893F976174J14631M70036P5745n55026M9742o06539M78868M36148r60929m85926
4883E992924l4710j50243K96359K94849l64509Q037m87051L87726K20343r92972
4873E170753m7797J07411l99998L95024J148j96094l70671o64548L87260P2928
4863D455416p70917K93576O03013m30178K1965j52995r98282M99255M26035n35194
4853C411694l29878j166O2616j64846p6423l72916j25605L31929J5181J91019
4843B941605K71110p63623k00195K78004j45495n2179R057k12650l6201J99405
4833B288838J06976j44196r385j50644K51565K83400Q672m99496l21816K60210
$$ plain form
4903 8819666 8626179 8600076 8703468 8389447 8190597 7885461 8233118 8415094 7433860 6976174
4893 6976174 7090805 7560841 7636586 7081560 7131302 6524763 7003631 7439779 6478850 5992924
4883 5992924 5958214 5807971 6104330 6399179 6034670 6042707 5555656 5943382 6163725 5170753
4873 5170753 5122956 5230367 4830369 5225393 5226541 5030447 4659776 3995228 4382488 4455416
4863 4455416 3684499 3978075 4581088 4150910 4172875 4019880 3021598 3520853 3946888 3411694
4853 3411694 3081816 3080650 3143266 2978420 2901997 2529081 2403476 2735405 2750586 2941605
4843 2941605 3212715 2449092 2248897 2526901 2381406 2329227 2338284 2125634 2089433 2288838
4833 2288838 2395814 2251618 2242233 2091589 2343154 2626554 2635226 2135730 1813914 2074124
4823B074124k6545j20762J64342M00297o5676n1812p04754K34794P90914k10627
4813B484295m16840k46622l4399M09789J68989j57998r2211l4642l55035j45269
4803A580057p990J21036j24948K05801N41022p81364N1561k00778l04673Q55413
4793A935137l50026J88222O62940o0856l71034Q7151k157J11223K43730J37696
4783B582026K34056k96087N57131L726k87029r5217j25256Q0567L74675q7909
4773B940683L47491N97886k79159k24560m3268J79698j12723J03649L92350l4270
4763C867777r6521K10552r9228J40167Q00196r3385l57280r8930J51943O75945
4753E101236Q1113l65576R698N22658K07309j60075J82932R9655L01327J95996
$$ plain form
4823 2074124 2047579 1926817 2091159 2491456 2425780 2373968 1669214 1904008 2694922 2484295
4813 2484295 2067455 1820833 1786434 2196223 2365212 2207214 2115003 2080361 1725326 1580057
4803 1580057 1572067 1693103 1568155 1773956 2314978 1533614 1585175 1384397 1079724 1935137
4793 1935137 1585111 1773333 2436273 2375417 2004383 2091534 2089377 2200600 2444330 2582026
4783 2582026 2816082 2519995 3077126 3080852 2793823 2698606 2573350 2653917 3028592 2940683
4773 2940683 3288174 3886060 3606901 3382341 3339073 3518771 3406048 3509697 3902047 3867777
4763 3867777 3771256 3981808 3882580 4022747 4822943 4729558 4372278 4273348 4425291 5101236
4753 5101236 5182349 4816773 4826471 5349129 5556438 5396363 5579295 5678950 5980277 6176273
4743F176273j98583J9727O56330j36808m40751Q7252K80403j38546K50928N98831
4733G155056j99338l06896L03649P9434m2617m7318j14539k44888j63232O58233
4723G077544j29542q0768O95505k41349n74448q457J97833K34049m89004l44012
4713F337351R43654P9642n40448L83723K16949o2769j16952L7881j61744K38090
4703G355377J80725o57262l27003O75786J71487n44068k8194M6278j58717L6042
4693F750451J9316L5024r4933l96157L08309m41789j55600K20060n74258J6001
4683E686424J86565L10565k05251j86407M53581k6577l67226j04918j80344o1070
4673E505342o1685k9804l63757J09997l6034J13147K63130l57208M47416n46934
$$ plain form
4743 6176273 5977690 5997417 6653747 6516939 6076188 6163440 6443843 6305297 6556225 7155056
4733 7155056 6955718 6648822 6952471 7031905 6989288 6941970 6827431 6582543 6419311 7077544
4723 7077544 6948002 6867234 7562739 7321390 6746942 6738485 6936318 7170367 6681363 6337351
4713 6337351 7281005 7360647 6820199 7203922 7420871 7358102 7241150 7279031 7117287 7355377
4703 7355377 7536102 6878840 6551837 7227623 7399110 6855042 6826848 6873126 6714409 6750451
4693 6750451 6769767 6804791 6709858 6313701 6622010 6180221 6024621 6244681 5670423 5686424
4683 5686424 5872989 6183554 5978303 5791896 6245477 6218900 5851674 5746756 5566412 5505342
4673 5505342 5443657 5413853 5050096 5160093 5124059 5237206 5500336 5143128 5590544 5043610
4663E043610j129115L05246J56243l72266q5770k89337j61860L07493k3399J7877
4653C768722j81129o74662l0495J10355L6540k35467J05854M5684p29533l7402
4643B178467j2283l31177N95752M03579j046315J61815j80972l08487N30848l28516
4633A662711l77899r0293j21988K4568Q3884M58662l44333j16276m8674k43314
4623H87048M38173j41139m60603K59620M64619L01529l3292o40418o35618O95689
4613A135608L53695o96316l31882j4584K16105r1538Q6711j24248K24650P2640
4603H30841n38898k09249O36066m62822m7456K00629o4837M41685K98405m19179
4593F65185M84469L26120l38289j22091R7821m34852k47432N4291k18160Q62290
$$ plain form
4663 5043610 3914495 4219741 4375984 4003718 3917948 3628611 3466751 3774244 3750845 3768722
4653 3768722 3587593 2912931 2882436 2992791 3029331 2793864 2899718 2945402 2215869 2178467
4643 2178467 2166184 1835007 2430759 2834338 1788023 1949838 1768866 1460379 1991227 1662711
4633 1662711 1284812 1194519 1072531 1097099 1180983 1639645 1295312 1179036 1130362 887048
4623 887048 1325221 1184082 723479 983099 1447718 1749247 1715955 1075537 439919 1135608
4613 1135608 1489303 792987 461105 446521 662626 571088 657799 533551 758201 830841
4603 830841 291943 82694 718760 255938 208482 409111 344274 785959 1084364 665185
4593 665185 1149654 1475774 1137485 1015394 1113215 678363 430931 485222 267062 1129352
4583A129352k63551j78914J77219l26605k38782k1948M36062r4291k65400n75536
4573b22394L7743M40081K09457N7374q7102J18411o5744k78260k44101J39198
4563A04663M49965P8441k67461j67619l21431L67649K43781j18627J51702K56389
4553G77452n12375r1410K44353m91834L82372K06497n71833r4010J32449O9263
4543E0924j3741k34129L51117Q2014n642R8616r3044j59375l50114M92895K65528
4532D85049l59109o0515j25090J75606K40031J9907J61403m87358k39326m89981
4522f79383L5391Q65778J55047R5133j72949J16786P6617m88282j23100M77334
4512C58372K97281n19051k87170K63314L46336n4210j81997K15488m9425j85063
$$ plain form
4583 1129352 865801 686887 864106 537501 298719 276771 712833 618542 353142 -222394
4573 -222394 -184651 255430 464887 522261 435159 553570 487826 209566 -34535 104663
4563 104663 554628 633069 365608 197989 -123442 244207 487988 369361 521063 777452
4553 777452 265077 173667 418020 -73814 308558 515055 -56778 -150788 -18339 50924
4543 50924 37183 -196946 154171 236185 230543 329159 236115 76740 -273374 219521 485049
4532 485049 125940 65425 -59665 115941 355972 375879 537282 49924 -189402 -679383
4522 -679383 -643992 221786 376833 471966 299017 415803 492420 4138 -118962 358372
4512 358372 655653 136602 -150568 112746 459082 404872 222875 438363 388938 203875
4502B03875L63056n04498l12332K85872m12642p0039L00309j77014K01415L67474
4492B45476j7150N47026k3647n31991k38152k28767l8178K2907j88248O93116
4482B42392M91289j18015j42756p43783M39231m3974m15870L34362k47775q2800
4472b87699K96851J93123M98851j61580j15208n2857o22603k1574j87431j05102
4462e65229M56694j62451k06693O71202K34603N0293k71250l96766M43900k0182
4452B34121k55931n99630J91584O24948m89759L93642J21827l80391M54365l225
4442B91551J87228J89217k61702m2446R3500J71786j8599l47989p1375n60588
4432c69417k8551K84584k72575M18658j8330N58360K17805p78602J5016L41980
$$ plain form
4502 203875 566931 62433 -249899 35973 -376669 -446708 -146399 -323413 -121998 245476
4492 245476 228326 775352 751705 219714 -18438 -247205 -285383 -262476 -450724 242392
4482 242392 733681 615666 472910 -270873 168358 124384 -291486 42876 -204899 -287699
4472 -287699 9152 202275 701126 539546 424338 371481 -251122 -272696 -460127 -565229
4462 -565229 -108535 -270986 -477679 193523 428126 478419 207169 -189597 254303 234121
4452 234121 -21810 -621440 -429856 195092 -294667 98975 220802 -159589 294776 291551
4442 291551 478779 667996 406294 363848 457348 629134 610535 262546 191171 -369417
4432 -369417 -397968 -113384 -385959 32699 14369 572729 790534 11932 26948 368928
4422C68928o6839M14664m74111r40116K12925P57638M79360k98816l75576J21961
4412B00018K67524J50973l35606j90766N34230m61213k95551q2944Q5302M06496
4402B78463J91445k23508k25985L07795J20888n71511q718J28584m4836M08329
4392C60946n00204K00446Q9566L0203K61836l45925Q5251J73052k20247N4835
4382A89759J86329O8383k53917K78203k93893P8589k25416M73491M46554o86422
4372B61660l96774J33495L96438J48308P0161n6638P0672j95066K47124n01111
4362A78269k76337O49372k17034n09022n096j82127L78131O4380N8121N19425
4352F58082n42837J3576m0551k07233Q21558n1939l4707m88822p66495K29799
$$ plain form
4422 368928 302089 716753 242642 -697474 -484549 273089 752449 453633 78057 200018
4412 200018 467542 618515 282909 92143 626373 165160 -130391 -213335 -128033 278463
4402 278463 469908 246400 20415 328210 449098 -122413 -131131 -2547 -47383 360946
4392 360946 -139258 61188 150754 180957 442793 96868 182119 355171 134924 189759
4382 189759 376088 444471 190554 468757 174864 253453 28037 501528 948082 261660
4372 261660 -135114 -1619 394819 543127 613288 556650 627322 432256 679380 178269
4362 178269 -98068 551304 334270 -174752 -179848 -361975 16156 80536 138657 658082
4352 658082 115245 128821 88270 -118963 702595 650656 615949 127127 -639368 -409569
4342d09569M24339K82217M02426L78282q7510j52747m50055k11442Q5160k93281
4332c2180K91346J60472r5640k6388n32260L31701P94483M1967n13543n49949
4322a29991K65691J32029J86521j16313l0795j80135j56677J31664O0415k1485
4312A40924K23311j48253q3117N20269j1709j91622j84054m04860L33739j46727
4302D7901l77985M55802J96121K24122n54180o8859N28856K6201M8697m51667
4292G5009q2676L33999K72075k17484j10229r3077l83566L05437K68496j58930
4282B09054L74024j92046l07961K24336J81638j07141j00532L75443l26843K02357
4272E32329J69251m80362L21574P1067l60709j3226k97953k42247k51217O15423
$$ plain form
4342 -409569 14770 296987 699413 1077695 990185 837438 387383 175941 261101 -32180
4332 -32180 259166 419638 323998 297610 -234650 97051 891534 933501 419958 -129991
4322 -129991 135700 267729 454250 337937 307142 127007 -29670 101994 162409 140924
4312 140924 364235 215982 132865 653134 641425 449803 265749 -139111 194628 47901
4302 47901 -330084 125718 321839 545961 -8219 -77078 451778 477979 526676 75009
4292 75009 -7667 326332 598407 380923 270694 177617 -205949 99488 367984 209054
4282 209054 583078 391032 83071 307407 489045 381904 281372 656815 329972 532329
4272 532329 701580 221218 542792 613859 253150 239924 -58029 -300276 -551493 63930
4262F3930P18631q1471l16961k61859K90178p6113O1032l16118j5628n7055L1133
4251C9699Q11532l25990k00724J85299P87701p09057j56771N51375m77340k31078
4241B74646J04893M08385l11045k23259m3440M09419p3761o24010P03493j53185
4231D72136J44092k69745m40897O04772K62135J00454Q9644p33489J05617m6936
4221B87783l95058l1078M78034K50691m19621N28605K48271k10992k1261k06756
4211E08618m53990m8142J44887k43004m78207P49122P13159j76071m81035J43659
4201C78996m90518K79568P86556J97063n77376p17387Q62254k19808o36371K87211
4191A50188o5532M46710q6467j96050J82162m26679n3325N25321j86080o75676
$$ plain form
4262 63930 782561 701090 384129 122270 412448 336335 397367 81249 65621 8566 39699
4251 39699 851231 525241 324517 509816 1297517 588460 431689 983064 505724 274646
4241 274646 379539 787924 476879 253620 210180 619599 545838 -78172 625321 472136
4231 472136 616228 346483 -94414 510358 772493 872947 962591 229102 334719 287783
4221 287783 -107275 -138353 339681 590372 170751 699356 947627 736635 715374 508618
4211 508618 54628 6486 151373 -91631 -569838 179284 892443 716372 235337 378996
4201 378996 -111522 168046 954602 1151665 574289 -143098 719156 499348 -137023 150188
4191 150188 84656 531366 444899 248849 431011 4332 -48993 476328 290248 -385428
4181c85428N75000j19426l43805N06705L70657P6705l98047L13451P718m4062
4171E59468P9898K50340j85393k51282l45032m55548O77588K54243n14242K64785
4161C34825m27635K72678N05725l16073J01535k23030l14253j87266L32295n411
4151G3390r4030k33265K01680O3321j089N98281J49670o34371J17214k47207o0135
4140f6541N26980Q2752m27689M741r320l6851P47223j51585j90129k09141l74852
4129a04412K4152J40660J9317K23270N6690K15642l12069l64168O1225L98824
4119C59131J06417K94554n10776m89367K0427J49408R9878k6622L75989L35289
4109G14328l32747M9407J94680M5642l6200p26738j12231K59878M94125k20362
$$ plain form
4181 -385428 189572 70146 -273659 233046 603703 680408 282361 595812 603530 559468
4171 559468 639366 889706 704313 453031 107999 -347549 330039 584282 70040 334825
4161 334825 -92810 179868 685593 369520 471055 248025 -66228 -253494 78801 73390
4151 73390 -20640 -253905 -52225 11096 10007 608288 757958 123587 240801 -6406 -66541
4140 -66541 460439 543191 115502 120243 110923 74072 821295 669710 479581 270440 -104412
4129 -104412 -80260 60400 79717 302987 359677 575319 263250 -100918 -39693 359131
4119 359131 465548 760102 249326 -240041 -219614 -70206 29672 3050 379039 714328
4109 714328 381581 430988 625668 671310 635110 -91628 -203859 56019 550144 329782
4099C29782l08820J53279j80772K47289K47214k00972M39951j413J15540m59805
4089C81273J44427L182m06062M77880n64260j0225P4920m73561K48305J94976
4079G0855J49559L70672M93669R0926n20654m76574K97674o683N3054R7971k95464
4068C25005P6893J54456o614K47265J90607k44908q7152j78905k59224J11049
4058C28472j70887q329P85089j23106m01126l56307k27831N24259l0941p9885
4048B39408l29591J62037l4767L17739j728P9497L09778n37903K73611K59516
4038G37597j41978K1656m94126K82402L26350l98031K99830q1919l65387N75754
4028G62148N91786m86382j04121K63770k8347O88702m79918l94985Q9296j66356
$$ plain form
4099 329782 20962 174241 -6531 240758 487972 287000 726951 725538 841078 381273
4089 381273 525700 528882 122820 600700 36440 26215 101135 -372426 -124121 70855
4079 70855 220414 591086 1084755 1175681 655027 178453 476127 469444 522498 620469 325005
4068 325005 401898 556354 549740 797005 987612 742704 655552 476647 217423 328472
4058 328472 157585 149256 934345 811239 410113 53806 -174025 350234 319293 239408
4048 239408 -90183 71854 37087 354826 353098 432595 742373 204470 478081 737597
4038 737597 595619 617275 123149 405551 731901 333870 633700 551781 186394 762148
4028 762148 1353934 867552 763431 1027201 998854 1687556 1207638 812653 901949 735593
4018G35593j17572K07580k931j06192l19253k56283J81907o71769M15461O79446
4008G45987m66933O6033K02877l8288K88693O9737j47945k13222K79023m02030
3998C83932J74529K47367k4370m13553J25814m5365q4683J7721R0261N34447L80544
3987A386644k00302k27283l36617K03750j89387L08254j09567m61675N92665K02605
3977A169087m07383K92852M84302l15616o63351j41165L33840O714m71037O8220
3967C56463N9569J19088N2144k47444L42143k52050N87148l15257m56665O85192
3957I30331Q2083J44571k27164k96145J60818J49997J11808k79571K62435j45698
3947H93465K47043j23459p83794M75487K95490m56159K59327O87159l11007m27859
$$ plain form
4018 735593 618021 825601 822670 716478 397225 140942 322849 -348920 66541 745987
4008 745987 279054 345087 547964 509676 798369 868106 720161 506939 785962 383932
3998 383932 558461 805828 781458 367905 493719 448354 363671 381392 471653 1006100 1386644
3987 1386644 1186342 959059 622442 826192 636805 945059 835492 373817 966482 1169087
3977 1169087 761704 1054556 1538858 1223242 559891 418726 752566 759280 288243 356463
3967 356463 416032 535120 587264 339820 681963 429913 1017061 701804 245139 930331
3957 930331 1012414 1156985 929821 633676 794494 944491 1056299 776728 1039163 893465
3947 893465 1140508 1017049 233255 708742 1004232 548073 807400 1494559 1183552 755693
3937G55693N8069l11331L36183K40688K06238o115N693l48843l44973L55461j04850
3926H41913l4871j43682j04149N15472J5198K79737N1619j86234n3952n10784
3916F70267m5473J58713m66112j20597N55295M00509k67605k29662K28924Q64100
3906A748359J8993p11775k21074l48791J45230K23165K8846L05033K62463l39885
3896A110564m12816K94027L07142J80204K283l33555l8900J51578l43836M19735
3886A336426L88705K0104j26314J82738p6030n12188K50890O1538j17621j81485
3876A226763j52221N8562N34545K09835j75131k14991K93473j90721O1771M6934
3866A698819l90718N3636j01144M77978P1016m01410O943O4164K67869k93358
$$ plain form
3937 755693 813762 502431 838614 1079302 1285540 1279425 1285118 936275 591302 946763 841913
3926 841913 807042 663360 559211 1074683 1089881 1369618 1421237 1235003 1181051 670267
3916 670267 624794 783507 317395 196798 752093 1152602 884997 655335 884259 1748359
3906 1748359 1767352 1055577 834503 485712 630942 854107 882953 1187986 1450449 1110564
3896 1110564 697748 991775 1298917 1479121 1481404 1147849 1108949 1260527 916691 1336426
3886 1336426 1725131 1745235 1618921 1801659 1725629 1213441 1464331 1525869 1408248 1226763
3876 1226763 1074542 1133104 1667649 1877484 1702353 1487362 1780835 1590114 1651885 1698819
3866 1698819 1308101 1361737 1260593 1738571 1809587 1408177 1415120 1479284 1747153 1453795
3856A453795L41301K65337m38829P5902o8672P2373K38539o06174q3931L97051
3846A646692K87588K94695L0556l69221M44881L81450j57398n97673l20554O66784
3836B307800j0876n42874N09835R3746k62063K30001l09476j71279O69954k4287
3826B490481j10199j91635m63652O86698J58327k77466j77773M1853J85931Q4225
3816B426790L72977L4722l11630O52025J04794n87490P3662K21039L24005Q0019
3806C390913J83053M10351k41569p6428o3149k23120n5328P00390L93214J59073
3796D577400L06099J6794l02342J02157J22209k6844m38233J6877O59383L62349
3786E395849J04308K06779K48269j21914J19355k4606K58343K16889M66461M70556
$$ plain form
3856 1453795 1795096 2060433 1621604 1697506 1628834 1701207 1939746 1333572 1249641 1646692
3846 1646692 1934280 2228975 2259531 1890310 2335191 2716641 2559243 1961570 1641016 2307800
3836 2307800 2296924 1754050 2263885 2357631 2095568 2325569 2016093 1844814 2514768 2490481
3826 2490481 2380282 2188647 1724995 2411693 2570020 2292554 2114781 2156634 2342565 2426790
3816 2426790 2799767 2834489 2522859 3174884 3279678 2692188 2765850 2986889 3310894 3390913
3806 3390913 3573966 3984317 3742748 3666320 3603171 3380051 3324723 4025113 4418327 4577400
3796 4577400 4883499 4900293 4597951 4700108 4822317 4795473 4357240 4374117 5033500 5395849
3786 5395849 5500157 5706936 5955205 5833291 5952646 5928040 6186383 6403272 6869733 7340289
3776G340289m85349J14310L21518l01412J84203N88736l9799J26411M22040p0716
3766H200231M49195M5073l79559o3957N01243N54680o39019n6089N99248L43389
3756I554435K11338m00675m9569N39915N63604p1341n25913k97699K20325O45928
3746A0390348j43730j6128N79673l7387P70873K47062j54357J4788n5081J22467
3736A1718528N36489o6896L43513M18020m90394L71104J64321N48001K88183l76952
3726A3453917L69722L94017L29314O13634o40229p01429M63679M76904K94795
3717A5054324J3336P3589Q59570J82781k0696j14238k95612J142580K91429j19345
3707A7067718R55398J68598M89052N77062K09709J16436J73768P72663J21510
$$ plain form
3776 7340289 6854940 6969250 7290768 6989356 7173559 7762295 7722496 7848907 8270947 8200231
3766 8200231 8649426 8694499 8314940 8250983 8752226 9306906 8667887 8611798 9211046 9554435
3756 9554435 9765773 9365098 9315529 9855444 10419048 10347707 9821794 9524095 9744420 10390348
3746 10390348 10246618 10230490 10810163 10772776 11543649 11790711 11636354 11651142 11596061 11718528
3736 11718528 12255017 12188121 12531634 12949654 12459260 12830364 12994685 13542686 13830869 13453917
3726 13453917 13823639 14217656 14546970 15160604 14520375 13818946 14282625 14759529 15054324
3717 15054324 15067660 15141249 16000819 16183600 16162904 16048666 15753054 16895634 17187063 17067718
3707 17067718 18023116 18191714 18680766 19257828 19467537 19583973 19757741 20530404 20651914
3698B0651914Q3590J84015L53134P55550M52303j4124L64914N45287N82119J53777
3688B4112479k31067M71524N44839J019554p0247M2220Q76711N92418J093498
3679B8451929L28131R3979J093840O96160N11705P44592Q75147P22517J30330
3670C3648330O66619P03602R23308O17657o4340N49148K06617K03105M39488K43337
3660C8136871k03435K06235N39977K85050L81397M77623N23356K64133N4590o4866
3650D0600931J49596Q42978O36890N93688K53038L59384M19138O74727R36541
3641D5466911P33209M62904L86769Q77181j64871K41471M00856p5195K19518J37702
3631D8686455J74298j38909k15117m14745q11697k44644n06082o1128J29556p89788
$$ plain form
3698 20651914 20735504 20919519 21272653 22028203 22480506 22466382 22831296 23376583 23958702 24112479
3688 24112479 23881412 24352936 24897775 25917329 25847082 25889302 26766013 27358431 28451929
3679 28451929 28780060 28874039 29967879 30664039 31175744 31920336 32795483 33518000 33648330
3670 33648330 34314949 35018551 35941859 36559516 36495176 37044324 37250941 37454046 37893534 38136871
3660 38136871 37933436 38139671 38679648 38964698 39346095 39823718 40347074 40611207 40665797 40600931
3650 40600931 40750527 41593505 42230395 42824083 43077121 43436505 43855643 44530370 45466911
3641 45466911 46200120 46663024 47049793 47926974 47762103 48003574 48404430 48329235 48548753 48686455
3631 48686455 48860753 48721844 48506727 48091982 47280285 47035641 46529559 46468431 46597987 45808199
3621D5808199q43632j33484o55784q8267o4020o64078l62792j57480n06008n0613
3611D2282041J22932n25969J24113J44582o86620o3125J06196m98424l76530k86054
3601D0343142n07301p99233j40235k99327o46686n71145p97460j134375n99442
3592C4847938o34240p22239n24177q98967m20497k25773j005416l13233l83810
3583B9719586j287040r87095m97499k09761l71393m30874k5576J23955j59993
3574B5874310J30269k07577p29827m73992M5799n22948o04773L87085l82956j078047
3564B2437343k83119j5091k9963n99963q8092O522j062284n41810J52510k50635
3554A9725418L3617L02547n59909k5952L05397l26330K33731k4472O5341j92492
$$ plain form
3621 45808199 44964567 44831083 44175299 44087032 44023012 43358934 42996142 42838662 42332654 42282041
3611 42282041 42404973 41879004 42003117 42147699 41461079 41397954 41504150 41005726 40629196 40343142
3601 40343142 39835841 39036608 38896373 38597046 37950360 37379215 36581755 35447380 34847938
3592 34847938 34213698 33491459 32967282 32068315 31647818 31422045 30416629 30103396 29719586
3583 29719586 28432546 27445451 26947952 26738191 26366798 25935924 25910348 26034303 25874310
3574 25874310 26004579 25797002 25067175 24593183 24638982 24116034 23511261 23898346 23515390 22437343
3564 22437343 22154224 22139133 22109170 21509207 21421115 21427637 20365353 19823543 19976053 19725418
3554 19725418 19759035 20061582 19501673 19475721 19781118 19454788 19688519 19664047 19729388 19536896
3544A9536896r42795P18742M95316m43266L34832N43703Q9283p3001J2926O25325
3534B0897961J36217P8275J12082J79709K46614L67545L37472J6010P4278K95958
3524B2742121L71086Q70991O78034M56661m686K05872K38790k21629L50465P77490
3514B6465195L11366k7550N75997Q86515R00744O94502Q40198K68691j07144Q23602
3504C1632116R75213O03141J065385R33839M06102K97089R41195N89993K89669
3495C7733742Q57153P80743P34536M15243K72798J39586N59106R79454K05219
3486D2677580P4109K82606O28543M30877L84131L75808j90302o8029l0848m6075
3476D4518400N91536L10801Q82071J164484K86671m0188O64790O08071M62805
$$ plain form
3544 19536896 18594101 19312843 19808159 19364893 19699725 20243428 20332711 20259710 20272636 20897961
3534 20897961 21034178 21112453 21224535 21404244 21650858 22018403 22355875 22371885 22446163 22742121
3524 22742121 23113207 23984198 24662232 25118893 25114207 25320079 25558869 25337240 25687705 26465195
3514 26465195 26776561 26749011 27325008 28211523 29112267 29806769 30646967 30915658 30808514 31632116
3504 31632116 32607329 33210470 34275855 35209694 35615796 35912885 36854080 37444073 37733742
3495 37733742 38590895 39371638 40106174 40521417 40794215 40933801 41492907 42472361 42677580
3486 42677580 42751689 43034295 43662838 44093715 44477846 44853654 44663352 44595323 44564475 44518400
3476 44518400 45109936 45420737 46302808 47467292 47753963 47713775 48378565 48986636 49449441
3467D9449441Q96008Q99701K55061J3297Q37870O20911P38058N41194l96111o78736
3457E3176694p2048O42889q4142l98836k38142k26037k86589k65136m41356j033412
3447E0773885o64725K49990j09290n53131r52365o30507M47795k3300l39461n7224
3437D8141667k12683m97306P50450J31972o00280j28521j60351M23328L16711
3428D8164987m90951l80941k00677J4552K32422m86765l82047L01154o04871p35472
3418D5431391m55167j031964m3046j96523l44507K52718p80670j16809P7926l63454
3408D2429895K76635j68013J66650j5458K00452k09415K71195J76110K98268N14317
3398D3940636q7838k43801O2222K33997N79405J065537N64056L66906K43113N14886
$$ plain form
3467 49449441 50345449 51245150 51500211 51513508 52351378 52972289 53710347 54251541 53855430 53176694
3457 53176694 53104646 53747535 53663393 53264557 53026415 52800378 52513789 52248653 51807297 50773885
3447 50773885 50109160 50359150 50249860 49696729 48744364 48113857 48561652 48538352 48198891 48141667
3437 48141667 47928984 47431678 48182128 48314100 47713820 47585299 47424948 47848276 48164987
3428 48164987 47674036 47293095 47092418 47106970 47339392 46852627 46470580 46771734 46166863 45431391
3418 45431391 44976224 43944260 43901214 43704691 43360184 43612902 42832232 42715423 42793349 42429895
3408 42429895 42706530 42538517 42705167 42689709 42890161 42680746 42951941 43128051 43426319 43940636
3398 43940636 43852798 43608997 43671219 43905216 44484621 45550158 46114214 46481120 46724233 47239119
3388D7239119N55500J236555J93693K86350P37326J182055J003937J244121J022073
3379E4700729P51927J518646J553145J587932J299879Q23285J268815J439635
3371F4943993J668739J647655J633267J634884J068554K049112J666399J197315
3363G7509918J358620J997615K090988J700476J408674K079492K683220K334471
3355I3163474J759689J900842K213322L001959L147154K881830K373042L137354
3347A13578666L339996L344735L422722L776175M026664M199187L780717M277652
3339A43746514M961391M039197M758455N242189N282213N433145N645587N238650
3331A84347341N944523N157341N112597M244674M162903L552859L177178L070373
$$ plain form
3388 47239119 47794619 49031174 49224867 49511217 50248543 51430598 52434535 53678656 54700729
3379 54700729 55452656 56971302 58524447 60112379 61412258 62235543 63504358 64943993
3371 64943993 66612732 68260387 69893654 71528538 72597092 74646204 76312603 77509918
3363 77509918 78868538 80866153 82957141 84657617 86066291 88145783 90829003 93163474
3355 93163474 94923163 96824005 99037327 102039286 105186440 108068270 110441312 113578666
3347 113578666 116918662 120263397 123686119 127462294 131488958 135688145 139468862 143746514
3339 143746514 148707905 152747102 157505557 162747746 168029959 173463104 179108691 184347341
3331 184347341 190291864 195449205 200561802 204806476 208969379 212522238 215699416 218769789
3323B18769789K897543K709631K395667J915294J863626K363043J340924J633253
3315B35888770K226487K272372K142480J835720K019941K578593J509802J475973
3307B51950138J923160J227238R15348k98659J66192J72717o87232m10989p62048
3298B54195865n46569L01146L14000O02509J444588J321979J307401P85566J272426
3289B60998911K566326J351411Q01497J396814R81389J272132J647296J534043
3281B72549819K214495K306752K326935K186027J268096J652963J907645O25221
3273B87037953K14446o07010j224539k235311l983045m353929o133706o437377
3265B62277482p513857p334276p159182o189101n678718n562277m089783l083750
$$ plain form
3323 218769789 221667332 224376963 226772630 228687924 230551550 232914593 234255517 235888770
3315 235888770 238115257 240387629 242530109 244365829 246385770 248964363 250474165 251950138
3307 251950138 253873298 255100536 256015884 255717225 255883417 256056134 255368902 254957913 254195865
3298 254195865 253649296 253950442 254264442 254866951 256311539 257633518 258940919 259726485 260998911
3289 260998911 263565237 264916648 265718145 267114959 268096348 269368480 271015776 272549819
3281 272549819 274764314 277071066 279398001 281584028 282852124 284505087 286412732 287037953
3273 287037953 287252399 286645389 285420850 283185539 279202494 274848565 268714859 262277482
3265 262277482 254763625 247429349 240270167 234081066 228402348 222840071 218750288 215666538
3257B15666538k648291l433912k125902j498578j886801j061369j940592j588203
3249A99482890j557749k215586k433756k848981k593064k840836k999812l405993
3241A78587113k627472l298383l250833k301532k561389k077071j918204j573513
3233A58978716j659629j796927j094051j317272j243706j006679j716672j613871
3225A47529909j902327j271625j363397j966339p89261n48513j166254n55975
3217A37966218q42570j035579q75086m73610j69001p30126q95636j588470l08303
3208A31047837L48207n70344m0714m99689k60671J282410O99253L45440J156991
3199A33508720J446327J018634J749140R95842J462516J617767K040521J686551
$$ plain form
3257 215666538 213018247 209584335 207458433 205959855 204073054 203011685 201071093 199482890
3249 199482890 197925141 195709555 193275799 190426818 187833754 184992918 181993106 178587113
3241 178587113 175959641 172661258 169410425 167108893 164547504 162470433 160552229 158978716
3233 158978716 157319087 155522160 154428109 153110837 151867131 150860452 149143780 147529909
3225 147529909 145627582 144355957 142992560 141026221 140236960 139688447 138522193 137966218
3217 137966218 137123648 136088069 135212983 134739373 134570372 133840246 132944610 131356140 131047837
3208 131047837 131396044 130825700 130784986 130285297 130024626 131307036 132006289 132351729 133508720
3199 133508720 134955047 135973681 137722821 138718663 140181179 141798946 143839467 145526018
3191A45526018J996227L185128K120735K670910L651970K955598L292986L375288
3183A68774860L195528L981295M141116L865747L209228L512710L331855L262427
3175A97274766K412672J853718K312642O80567N31168l39134o52431n97853j298108
3166B02178007q58094j496084k097194j732064k303152k551720j804981k562714
3158A86772004k714900k661615k413691j265012k831416k614353j432080j986669
3150A68852268j594467j429566j089856j557837k113225j335848r27803p94141
3142A58009525j27582r06219m8662J11835m25283l95605J05108L92504Q37930
3133A57553551Q9211O52345O42656O33654J204696L55293N27314j32950J60021
$$ plain form
3191 145526018 147522245 150707373 152828108 155499018 159150988 162106586 165399572 168774860
3183 168774860 171970388 175951683 180092799 183958546 187167774 190680484 194012339 197274766
3175 197274766 199687438 201541156 203853798 204534365 205065533 204726399 204073968 203476115 202178007
3166 202178007 201319913 199823829 197726635 195994571 193691419 191139699 189334718 186772004
3158 186772004 184057104 181395489 178981798 177716786 174885370 172271017 170838937 168852268
3150 168852268 167257801 165828235 164738379 163180542 161067317 159731469 158803666 158009525
3142 158009525 157881943 156975724 156927062 157038897 156613614 156218009 156323117 156715621 157553551
3133 157553551 157642762 158295107 158937763 159571417 160776113 161131406 161658720 161525770 161685791
3124A61685791L24716m59938j02945m03179m32949r88606j019250j025113j278695
3115A56299832j928507j475822j262006j718953r04349j788327j532396r91076
3107A44698396j730402j010365q22678j343774q61932j967804j627769j899368
3099A33434304k241260k190958k438335k337553l338113l492814l035078l479263
3091A10880930l019484k800777l336444l179964k507316k449566k935384k105518
3083H8546477k149576k113183j916707k379746k251073k095115j635976j535514
3075G2469587j787070k157986k321901j218020r83139j615530k013075j940712
3067E8432154j705903j252270j675255j659317n52043j574579j355800r65139
$$ plain form
3124 161685791 162010507 161550569 161447624 161044445 160611496 159622890 158603640 157578527 156299832
3115 156299832 154371325 152895503 151633497 149914544 149010195 147221868 145689472 144698396
3107 144698396 142967994 141957629 141134951 139791177 138929245 136961441 135333672 133434304
3099 133434304 131193044 129002086 126563751 124226198 120888085 117395271 114360193 110880930
3091 110880930 107861446 105060669 101724225 98544261 96036945 93587379 90651995 88546477
3083 88546477 86396901 84283718 82367011 79987265 77736192 75641077 74005101 72469587
3075 72469587 70682517 68524531 66202630 64984610 64001471 62385941 60372866 58432154
3067 58432154 56726251 55473981 53798726 52139409 51587366 50012787 48656987 47691848
3059D7691848j500824j309304j001229j169294j120301j325332q66910j211121
3051C8187533p40438p12404r20188q44158p67811p11639j252198j453409q01983
3042B9983305m57248q37465r01690p18715m04075l04861k26957r15136q48601
3033B4368557m57107o08653n65916k74670k17148o12431n72745M47412K78751
3024B1786050m79945l83066n92924l96802j2284p65059K24847k27997j65847L21512
3014A9308485m12372n85229N84870l5762n02935n0616j59977K2681j46J68584
3004A8337583l68413k67127P47385o476p34041L97205K68936P81598J3621n66786
2994A8603485M09383m0887J86493Q70919l1836J13656j40942K8569J11359O15448
$$ plain form
3059 47691848 46191024 44881720 43880491 42711197 41590896 40265564 39398654 38187533
3051 38187533 37447095 36734691 35814503 34970345 34202534 33490895 32238697 30785288 29983305
3042 29983305 29526057 28688592 27786902 27068187 26664112 26359251 26132294 25217158 24368557
3033 24368557 23911450 23302797 22736881 22462211 22245063 21632632 21059887 21507299 21786050
3024 21786050 21306105 20923039 20330115 19933313 19921029 19155970 19380817 19152820 18986973 19308485
3014 19308485 18896113 18310884 18895754 18859992 18357057 18306441 18146464 18169145 18168999 18337583
3004 18337583 17969170 17702043 18449428 18442952 17708911 18106116 18375052 19156650 19170271 18603485
2994 18603485 19012868 18971981 19158474 20029393 19997557 20111213 19970271 19998840 20110199 20725647
2984B0725647O07609k98408O07251J112456K84319K70086N05186M08775M5721
2975B4268642k59356N09279O41171P64828P27993R04076O28701J077234N79491
2966B9842059N94467L77139N18566J515130O21874J127223P70958P07825J681008
2957C7756249J929487J416143J230688J669279J713598K287565K207002K218427
2949E2428438J936596K679266L473310L473266K927686L616688L990932L597670
2941G8123852L765463L148112K190377J630961J946824J637205R69061J119009
2933I4530864J499107R99545J490448J650096J402037J155224J398449J857835
2925A05983605J666525J809795K897917K867937K817493M114359N315082N843543
$$ plain form
2984 20725647 21333256 21034848 21642099 22754555 23038874 23308960 23814146 24222921 24268642
2975 24268642 24009286 24518565 25159736 25924564 26652557 27556633 28185334 29262568 29842059
2966 29842059 30436526 30813665 31332231 32847361 33469235 34596458 35367416 36075241 37756249
2957 37756249 39685736 41101879 42332567 44001846 45715444 48003009 50210011 52428438
2949 52428438 54365034 57044300 60517610 63990876 66918562 70535250 74526182 78123852
2941 78123852 81889315 85037427 87227804 88858765 90805589 92442794 93411855 94530864
2933 94530864 96029971 97029516 98519964 100170060 101572097 102727321 104125770 105983605
2925 105983605 107650130 109459925 112357842 115225779 118043272 122157631 127472713 133316256
2917A33316256O343260P543597R701443J1221989J3073667J4845908J4765357
2910B10811477J3153242M771484l981635q733296j0699418r934412r760359q643345
2902A76983738p225334n820551m993858m497498l562852l532347k753727j425271
2894A43172300j180421k68823K81488M37860J873726L199736M309115M534396
2886A56359377M676053L723828L647182M702744P126756Q525643R645276J1910155
2878B10317014J0720377M696392p023037j7022827k0530602j8948257j5936168
2871A46272892j3132269j0737757q623687o943198n724784m803631m828793m049025
2863H7429748l497297k777756k000211j618202j326041q69189n62958n98437k19407
$$ plain form
2917 133316256 139659516 147203113 156904556 168126545 181200212 196046120 210811477
2910 210811477 223964719 228736203 224754568 216021272 205321854 195387442 185627083 176983738
2902 176983738 169758404 163937853 158943995 154446497 150883645 147351298 144597571 143172300
2894 143172300 141991879 141723056 142004544 142442404 144316130 147515866 151824981 156359377
2886 156359377 161035430 164759258 168406440 173109184 180235940 188761583 198406859 210317014
2878 210317014 221037391 225733783 218710746 201687919 181157317 162209060 146272892
2871 146272892 133140623 122402866 113779179 106835981 101111197 96307566 91478773 87429748
2863 87429748 83932451 81154695 79154484 77536282 76210241 75341052 74778094 74179657 73960250
2854G3960250j64636O55657J215205J080525J430475J981636K222435K462989
2846H4844536O65466j637795l298697n156809n799515n582243n898085n254669
2838E2882189m354557m196243l345561k708909k705467j831642j948021j858218
2830B9933571q84122j273139j225892j314294j681165o79622n82831r69554o62816
2821B0660136m60942k22657j024379q38887J29439j175160q54415M0717r65568
2812A5288284n11420q0149m63991j107213o27864N4358k4609l92521k42840o28043
2802A1263992o43537k01675k75688L9454n26626o21337R7892q49934n07552N73022
2792H348011p30171q05934J55719N54983l08644j51421l19739j76535Q4231n1883
$$ plain form
2854 73960250 73795614 74451271 75666476 76747001 78177476 80159112 82381547 84844536
2846 84844536 85510002 83872207 80573510 75416701 69617186 64034943 58136858 52882189
2838 52882189 48527632 44331389 40985828 38276919 35571452 33739810 31791789 29933571
2830 29933571 29049449 27776310 26550418 25236124 23554959 22875337 22292506 21322952 20660136
2821 20660136 20199194 19976537 18952158 18113271 18242710 17067550 16213135 16253852 15288284
2812 15288284 14776864 14696715 14232724 13125511 12497647 12552005 12527396 12134875 11892035 11263992
2802 11263992 10620455 10418780 10143092 10182546 9655920 9034583 9132475 8282541 7774989 8348011
2792 8348011 7617840 6811906 6967625 7522608 7213964 7062543 6742804 6566269 6650500 6598617
2782F598617m07028m15677j1203K84727n8092n55486L21078j62846j9872n05962
2772E068256M3076M86827m06914j41500K23776n37024m20462K33960k97178j1470
2762D241347J73568j5250m1905n41977n7992j99807k02430Q55901o05644r27715
2752B678096L89064M89128j07037n9650m55882k48667L99729K2390K46053n84545
2742B768679o86210Q46831J70219k28443L2452o99888j53934L67298K50296J99339
2732B866639j04123k93779J97404j97823K38125j88476l78089r4826j16222Q2417
2722B011247m35896j75372P02750Q4757J30961k9493k21228k45790j11459L68731
2712B079208j57140j66092k31868l61842O78162N50054j15849o83800l88143L59830
$$ plain form
2782 6598617 6191589 5775912 5764709 6049436 5991344 5435858 5756936 5594090 5574218 5068256
2772 5068256 5111332 5598159 5191245 5049745 5273521 4736497 4316035 4549995 4252817 4241347
2762 4241347 4414915 4399665 4357760 3815783 3757791 3557984 3355554 4211455 3605811 2678096
2752 2678096 3067160 3556288 3449251 3389601 2933719 2685052 3084781 3107171 3353224 2768679
2742 2768679 2082469 2929300 3099519 2871076 2903528 2203640 2049706 2417004 2667300 2866639
2732 2866639 2762516 2468737 2666141 2468318 2706443 2517967 2139878 2045052 1928830 2011247
2722 2011247 1575351 1399979 2102729 2187486 2318447 2288954 2067726 1821936 1710477 2079208
2712 2079208 1922068 1755976 1524108 1162266 1840428 2390482 2274633 1590833 1202690 1562520
2702A562520Q6173J73524l71056j27942J86665j20447N75927K18415l85208k33809
2692A564762m05869j525J63398j84657j63087j99052j39430K54037k362k31814
2682F54401O0755J78968O2457k64543k37659K92469O5118j29241n2656L86472
2672A016541o6880k05999j05874K09373J72327k11333k20715M75242M75892q7072
2662A451502o84830l4444P2345J38706j524p0453j37588K60969K7036j13748L54748
2651A262719j79247M54237R3705p68215K4733M45678n35955k33822J95524J62805
2641I22162k81185R4709J8716k07085M62276J96479j17632o09533j58494L02549
2631F22962K57559K58920J86082P9427J25304l53832R62l4809j65644J22467k6844
$$ plain form
2702 1562520 1648693 1822217 1451161 1323219 1509884 1389437 1965364 2183779 1798571 1564762
2692 1564762 1158893 1157368 1320766 1136109 973022 773970 634540 888577 886215 654401
2682 654401 715156 894124 956581 692038 454379 746848 811966 682725 630069 1016541
2672 1016541 949661 743662 637788 847161 1019488 808155 587440 1062682 1538574 1451502
2662 1451502 766672 732228 804573 943279 941755 871302 733714 994683 1021719 907971 1262719
2651 1262719 1083472 1537709 1631414 863199 887932 1333610 797655 563833 759357 922162
2641 922162 640977 735686 754402 547317 1009593 1206072 1088440 478907 320413 622962
2631 622962 880521 1139441 1325523 1404950 1530254 1176422 1177384 1142575 976931 1099398 1072554
2620A072554m36634r3026Q25167j66842j37661J83737K06161k68008J22925q1639
2610A226734o11541P26049N69844j30725o37284k53238P90828k38305n16405k11231
2600G14726K75430L15139l24970j64450o6414J10710M79988o9746l5538j90946
2590A043929r8699M7147k27163l83770r3305J49142j75252K07451J8531j25191
2580C62820k00688J72970k69891J23579J82249j69690M52282m75783j14992J98707
2570B61563Q9882N85335r133j09688J59918p1344J90536j37691l14762R7124N36461
2559A278201p6519j77129l66218k01741O1646l67866K62529j42522j31268J35717
2549B74830k29435K857K83441j84419k48790N724N26970k58130l99955j35575
$$ plain form
2620 1072554 635920 542894 1368061 1201219 1063558 1247295 1453456 1185448 1308373 1226734
2610 1226734 615193 1341242 1911086 1780361 1143077 889839 1680667 1442362 925957 714726
2600 714726 990156 1305295 980325 815875 749461 860171 1340159 1270413 1234875 1043929
2590 1043929 945230 992377 765214 381444 288139 437281 262029 469480 488011 362820
2580 362820 162132 335102 65211 188790 371039 201349 653631 177848 62856 261563
2570 261563 351445 936780 927647 817959 977877 906533 1097069 959378 644616 741740 1278201
2559 1278201 1201682 1024553 658335 456594 518240 150374 412903 270381 139113 274830
2549 274830 45395 48252 331693 147274 -101516 -95792 431178 173048 -226907 -362482
2539c62482l0201L66938J07955k22432o50204L87188K02469L28649J00720K2331
2529B50931J53113K11295J12553m26515q32027k623P84856L9896j77357p5879
2519C8243j65846J42745M87373L66393k21982j050662j18206J91716l1360M86318
2509A24732p1294l64148P399J5322O79093l79014l88577M0690m42930L45292L59745
2498g3690j4734j23166M10355M11102l26456K01412m90492l83598N6146J50145
2488a82976M72490m14224l13445M05756L6120k83641O61193j07068j8450k08784
2478D6971k79390L25224m00568L0705K01185J69741J372J10400J17393l66880
2468d3847n36073k17884L10315M8357m03425N91972M75560K70015O7078o24526
$$ plain form
2539 -362482 -392683 -25745 82210 -140222 -790426 -403238 -200769 127880 228600 250931
2529 250931 404044 615339 727892 301377 -530650 -533273 251583 291479 114122 38243
2519 38243 -127603 15142 502515 868908 646926 -403736 -521942 -330226 -361586 124732
2509 124732 53438 -310710 -303311 -287989 391104 12090 -376487 -335797 -778727 -433435 -73690
2498 -73690 -88424 -211590 198765 609867 283411 484823 -5669 -389267 -333121 -182976
2488 -182976 289514 -124710 -438155 -32399 3721 -279920 381273 274205 255755 46971
2478 46971 -232419 92805 -307763 -277058 -75873 93868 95240 205640 323033 -43847
2468 -43847 -579920 -797804 -487489 -439132 -842557 -250585 224975 494990 562068 -62458
2458f2458j18449n1089k17283L99334l65311m7915P30031j97134L75823j07779
2448C37770q21266J06515J63621O33197J08388k81148o6149j53665K60505k75329
2438A2439J60340K03814n47304L667J74059l21233J53484j87638l49676N08908
2428a89140J29624m4693k1831m58132L51794L54466J80898m09752n438j5151n6110
2417a83465O10146k27584n58521N11406J30694l44680J64810N6577k52649N2943
2407d0323j57324j63984M00742m04689J6042O6276N23259J95067m48347R565j26803
2396a30519K23238q5783j10092L48115p3113o1535O15555j61119k89339N13271
2386G88679L59131K85245L50684n8422j36649p5610m24586N131o64440o2804K13722
$$ plain form
2458 -62458 -180907 -231996 -449279 -49945 -415256 -463171 266860 69726 445549 337770
2448 337770 -483496 -376981 -213360 419837 528225 247077 180928 27263 287768 12439
2438 12439 172779 376593 -170711 -167044 7015 -314218 -160734 -348372 -698048 -189140
2428 -189140 -59516 -104209 -126040 -584172 -232378 122088 302986 -106766 -112204 -127355 -183465
2417 -183465 426681 199097 -359424 151982 282676 -62004 102806 159383 -93266 -40323
2407 -40323 -197647 -361631 39111 -365578 -349536 -283260 239999 435066 -13281 -3716 -130519
2396 -130519 92719 6936 -103156 244959 171846 110311 725866 564747 275408 788679
2386 788679 1147810 1433055 1783739 1725317 1588668 1513058 1088472 1093603 429163 366359 580081
2375E80081k09014J31895o3027M45491m02011p88477K50526M81669K66218k81068
2365D12283n05932j71501Q1170K39074Q2560k60186M50562N78240m33460l68819
2355A03991l62455j51654J5722K77128P91275l38120M0707j232q39246M4604j03249
2344e22529k50688N08801L03942K44052N74061R919o49957O7367R3960k96379
2334H2549k413j51706l19138P31036O59184o05197l83479J72131J94618k23737
2324A53848n57566k7518l64312n4671J214619M66192o94792o44900j73947N93179
2314h9868K25843J10610n00732J15637M55674o94510p7394j42950l43804N44872
2304c96622M10582l42762K86277o9389o0857M73828r4522k20387N0874m09893
$$ plain form
2375 580081 371067 502962 439935 885426 483415 -305062 -54536 427133 693351 412283
2365 412283 -93649 -265150 -183980 55094 137654 -122532 328030 906270 472810 103991
2355 103991 -258464 -410118 -394396 -117268 674007 335887 376594 375362 -463884 -419280 -522529
2344 -522529 -773217 -264416 39526 283578 857639 867558 217601 284968 378928 82549
2334 82549 80136 -71570 -390708 340328 999512 394315 10836 182967 377585 153848
2324 153848 -403718 -431236 -795548 -850219 364400 830592 135800 -509100 -683047 -89868
2314 -89868 135975 246585 -254147 -138510 317164 -377346 -454740 -597690 -941494 -396622
2304 -396622 13960 -328802 -42525 -111914 -172771 301057 206535 -13852 37022 -372871
2294c72871p8181K52118N01622o05381J83838M44278k33099O26740N0948j17751
2284F52261k0639n59352K8887j31345J34291J4438K25190L44633j40241J8103
2274E66226k96519n54381K9656M1744l79149j40372k34365K47095P39755R9267
2264A18957p0445P3459j26420L27402l42980k67006K88325j11664K01298J56147
2254B47073m38780k73943k08912L40812N72140P6091N6109m10480L05857M70876
2244G36843l46026l86644l4875M01501m85232J86454m0974l21438J48709j40101
2234b81783M76225l05507l52244N98195L74523k26745k56067M20692k26789K28082
2224D48582K46051r8967L03620k73629L30375J67998K40180L5492l95260p3277
$$ plain form
2294 -372871 -451052 -198934 302688 -302693 -118855 325423 92324 719064 770012 652261
2284 652261 631622 72270 101157 -30188 104103 118541 343731 688364 548123 566226
2274 566226 269707 -284674 -255018 -213274 -592423 -732795 -967160 -720065 19690 118957
2264 118957 48512 121971 -4449 322953 -20027 -287033 1292 -110372 90926 247073
2254 247073 -191707 -465650 -674562 -333750 238390 314481 370590 -39890 265967 736843
2244 736843 390817 4173 -30702 370799 -114433 72021 31047 -290391 -141682 -281783
2234 -281783 194442 -111065 -463309 134886 509409 282664 26597 447289 220500 448582
2224 448582 694633 595666 899286 625657 956032 1124030 1364210 1399702 1004442 931165
2214I31165k86490R7023J62649p3487J47647J90018n27180j55158m4812r8702
2204C42673K06826J69491k0576m27238M44950O05315p17628k9554r7760j75447
2194C01052O56603j2203m46169J32695J97133L50791J4948l90168K19857L97335
2184A421874P841l37249m29291J22406J69786K46600P7530j30288J65101j5209
2174A299101k13050K06285K33920j42958O64927l47974M012p3689k12984j72408
2164A245182K52095K29934L22251j34515k27253N17770J75164j35121k1486J82305
2154B406326j91534M57652m310o20451M32202M05536O7894o5777k66749P49227
2144C370016K11022j3344J38261j78809K73152L48680n2950M15940K86497N58577
$$ plain form
2214 931165 644675 741698 904347 830860 978507 1168525 641345 486187 441375 342673
2204 342673 549499 718990 698414 271176 716126 1321441 603813 574259 476499 301052
2194 301052 957655 945452 499283 631978 829111 1179902 1194850 804682 1024539 1421874
2184 1421874 1429715 1092466 663175 785581 955367 1201967 1279497 1149209 1314310 1299101
2174 1299101 1086051 1292336 1526256 1383298 2048225 1700251 1704263 1630574 1417590 1245182
2164 1245182 1497277 1727211 2049462 1914947 1687694 2205464 2380628 2245507 2224021 2406326
2154 2406326 2214792 2672444 2668134 2047683 2479885 2885421 2953315 2887538 2620789 3370016
2144 3370016 3581038 3567694 3705955 3527146 3800298 4148978 4096028 4511968 4798465 5357042
2134E357042M79712l4437K66229n4139l98885O28955L76548J66496K38151O06469
2124G632141R20133L57981N35724J034058R45421Q07860J123505J671308j31812
2115A4896319j54306J201095K146638K425332L108217L131506M430036N100913
2107C6285750P787692Q774143J0525538J4515784K2257348R573920j6902311k3403528
2099F9414336j9707857j1820094p509131l742810l637929k836845k511840k265121
2091A5382709r39580q28212q00408r7568m98543j207395r96310o41164n23431
2082H850098l20618q72177k25773l93163m29508j142839p3038L57532q08445l21523
2072D620546M76235J46695K6138n86416n50620l07805j000951k23294J78797M87253
$$ plain form
2134 5357042 5836754 5802317 6068546 6014407 5615522 6244477 6621025 6787521 7025672 7632141
2124 7632141 8552274 8910255 9445979 10480037 11425458 12233318 13356823 15028131 14896319
2115 14896319 14742013 15943108 18089746 20515078 23623295 26754801 31184837 36285750
2107 36285750 44073442 52847585 63373123 77888907 100146255 109720175 92817864 69414336
2099 69414336 49706479 37886385 30377254 26634444 22996515 20159670 17647830 15382709
2091 15382709 14443129 13614917 12814509 12716941 12218398 11011003 10014693 9373529 8850098
2082 8850098 8529480 7657303 7431530 7038367 6608859 5466020 5392982 5750514 4942069 4620546
2072 4620546 5096781 5243476 5269614 4683198 4132578 3824773 2823822 2600528 2779325 3266578
2062C266578p671m90454n94212K6357L6326o6796l0519k43663K36090L25191l01160
2051B156067k38113K71083J32660R780j84189L81831j72216m26344n20175j48570
2041A261814K95494N33431Q4307o53152K21435j88056J00234j55331p92643j79373
2031E28160O48775J48944k30667R7622k29630P6536K59520o58826N7393j61154
2021E36673m72518L78737J88344k40462r6688k44752O02941M28324k16860k13523
2011F50216k51182l87246J43477K66479q8642j78592j17729Q5321L27243L09596
2001G58941k90480k19738o52782j87526L60664M33028L33508k69885l4150M06447
1991F38027Q7288l47313m52649l01361K13448n84340M78715K10840J90258J96381
$$ plain form
2062 3266578 3258907 2768453 2174241 2200598 2236924 2170128 2139609 1895946 2132036 2457227 2156067
2051 2156067 1917954 2189037 2321697 2331477 2147288 2529119 2356903 1930559 1410384 1261814
2041 1261814 1557308 2090739 2175046 1521894 1743329 1555273 1655507 1500176 707533 528160
2031 528160 1176935 1325879 1095212 1192834 963204 1039740 1299260 640434 697827 536673
2021 536673 64155 442892 631236 390774 294086 49334 652275 1080599 863739 650216
2011 650216 399034 11788 155265 421744 333102 154510 36781 122102 449345 758941
2001 758941 468461 248723 -404059 -591585 -230921 202107 535615 265730 231580 638027
1991 638027 725315 378002 -74647 -376008 -162560 -746900 -268185 -57345 132913 329294
1981C29294J29008n63578L08206J69412p4980j72764q52753N82657K41483P5944
1971A71929J81158j39999K8280J33675m61935K2162l54408K51557K87353r19403
1961g99631O94167N50050m39229P34205l22184j23604M43547p87446q597m17862
1951d76584P0842P91748r1j02669j23476J19314k86051K364j80589J8243l13439
1940d80388M74579K69973L0848p1676n40847L21690j06399Q8813J81687j83355
1930a5075L83123k61077k85633M07384k16767p8966m77455n2321N04539L43944
1920B51696k65192l43181K31713k70944k3038n5553j02180p439K63773K72339
1910d8006O1495l57436j11261M8049j40576L39058K52440k97537O7554P16809
$$ plain form
1981 329294 458302 -105276 202930 372342 297362 124598 -728155 -145498 95985 171929
1971 171929 353087 213088 241368 375043 -86892 -64730 -419138 -167581 119772 -799631
1961 -799631 -105464 444586 5357 739562 417378 293774 737321 -50125 -58722 -476584
1951 -476584 -405742 386006 385915 283246 159770 279084 -6967 -4603 -185192 -166949 -480388
1940 -480388 -5809 264164 295012 223336 -317511 4179 -102220 -13407 168280 -15075
1930 -15075 368048 106971 -178662 228722 11955 -67011 -544466 -596787 -92248 251696
1920 251696 -13496 -356677 -124964 -395908 -418946 -474499 -576679 -584118 -320345 -48006
1910 -48006 13489 -343947 -455208 -407159 -547735 -208677 43763 -253774 -186220 530589
1900E30589j04056o13689j33491J44387j50326J66068j30929O981N41044L75498
1890F32076K40516l12489p63174k04728j57398K31787M09400l00172R1762o9172
1880b01592k1006L51735K3091j41713k36641l60455L4153n6289K89471O12147
1870B92901K08881m77852k37414K42649l43745l2303k4214K04005L36059j64951
1860D016L2857k28268J78768J9685k27313m29304J6657O19442J67140m60250l8955
1849c45525M27752j02465l10009J77160M16323k73165m63199k55850N81390L88391
1839B40803q3230m55322j85821M13338J39141L53495j75071J10183j89164l72250
1829b03898J13670K05060m94742J81428o6984l14811N68275l98068p388M92858
$$ plain form
1900 530589 426533 -187156 -320647 -176260 -326586 -160518 -291447 -284466 256578 632076
1890 632076 872592 560103 -203071 -407799 -565197 -333410 75990 -224182 -132420 -201592
1880 -201592 -222598 129137 152228 10515 -226126 -586581 -552428 -608717 -319246 292901
1870 292901 501782 23930 -213484 29165 -314580 -346883 -371097 -167092 168967 4016
1860 4016 36873 -191395 -12627 7058 -220255 -649559 -632902 -13460 153680 -306570 -345525
1849 -345525 82227 -20238 -330247 -153087 263236 -9929 -473128 -728978 -147588 240803
1839 240803 157573 -297749 -483570 -70232 68909 422404 247333 357516 168352 -203898
1829 -203898 -90228 114832 -379910 -198482 -265466 -580277 -12002 -410070 -417458 75400
1819G5400j94547l4927j49501l99817J68991Q952K40656L62892j46430O3568O9749
1808F4986j35431N0444K9501J73729N1075k85753L55310J12086m05509J4485K56227
1797B81150n7380k87059l44053k8470n5284M2041N10196K66770k08647J1367r1546
1786C9085m41509j06863L27726o0654N8311K45651l41965l79169K30434P57566
1776C28613l73579k73781k24368j44949K35517N4416k6652K93921K1797K11763
1766A02698j6047l51462n1545P99870j41601n62401j86086k17501m3918M94109
1756a73884k49512l84860L46667O16430k81112j61113L5348J75883L5051p1666
1746a12768j41432J5650j7158P5056j84390m52389N65442m3036k78230O67276
$$ plain form
1819 75400 -119147 -154074 -303575 -703392 -534401 -525449 -284793 78099 -68331 -4763 64986
1808 64986 -70445 -20001 9500 183229 234304 -51449 303861 415947 10438 24923 281150
1797 281150 223770 -63289 -407342 -435812 -491096 -449055 61141 327911 119264 130631 39085
1786 39085 -402424 -509287 -181561 -242215 -183904 61747 -280218 -659387 -428953 328613
1776 328613 -44966 -318747 -543115 -688064 -452547 -398131 -424783 -130862 -109065 102698
1766 102698 86651 -264811 -316356 483514 341913 -220488 -406574 -624075 -667993 -173884
1756 -173884 -423396 -808256 -461589 154841 -126271 -287384 -252036 -76153 -41102 -112768
1746 -112768 -254200 -238550 -255708 -180652 -365042 -817431 -251989 -295025 -573255 94021
1736I4021K87879k71163m51245k06126O72293k48879p9663j00788j11871M02000
1726a3542l47585m8896L80889k55821K89711k67025k0483M31906m67109l65177
1716f83132L98967k2945K55572p1979L7915K8972l91896K18916r2140n36219P09077
1705a48892l46866J81135P16036k98987L68950k1595n06521K8570j35036n83066
1695g46272J62466O7490K79390K48946k25708j77372M39536m6758n10232J19523
1685c88991K97339l96370L04581l55972l8K19129n0013K98911l07173L120O4826
1674c10651J80408K7088Q8372Q9780k38498j133478J41033O49595Q344o8516P5174
1663d91349J45061J11100j3186j13621n70146J55834r0829m9151R10510j47332
$$ plain form
1736 94021 381900 110737 -340508 -546634 125659 -123220 -202883 -303671 -415542 -13542
1726 -13542 -361127 -410023 -29134 -284955 4756 -262269 -282752 149154 -317955 -683132
1716 -683132 -284165 -307110 -51538 -123517 -85602 -56630 -448526 -229610 -321750 -857969 -148892
1705 -148892 -495758 -314623 401413 102426 471376 449781 -56740 -28170 -163206 -746272
1695 -746272 -583806 -516316 -236926 12020 -213688 -391060 48476 1718 -508514 -388991
1685 -388991 -91652 -488022 -183441 -539413 -539451 -320322 -370335 -71424 -378597 -375477 -310651
1674 -310651 -130243 -103155 -14783 74997 -163501 -1296979 -1155946 -506351 -498007 -566523 -491349
1663 -491349 -346288 -235188 -248374 -361995 -932141 -776307 -867136 -916287 -5777 -153109
1653a53109K40325K4107k60791O51082l91386l25144k85235o447O15780r8865
1643A0317m84410L11006K91121K37156n32754l02125q5592J25683Q80572j72636
1633B78338n30882J4212L3496M50139M68353n37696n01960k70348J73601L50614
1623g2133k66632m7912K62288p9083J72761k65770L56555K26722o38697n7847
1613d09748o972l63504N05016N6753l16108O9894r9913j68429J23319K13460L96593
1602C61o0888r967M4337J51048j72353j40110J09563n38895M27708N34395l18323
1591B6876O7998j75382k0989j65726p3081O83833l14847k09496J67556k18034
1581b31292O06147O6672q03806j81091q625J23213p6622K08234R56210j78217
$$ plain form
1653 -153109 87216 111323 -149468 501614 110228 -214916 -500151 -506598 109182 10317
1643 10317 -474093 -163087 128034 365190 -167564 -469689 -555281 -429598 450974 278338
1633 278338 -252544 -238332 -204836 245303 713656 175960 -326000 -596348 -422747 -72133
1623 -72133 -338765 -386677 -124389 -203472 -30711 -296481 60074 286796 -351901 -409748
1613 -409748 -416720 -780224 -275208 -218455 -534563 -464669 -564582 -733011 -609692 -396232 361
1602 361 -60527 -70494 -26157 124891 -47462 -187572 -78009 -616904 -189196 345199 26876
1591 26876 94874 -80508 -101497 -267223 -340304 343529 28682 -180814 -13258 -231292
1581 -231292 374855 441527 -362279 -543370 -551995 -428782 -505404 -297170 659040 480823
1571D80823p80812o51280N61424N57513o70643j78884M85483j82980J41357M64654
1561B26655m36261J57216J72722o5794k2078l27407M5002K56475K54435K8269
1551B89234n65325n2636O9201l3522N7520J84205L36223J47062n739p48973k17378
1540e40128L23438J0896O4990m74639k68988J77239J61972j44357k19172O10692
1530b98057M95419j76686J34236k66485m75642K74017k9254J54927j37033K19032
1520a05526K64067l42691K58182J10886o8052m53780l07324O62050j7782j92216
1510a92186J56347j67174K19943l22973j20109m0126J89720L93844K02273k72579
1500D6980m17345Q4375n0820n6879L26041j83036j29507L92314k192r8660j99015
$$ plain form
1571 480823 -299989 -951269 -389845 167668 -502975 -681859 -196376 -379356 -237999 226655
1561 226655 -209606 -52390 120332 54538 32460 -294947 -249945 6530 260965 289234
1551 289234 -276091 -328727 -259526 -293048 -235528 -51323 284900 431962 426223 -322750 -540128
1540 -540128 -216690 -205794 -140804 -615443 -884431 -707192 -545220 -689577 -908749 -298057
1530 -298057 197362 20676 154912 -111573 -587215 -313198 -342452 -187525 -324558 -105526
1520 -105526 158541 -184150 74032 184918 116866 -336914 -644238 17812 30 -192186
1510 -192186 -35839 -203013 16930 -306043 -426152 -466278 -276558 117286 319559 46980
1500 46980 -370365 -285990 -336810 -393689 -67648 -250684 -380191 12123 9931 -88729 -287744
1489b87744Q914J13527N0988J3592K71067L41502m46421j60465j24977j2805L62825
1478A30003j43568k26302L15947M2505j23807m6474l59963L75242N1243l36542
1468c21716L33563l44456J89823M44840m35413k42964o51169K12133O33122k05466
1458c87703m87001j21735K32214L46080N6363j22271M97267J0754k77322k3894
1448b77248j50614K85282k64259K79083J32441K09970k77942l30056M18319n21081
1438d96105N48946p8607o96182M31779O39817l36127q1155O7447m03489k87953
1428f91629j54492L36853L36876P870K17496K02660j75042m91354P1402j9827
1418c59187L00520L67510k53210p47252j70178M05472K74653K02132k94960m90746
$$ plain form
1489 -287744 -278830 -165303 -114315 -100723 170344 511846 65425 -95040 -220017 -232822 130003
1478 130003 -13565 -239867 76080 118585 -5222 -51696 -411659 -36417 14826 -321716
1468 -321716 11847 -332609 -142786 302054 -133359 -376323 -1027492 -815359 -182237 -387703
1458 -387703 -874704 -996439 -764225 -418145 -361782 -484053 13214 23968 -253354 -277248
1448 -277248 -427862 -142580 -406839 -127756 4685 214655 -63287 -393343 24976 -496105
1438 -496105 52841 -25766 -721948 -290169 349648 13521 -67634 -187 -403676 -691629
1428 -691629 -846121 -509268 -172392 -164522 52974 255634 80592 -410762 -339360 -359187
1418 -359187 -58667 308843 55633 -691619 -861797 -456325 -181672 20460 -274500 -765246
1408g65246K97832Q09623J44721k15715m26619K40975l72469m72261K48627L56070
1398a54462J65705M29051N6610m75864j92983J04748K77609l75295k87528L63632
1388h8777j37927M8921L24471j85950K19077L46997m89685m84512J94656K04169
1378d8560J38666m51754j75085L99933j07571L10782r5823l99120N9316J35366
1368b33850N71274k74585P5365J78742m6694K44848k72674M2770k76923n00438
1358d92165O35188k2444n41825N86138j63914r4873O3761j87141j40528n29114
1348h86917M72110M98866j56416K05120k42014n04997L03676o3968N02123k42156
1338a14573J83609J68977n63739J37219L56215Q436n10462j52647M09207l86008
$$ plain form
1408 -765246 -467414 342209 486930 271215 -155404 85571 -286898 -759159 -510532 -154462
1398 -154462 11243 440294 496904 21040 -171943 -67195 210414 -164881 -452409 -88777
1388 -88777 -226704 -177783 146688 -39262 179815 526812 37127 -447385 -252729 -48560
1378 -48560 90106 -361648 -536733 -136800 -244371 66411 -29412 -428532 -369216 -233850
1368 -233850 337424 62839 138204 316946 270252 515100 242426 285196 8273 -492165
1358 -492165 143023 120579 -421246 164892 978 -93895 -30134 -217275 -357803 -886917
1348 -886917 -414807 84059 -72357 132763 -109251 -614248 -310572 -374540 127583 -114573
1338 -114573 69036 238013 -325726 -188507 167708 176144 -334318 -486965 -77758 -463766
1328d63766l64001R15156l66275m09815J45867R3674r5021J17586K0978K53225
1318a52392l46476p18999M36000j0986n2958N88350k80607j94077L27163L90023
1308a4959J77541j83295M48022k28846j043720M54697j24931K15523k64392m15372
1298i79732P84778n39O5719M94988l63727j92168K15711l3635k17896r1623K18878
1287i9246K78590o319O51432o26481l24318L77825Q327L0755l38836K77898O47229
1276H76856m83813m51155m58404K18306j21872l77537O01159k68207K01412l075
1266b66330N38157j13023m51245l23843L43610K79187K7052j23549p55187J46572
1256f98599N44032l42532J99076J56899K30954j83899N42789M74577o02915k56410
$$ plain form
1328 -463766 -827767 87389 -278886 -688701 -542834 -449160 -544181 -426595 -405617 -152392
1318 -152392 -498868 -1217867 -781867 -792853 -845811 -257461 -538068 -732145 -404982 -14959
1308 -14959 162582 -20713 427309 198463 -845257 -390560 -515491 -299968 -564360 -979732
1298 -979732 -194954 -195493 -129774 365214 1487 -190681 25030 -8605 -226501 -318124 -99246
1287 -99246 179344 173025 824457 197976 -126342 251483 259810 290565 -48271 229627 876856
1276 876856 393043 -58112 -516516 -298210 -420082 -797619 -196460 -464667 -263255 -266330
1266 -266330 271827 158804 -292441 -616284 -272674 6513 33565 -89984 -845171 -698599
1256 -698599 -154567 -497099 -298023 -141124 89830 -94069 448720 923297 320382 63972
1246F3972l03929Q553J35702J62970p0820K756M06856K82939O3673n74817l36201
1235a58346K23126K79283j53144m16742j38455K80017K8613J46650Q856k90029
1225a90171L31714K04887j16524j62764j070697M2631L44397M09716n3239j74955
1215d35005O99804o7208k41976L8288n8754R6766k52953M61130N40523n83481
1205A97134j81836N8326K172K06747j18906k29943n6400m108L62493K56738n78299
1194h5882k80976K11940K49431L26003l34967J28243n28830j25272L40816k98360
1184c97854L8707n84106q2332M30793J50470L53638k30737j62306o2486j35079
1174f81292M90487m1059J19032O8691k71608L43893j61578l3814J1425M98562
$$ plain form
1246 63972 -239957 -231404 -95702 67268 -3552 -796 406060 688999 752672 177855 -158346
1235 -158346 64780 344063 190919 -225823 -364278 -84261 -55648 91002 99858 -190171
1225 -190171 141543 346430 229906 67142 -1003555 -960924 -616527 -206811 -260050 -435005
1215 -435005 264799 197591 -44385 -6097 -64851 31915 -221038 240092 780615 197134
1205 197134 15298 73624 75796 282543 163637 -66306 -122706 -126814 235679 492417 -85882
1194 -85882 -366858 -154918 94513 420516 85549 213792 -315038 -440310 -99494 -397854
1184 -397854 -359147 -943253 -1025585 -594792 -444322 -90684 -321421 -483727 -546213 -681292
1174 -681292 -190805 -231864 -112832 -44141 -315749 28144 -133434 -167248 -155823 342739
1164C42739k24882J19317l99312n82915M60290L40481j68743q025l79218J16328
1154c83940M88052L66517j97462l20997l03014J21098K07149J64838K25497j31718
1144B36020j58728j43056L512J15053J39657j3955l85992K84192j77534n08364
1134f09195N42148P376K18823K49030n86026l6287L89883Q3113j91374k8849k09689
1123a71047j33960L22400O5724L7905m4436r3683L07017P1156l79195k22784l1651
1112b72554L53629l40503K76618o0699n8727L26718l16724l49304L9175J51750
1102b50621L60337l8030J75923L32016l98770k01632j66774j20604Q00688o26175
1092a33642q115K46949j00118M74415j79167n9230j66623r4559J50184l91604
$$ plain form
1164 342739 117857 237174 -162138 -745053 -284763 55718 -113025 -121050 -500268 -383940
1154 -383940 104112 470629 273167 -47830 -350844 -229746 -22597 142241 367738 236020
1144 236020 77292 -65764 -62252 52801 192458 178503 -207489 76703 -100831 -609195
1134 -609195 -67047 -59671 159152 408182 -177844 -214131 175752 258865 67491 38642 -171047
1123 -171047 -305007 17393 83117 121022 76586 -17097 289920 361076 -18119 -240903 -272554
1112 -272554 81075 -259428 17190 -43509 -102236 224482 -92242 -441546 -402371 -250621
1102 -250621 109716 71686 247609 579625 180855 -20777 -187551 -308155 492533 -133642
1092 -133642 -141757 105192 5074 479489 300322 241092 74469 -20090 130094 -261510
1082b61510k49955K81908r2353J21269J22431l07323L40738R6343l39936k29350
1072e17738j11984M33173J74410l46483O66156J26659m48353J27687j29811j28026
1062a54310K84030N1318k41598J79090J35250L233J37892n30174m18456l65604
1052i19329J91762P79554Q1159l22482m5449N00738l80325k01124J51826k08773
1042c72443J54216R0617L13461K81453l97543J921m19327M10975j90548k50871
1032c78089j66122m56050N87297N03004j38492k749p15484M843P67302M86483
1022D91943L53651p07323l11642J70525L32570J29428l42515k69792L46356J67212
1012C60413j25612J41992l4803m11491L87129L7681k95924j12430l3076J75393
$$ plain form
1082 -261510 -511465 -229557 -321910 -200641 -78210 -385533 -44795 51548 -288388 -517738
1072 -517738 -629722 -196549 -22139 -368622 297534 424193 -24160 103527 -26284 -154310
1062 -154310 129720 181038 -60560 118530 253780 257013 394905 -135269 -553725 -919329
1052 -919329 -727567 51987 133146 -189336 -234785 265953 -114372 -315496 -163670 -372443
1042 -372443 -218227 -127610 185851 467304 69761 71682 -347645 63330 -127218 -378089
1032 -378089 -544211 -1000261 -412964 90040 -48452 -51201 -766685 -761842 5460 491943
1022 491943 845594 138271 -173371 -2846 329724 459152 116637 -153155 193201 360413
1012 360413 234801 376793 341990 -69501 317628 355309 59385 -53045 -86121 89272
1002H9272K18705m10572l1976M05488m09928J37074J62474m07616k93549K01390
992c39238R5687k39651L0102O35977o95304k32701K18029N61793J49337n34837
982c50806k85519N16816N39177j92685K13465k09353r27627K50070J063924j52568
972D64894m23784K53104j16402l62982N97746K85457k55865m50179k56323n7246
962c21580p5983l3052K09442J14640J28354M85714K15911m35497k85572j38499
952a36122M16270j93581p61594J27993N53397o4198M04882j9704q1442Q9357l89189
941e3931j26767n42982J94024M29419Q7218R7374K24835l8038m86054j40065P7269
930b77698J60115N79649K50196m35495n08545k62104L76190o5604K6006J57901
$$ plain form
1002 89272 307977 -102595 -134571 270917 -139011 -1937 160537 -247079 -540628 -339238
992 -339238 -243551 -483202 -453100 182877 -512427 -745128 -527099 34694 184031 -350806
982 -350806 -636325 -119509 419668 226983 440448 231095 -696532 -446462 617462 464894
972 464894 41110 294214 177812 -185170 412576 698033 442168 -8011 -264334 -321580
962 -321580 -397563 -430615 -221173 -106533 21821 507535 723446 287949 2377 -136122
952 -136122 280148 86567 -675027 -547034 6363 -57835 347047 327343 245901 335258 -53931
941 -53931 -180698 -723680 -529656 -100237 -13019 84355 309190 271152 -214902 -354967 -277698
930 -277698 -117583 462066 712262 276767 -231778 -493882 -117692 -183296 -157290 611
920F11n4720O44375l45409j81967M42388n83891Q7127j22115m33507M36177J01239
909i692r4188N74848k28364p086m36663K13142N67883p75027M9894J54677l78416
898c68992N20877N3108j10530K93962l75712L02822k85060j04351K13307l46093
888b06662J10352K78888k63521j83909J70075J15182j80702k89591R161N4842
878c85885J59501r2914N68315M31311m32380p4573m42403K63007j10139J3100
868a03060l4L17923N85870k33839m29017l73622L48944J98349J71536k33295m09013
857a59258K16754j05227J16473J36038J9952J26950j82646p3073l36845M2097
847a98785M637j37190N32682p0461J02696J12708l36089J32670J25393j90157
$$ plain form
920 611 -54109 590266 244857 62890 505278 -78613 8514 -113601 -547108 -110931 -9692
909 -9692 -103880 470968 242604 235518 -201145 11997 579880 -195147 -145253 9424 -368992
898 -368992 151885 204993 94463 388425 12713 315535 30475 -73876 139431 -206662
888 -206662 -96310 182578 -80943 -264852 -94777 20405 -160297 -449888 -440727 -385885
878 -385885 -226384 -319298 249017 680328 247948 173375 -269028 -6021 -116160 -103060
868 -103060 -103094 214829 800699 566860 137843 -235779 113165 311514 483050 249755 -159258
857 -159258 57496 -47731 68742 204780 224732 351682 169036 95963 -240882 -198785
847 -198785 -194148 -331338 201344 130883 233579 346287 10198 142868 268261 78104
837G8104n16879k7718J56607K02350q1918L46434j92118j62463j70557m42252
827h10410Q81802J80984J46125P3613n77775m8296J91204J53095l5681J24174
817B78835m12243o51547R10570J55705j18095J63487J64696O0481j36684p60483
807c45278K15626N31099q73921Q157Q68722m19702K05486K93488m46480M37190
797D74387K52441l82529k9085K22367o71617o26677N32188N41891P5810L06416
787F95592p50160p4766J17737k38467L74956K33048M1955l88606l48918J71738
777a65891M92227K88853k83030l69281k39795K04127j13249J41582N20914m29060
767D7397M54326l30388j10528N86575k14114K19263p42717j34642L38113m72359
$$ plain form
837 78104 -438775 -466493 -309886 -107536 -189454 156980 -35138 -197601 -368158 -810410
827 -810410 71392 252376 398501 472114 -105661 -153957 37247 190342 154661 278835
817 278835 -133408 -784955 125615 281320 163225 326712 491408 551889 415205 -345278
807 -345278 -129652 401447 -472474 -464317 404405 -15297 190189 483677 37197 474387
797 474387 726828 344299 315214 537581 -134036 -760713 -228525 313366 389176 695592
787 695592 -54568 -129334 -11597 -250064 124892 357940 399895 11289 -337629 -165891
777 -165891 326336 615189 332159 -37122 -276917 -72790 -186039 -44457 476457 47397
767 47397 501723 171335 60807 647382 433268 652531 -90186 -224828 113285 -359074
757c59074J37096O40904J10632j90661o99758L90941o7353o81178L25836J43113
747b49502N879j6753m51980N00811N33747K37989j81256q47967J13752Q46292
737D91012J12886n29788m33991K07509l3618L09000K13163l451R8391k49677m293
726A77143K48716q837o54108k50844J39378J33636L53055L6507o6497M22263O9968
715F00380n28274l39988N02957J45284j84369j14564K33171L94338m82073K31063
705D57925K12890n85194j44532J07203J10778O2231K51470j90951l08055K05552
695A79317J3718m04909K92801N6474L7149k81155k43134K62371q9811P9699j6201
684a13681N3023K75342K48824K67041o12042j55974L30980J52810p40414j6964
$$ plain form
757 -359074 -221978 418926 529558 338897 -360861 30080 -37273 -718451 -392615 -249502
747 -249502 -243623 -260376 -712356 -211545 322202 560191 378935 -469032 -355280 491012
737 491012 603898 74110 -359881 -152372 -185990 123010 336173 332722 431113 181436 177143
726 177143 425859 417022 -237086 -487930 -348552 -214916 138139 174646 108149 530412 600380
715 600380 72106 -267882 235075 380359 195990 81426 314597 708935 226862 457925
705 457925 670815 85621 -58911 48292 159070 221301 472771 281820 -26235 179317
695 179317 193035 -211874 80927 137401 174550 -106605 -349739 -87368 -177179 -97480 -113681
684 -113681 -60658 214684 463508 730549 118507 -37467 293513 446323 -294091 -311055
674c11055P72910l65929k62800M15420n05526K56208M05281o24500j21685O39637
664B97961J17021R2683j89035l77163n76246l70295O95998p3128m3164j10039
654e35407L27047N90821k71890l22759J8047P6038L55858J23768K9421l02523
644H8421l84875K71919k24824K75097L08260j86147j7493j95077J89008q4701
634C9588J44472k1189k35897l5486M21548m10017J19532N20349O5264K471k99586
623C11049j83622P8799p60609J81573K05159j06949J66820J70189l5628l24017
613b97236J3089M81540p4734l23109K86936j3420K70490q3509n03378K24172N4407
602C5248J87649J83361o47939K82679J32839L47746M81036l75349o93365P1612
$$ plain form
674 -311055 461855 95926 -166874 248546 -256980 -772 404509 -219991 -341676 297961
664 297961 414982 507665 318630 -58533 -634779 -1005074 -309076 -382204 -425368 -535407
654 -535407 -208360 382461 110571 -212188 -194141 -118103 237755 361523 390944 88421
644 88421 -296454 -24535 -249359 25738 333998 147851 130358 -64719 124289 39588
634 39588 184060 162871 -73026 -108512 313036 -96981 22551 542900 608164 610635 311049
623 311049 127427 206226 -554383 -372810 -167651 -274600 -107780 62409 26781 -297236
613 -297236 -284147 197393 122659 -200450 86486 73066 343556 260047 -243331 -19159 35248
602 35248 222897 406258 -241681 40998 173837 521583 1002619 627270 -66095 5517
592E517l02750n1284O43362K49268n58100k89595L77218K23272M76591o53856
582A19643o367N15039n19699J97677k51629J83687M48624J9699j09244K1381l46054
571B72757k2150k47087L13370L12457o00901J49615J22018k00173P74776k30515
561F44167k75732K19448k27992k9287q12247L61701O18016j10788q1603m14971
551a09288L0716j29323l22828J84450N88594m93768r6324J15830m83494N80108
541a35327K6523K5355k04451m15559M42415J60651J01866J1347J26369P5168k208
530B12149O4137k47912K96330P1307o25490k69941N01527K31348j7873l81797
520a66215L45299P20400J04802m80067p5401m99677K21176J99077k33940k68070
$$ plain form
592 5517 -297233 -348517 294845 544113 -13987 -303582 73636 296908 773499 119643
582 119643 113276 628315 108616 306293 54664 238351 686975 706674 597430 618811 272757
571 272757 250607 3520 316890 629347 28446 178061 300079 99906 874682 644167
561 644167 368435 587883 359891 330604 -481643 -119942 498074 387286 305683 -109288
551 -109288 -78572 -207895 -530723 -346273 242321 -251447 -347771 -231941 -715435 -135327
541 -135327 -108804 -83449 -287900 -703459 -261044 -100393 1473 12820 139189 214357 212149
530 212149 276286 28374 324704 396011 -229479 -499420 2107 233455 215582 -166215
520 -166215 179084 899484 1004286 524219 448818 -50859 170317 369394 135454 -132616
510a32616p375Q18896l92925l71645P86222j82805k87026j53924l27424J94584
500e6038O86388l2316l91348n05834M22429J61548N8107q6722k48181M51097o2653
489C96477j48551J38815l55952k48083R4471J7574N92662j17665k30169o5791
479G3788J01888K96083o98374j05054M05776o498N16601m85418k70361L33303
469A61734j6305L37807m50575r4812K46758l39464J51066j85184q1222P44089
459D73892P8982K4482N6109o48509L02256L38628j77194K57580K61845m70824
449D97247o55249J80709N41712j97256l73452l97202O8241K78572P30131K18247
439H91700l64051m48422P9259K08325K44892k83336o48409J32929L62679m20643
$$ plain form
510 -132616 -139991 678905 285980 -85665 700557 517752 230726 76802 -250622 -56038
500 -56038 630350 598034 206686 -299148 123281 284829 342936 256214 8033 459130 396477
489 396477 247926 386741 30789 -217294 -122823 -105249 487413 369748 139579 73788
479 73788 175676 471759 -226615 -331669 74107 67609 584210 98792 -171569 161734
469 161734 145429 483236 32661 -62151 184607 -154857 -3791 -188975 -270197 473892
459 473892 552874 577356 633465 -15044 287212 625840 448646 706226 968071 497247
449 497247 -158002 22707 564419 367163 -6289 -403491 -335250 -56678 673453 891700
439 891700 527649 79227 158486 366811 611703 328367 -320042 -187113 175566 -245077
429b45077N69491K89367l86525l92650J96230Q8416J24803Q6463N9002r5605l1539
418B62376k59035j88828J61106J29331j8711k47784L44216K10124k95626J02053
408A99222J7702k91569L5316n59380J0512M75669J50421j99396J31630J60933
398A31060P34066M85412j028635r82364m104O31470L15273j14681j33134j11590
388g7227P44368m8633p99481j03615L50954O9994L20179k48972k86041J12519
378C4045k38748J408O3886m9863L57806j3917J72099J6601o22943J76895L32763
$$ plain form
429 -245077 324414 613781 227256 -165394 30836 119252 244055 330518 389520 293915 262376
418 262376 3341 -185487 -24381 104950 86239 -161545 182671 392795 97169 199222
408 199222 216924 -74645 -39329 -598709 -588197 -112528 37893 -161503 -29873 131060
398 131060 865126 1350538 321903 -660461 -664565 -33095 282178 167497 34363 -77227
388 -77227 667141 618508 -180973 -284588 66366 136360 456539 207567 -78474 34045
378 34045 -204703 -203295 -139409 -189272 168534 154617 326716 343317 -279626 -102731 230032
$$ [...]
##END NTUPLES=NMR SPECTRUM
##END=
