##TITLE=1H_30-22
 CDCl3
 8 sc, 
 7.06.2022
##JCAMPDX= 6.0         $$ Bruker NMR JCAMP-DX V2.0
##DATA TYPE= NMR FID
##DATA CLASS= NTUPLES
##ORIGIN= UXNMR, Bruker Analytische Messtechnik GmbH
##OWNER= root
$$ XWIN-NMR		Version 3.5
$$ Tue Jun  7 14:03:24 2022 Russian Standard Time (UT+4h)  she@DPX200
##.OBSERVE FREQUENCY= 200.13135
##.OBSERVE NUCLEUS= ^1H
##.DELAY= (6, 6)
##.ACQUISITION MODE= SIMULTANEOUS
##.ACQUISITION SCHEME= undefined
##.AVERAGES= 8
##.DIGITISER RES= 18
##SPECTROMETER/DATA SYSTEM= spect
##.PULSE SEQUENCE= zg30
##.SOLVENT NAME= CDCl3
##.SHIFT REFERENCE= (INTERNAL, CDCl3, 0, 15.7039)
##AUDIT TRAIL= $$ (NUMBER, WHEN, WHO, WHERE, WHAT)
$$ ##TITLE= Audit trail, XWIN-NMR		Version 3.5
$$ ##JCAMPDX= 5.01
$$ ##ORIGIN= Bruker BioSpin GmbH
$$ ##OWNER= she
$$ F:/spectra/data/she/nmr/H-F/1/audita.txt
$$ ##AUDIT TRAIL=  $$ (NUMBER, WHEN, WHO, WHERE, WHAT)
(   1,<2022-06-07 14:02:07.60 +0400>,<she>,<DPX200>,
      <created by zg, POWCHK disabled, PULCHK disabled
       configuration hash MD5:
       00 E9 B6 7A A2 85 ED C7 34 08 36 98 17 FE 4E 26
       data hash MD5: 16K
       15 4E 81 A0 49 16 C9 6B 20 77 F3 50 22 17 B4 59>)
$$ ##END=
$$ 
$$ hash MD5
$$ C7 43 77 7A AF 89 90 0D BB 9F 55 46 78 CC DD C0
##$RELAX= 
##$RELAX= 
##$RELAX= 
##$RELAX= 
##$RELAX= 
##$RELAX= 
$$ Bruker specific parameters
$$ --------------------------
##$DU= <F:/spectra>
##$EXPNO= 1
##$NAME= <H-F>
##$PROCNO= 1
##$TYPE= <nmr>
##$USER= <she>
##$AMP= (0..31)
100 100 100 100 100 100 100 100 100 100 100 100 100 100 100 100 100 100 
100 100 100 100 100 100 100 100 100 100 100 100 100 100 
##$AQSEQ= 0
##$AQ_mod= 1
##$AUNM= <au_zg>
##$AUTOPOS= <>
##$BF1= 200.13
##$BF2= 200.13
##$BF3= 200.13
##$BF4= 200.13
##$BF5= 200.13
##$BF6= 200.13
##$BF7= 200.13
##$BF8= 200.13
##$BYTORDA= 1
##$CFDGTYP= 0
##$CFRGTYP= 5
##$CHEMSTR= <none>
##$CNST= (0..31)
1 1 145 1 1 1 1 1 1 1 1 1 1 1 1 1 1 1 1 1 1 1 1 1 1 1 1 1 1 1 1 1 
##$CPDPRG= <>
##$CPDPRG1= <>
##$CPDPRG2= <>
##$CPDPRG3= <>
##$CPDPRG4= <mlev>
##$CPDPRG5= <mlev>
##$CPDPRG6= <mlev>
##$CPDPRG7= <mlev>
##$CPDPRG8= <mlev>
##$CPDPRGB= <>
##$CPDPRGT= <>
##$D= (0..31)
0 1.2 0 0 0 0 0 0 0 0.06 0 0.03 0 0 0 0 0.0002 0 0 0 0 0 0 0 0 0 0 0 0 
0 0 0 
##$DATE= 1654596126
##$DBL= (0..7)
120 120 120 120 120 120 120 120 
##$DBP= (0..7)
150 150 150 150 150 150 150 150 
##$DBP07= 0
##$DBPNAM0= <>
##$DBPNAM1= <>
##$DBPNAM2= <>
##$DBPNAM3= <>
##$DBPNAM4= <>
##$DBPNAM5= <>
##$DBPNAM6= <>
##$DBPNAM7= <>
##$DBPOAL= (0..7)
0.5 0.5 0.5 0.5 0.5 0.5 0.5 0.5 
##$DBPOFFS= (0..7)
0 0 0 0 0 0 0 0 
##$DE= 6
##$DECBNUC= <off>
##$DECIM= 32
##$DECNUC= <off>
##$DECSTAT= 4
##$DIGMOD= 1
##$DIGTYP= 9
##$DL= (0..7)
0 120 120 120 120 120 120 120 
##$DP= (0..7)
150 150 150 150 150 150 150 150 
##$DP07= 0
##$DPNAME0= <>
##$DPNAME1= <>
##$DPNAME2= <>
##$DPNAME3= <>
##$DPNAME4= <>
##$DPNAME5= <>
##$DPNAME6= <>
##$DPNAME7= <>
##$DPOAL= (0..7)
0.5 0.5 0.5 0.5 0.5 0.5 0.5 0.5 
##$DPOFFS= (0..7)
0 0 0 0 0 0 0 0 
##$DQDMODE= 0
##$DR= 18
##$DS= 0
##$DSLIST= <SSSSSSSSSSSSSSS>
$$ [...]
##$SUBNAM2= <"">
##$SUBNAM3= <"">
##$SUBNAM4= <"">
##$SUBNAM5= <"">
##$SUBNAM6= <"">
##$SUBNAM7= <"">
##$SUBNAM8= <"">
##$SUBNAM9= <"">
##$SW= 18.05172834244
##$SWIBOX= (0..15)
0 0 2 0 0 0 0 0 0 0 0 0 0 0 0 0 
##$SW_h= 3612.71676300578
##$TD= 16384
##$TD0= 1
##$TE= 0
##$TE2= 300
##$TE3= 300
##$TEG= 300
##$TL= (0..7)
0 120 120 120 120 120 120 120 
##$TP= (0..7)
150 150 150 150 150 150 150 150 
##$TP07= 0
##$TPNAME0= <>
##$TPNAME1= <>
##$TPNAME2= <>
##$TPNAME3= <>
##$TPNAME4= <>
##$TPNAME5= <>
##$TPNAME6= <>
##$TPNAME7= <>
##$TPOAL= (0..7)
0.5 0.5 0.5 0.5 0.5 0.5 0.5 0.5 
##$TPOFFS= (0..7)
0 0 0 0 0 0 0 0 
##$TUNHIN= 0
##$TUNHOUT= 0
##$TUNXOUT= 0
##$USERA1= <user>
##$USERA2= <user>
##$USERA3= <user>
##$USERA4= <user>
##$USERA5= <user>
##$V9= 5
##$VALIST= <valist>
##$VCLIST= <CCCCCCCCCCCCCCC>
##$VD= 0
##$VDLIST= <DDDDDDDDDDDDDDD>
##$VPLIST= <PPPPPPPPPPPPPPP>
##$VTLIST= <TTTTTTTTTTTTTTT>
##$WBST= 1024
##$WBSW= 4
##$XGAIN= (0..3)
0 0 0 0 
##$XL= 0
##$YL= 0
##$YMAX_a= 524368
##$YMIN_a= -405604
##$ZGOPTNS= <>
##$ZL1= 120
##$ZL2= 120
##$ZL3= 120
##$ZL4= 120
##$ABSF1= 10
##$ABSF2= 0
##$ABSG= 5
##$ABSL= 3
##$ALPHA= 0
##$AQORDER= 0
##$ASSFAC= 0
##$ASSFACI= 0
##$ASSFACX= 0
##$ASSWID= 0
##$AUNMP= <proc_1d>
##$AZFE= 0.1
##$AZFW= 0.1
##$BCFW= 1
##$BC_mod= 2
##$BYTORDP= 1
##$COROFFS= 0
##$CY= 11.3945322036743
##$DATMOD= 1
##$DC= 2
##$DFILT= <>
##$DTYPP= 0
##$F1P= 2.36226072786647
##$F2P= -0.459571619588291
##$FCOR= 0.5
##$FTSIZE= 0
##$FT_mod= 4
##$GAMMA= 1
##$GB= 0.15
##$INTBC= 1
##$INTSCL= 1
##$ISEN= 128
##$LB= 0.24
##$LEV0= 0
##$LPBIN= 0
##$MAXI= 10000
##$MC2= 0
##$MEAN= 0
##$ME_mod= 0
##$MI= 1.114404
##$NCOEF= 0
##$NC_proc= 0
##$NLEV= 6
##$NOISF1= 3.799351
##$NOISF2= 2.8
##$NSP= 1
##$NTH_PI= 0
##$NZP= 0
##$OFFSET= 15.70392
##$PC= 1
##$PHC0= -18028.93
##$PHC1= 9.200741
##$PH_mod= 1
##$PKNL= yes
##$PPARMOD= 0
##$PSCAL= 0
##$PSIGN= 0
##$REVERSE= no
##$SF= 200.130013532006
##$SI= 16384
##$SIGF1= 3
##$SIGF2= 2
##$SINO= 400
##$SIOLD= 16384
##$SREGLST= <1H.CDCl3>
##$SSB= 0
##$STSI= 0
##$STSR= 0
##$SW_p= 3612.71676300578
##$SYMM= 0
##$S_DEV= 0
##$TDeff= 0
##$TDoff= 0
##$TI= <>
##$TILT= no
##$TM1= 0
##$TM2= 0
##$TOPLEV= 0
##$USERP1= <user>
##$USERP2= <user>
##$USERP3= <user>
##$USERP4= <user>
##$USERP5= <user>
##$WDW= 1
##$XDIM= 8192
##$YMAX_p= 0
##$YMIN_p= 0
$$ End of Bruker specific parameters
$$ ---------------------------------
##NTUPLES= NMR FID
##VAR_NAME=  TIME,          FID/REAL,        FID/IMAG
##SYMBOL=    X,             R,               I
##VAR_TYPE=  INDEPENDENT,   DEPENDENT,       DEPENDENT
##VAR_FORM=  AFFN,          ASDF,            ASDF
##VAR_DIM=   8192,          8192,            8192
##UNITS=     SECONDS,       ARBITRARY UNITS, ARBITRARY UNITS
##FACTOR=    0.0002768,     1,               1
##FIRST=     0,             0,               0
##LAST=      2.2672688,     0,               0
##MIN=       0,             -405604,         0
##MAX=       2.2672688,     524368,          0
$$ Real data points
##PAGE= N=1
##DATA TABLE= (X++(R..R)), XYDATA
0 0 0 0 0 0 0 0 0 0 -8 8 -8 8 -16 16 -24 24 -32 40 -48 64 -72 88 -104 121 -144 168 -197 225 -262 300 -343
31 -343 390 -445 503 -568 640 -720 808 -901 1006 -1122 1245 -1383 1531 -1694 1871 -2065
47 -2065 2279 -2511 2767 -3046 3357 -3698 4081 -4509 4989 -5535 6161 -6887 7741 -8763
61 -8763 10009 -11572 13596 -16335 20261 -26396 37410 -63394 259639 60366 -80955 524368
73 524368 92428 -109423 289412 145375 -255824 23589 34439 -318210 -162809 101603
83 101603 -172339 -195013 36957 -17227 -89019 38215 135260 160300 59082 78739 161890
94 161890 46563 51181 183961 12758 -73099 93081 -22171 -227115 -13859 97357 -165689
105 -165689 -126915 73359 -120936 -139010 100492 -6957 -75237 93294 6369 -97955 35345
116 35345 74074 -12038 -15376 38577 19719 -49813 -38866 27544 37624 -12721 -15215 10639
128 10639 -54718 -38022 56358 -44163 -59420 78889 -53767 -137860 53163 25958 -80634
139 -80634 40660 48677 -58668 14796 66459 -17126 42250 113413 -18967 -27176 71596 -17738
151 -17738 -28522 47849 -38862 -38244 13429 -87642 -61237 42920 -25419 -43405 38918 -2327
163 -2327 -40731 48942 46049 -13494 69845 57428 -62384 17720 59388 -52510 -7499 35612
175 35612 -55903 -43724 -8598 -49857 -28173 15269 -12126 -32466 1911 8620 -10791 17127
187 17127 29091 15089 21995 -7289 -8051 25303 -8520 -5441 20678 -28387 -23547 2166 -32852
200 -32852 -12649 21816 -9991 -23217 3917 5835 -11700 12207 28030 -1744 10731 17015
212 17015 -15173 13957 23642 -7174 13900 4781 -18543 4718 -7735 -14621 13027 -4215 -23524
225 -23524 -6186 -2106 -16648 -3540 18265 -7867 -8498 23518 -8818 -6140 39903 3326 -6181
238 -6181 29159 -2279 -10629 15222 143 -8613 852 -4967 -18925 -11371 1260 -14161 -6957
251 -6957 10167 -11912 -1187 14243 -6269 13376 20917 -2134 13619 13476 -1778 9732 8196
264 8196 1581 1551 636 721 -6287 2541 5988 -6457 8303 7894 -3576 13936 7786 2299 16396
279 16396 3614 4454 11379 -1132 3401 2723 -3855 1058 -3500 -988 -770 -5174 3649 -1879 -1232
294 -1232 10163 -132 5349 10581 -1782 7762 6433 -764 9115 -152 -3390 1803 -7988 -3752
308 -3752 -2159 -7317 -2956 -9206 -7752 -5214 -10866 529 -1754 -8023 2900 -5769 -6447 4680 -2877
323 -2877 2367 3361 -5405 483 -4639 -3577 4402 -4427 -1524 -1888 -10362 -3395 -4497 -3380 1700 -7238
339 -7238 -2825 -4153 -11638 1403 -1123 -5255 2774 -7214 -8195 -2940 -6500 718 -278 -3031 20
354 20 -8193 -2787 4101 -480 7284 3447 -3143 2353 -3117 1197 6426 -1288 2341 -4211 -10927 2
370 2 -5026 -3819 4689 -3787 -3878 -1672 -3257 4847 6070 8515 6693 -931 6301 1200 -1703 13409
386 13409 2831 -3782 3389 -9341 -7201 5641 269 -414 3957 2166 -3289 218 13550 7861
400 7861 4853 14111 -1375 -3955 10210 -3716 -2520 9214 -6215 -11821 -5400 -7019 -4380 1491
414 1491 3950 -1433 327 6447 -2327 6846 20795 4430 3535 8235 -6538 -112 4267 -6482
428 -6482 -878 -2450 -13979 -13855 -5650 -343 -3824 569 5205 -3519 3233 7871 1245 14769 15497
443 15497 -610 1854 1910 -1063 399 -2941 793 -3545 -13308 -9222 -8163 -3439 4237 -2813 -4411
458 -4411 1664 1519 -42 2509 14365 10130 -3323 5476 2731 -4327 11232 2929 -7951 8572
472 8572 -1337 -17163 -1277 5873 -4291 -3098 973 -8648 -7638 5047 -6261 -3853 16796 -4959
486 -4959 -15132 11118 1545 -3883 15414 2682 -4240 11080 342 -9563 10702 13479 -9399
499 -9399 -3778 7437 -12500 -6186 9265 -12157 -3208 11929 -17717 -12733 14284 -1774 -6597
512 -6597 10587 2368 -6349 4235 3717 -3979 10282 10586 -12961 -2962 9789 -7992 -2936 6570
526 6570 -4136 -1329 -2547 -9668 371 3674 -1947 -3502 -2882 -878 -4018 -5821 -1143 2515 1069
541 1069 -7160 -6733 2586 -1839 -1225 4275 -2040 2652 1237 -10113 2828 8104 -4674 -906 48
556 48 -6347 -1096 -128 -5420 872 6662 -5792 -8843 8602 2666 -5587 10789 3332 -5436 10150
571 10150 -1352 -9300 13362 5718 -11257 2247 4281 -8454 -166 7572 -3565 1475 11029
584 11029 -7518 -2228 18238 193 -3419 14812 -222 -4900 8594 -2597 -4234 8787 -1288
597 -1288 -10471 2411 3595 -8120 640 8254 -3754 1155 6618 -5791 3563 11086 -4623 -1072
611 -1072 5619 -4448 -4158 -214 -2374 -1806 -1799 -3793 -4520 428 1932 -1997 2352 4554 486 2523
627 2523 704 1801 5837 -2220 -2294 1548 -5699 -3672 -1193 -6394 -1217 232 -6442 -2623 2578 610
643 610 -594 4527 4120 -615 5026 3481 -3144 6073 2958 -7450 2013 666 -7537 -75 -194 -5773
659 -5773 507 812 -3824 430 5349 -473 -533 6858 563 -2688 5743 -1369 -3750 5096 -3769 -6468
675 -6468 2867 -3280 -5834 1821 -792 -3387 1144 1734 -2069 2198 5721 -1709 694 6569 -2436
690 -2436 -854 4948 -2953 -1435 2097 -3672 -2150 409 -2242 -2209 -265 169 -1140 -52 1610 -455
706 -455 1196 1802 -1073 1980 610 -1621 2180 -648 -1677 2651 -1340 -1732 2428 -1082 -1224 1184
722 1184 416 -568 293 1885 -929 -1023 2260 -1527 -1229 2235 -2731 -1667 1202 -2315 -606 446 -1437
739 -1437 91 -353 -801 708 155 405 625 634 605 -889 1494 669 -1493 2481 142 -2440 2194 -85
757 -85 -2103 2099 596 -1315 384 443 -496 -543 1616 462 -1582 1429 -64 -2136 2024 643 -409
774 -409 1650 -319 138 1205 -73 1433 990 -215 1044 125 211 567 191 666 -633 199 360 -1965
792 -1965 411 1123 -1837 243 334 -2254 -5 -46 -665 74 -424 -121 -980 -504 1037 -600 -62 864
810 864 -1240 51 428 -463 739 -176 30 517 -1151 378 723 -902 697 326 -1347 -165 -455
827 -455 -80 -316 67 896 -1202 -530 1181 -1211 553 1543 -1012 490 688 -338 1013 632 652 954
845 954 -308 383 -141 135 933 -106 245 138 -1141 548 -250 -241 1470 -639 -795 607 -683 -233
863 -233 415 -148 -386 -950 -384 -759 -1063 1099 -385 -1263 1002 -313 -771 1303 193 356 954 -88
881 -88 -72 9 650 719 -792 684 5 -1983 36 -187 -822 219 -366 -595 -151 -590 544 40 498 1090
901 1090 -781 733 1274 -238 1093 762 -545 1021 -31 -679 502 614 199 -104 260 331 -715
918 -715 620 240 -522 1451 69 -1670 1219 201 -1408 887 -79 -1100 -299 114 -614 -396 800
935 800 -286 -1351 1460 134 -1517 1605 356 -774 965 -642 -1187 487 -110 -769 -356 181 -149
952 -149 -923 477 447 -227 665 -411 -426 849 -524 -358 337 -427 -315 -855 -669 684 -350 -68 182
971 182 -193 279 188 -74 1113 820 419 399 184 724 73 -67 516 -788 10 39 -1871 6 827 -1459
991 -1459 -258 395 -890 -114 272 83 34 1060 74 -1079 1075 879 -1304 636 1196 -1032 206
1008 206 473 -831 630 482 -1051 -283 430 -344 -721 789 188 -792 604 127 -1036 1094 114 -1390
1026 -1390 668 219 -1189 -67 -31 -131 346 -87 -148 -256 747 80 -347 1013 238 -469 598 101
1044 101 167 929 -92 -156 413 -259 26 -368 5 298 -696 -83 103 -410 -50 91 16 201 -62 226 -314
1065 -314 124 814 -424 -17 741 -378 78 627 -324 258 714 -668 -380 473 213 -378 54 267 -573
1084 -573 -157 153 -1018 42 337 -1043 -104 665 -891 197 485 -393 -151 328 2 -236 572 -21
1102 -21 -769 428 -45 -800 374 118 -490 299 50 -801 251 -4 -333 144 70 19 -205 -135 70 -485
1122 -485 228 -240 -400 649 -89 -473 117 -506 -4 191 -356 348 355 -129 168 183 154 223 -64 371 257
1143 257 83 161 0 -85 161 -447 231 81 -334 364 -223 -267 455 31 -291 -55 85 50 117 248 -102 143
1165 143 255 -44 -66 831 153 -84 298 -387 -74 441 -167 -15 84 -47 -231 -297 -25 -231 -13 173 -314
1186 -314 -87 126 -536 204 519 -269 157 225 -366 275 615 -163 151 314 -442 235 -14 17 126 106 368
1207 368 -427 109 245 -89 414 155 -145 14 -131 114 31 -215 12 -197 -284 -9 38 -10 174 -322 83
1228 83 49 -47 486 -16 104 278 -169 354 36 90 381 252 -118 -328 -163 -18 -410 -104 91 -215 -164 -33
1250 -33 -373 163 -194 -340 -41 -224 -58 474 -89 -200 80 -103 -69 -29 126 368 115 273 -112 -356 223
1271 223 -112 -203 588 -292 234 168 -340 143 130 81 -95 -483 -115 -162 -32 10 -153 -503 3 -311 -389 13
1293 13 11 345 -63 -45 74 62 146 149 -59 143 -341 -126 66 -306 47 33 -101 -436 15 -227 169 -233 -60
1316 -60 139 -529 6 -24 -88 261 159 -97 2 -280 156 262 56 123 -64 -100 -45 13 256 446 -55 127 -141
1339 -141 -251 20 -36 8 196 152 136 -98 -160 111 -26 57 217 -298 184 -7 71 267 64 -249 60 -5 -126
1362 -126 186 295 217 -59 -61 26 -25 137 425 167 64 136 -124 -36 -64 -316 69 22 -203 -376 -349 -152 55
1385 55 286 -65 -254 501 37 -94 388 285 -42 83 136 59 247 119 107 1 216 -99 -371 262 154
1406 154 -254 104 106 -23 -52 -40 380 171 -13 -130 -193 -59 194 -112 162 150 -208 -66 -122 -42 49 231 -240
1429 -240 -60 17 202 76 299 -177 -6 -155 87 -142 413 13 -182 166 48 -442 -148 14 -37 -136 -115
1450 -115 150 -181 103 239 -110 317 46 -70 182 -30 -65 10 63 113 112 322 -18 -112 136 47 -84 -190 -84
1473 -84 -24 63 117 -210 211 -127 -321 121 286 245 -167 234 27 -159 130 17 37 148 -145 -378 -183 -87
1495 -87 -27 -64 -135 -2 -56 -73 15 -246 -25 90 -63 127 31 -156 -44 202 -53 -120 141 16 127 -59 178
1518 178 -229 -52 200 -137 -79 198 -121 135 200 -145 63 150 195 -41 -124 112 -184 82 1 -418 -114 61
1540 61 -78 128 -108 -335 -212 118 -61 -38 37 108 -11 234 5 -307 119 129 -79 55 132 -178 78 -97
1562 -97 29 144 4 -282 52 141 -16 2 -94 58 -83 -224 -18 -174 30 135 91 -13 -45 -34 -23 43 311
1585 311 -141 -35 199 -122 195 270 26 179 160 96 -12 -148 53 -196 -26 71 -69 -37 62 -18 -119 168
1607 168 -331 -110 -61 -37 -100 291 17 131 93 7 -106 21 208 -65 -43 85 194 120 59 8 -6 1 150 145 -82
1632 -82 -268 -149 157 -254 -121 -36 59 -35 -21 97 -96 167 -29 -3 -97 345 -41 -228 -5 171 54 269
1654 269 16 -36 71 -109 208 20 48 -81 86 -39 -134 -91 -161 -59 -200 -69 -66 68 96 -87 136 -229 39
1677 39 135 148 -179 -15 56 191 140 125 63 220 -52 60 157 -158 -9 25 143 -95 -59 -63 141 5 65 -118
1701 -118 -8 100 72 -152 130 -19 -16 24 -375 119 41 -103 -12 -30 117 -93 78 -121 17 -227 -124 -217 167
1724 167 27 -151 110 39 32 -85 -63 -227 -103 -132 -93 18 -54 24 -220 -58 142 -23 -169 205 -31 -199 125
1747 125 71 -134 -11 217 111 264 94 143 -84 9 101 165 31 -34 -22 39 -48 -141 -116 58 -107 23 -75 101
1771 101 84 -98 -65 -169 32 207 -31 122 138 134 204 -82 209 -42 34 -43 -156 177 108 -152 -79 -39 -89 51
1795 51 -55 124 2 27 18 155 59 128 -125 -6 213 -21 -95 -20 -101 -174 -192 -111 40 -33 -35 42 29 175 -81 59
1821 59 78 195 35 -8 -8 -2 -32 -100 -151 -94 31 -226 -23 -128 -301 -81 -85 29 -47 -117 197 28 41 -198 -144 56
1847 56 -86 -92 -52 52 -75 -220 60 -90 -180 -22 -23 -135 117 -86 -149 -74 -105 -165 -25 29 -291 124 -25 -92
1871 -92 41 -192 -44 140 220 -38 2 82 260 169 -116 -16 -31 91 72 -40 -120 -235 102 109 64 204 35 55
1895 55 -82 -213 130 3 -140 -222 -148 -122 -165 185 142 103 -84 113 111 84 240 83 55 -24 10 118 85 275 15
1920 15 110 -173 66 -107 4 -145 -194 -93 275 71 64 -29 -172 179 47 93 212 286 -206 -82 -78 115 -222
1943 -222 180 355 265 261 229 195 81 62 109 209 73 -28 120 -275 163 -9 98 133 -60 -154 30 28 -26 -20 83
1968 83 96 -176 57 11 -1 -40 -17 -70 118 29 51 281 109 95 93 110 -34 52 -155 191 -175 -91 -174 -65 102
1993 102 99 -102 302 -6 -278 -130 112 -25 -114 128 20 129 1 -7 -246 90 9 56 24 157 -94 112 -310
2016 -310 15 -191 60 -91 -142 150 22 -161 -17 -71 -26 13 102 127 -116 -2 -106 121 169 -15 -97 151 12
2039 12 144 135 -192 -59 95 104 12 -33 114 -148 -235 16 -128 -95 245 85 57 -38 7 230 101 -3 21 26 90
2064 90 -1 -141 -54 -195 97 94 -88 65 -136 97 3 11 -48 33 12 115 57 6 95 121 -174 -23 167 -116 -167
2089 -167 6 160 -83 213 -31 -218 45 -104 129 122 223 -237 -4 262 -45 -184 -89 34 -131 -179 -39
2110 -39 -131 9 -167 -1 76 117 91 101 -56 74 64 -16 -143 -178 92 -153 9 -63 126 -1 -244 -7 -49 166
2134 166 147 -64 -31 -21 29 -190 -235 -159 -137 -114 67 59 16 10 -71 -134 -61 -36 124 71 56 56 -276 31 245 -244 7
2161 7 142 183 -76 25 -175 117 1 80 21 -197 228 -32 -66 -112 71 -298 -7 -250 -189 172 -202 -84 -8
2184 -8 88 5 9 186 141 -235 -105 86 79 -92 -105 -128 -170 42 22 71 127 -72 -48 -39 -123 -28 210 132 -139 102 -158
2211 -158 22 -156 101 182 73 77 -7 -187 -92 -28 136 95 -46 -174 -101 -28 64 -48 143 30 85 -1 -294 65
2235 65 -26 -11 195 129 149 -96 112 133 80 79 109 406 110 -78 31 79 58 82 -99 -86 55 -45 69 -208 63
2260 63 101 128 78 -82 -188 40 -86 -114 188 -119 88 29 -186 276 -47 -29 -150 -268 -217 -182 -213 -53 160
2283 160 -126 -75 -52 -74 244 -118 1 87 -28 -5 196 -139 -19 -18 3 3 97 -110 292 162 -69 -103 195 87
2307 87 -109 -7 101 141 59 291 -49 29 -73 -368 -309 70 -97 142 -42 122 -116 -19 -206 -183 -35 -150
2329 -150 75 -28 -61 -109 122 56 -109 -110 105 -131 -101 -89 -40 -162 -71 -3 -266 46 -107 -235 -190 65 -150 25
2353 25 33 -2 72 -208 -171 50 -166 -280 88 -161 -28 -14 102 -6 1 -13 -256 -40 -154 116 259 -134 274
2376 274 -27 102 156 180 -30 -195 -74 -42 1 88 -212 121 4 101 -161 147 201 6 130 263 -134 -64 80
2399 80 -33 86 -17 182 -275 -15 -30 -72 -203 19 -50 -177 -70 36 -45 81 -56 85 64 -185 355 -79
2421 -79 -9 -305 269 -37 -136 166 -38 -156 259 -18 349 -37 -57 147 50 -33 -31 37 -51 -136 6 216 23 -50
2445 -50 108 -162 -40 -175 -96 129 87 -22 207 75 128 159 72 -178 26 15 -71 -168 186 100 -28 -58 -37 -225
2469 -225 46 66 218 96 -62 -110 -240 -53 -35 66 137 -182 -158 242 46 -113 17 -220 -97 -26 141 77
2491 77 -57 256 -10 -6 176 11 -122 351 220 87 -138 -209 38 76 -85 -118 -156 198 36 -82 259 69
2513 69 20 -53 -17 152 124 -221 -71 -133 -51 78 31 -123 -70 -258 -217 -50 55 -29 -157 146 108 -84 -73 -42 24
2538 24 140 -283 53 -51 -185 221 -103 -191 55 -137 -128 7 94 -80 68 12 49 -137 64 -159 -245 -101 -110
2561 -110 -187 -15 149 -161 -222 -78 -191 -110 -110 228 -47 -270 108 -33 -31 -69 -183 289 -64 165 -141 -29 108
2584 108 -172 175 -184 26 98 -78 -79 198 -119 -159 -96 -105 -288 -57 20 40 22 206 3 165 -100 87 95 -51
2608 -51 197 27 -98 150 -4 -72 -49 -101 290 -132 -85 -15 -105 -119 -191 -152 99 -33 -21 159 -221 9 96 -59
2632 -59 -103 28 -160 17 -19 65 -34 -30 212 5 77 56 46 -153 -23 38 42 55 -4 1 -25 108 -112 -237 -8 -279
2658 -279 -55 31 -85 -121 43 -59 56 -114 -81 86 -106 212 95 -50 -125 104 230 -77 12 -47 -263 393
2680 393 116 162 19 -63 -212 -111 0 -271 -80 58 -94 -165 -136 18 -213 -28 52 -37 211 -113 -66 39
2702 39 50 -401 -48 88 -35 206 -81 -59 -40 125 -39 69 24 -67 -32 287 8 -176 -392 75 59 -38 29
2725 29 290 227 -139 163 54 -201 -103 34 -176 86 -62 22 -125 -309 11 173 149 112 276 -75 -135 -43 0
2748 0 105 83 19 -196 210 225 -225 90 -403 -5 -19 -54 -45 -92 131 -202 196 125 136 13 81 -11 99 253 -98
2773 -98 43 125 -25 -70 146 18 -126 -46 66 -82 28 56 -118 -95 165 4 204 -11 -166 161 -14 30
2795 30 92 -37 -136 -77 -14 -78 -70 16 308 226 16 -60 148 -215 23 -116 394 90 -103 140 -313 199 63 -30
2819 -30 129 -257 -2 -149 -41 74 -139 -14 241 -11 -74 54 98 93 212 291 44 -144 90 155 -66 189
2841 189 46 -145 205 -6 -97 -1 -249 -109 197 58 44 -11 -115 -313 -27 90 297 -48 -45 77 86 -101 22
2864 22 28 152 39 -76 181 -55 -118 5 -197 -259 2 -10 29 96 -134 -77 75 115 57 228 224 359 -256 -11
2888 -11 -90 150 171 49 -56 -169 -184 122 -311 -274 -171 -301 268 148 -46 67 190 93 -6 32 -53 45 40 19
2912 19 18 -9 -18 -55 -19 -287 -119 -277 22 -157 -74 43 -29 1 -149 41 -53 15 12 27 -15 -7 110 -153 -91 -57 -89
2939 -89 151 -60 -10 -24 215 20 224 54 80 29 15 53 30 -103 102 26 -256 -36 -20 -82 63 -138 -15 207
2963 207 79 168 -212 -32 -122 138 -30 -46 -190 94 85 94 59 -372 0 -139 59 -237 -327 -60 -250 -214 84
2986 84 -87 -107 -194 -174 35 13 4 154 42 -196 206 -155 -74 5 85 211 -67 -133 -157 -21 409 -48 -169 -63
3010 -63 35 -84 25 -161 -284 64 14 -102 -54 18 -71 38 331 90 113 76 -74 188 136 66 -13 -9 -150 84
3034 84 216 -99 123 127 -8 -110 1 -39 17 -130 -144 -68 -31 167 -132 150 -34 62 -29 232 83 128 182 73
3058 73 -203 10 97 200 -253 168 155 -101 -13 293 34 9 -90 -338 -66 -84 -36 -18 101 -88 152 74 -93
3081 -93 -50 -95 -29 64 -26 283 147 121 -313 -234 152 70 -188 -53 11 -72 -128 -75 -138 -67 -230 -172 186 -284 -62
3106 -62 3 154 -41 128 78 -63 269 32 290 103 -94 -29 186 207 48 164 79 -58 -3 241 165 121 -252
3129 -252 107 186 253 -9 -101 46 -348 -31 45 118 -66 89 -94 108 190 53 -81 57 54 83 224 107 116 27
3153 27 13 219 -76 -71 179 -172 7 129 -361 -188 -27 -113 160 111 246 -3 67 55 227 44 24 -90 78
3176 78 112 83 38 -227 87 -5 -33 200 -267 17 -93 19 3 -340 94 -59 -120 -199 -290 -24 -118 -113 -39 167 70
3201 70 21 78 -22 163 24 -322 61 -252 -79 61 -178 306 -98 162 -139 -71 -71 -117 -21 -122 180 382 145
3224 145 -124 262 53 96 302 149 -108 155 -204 -64 -214 -113 63 -269 -32 -85 -84 -48 -4 107 49 14 -65
3247 -65 -119 38 1 -3 39 -5 194 -45 191 -89 20 19 25 23 272 -52 -72 -75 -110 73 1 94 226 50 -31 -88 1
3274 1 56 -24 -2 -41 -188 10 32 102 133 175 33 9 119 -145 40 1 -53 21 -171 91 -205 46 61 -158 146
3299 146 108 -108 284 -4 -32 -190 -209 -183 -284 -24 -281 88 206 78 -100 -74 141 -212 39 -11 -64 393
3321 393 -96 68 -241 103 -30 8 195 272 -143 127 -7 140 66 149 -80 -111 50 -152 -43 -217 -109 70
3343 70 49 -39 16 21 227 106 48 17 234 101 -105 -113 93 -161 93 30 -238 -43 -141 -182 -25 9 23 -151 -40
3368 -40 397 71 128 130 -91 22 271 -178 124 199 6 80 111 -141 -16 246 303 -15 20 41 33 144 154 99 85
3393 85 75 -99 -114 -404 60 109 18 -197 136 60 94 -93 -110 92 -85 -112 72 163 -309 -105 47 27 -8 -92
3417 -92 128 -103 -81 1 -69 157 -74 -134 -118 116 111 140 -136 63 -95 -38 177 48 34 -44 207 -88 34 -9
3441 -9 16 203 -55 36 75 -85 -102 58 -90 12 130 -93 -6 -450 -108 313 109 60 -31 -78 111 170 -10 121
3465 121 -57 88 43 88 122 67 2 117 88 -137 -118 -64 96 -345 28 26 -138 92 267 -121 -343 -29 14 176
3489 176 24 164 122 -41 112 -63 -161 69 192 31 109 -372 -50 -238 -132 -107 -207 -165 -137 135 -76 61
3511 61 -32 20 172 -73 -66 -154 121 -159 45 108 -85 -19 -103 -61 -61 -163 35 84 82 226 -141 -150 -237 149 -213 122
3537 122 -14 -27 80 63 -155 -19 -209 60 198 182 117 -70 8 169 -146 -71 -18 -142 34 138 -57 -72 -283
3560 -283 318 121 -332 -22 107 -210 44 -192 -94 -25 81 145 12 19 -208 348 -106 -147 106 -172 98 33
3582 33 148 -119 -193 32 194 119 97 -10 -29 146 -104 446 32 113 -259 84 -49 -251 -154 120 25 -78 59
3605 59 -120 135 146 68 -81 -232 15 48 -58 284 -47 101 89 -310 96 91 208 -16 117 128 116 60 -147
3628 -147 -135 131 -150 -45 -152 -44 -121 266 -23 -104 -1 -47 198 186 -135 -17 138 -62 92 7 -15 -98 30
3651 30 225 -96 84 27 -329 143 -186 113 49 208 91 66 248 -189 -217 31 -173 110 90 164 -68 116
3673 116 -29 -180 -66 -70 -40 -123 70 -215 150 -145 25 88 -27 0 -100 107 -121 64 105 -102 -180 -35 95
3696 95 -48 -81 70 122 -27 -92 106 29 -56 10 -45 -72 69 158 -193 92 -152 21 84 -121 43 5 46 -164
3720 -164 -16 211 -64 19 110 53 -9 110 -33 95 -76 249 -66 -104 -180 -131 34 -156 2 -31 127 70 39
3743 39 -153 -90 57 213 163 245 -80 212 96 36 -225 -46 -21 -119 29 -191 -74 5 82 118 -112 -40 117 -272
3767 -272 -183 -29 91 -41 -148 -54 188 166 51 -2 96 82 -159 128 -59 122 212 -3 -75 36 -74 140 -176
3790 -176 -220 66 -166 127 -34 101 18 64 -146 -225 190 -106 -2 66 61 11 83 22 42 69 71 16 -105 0 67
3815 67 93 70 -21 -170 -67 156 17 -130 -194 -14 92 -119 81 58 -65 154 -145 -50 -2 25 -58 -17 -40 68
3839 68 43 190 -69 302 169 3 -148 19 274 -331 -62 -36 0 -201 -4 506 56 203 98 205 -147
3860 -147 -283 -93 -19 -66 -90 -120 120 -88 203 79 101 -154 -202 -55 -140 -161 168 -125 -295 -94 -38 67 189
3883 189 -153 35 -36 -364 149 -58 -74 -30 -184 2 -179 67 247 247 151 -8 -88 -91 101 27 -103 -280 254
3906 254 27 54 -1 93 -89 89 42 177 -142 -202 -14 -83 2 -16 160 0 -161 138 26 -93 141 -144 56
3929 56 -219 -40 162 -8 -124 9 -37 -112 279 32 223 97 63 -1 -3 309 -258 -220 39 304 101 113 173
3952 173 -302 76 106 104 107 45 181 139 -220 -202 -16 159 227 12 -51 -27 60 2 -226 -6 -8 272 90 196 41
3977 41 218 120 -219 5 20 47 32 -296 46 -140 -91 58 6 416 -188 20 -14 -7 209 -297 -142 40 11 -78
4001 -78 -39 57 -23 -63 -168 -154 -75 -11 302 -122 66 19 23 19 -202 -79 72 -16 -120 56 -25 101 20 209 139 -204
4027 -204 -28 -15 169 142 -286 -257 -145 -69 -177 -12 66 36 -70 -44 75 -198 -93 123 67 -45 20 -197 154
4050 154 -4 -180 -136 54 -129 116 -94 -151 61 -26 -35 -217 -24 229 174 69 136 -284 49 -143 4 109
4072 109 2 76 -110 90 14 261 131 272 30 69 82 -15 92 -80 149 48 -114 -162 178 208 -136 -295
4094 -295 110 149 -45 32 56 34 -62 -127 -36 131 88 62 200 -17 -44 67 -102 7 7 257 -150 -165 234 172 -215
4119 -215 -50 -154 125 103 -17 -61 117 -161 -7 70 7 -194 -88 52 -6 64 108 21 111 115 -155 -101 -238 -146
4143 -146 148 36 79 -100 -20 54 114 -59 -68 -217 192 140 143 38 21 -24 -258 70 40 -154 -64 80 -65 -8 -234
4168 -234 53 115 10 79 15 -78 -10 290 59 -88 72 -26 -187 218 89 6 -32 252 4 -197 126 52 -219
4191 -219 -74 -27 -16 -40 -78 -17 0 4 -10 31 -196 22 77 -16 -112 10 5 -32 77 119 10 5 36 -196 121 138 -10
4218 -10 -48 239 191 4 206 -70 128 87 -106 44 -104 -58 78 92 -33 66 -105 291 166 -91 1 -101 -37
4241 -37 116 -210 -319 113 228 -230 -162 19 45 259 -101 -42 163 -27 98 75 53 37 -112 -81 89 -8 23
4264 23 46 57 -211 -13 146 3 -12 -168 14 74 29 -32 -33 -222 104 -248 -238 145 18 149 126 -137 72 -45
4288 -45 84 106 54 -39 -2 -125 74 152 44 -113 67 -5 62 41 69 262 -25 205 -180 117 -117 77 0 68
4312 68 138 69 -64 -183 36 216 76 124 -5 184 109 -263 26 -197 192 -71 -3 -19 -19 -214 -158 45 -140
4335 -140 105 97 -140 151 -32 104 -179 -290 181 -69 153 154 52 58 -186 -402 -56 231 -138 105 5 156
4357 156 341 13 188 2 298 180 -49 64 222 -94 -54 30 14 118 185 111 -48 48 38 -100 3 141
4379 141 -85 -123 -246 -144 -221 35 6 3 106 -228 135 -18 -34 361 -74 -101 -28 -229 -131 27 -227 140 -148
4402 -148 275 188 -68 -64 106 19 66 52 -76 -156 -396 -107 -154 153 -126 90 31 -45 64 -272 -345 -121 -32 -62
4426 -62 -95 271 3 185 157 -66 -3 -326 -49 -315 131 147 87 167 -38 271 -11 149 -15 -132 -180 -48 -2
4449 -2 197 -194 -88 50 -165 -59 -49 -196 -143 -94 87 192 247 -34 -6 -103 187 -2 -226 117 -32 -132 -141
4472 -141 110 135 0 -178 -67 114 141 161 -79 -306 -169 181 -24 82 40 -179 -287 -197 -79 37 2 -148
4494 -148 43 -114 -55 158 95 45 -113 -86 -165 87 -70 -48 -37 -7 78 18 -11 125 -91 61 -230 -84 65 297
4518 297 -253 -98 122 -218 101 81 -11 -52 73 37 161 385 37 166 129 -56 198 16 202 -206 10 144
4540 144 -3 -12 -51 -29 -59 218 9 220 94 -114 -108 -98 -84 -296 98 -48 190 128 -39 -144 67 179 95 84
4564 84 -209 63 -160 -96 126 -71 -105 31 199 29 9 78 -70 -17 139 157 -42 131 -21 191 -107 184
4586 184 7 58 -59 256 32 -103 150 -165 -22 263 116 -16 -24 -40 -109 -108 180 146 97 -1 43 192 -99 -319
4610 -319 -82 -298 183 -36 60 -123 231 -111 -121 -74 11 -57 104 -206 -233 -33 -96 57 77 -33 45 29 97 77
4634 77 -220 -69 32 -90 35 -10 160 -51 21 -318 -176 11 -2 69 -164 -17 -40 136 13 -10 -64 343 -175
4657 -175 64 10 -273 -98 -91 137 -20 132 35 184 46 -128 55 22 92 -175 83 114 -144 -42 -161 132
4679 132 55 47 -110 109 -57 113 104 -11 17 -117 25 151 -69 234 99 -115 86 -90 40 -35 52 119 128 -2
4703 -2 55 -169 101 5 -59 59 9 126 14 -162 -86 16 300 -30 -18 -88 64 -118 -83 -76 -8 134 70 -124 55
4728 55 -67 65 7 97 63 -182 185 14 -72 18 -86 76 -81 247 341 -112 -51 201 287 -126 43 -116 57
4751 57 -57 61 -119 -1 -65 52 -1 20 -7 -52 -50 -20 -149 39 201 136 -120 -23 -215 -258 -275 -25 6 33 93
4776 93 352 103 -57 -59 89 26 -39 121 -11 -229 -98 95 -181 -30 268 126 31 -51 76 -35 -242 -77
4798 -77 23 -127 77 26 -105 160 5 74 -60 77 42 -56 -66 -87 -209 27 108 -239 43 -15 -121 -199 -138 -210
4822 -210 22 135 220 103 -70 26 -139 27 219 104 24 34 -15 -138 -1 -88 -77 17 74 121 60 153 163 33
4846 33 -32 18 -179 4 -79 7 39 -19 56 26 84 32 -60 -17 -79 125 -62 -287 -58 19 282 45 26 -104 112
4871 112 107 -77 -216 -213 -52 -428 66 27 -86 -2 14 -290 -19 -140 219 -109 306 -221 -273 -153 45 38 -50 81
4895 81 -14 -44 43 140 16 -420 -123 81 156 -3 -83 124 349 20 -101 87 180 -60 9 177 224 101 108 138
4919 138 97 146 135 86 104 -142 52 -61 131 13 117 105 -50 65 58 128 -22 130 -81 0 -81 -169 138 -43
4943 -43 -19 147 -151 -21 -39 193 -260 35 89 -77 6 -51 113 27 -11 -130 -10 13 -240 89 118 26 -2 -125
4967 -125 -1 180 47 -122 198 40 -73 35 55 97 -212 112 92 -355 71 135 -41 99 102 -104 -27 59 129
4990 129 -94 -149 -512 266 -10 47 141 103 -90 93 179 -117 170 -44 -73 13 355 -125 -73 -51 57 226 -93
5013 -93 -26 -172 15 -199 -76 223 69 254 -61 55 26 -103 115 160 -23 -77 202 -112 -84 57 -117 35
5035 35 19 -260 -42 64 45 -281 -131 -88 61 -296 -30 44 -82 180 -169 -41 160 -7 3 27 -241 -36
5057 -36 -69 191 38 90 -66 -102 40 -86 60 -124 14 -250 138 -139 -201 335 185 105 220 229 -74 -145 -67
5080 -67 -108 112 -174 240 -249 -44 -110 -15 -18 150 -102 55 139 -71 -171 -54 -132 -163 40 148 -123 223 183
5103 183 -225 -50 -187 -231 -191 283 -101 67 91 140 283 -84 111 187 93 124 -173 182 -60 -47 -56 -53 -51 169 -119
5128 -119 -123 157 -67 180 -78 -28 -1 -82 52 -87 129 -2 161 -2 -93 -119 -173 92 -227 -154 -91 -178 81 4
5152 4 -46 -232 -308 248 -102 -166 227 -151 -109 255 28 131 236 128 -9 -41 269 -32 -75 155 -44 -35 148
5175 148 -7 -197 -38 54 -75 -126 59 -260 52 -47 139 -305 -12 89 50 101 -134 48 -126 -78 -11 -183
5197 -183 -140 98 45 -15 -74 -223 46 286 188 32 8 37 91 31 -177 -133 28 53 -218 13 -194 -40 -123 187
5221 187 -79 -187 96 60 -62 140 -270 -24 110 -76 47 -12 101 -166 -50 15 147 116 162 50 67 -206
5243 -206 -99 53 135 72 100 254 147 200 -137 77 -59 212 30 -35 -16 -5 -172 -154 -14 17 70 11 35 -194
5267 -194 64 -15 8 -29 -202 -150 12 102 -8 104 -203 132 60 74 57 69 -30 341 195 -34 -210 10 -169
5290 -169 56 311 27 20 -16 -126 -36 -51 30 70 232 6 49 93 -48 -121 26 125 2 67 107 -214 -131 135 253
5315 253 97 -139 -145 -102 -34 50 125 76 -104 -14 124 -1 5 94 144 158 -151 1 -220 -127 -20 173 -33 30 -220
5340 -220 54 -68 355 81 101 8 182 145 -247 58 14 85 144 -253 -85 186 23 -217 -157 172 -55 -250
5362 -250 -97 132 154 90 37 68 -42 254 11 40 213 -156 -65 178 248 372 10 -183 -111 37 245 -81 188
5385 188 -11 -47 -109 -216 -27 31 -80 -13 24 -22 35 144 -41 22 74 -195 317 0 -229 -8 52 44 -57 -48 64
5410 64 -47 -64 -19 42 38 18 -56 -70 -49 154 7 -94 -52 157 174 -56 31 49 -133 -164 -61 26 -2 62 84 97 98
5437 98 -76 63 -76 -28 353 -26 -103 -83 -98 295 -205 -77 93 -44 152 64 -41 -109 88 42 -10 109 -46
5460 -46 67 -330 15 -65 252 -47 443 17 162 -118 -186 -161 85 7 -40 -34 -118 -13 -40 -50 29 -13 133 -49
5484 -49 -97 -105 -99 -110 -90 -254 73 -37 -121 -164 191 -13 167 258 -81 47 132 -8 -88 162 -240 265 -50 -73 -67
5509 -67 -50 -74 47 -120 139 12 138 40 247 119 -2 -14 -227 -96 95 352 -7 106 30 15 297 124
5531 124 64 -29 -71 -5 -38 67 -141 102 40 39 278 -194 -103 194 151 -8 -11 278 -204 -72 207 -124 -167 -319
5555 -319 -123 101 -227 -113 76 -41 -177 -149 101 -111 49 -27 -28 -27 -95 -56 22 76 129 -12 -27 -113 -31 46 -46
5580 -46 14 -103 -83 68 90 79 81 43 144 76 -436 -140 -91 12 81 148 -62 249 -88 113 25 -179 138 -160
5604 -160 92 -78 -97 -150 99 -221 -1 -160 -42 -65 68 -245 -141 79 136 -81 -343 0 12 87 27 -107
5626 -107 -156 -20 102 281 -199 -32 -241 -228 -63 -54 -62 103 -51 -1 112 81 2 165 276 -181 -97 219 -4
5649 -4 54 -161 108 -138 65 -62 31 -97 30 -35 -189 54 -140 -98 300 13 -92 -56 -27 -148 81 15 111
5672 111 -47 49 -14 69 -59 -328 47 -129 93 118 114 217 2 123 -96 -11 28 -33 80 24 42 -91 -24 -142
5696 -142 -81 -109 -104 -159 136 128 -65 -44 15 241 54 20 129 -107 -88 32 159 -153 -58 40 -135 -41 192 -19 -5
5721 -5 -120 -33 -182 258 76 12 -129 -398 137 4 33 -85 113 55 17 -1 -121 184 188 31 203 110 98 191
5745 191 438 -113 220 43 89 197 -100 5 -71 -109 -45 42 103 108 9 203 -95 53 191 -139 -117 356 1
5768 1 161 81 193 -1 69 1 -171 140 67 45 25 215 82 -182 101 -74 177 68 -280 80 -31 -93 207
5791 207 44 -65 36 -60 36 -32 -173 23 -194 88 121 -21 103 41 -211 -41 55 18 5 -159 -108 -14 -134
5814 -134 -5 -136 -77 28 -110 167 125 -211 -303 169 -40 47 16 38 219 -28 19 -174 24 245 84 -28
5836 -28 58 220 -48 84 19 176 -106 87 -285 47 347 111 107 32 -195 -119 -25 -190 -61 32 -135 -186 21
5859 21 104 200 177 303 -86 -346 134 -40 -220 191 -50 44 23 191 83 79 -319 58 -11 -93 26 -39 -97 86
5883 86 -124 14 -91 90 -8 -432 70 -109 122 18 -21 -35 -115 -115 -51 -245 -115 61 278 49 -60 -372 111
5906 111 -189 -303 -16 259 -98 -13 -141 -46 173 -34 210 321 -14 -87 91 146 -221 139 91 -117 -171 -161
5928 -161 69 68 -44 -78 122 -324 -78 186 -77 -201 -25 45 69 251 -133 -77 -48 100 45 127 -6 124 -79
5951 -79 84 -21 116 68 53 -340 -47 -217 -178 -67 242 94 -73 142 -99 -167 -86 9 10 -150 97 91 68 -62
5975 -62 -16 -125 16 103 22 54 -46 -34 42 64 19 23 102 153 101 -23 13 123 49 156 81 -218 -45 23 35 29 90
6002 90 -147 71 168 50 -251 -105 -37 -145 146 11 17 -60 -37 9 226 11 -41 -291 -136 -192 -162 63 -133 -5
6026 -5 -150 18 -73 -106 -59 -101 103 221 154 -74 32 250 45 180 -11 72 218 51 -36 -58 -41 71 22 -30
6050 -30 -67 109 -145 -76 120 58 19 54 131 1 -128 -16 62 -86 -139 -110 -154 -95 17 -36 18 87 51 -65 79
6075 79 24 233 -211 -36 -106 -58 197 -70 25 154 58 -187 54 -42 263 -163 -90 -58 -68 9 -44 -45 228 123 152
6100 152 142 3 325 91 -1 -96 155 184 39 -1 -19 -1 22 30 68 59 115 -29 115 108 179 -144 199 34 38 139
6126 139 -4 -183 39 -82 -71 -53 -32 -9 -13 -11 -163 170 -165 -90 45 -233 -103 -140 -23 139 -59 97 153 89
6150 89 -76 52 248 21 -135 15 -185 119 129 -3 -138 295 -32 -74 -2 99 -24 -88 -133 -79 -191 -7
6172 -7 55 52 25 87 102 -138 80 62 -32 25 157 -232 -106 89 -2 -277 108 -50 24 115 20 224 1 142 -66
6197 -66 146 83 66 92 -344 -33 -192 -250 32 -56 -198 53 -150 133 -29 354 205 119 113 -144 116 -17 -59
6220 -59 -370 52 -46 -141 -73 -114 90 230 120 -47 -161 -29 -46 107 118 52 -250 -48 12 -83 -130 185 26 -89
6244 -89 140 -11 -191 -71 -18 43 31 -518 -405 -25 190 -11 178 -54 328 -180 7 85 -223 260 -121 180
6266 180 84 -26 -128 -167 44 124 128 46 5 -103 -139 -53 -277 -183 137 -34 139 -133 -55 142 -49 -123 173 -313
6290 -313 193 -233 115 -182 -219 156 99 82 -165 10 -19 4 -59 -76 -9 -233 -76 265 -4 212 114 85 216
6313 216 -43 33 -78 25 -124 229 5 -107 68 -245 37 -67 -21 19 28 230 30 297 123 -80 -72 -154 298
6336 298 -65 15 24 52 -125 201 -84 55 115 144 -37 -220 11 -41 39 132 -35 230 -150 -52 -11 47 232 -155
6360 -155 -19 -95 122 -42 -30 -116 -25 146 164 -182 -148 25 167 -52 173 -52 -133 9 -55 -259 -79 -80 -54 64
6384 64 253 -27 32 -115 -57 28 81 0 121 -95 -169 217 -67 112 -7 -50 128 -193 -23 139 -183 146 18
6407 18 15 -58 -88 151 154 -292 -215 104 118 -116 -32 65 -68 200 -16 -264 252 -136 115 -83 12 -66 87 -124
6431 -124 -75 -110 26 -126 25 -62 24 -140 -21 165 86 -42 -31 -44 13 -213 -45 197 -164 12 -143 -50 9
6454 9 156 -75 -87 10 -151 11 123 196 189 -3 288 96 7 32 47 -105 24 109 -19 -7 58 -303 32 -1 -20
6479 -20 23 210 -119 -52 -228 -10 -41 -108 -154 -22 161 -169 -66 37 122 -64 -86 68 25 320 -122 44 -9
6502 -9 -211 -151 -146 -43 53 179 30 115 -107 -252 66 129 -83 132 159 394 -237 -197 48 65 160 86 -5 -173 70
6527 70 -61 -69 -26 84 -133 84 -30 288 -105 -124 -186 -122 -84 21 142 -77 62 -53 150 -23 -350 -13 -70
6550 -70 -115 -34 -236 234 -93 164 -12 16 74 -159 65 112 80 31 314 -94 -185 -4 112 22 7 -36 280 75
6574 75 120 37 196 -70 30 43 -12 313 191 43 -34 -48 42 94 -121 -57 66 108 -19 -82 30 -4 6 22 120
6599 120 151 167 64 26 -135 -118 30 -203 21 63 -30 8 -172 32 157 184 -16 -3 -145 232 -155 -61 -76 -13
6623 -13 -169 -182 110 211 30 -38 -34 163 -68 99 -58 2 158 130 168 164 60 -185 197 -50 70 154 -20 -13
6647 -13 144 162 -191 114 -29 144 -1 5 -23 82 -97 8 -39 -29 -7 36 -183 -87 49 -123 -27 26 237 -216
6671 -216 -165 -225 14 -15 -8 129 -99 -98 -61 -64 -122 -18 -113 15 -71 -58 -266 97 -88 -165 49 15 156 -160 156
6696 156 -97 -163 138 -137 -232 307 -87 -26 36 79 138 8 -95 187 -88 9 -103 99 258 113 -47 52 250
6719 250 58 98 -46 -27 -137 -74 84 208 117 65 -87 60 59 81 32 -90 14 29 123 -13 75 -82 -46 23 196
6744 196 -70 2 -79 25 36 -152 54 -196 -244 104 -89 -28 -95 166 -61 93 59 152 -45 -13 -113 72 -5
6767 -5 -175 -9 121 -115 -239 -31 52 178 -148 78 -64 162 -23 -160 -146 -53 222 -206 -223 -54 -94 11
6789 11 -24 -162 137 -177 -87 -36 -291 -116 -261 -29 -101 -51 -237 120 -76 -4 76 51 -122 17 -18 60 -69 -242
6813 -242 166 95 50 203 -1 54 -53 122 -48 -44 -148 -17 -9 143 131 180 19 -10 -63 30 -48 -13 271 -166 33
6838 33 131 95 19 71 -38 -25 -37 -35 -13 82 -34 -59 192 -45 2 135 -160 316 -155 413 -27 22 -122 -106 7
6863 7 -82 210 203 41 -196 53 258 56 121 93 -16 -88 -113 14 -15 -100 -176 159 -36 227 -11 -14 16 -77 -126 218
6889 218 121 32 -164 103 344 -196 36 -294 279 151 -54 3 78 51 130 141 -162 -77 298 165 -22 -273 -14
6912 -14 -56 -63 -159 -100 24 -123 70 53 93 29 -23 -21 -34 224 31 -1 100 -69 65 -281 -62 -151 -113 149 -179
6937 -179 82 -83 32 198 -46 37 -11 68 53 -207 -141 44 -68 -24 69 -63 199 164 149 -68 234 2 51
6960 51 -282 110 -161 -122 -189 -143 -127 0 266 17 47 161 235 221 81 140 116 83 42 138 -59 -234 140 -180
6984 -180 -80 278 30 -43 -52 -117 -136 -240 -222 62 50 -67 -74 -105 -131 17 -15 13 -28 102 -45 -45 96 45 213 -55
7010 -55 -102 92 182 18 145 -78 -176 -23 -28 120 -2 -43 -16 153 134 -134 9 -347 -273 42 158 64 -83 -47
7034 -47 -61 -51 170 -150 12 59 -141 -126 31 -127 203 271 -242 171 18 -224 26 172 -72 -118 -233 -87
7056 -87 -42 -264 38 219 69 -142 164 83 32 -26 34 68 -10 -103 -3 -16 110 -43 -43 25 190 -3 93 -18 -36
7081 -36 -239 132 -28 -100 212 -85 -315 43 -150 -41 -80 56 -7 -90 -264 160 131 -162 254 -81 100 204
7103 204 -55 -61 103 -35 39 18 255 37 -12 192 -2 121 -93 177 69 -91 106 -14 -104 26 -19 -32 -161
7126 -161 1 -17 42 67 -218 -222 44 -25 -95 -18 -102 53 171 86 -74 -170 63 34 -10 132 -9 81 -96 -12 35
7151 35 68 -49 -133 121 -63 5 24 128 121 -32 -15 -125 -177 -91 78 88 235 39 -84 121 194 -9 159 157 128
7176 128 98 -244 -49 148 35 -90 26 -100 -15 -58 -32 -11 -261 -117 126 -286 53 -138 64 89 -121 -204
7198 -204 -111 60 -64 -69 -74 -69 -199 -141 -65 53 -252 1 26 -204 7 -45 171 23 178 103 7 -70 -114 -318 -217
7223 -217 -20 88 -100 -176 168 -41 -51 -77 187 20 89 -90 -90 120 -259 -343 91 177 170 -139 92 41 -60 -46
7247 -46 -210 -50 -123 -229 132 -382 135 74 2 161 -118 -127 -37 206 -73 107 -29 -158 -183 -212 -33 -15 -79 -121
7271 -121 -35 -114 -15 127 110 -157 56 58 41 -171 270 -6 61 -63 -168 38 -232 117 -160 224 62 -109 104
7294 104 68 -12 -268 -76 -211 87 268 100 -43 44 -45 -52 -73 -68 -86 -76 62 44 -27 -19 173 -138 63 25 83 7
7320 7 -127 44 -229 84 -40 -89 76 22 40 14 -2 -9 12 -150 -192 -57 134 68 43 -8 -251 -104 29 -19 49
7345 49 -21 -258 -29 -85 29 171 -147 -186 40 291 232 41 97 -369 -100 -48 209 48 218 176 -214 117 170
7368 170 150 99 19 71 -255 166 112 177 -71 -104 -136 -202 153 138 219 -268 40 -235 -154 37 27 -124 153 -42
7392 -42 -192 10 4 -187 -200 -238 -125 152 182 24 -203 199 -108 -165 266 99 35 -3 148 -115 41 -123 -55
7415 -55 -131 18 -52 -81 163 -67 59 -60 -16 -136 312 208 -134 12 73 165 -56 -86 195 -47 184 -110 -271
7438 -271 -32 -207 -86 -50 -59 -70 -107 19 -144 -362 42 -57 -31 83 11 -99 -53 -71 -40 -155 -214 29 157 -8
7462 -8 -177 -16 -189 95 6 -145 0 33 92 -19 242 -119 53 268 128 23 178 40 184 42 -126 188
7484 188 64 32 -145 291 -15 57 14 -44 -65 -7 -282 94 12 -107 -161 -244 -210 -162 237 -194 -35 -42 133 19
7508 19 200 178 -164 161 -117 -46 -185 -19 -7 -63 201 -421 -99 -3 108 -137 183 43 -128 34 -95 238
7530 238 46 204 -28 38 146 335 138 15 -2 -142 -116 -62 25 -19 -83 45 -8 -44 46 -14 -154 201 122 202
7554 202 114 210 -105 14 60 -27 281 158 -269 -179 -63 77 329 84 16 -54 64 -103 50 -171 210 -22
7576 -22 -110 100 -16 -211 86 102 -208 -4 153 176 253 13 334 -162 -132 -165 -13 -29 182 164 -26 89 -214
7599 -214 65 -163 -59 -103 -146 -71 162 82 -69 -333 240 30 -258 -45 149 175 -57 -38 -136 -140 47 -37 -61 -50
7623 -50 54 -28 -62 150 -106 24 -31 187 -154 -66 40 -34 2 -95 58 92 -8 -35 117 11 -206 8 31 49
7647 49 -193 -278 162 -17 245 -291 65 90 3 -5 -50 26 155 97 143 -53 6 81 -303 -95 16 -242 -69 -71 22
7672 22 75 163 -157 24 -22 76 -173 57 90 157 -85 141 -183 31 261 125 -158 -104 -56 -151 72 -20 -216 31
7696 31 66 -187 -40 -18 -22 -40 128 57 -166 85 -9 47 23 -102 245 360 76 41 79 114 167 -208 -99 181 109
7721 109 -172 78 43 -90 -182 -136 -136 -222 -135 -90 166 371 160 -125 -69 144 -163 142 10 136 194 -76 23 84
7745 84 -40 37 156 -7 143 123 -99 144 90 -308 23 48 -37 58 50 -53 257 105 -47 -54 92 251 -33 64
7769 64 -5 7 17 196 -12 95 -51 -12 -132 -87 -179 68 96 -148 -144 -149 -303 62 -139 -10 -52 -3 101 22 -74
7794 -74 71 -84 129 -4 86 146 -40 116 118 253 -10 -70 259 -170 172 10 157 -203 100 -55 -154 -48
7816 -48 183 143 76 52 162 58 9 241 88 -126 -80 -29 111 143 51 -56 -167 130 -16 21 2 165 -40 -2
7840 -2 -80 -268 -120 172 70 173 -280 -40 -183 171 -82 85 77 -10 21 66 -32 18 51 -156 -90 130 24 -18
7864 -18 -42 -55 -8 -142 235 42 119 -18 -294 -27 81 18 24 5 196 28 9 9 103 -158 -142 108 30 -142 -9
7889 -9 -62 117 -183 -30 -121 98 -41 -136 -12 174 121 -176 36 92 -3 54 -94 -95 158 -14 74 -102 98 -56
7913 -56 -239 -61 169 38 106 6 27 -317 141 174 17 158 29 10 -121 72 -76 53 11 -58 -249 -47
7935 -47 171 31 -24 -45 -90 8 26 -102 104 -15 -26 -132 52 -134 57 31 93 261 104 -64 161 152 -172 230
7959 230 -126 48 -94 220 -80 3 -34 186 108 5 -34 112 59 -12 85 205 -124 30 -151 -251 -27 255
7981 255 126 -86 -100 -96 -156 29 -48 -26 211 11 67 -22 -87 255 -76 -52 -90 131 170 -168 23 93 -227 -64
8005 -64 -143 -31 -42 -52 24 160 194 -12 124 -82 88 -124 -104 -101 -24 143 69 21 115 104 95 -98 -37 -306 -5 12
8031 12 146 133 -51 29 -73 13 -77 111 -86 -206 -31 186 -68 -72 290 218 -190 81 -65 198 4 80 -9
8054 -9 76 -73 178 224 61 31 -136 -322 -41 61 88 140 -66 60 137 246 -387 188 117 -58 -125 -195 116 -96
8078 -96 18 112 -41 46 -234 81 51 43 83 -121 205 -135 -121 -246 -251 -188 -51 19 -30 1 -92 58 -59 70 -90
8103 -90 -148 -225 134 13 -90 67 55 42 82 -6 -211 108 121 -72 113 103 96 -142 197 -78 -16 -133 -56 31 19
8128 19 -197 -70 -99 171 38 -84 343 63 24 -77 -114 211 -20 -72 105 -212 -38 51 106 -108 78 -467
8150 -467 -278 -126 16 114 -177 54 -138 -45 -17 -104 -78 -18 93 80 -166 173 -34 66 -4 102 56 -84 169
8173 169 -11 47 354 219 196 89 -17 -317 -59 40 -109 -124 -59 -178 -68 -105 -30 -92
8191i2
$$ Imaginary data points
##PAGE= N=2
##DATA TABLE= (X++(I..I)), XYDATA
0 0 0 0 0 0 0 0 0 0 0 0 0 -8 8 -8 8 -12 16 -16 24 -24 32 -38 44 -49 60 -68 80 -92 106 -119 136 -156 176 -199
34 -199 223 -251 281 -314 348 -389 431 -479 530 -585 648 -714 788 -867 954 -1050 1159 -1277
52 -1277 1407 -1555 1722 -1910 2128 -2381 2679 -3036 3470 -4016 4722 -5671 7019 -9067 12520
67 12520 -19358 37716 -181536 -405604 314504 165822 -170982 303912 354899 -76347 152189
78 152189 329238 -35484 -4824 273412 -20868 -214014 10421 -47452 -214049 -103214
88 -103214 -23940 -48678 -118155 -98287 45457 21851 8896 178382 103856 -8273 169826
99 169826 150792 -55793 97932 242253 -33006 -103135 121876 -20429 -148495 86089
109 86089 30347 -137384 21325 8580 -126017 9572 85968 -20731 -33997 32177 23411
120 23411 -36246 -18283 52484 52397 -7233 -20503 19407 -7214 -15933 75423 16616 -56142 69143
133 69143 3025 -127544 45023 67703 -100320 -22214 28738 -96902 -54818 36063 -38920
144 -38920 -26312 68160 -24430 -59386 80039 42569 -12448 85454 34177 -17677 55101 -14217
156 -14217 -39458 64125 -1118 -75747 -1218 -19134 -80998 -3909 25079 -46950 7259 46257
168 46257 -55634 3226 101736 -1495 3344 84272 -1857 -21605 39379 -2121 -13950 21763
180 21763 -13833 -51400 -22995 -7245 -32144 -14802 7697 -13036 -6942 -7850 -10719 31433 16739
193 16739 -2047 32645 -1648 -17503 22468 -5517 -11563 22687 -11986 -38455 -9617 -2356
205 -2356 -22368 -10299 10135 -17225 -18417 7033 -15971 -181 28190 -6377 2741 16145 -11211
218 -11211 9878 15839 -4174 18287 8489 -19464 -2588 5922 -11330 -9271 8060 -13247 -28764
231 -28764 4327 -10557 -27004 21224 1804 -26984 17586 6150 -14398 21248 15654 -1783
243 -1783 10699 8536 -4822 -2204 9094 -5824 -13912 2997 -16431 -21973 1465 -17037 -12648
256 -12648 7301 -16278 -7471 8408 -7840 3569 11276 1017 3323 3625 3003 -1703 -245 5755
270 5755 -8744 -4177 3585 -12785 -634 4044 -8549 6827 4174 -1901 12482 4330 4784 12161
284 12161 3631 7270 6593 2538 5028 -2034 1798 941 -6076 4807 -1220 -4707 7139 -2767 2169
299 2169 11310 1388 11061 10777 2711 12501 7358 6836 13267 5107 6534 3952 -497 5377 -1377 2226
315 2226 4879 -7417 466 -1213 -8076 5484 1304 -1596 4938 -4284 50 3480 -278 9087 2833
330 2833 -871 4511 -3785 1117 4956 387 4944 -2643 -3872 1369 -6552 2195 5872 -5475 1397
345 1397 -2544 -8299 1195 -1938 -195 825 -7241 -4348 -8330 -7902 2378 -3839 -2849 -877 -10037
360 -10037 -2539 -491 -706 7891 150 -586 802 -7249 3140 3202 -4351 2556 -5752 -11721 -5792 -8079
376 -8079 -3516 -1196 -4417 -4101 -9581 -2485 1999 -3138 10224 6579 -6745 3475 -1023 -5337 8451
391 8451 1261 -6881 -2903 -5942 -9825 -6836 4517 2180 -6317 4677 -147 -6183 13563 8482
405 8482 906 15419 3501 -7710 3014 1681 -860 303 -2438 -8954 -11235 -3720 -7190 -4129
419 -4129 11874 -426 -6481 8611 1904 5100 17194 6522 6549 9320 -3939 -4322 2913 2853 -4804
434 -4804 -8156 -4671 -12657 -10527 -259 -5591 1635 8580 -6015 -1794 8912 6875 10262 8668
448 8668 7921 6404 -4297 -1335 2885 452 2975 -5829 -12637 -5523 -5288 -6775 -3820 3730 2311
463 2311 -9950 -1816 6816 -1666 10235 11040 -5399 8101 8158 -10054 4597 15247 97 -3363
477 -3363 2615 -3863 -6438 5569 -447 -7617 9155 -3929 -21906 5288 5776 -11456 6356 1933
491 1933 -12397 5000 3852 -8137 9659 16903 -5432 -4461 14096 8 -3478 16205 -667
504 -667 -6571 13071 -9611 -15994 15230 2154 -14580 3428 715 -11952 -336 5533 -3288
517 -3288 4627 10027 -9750 -4713 15829 369 -2736 11594 324 -2706 2749 -4057 2927 8162
531 8162 -962 -2844 -453 1063 -196 -2735 2283 3870 -130 -6228 -6942 2873 501 -4624 1888
546 1888 -2837 -3891 960 -7690 178 10780 -3800 -4252 3058 -3437 -625 2687 -3564 -1258 3239
561 3239 -6861 -12685 2626 2940 -11496 1274 2654 -11683 2723 2608 -10336 9063 9428 -12500
575 -12500 -1174 8021 -6718 -3802 6363 -4410 -7001 3934 -7929 -10156 12210 666 -11953
588 -11953 9589 3840 -8213 9124 5133 -3037 10138 4042 -8466 2815 7827 -5939 -2799
601 -2799 7147 -4600 -6241 4957 -4295 -1415 11805 -1892 -3133 9616 1711 -940 6100 3560
615 3560 905 518 -1560 -3024 -334 1028 -4309 -2877 1176 -3071 -1668 1284 897 6323 2191 -631
631 -631 6784 2053 68 5076 -769 -489 2295 -5721 -4893 270 -2671 -5563 -1575 -560 -4588 -484
647 -484 3669 -2506 4208 7121 -4156 3073 8030 -3577 1234 4898 -3989 -1064 871 -5172 -3132
662 -3132 2077 -2513 -4985 3073 975 -4088 4918 3685 -2403 6956 2457 -4359 5346 2236 -4882
677 -4882 1775 409 -5294 -1985 -123 -4018 -2306 2448 -2859 -3057 5583 -404 -2369 6440 1054
692 1054 -1115 5276 239 -1566 3043 -492 -1883 6 -303 -1982 -1982 44 -1562 -1178 946 -1527
708 -1527 315 1534 -1535 1656 1313 -2048 2177 185 -2222 2164 58 -2211 1279 556 -1117 -113
724 -113 1450 -198 -1000 2532 429 -1649 3001 376 -2179 2279 -686 -1177 1302 -1579 -784 -301
740 -301 -1905 -161 -273 -851 -272 -689 -183 -1037 434 1170 -1781 1297 1369 -3129 1198 1442 -2582 1289
758 1289 1559 -2044 -118 640 -658 -543 985 482 -1974 150 975 -2236 642 770 -1909 462 -193
775 -193 -1361 1113 -415 170 803 -882 426 532 -78 1242 727 804 210 98 1771 -189 601 2375
793 2375 -1006 117 1693 -1502 213 1322 -577 2 -211 -475 -159 -532 1150 -552 -997 606 -1159
810 -1159 -916 1025 -271 317 63 -738 401 -786 -168 1666 -839 300 477 -1210 -123 518 35
827 35 103 -412 446 -993 -1185 1148 -511 -473 1106 -1477 -1147 779 -785 296 501 -65 130 -257 292
846 292 709 -51 1012 248 130 917 -407 681 736 -745 1319 66 -1299 1012 257 -214 1255 319
864 319 -34 -161 -29 381 -154 946 84 -1766 524 -132 -1668 607 41 -960 477 -820 -329 -19
882 -19 127 942 -269 247 734 -838 344 1242 -469 167 -468 -1067 -253 -368 -263 -503 -724 110 -1533
901 -1533 -885 1033 -628 245 975 -761 296 565 -668 618 483 92 -360 200 524 -516 335 981
919 981 -522 700 616 -1541 1030 1379 -1215 605 998 -680 26 509 -1 -411 820 1 -1695 674
937 674 757 -1488 967 1215 -1026 451 516 -797 1010 578 -524 -111 268 -95 -834 198 623 -604
955 -604 -34 -99 -913 811 140 -511 876 150 -366 -206 -309 513 -206 -915 -309 -930 -549 -125 -857 107
975 107 145 -626 -376 -52 759 324 351 1052 371 64 759 -372 437 1432 -1042 -798 717 -733 -659 417
995 417 -292 -675 -84 -18 -1083 512 1271 -1230 54 1509 -794 -10 1128 -744 338 1070 -915
1012 -915 -668 572 -327 -599 456 448 -953 -15 334 -904 523 728 -1335 313 567 -1056 60 436
1030 436 -563 -34 32 -447 -570 320 -196 -664 377 520 -994 220 270 -335 483 -23 -62 687 114 -4
1050 -4 352 171 477 -217 -309 648 -137 100 8 -227 19 -296 -308 -99 -353 583 -178 -825 737 -136 -426
1071 -426 665 90 -183 1014 -116 -321 788 386 -36 98 666 -409 -266 1085 -454 -27 931 -967
1089 -967 -529 848 -915 -564 570 -381 -540 231 -10 -388 572 249 -581 77 639 -777 -112 533 -659
1108 -659 295 357 -520 241 437 -378 185 307 -58 -38 151 13 -242 97 407 -562 410 39 -268 247 -80
1129 -80 -445 72 -155 -290 210 -451 -177 108 -145 184 -209 110 2 -3 94 -20 338 457 -103 -232 343
1150 343 -546 99 242 -687 344 -384 -562 78 -73 -360 -291 149 -325 -553 302 79 -186 530 211 -247
1170 -247 253 51 -616 496 227 -151 492 56 -73 129 -72 132 -83 294 -240 -90 439 -248 -161 339
1190 339 -668 -419 283 -231 174 421 -197 -203 47 -3 -45 -3 86 -259 34 227 -217 151 205 -282 -106 -100 -237
1213 -237 266 126 -71 216 -23 -210 174 -275 78 -29 -92 -6 -214 -20 -247 -23 -87 -312 -269 348 -136
1234 -136 -111 -57 93 189 336 49 364 227 197 412 76 143 -541 -116 101 -110 -107 447 -251 -41 -125 -174 167
1257 167 159 -42 159 -188 -224 208 251 190 4 -86 46 6 132 341 46 309 70 -59 155 196 42 426 143
1280 143 278 -262 28 -131 120 181 -203 -265 -230 -392 -134 174 -28 15 91 -501 96 -168 76 275 363 -77
1302 -77 -82 -85 133 -48 -112 84 -305 -387 107 -227 6 349 171 -184 -296 -202 -163 103 230 -61 -129 -197 59 -162
1326 -162 51 -109 -296 -61 -148 -43 116 124 334 -10 -23 -107 -102 213 289 -213 52 -123 19 201 -28 224 7
1349 7 102 268 -145 176 -105 -149 50 104 -120 -54 -165 -121 51 -8 -59 -104 -128 -63 -90 302 490 -74 183 129 -299
1374 -299 194 -23 -33 270 -354 -179 5 186 116 -174 -190 -21 -296 34 39 -99 60 210 -319 66 14 -58
1396 -58 328 -100 -5 -4 47 356 -110 331 104 -102 -48 -100 -124 97 -60 -242 173 -130 -170 -271 229 123 -199
1419 -199 -104 92 -162 -190 331 22 280 312 -358 -48 165 152 259 318 -116 19 59 173 10 176 519 -349
1441 -349 -92 164 -232 145 249 -14 -161 64 -49 -79 155 212 -463 -99 319 -481 -32 352 98 53 180
1462 180 -25 -366 135 226 -230 311 360 -112 -45 93 -179 125 183 -241 -159 121 -93 -136 34 -66 56 -179
1484 -179 -201 -59 -43 120 -225 74 445 -156 253 328 -64 12 87 -143 -96 170 44 -55 -4 140 -193 -40 -77
1507 -77 -161 77 251 -239 -125 15 240 30 93 146 -64 23 132 -233 14 415 -188 -182 293 -97 216 209 -118
1530 -118 -10 77 159 42 78 341 78 -114 218 36 14 345 -104 117 137 -427 -69 59 -117 52 -28 195
1552 195 -120 140 55 -39 -79 88 -226 84 217 1 -155 -162 94 -170 68 56 30 115 113 3 -260 41 -139
1575 -139 -40 377 89 69 89 107 -88 -53 1 -263 220 33 -60 158 214 -2 37 293 -37 -183 175 62 163
1598 163 -18 -27 236 38 407 -65 195 -161 -131 -3 -136 -117 -205 -109 -41 -91 -50 177 -93 130 225 -158 -109 182
1622 182 93 32 151 -122 -93 151 67 -148 -33 146 -240 117 161 -82 -185 -51 -216 -51 -66 -275 -199 -197 -209
1645 -209 3 3 84 219 262 65 -7 -9 14 -385 197 -14 21 208 350 -60 -65 -122 -162 216 189 -66 25 145 86
1670 86 102 -296 161 121 -156 165 -239 -69 12 -148 -17 -43 36 39 285 18 227 -6 54 -152 -188 245 147 81
1694 81 136 -164 86 139 27 43 -302 -7 -119 -238 -104 -254 22 -110 -119 -218 155 4 -163 93 -4 -127 -50
1717 -50 -106 -59 191 201 78 -62 -247 -149 -227 3 208 23 229 -55 -11 107 209 86 44 36 160 -270 63
1740 63 -43 -49 15 63 -50 -143 -111 -24 202 -123 65 145 -1 7 -37 96 93 103 -87 102 24 191 246 355 -20 -72
1766 -72 151 7 86 219 -117 -117 -33 -201 -204 54 -70 -112 4 -274 -35 42 -21 269 36 193 27 -258 91
1789 91 -86 -8 146 -42 202 -65 91 -72 169 -107 -101 82 2 125 91 -58 147 62 -141 -98 -50 -85 65
1812 65 -4 -15 -50 -61 125 -161 -224 -60 191 -144 -117 146 -169 230 99 119 438 91 -97 -116 84 82 -65 -327
1836 -327 -145 -336 252 -22 -56 304 -129 -284 54 38 89 94 -411 215 -72 72 -9 155 -22 -118 -207 52 -80
1859 -80 -292 8 201 -213 -77 -195 -137 -177 59 -87 -76 53 85 -153 -162 1 -245 164 107 -76 37 445 -16
1882 -16 99 21 202 15 -73 121 -70 101 21 -76 139 118 57 54 -80 -51 -40 -110 -171 -217 52 127 -46 65 91
1907 91 -67 136 64 136 -64 -43 -108 68 309 -143 138 109 -27 -148 330 178 250 271 -53 -194 -192 54 -32 187
1931 187 -79 76 -127 -111 -20 -111 60 -54 -82 96 -33 -262 167 2 -24 53 -1 -46 -73 93 127 103 -136 54
1955 54 -129 225 105 -156 41 208 -224 -49 -55 -68 188 -94 252 13 45 -12 114 -5 134 -76 -240 -38
1977 -38 43 -139 -42 147 297 212 28 258 19 327 37 106 64 108 110 102 -44 -60 71 -189 -139 -183 -2 130 321
2002 321 53 68 -40 -15 -60 243 -242 -105 -178 22 125 187 67 219 100 179 27 79 -165 310 164 -157
2024 -157 -172 -141 72 -144 -165 145 99 240 -163 100 -76 -56 -123 44 -97 54 -206 -214 -33 69 -40 -87 39
2047 39 78 211 23 196 -2 -284 -113 76 -139 61 -25 48 3 -215 197 -138 -159 -66 151 -105 9 72 -93
2070 -93 39 -217 80 -98 151 165 -23 148 -36 33 -37 -34 120 54 353 4 -20 -31 18 -28 106 -222 -47 -167
2094 -167 32 -51 -55 -354 -88 297 -225 -31 63 34 64 60 -3 -110 -192 177 130 80 236 87 100 -445 268 75
2118 75 5 240 -61 59 -47 127 25 219 -121 -14 83 48 -71 -239 -100 -111 148 -181 -23 30 -125 -131 -112
2141 -112 -1 -60 -31 -107 15 -77 170 218 -66 187 -69 -67 -131 39 124 -390 66 -151 -65 14 -109 57 74 102
2165 102 205 -103 -49 -113 -112 -135 -98 117 -13 -259 320 -140 -191 25 -201 -23 137 -160 -23 92 -229 73
2187 73 -41 -399 149 -32 53 -80 -55 -208 -76 -114 -21 -86 -128 58 -184 106 -162 -13 -67 91 -107 -118 77
2210 77 -32 -94 14 -14 52 -85 142 -119 54 -141 47 -233 -70 -105 10 -38 -112 -78 97 47 -78 -39 -14 -171
2234 -171 84 -38 -190 -113 -89 99 359 -84 146 -97 131 -193 230 301 -11 198 31 -125 133 -111 232
2255 232 -10 -239 -320 -20 -176 88 -188 47 -11 466 146 246 10 6 -76 -89 73 5 51 -216 28 -166 36
2278 36 -55 8 105 141 6 215 80 165 44 -39 16 -113 -265 101 1 132 248 94 -89 260 2 168 -79
2301 -79 126 -223 -150 276 -13 -55 104 39 86 -33 -45 2 130 45 133 113 -114 -32 294 -106 185 114 -23 -239
2325 -239 98 135 -131 -12 -129 238 111 89 118 37 -12 5 -248 27 104 -103 -65 -73 40 4 234 84 -184 26
2349 26 33 -172 13 -95 -5 -9 -15 88 -109 -10 133 -5 122 35 -78 85 -32 115 -34 23 -146 -52 -65 48
2373 48 -52 -101 -119 176 -210 16 -41 96 -210 3 -83 17 26 23 184 72 -62 -355 93 36 -77 -237 253
2396 253 192 -166 -56 188 -115 15 93 -17 -29 6 216 -137 -13 -56 116 -82 12 21 -13 -137 -27 118 -128
2419 -128 108 20 -14 118 -57 -10 130 -73 -163 -82 218 73 163 -31 -100 -10 47 67 194 36 200 44 7 200
2443 200 -196 -49 91 139 -58 -38 23 182 43 118 147 142 -145 152 14 65 14 -16 34 -161 279 -115 20 -43
2467 -43 -48 -1 262 105 19 -8 180 -25 -184 346 -48 -126 -17 123 -60 162 146 -249 69 32 -58 24 42 -291
2491 -291 245 -15 -218 17 -38 185 94 147 42 191 12 -115 27 -84 25 -85 -23 -104 -234 -111 -20 1
2513 1 -68 65 -158 1 -156 -152 -69 -125 15 15 -42 73 214 1 48 -114 -15 114 -163 97 98 -299 -80 14 108
2538 108 15 148 -77 96 -12 -167 70 -227 -3 -343 10 65 48 92 -17 114 -78 176 217 68 -55 -44
2560 -44 -109 -172 -78 -127 223 -178 -204 20 -154 79 -54 243 33 4 171 116 -7 -228 195 -49 36 -97 -22
2583 -22 279 -21 -59 156 80 89 51 13 -131 120 100 10 179 77 -34 -333 -216 -217 223 154 -216 105 -151 -191
2607 -191 -197 -196 58 -2 26 -157 -84 12 -22 41 57 258 14 79 -150 -104 240 -83 295 43 -32 -5 132 82 -85
2632 -85 92 55 168 329 45 -71 -61 -123 -20 -78 91 227 60 187 -81 -14 -34 143 106 -16 137 -223 -310
2655 -310 169 -86 191 -283 -202 -52 -33 37 12 -125 68 -27 -101 -180 457 63 76 -171 14 -53 -79 76 -159
2678 -159 -95 50 -41 73 -269 -327 163 55 129 35 -100 -200 -120 -44 155 83 -178 83 104 -86 -113 -61 -162 -112
2702 -112 84 -190 324 -99 -75 57 205 -83 289 209 43 -189 213 87 -20 -99 60 146 234 40 24 -62
2724 -62 -159 -120 -150 33 106 264 -15 -88 -216 -131 232 37 -154 -186 -43 1 179 121 -118 -107 -101 -130 46 -159 -161
2749 -161 99 -218 -136 16 -260 -165 -125 -71 158 112 -4 218 -148 -173 339 118 132 -143 223 -175 -69 226
2771 226 -117 -238 85 -41 91 12 -242 133 3 62 -241 -47 169 138 132 45 31 231 -229 -83 -276 61
2793 61 -148 7 -169 -67 257 -224 -9 -73 0 79 8 -50 326 42 4 71 98 -147 -47 -208 158 -202 -110
2816 -110 63 12 -10 -47 -79 -70 -184 -161 -100 23 -43 18 -80 79 196 -143 48 -6 -32 103 31 5 -178 -2 97
2841 97 -50 -91 -34 -6 66 58 -257 157 -129 -128 24 -205 123 157 -160 -211 -105 -64 94 172 118 81 216 206 -84
2866 -84 -143 21 -230 -142 78 78 30 -104 -212 169 -87 1 -67 -134 -76 -109 -93 239 15 86 36 -296 49 62 31
2891 31 -43 25 52 -67 132 62 -160 268 68 -101 76 -103 -46 -111 2 -51 161 29 -122 -21 -73 -56 -184
2914 -184 -96 -57 228 -143 51 58 -103 -145 233 187 -70 22 -84 -53 46 28 23 -127 -63 152 59 4 133 -58 -128
2939 -128 174 -215 -86 -74 -97 88 12 24 286 153 23 -65 56 -16 121 -20 -41 -49 65 -44 14 -10 -33 -127
2963 -127 -59 -21 -74 -122 17 -91 12 -88 186 35 289 46 145 -96 52 -228 -6 -9 -178 3 -128 -163 -103
2986 -103 -14 -107 19 -306 186 68 443 13 122 -4 154 -281 -145 -81 -65 -73 -17 -72 -77 -73 80 268 40 85
3010 85 36 -113 23 -178 -72 274 -109 -24 -336 33 242 -116 -42 7 82 280 -23 -44 -101 -2 117 -99 60
3033 60 7 175 6 146 14 81 -41 94 -32 69 117 51 -166 -107 149 -462 -10 73 -104 78 -129 -47 -18
3056 -18 122 174 -12 228 157 52 -39 -214 54 -159 -5 65 89 267 -170 -246 -81 20 -171 154 102 76 84 22
3080 22 -69 137 101 -280 -50 -233 196 -229 -89 -12 -125 105 40 6 -260 135 -113 89 58 -65 7 63 -157
3103 -157 -108 160 131 -154 160 -36 181 26 6 204 -222 105 289 31 -152 -209 56 4 79 56 -28 -139 -130
3126 -130 169 153 -51 -161 -23 -53 59 71 107 -223 -19 78 186 178 215 26 173 -45 -132 -39 -150 46 299
3149 299 114 66 224 -211 129 121 -75 -121 -123 1 92 36 49 215 -98 -61 -83 80 -128 231 -89 -72 -18 -11 -206
3174 -206 113 165 -25 -115 -16 23 -6 -110 -81 219 66 9 -20 -176 70 -2 -286 -77 -142 11 90 165 27 -122
3198 -122 -14 220 36 42 164 162 6 180 -57 75 -48 -158 -46 -171 -73 35 -186 245 30 82 144 47 -103
3221 -103 -150 -50 23 -239 -77 -151 -234 -20 150 258 -157 274 26 -72 29 -128 -94 -123 -70 13 -153 -32 -230
3244 -230 32 82 -134 15 119 -7 -139 62 -185 -225 -35 125 -18 -70 31 -170 -106 -90 -255 79 72 -93
3266 -93 96 -258 -73 55 80 -73 98 101 177 255 213 -35 362 123 -102 -8 265 64 -145 86 210 93 40
3289 40 46 67 -96 -60 -81 -44 -229 -101 61 23 175 120 135 -185 62 -61 -4 -151 -29 -40 88 -47 -200 80
3313 80 100 -23 -19 196 306 -60 -65 -32 100 79 149 -145 222 79 -396 -134 -166 37 -221 -124 234 127 110 291
3337 291 40 30 12 58 -91 -311 -141 -14 23 -92 -82 -2 -4 149 170 -51 55 -85 176 -2 70 -51 68
3360 68 149 -188 155 -32 -185 159 -182 -107 -114 73 -94 -61 -27 -62 -63 -104 106 38 104 79 91 -128 58 194 255
3385 255 -27 115 -253 83 52 -293 118 -220 50 62 -24 -186 -68 -117 -183 -38 34 -202 -149 -179 141 62 -174
3408 -174 -187 -111 -196 -165 -80 -3 115 89 230 52 39 126 141 -42 53 -214 -230 7 -180 357 191 50 -158 -71
3432 -71 -268 -107 -51 73 -149 175 -147 -87 -48 -40 -43 -141 81 -55 -127 -565 -206 93 -111 -199 219 -6 -75 56
3456 56 22 168 -316 -60 -13 127 -77 157 -79 -148 -115 118 4 -44 -134 47 311 180 25 -107 16 -100
3478 -100 -43 83 85 91 51 -203 107 -159 60 90 15 -114 119 52 -149 197 -15 -89 -121 46 164 184 -61 205
3502 205 -21 -95 -123 -72 -52 219 -29 17 -106 -247 140 -89 -174 -63 283 -59 107 281 -19 -49 -58 -80 136
3525 136 -74 -55 29 -202 -116 -67 322 -223 22 -269 3 -129 -221 45 -19 -133 50 111 201 92 -33 25 -121
3548 -121 -66 -81 31 147 -253 19 -28 -62 -114 267 -154 16 12 -142 -116 47 -93 -201 36 44 189 30 127 152
3572 152 -213 -123 -70 -50 78 2 -106 76 -135 -225 155 1 65 21 -225 211 105 353 -111 205 -221 106
3594 106 -216 150 18 -73 -174 66 70 -121 100 162 119 -110 73 187 -51 60 10 -98 -199 -13 -105 194
3616 194 201 194 383 170 -32 76 -266 -167 -97 -167 -215 -91 183 -94 -52 -83 -111 173 -116 -64 -34 -222 117 -45
3640 -45 -13 -40 -13 -73 407 -29 -201 141 38 -92 -86 168 -264 -70 -132 -276 -118 248 70 -89 -100 122 58
3663 58 72 15 43 219 -39 -135 151 120 -174 -65 -113 -25 3 -51 9 260 205 89 -98 -272 19 -216 11 215
3687 215 -165 107 -141 83 -33 -208 -61 -159 -167 -49 -128 53 -54 1 169 130 -111 -18 -262 -308 195 131 55
3710 55 -134 126 -47 -78 44 -36 -128 155 -4 163 89 -46 81 -14 17 -219 198 -20 -50 140 140 9 128
3733 128 121 -104 245 -86 24 381 -10 66 -176 1 -97 121 80 20 57 -26 305 30 -34 129 -47 32 218
3756 218 62 22 268 26 -74 -233 90 -115 -368 132 -18 -13 -281 -28 -157 37 45 -153 137 55 -84 -172
3778 -172 -57 -125 246 -276 -148 95 4 123 -68 -176 96 155 -85 -122 128 -11 81 48 174 -8 88 112 -40
3801 -40 -96 -118 172 55 -50 52 25 -51 -35 106 63 69 -209 21 23 5 27 -108 -98 17 150 -71 192 -255 29
3826 29 -74 29 -34 206 -149 -75 87 -49 159 -373 45 -277 -39 48 104 87 -40 -22 80 -121 79 -16 -147
3849 -147 30 17 -42 -52 -40 -142 34 104 33 264 -330 25 -50 102 173 -249 26 -91 34 96 237 -22 -144
3872 -144 236 1 -21 -174 -33 14 159 -64 42 3 -261 189 -49 145 92 -168 -68 -159 61 -81 -159 29
3894 29 -112 221 -135 105 56 29 -24 -247 12 232 135 19 -92 -48 218 201 166 9 185 17 -16 100 45
3917 45 -39 63 27 -59 -158 -168 -126 130 23 135 -72 54 25 94 33 -180 -81 -106 78 -147 157 276 -198 54
3941 54 31 -64 -1 224 183 -93 115 31 -120 243 -6 -39 -41 -244 -187 224 14 108 144 127 -22 -223 2 -5 51
3966 51 159 107 -9 106 166 136 85 -155 29 129 -272 19 161 -16 -39 209 156 194 -6 -246 -78 -186 -83
3989 -83 -224 104 -60 11 14 -18 -67 115 253 -52 -67 228 68 336 100 -195 -171 128 125 129 -22 -95 -86 9 -92
4014 -92 -98 -88 -103 55 -66 46 111 114 -99 -96 -57 81 -44 -96 122 103 195 -12 -99 -194 -61 88 92 -34 47 308
4040 308 -79 -21 111 -208 -245 274 124 -183 70 135 130 -99 -47 46 360 -157 256 156 -135 97 -241 -125
4062 -125 193 -122 -74 131 -145 182 5 174 6 130 109 32 81 -248 -30 -138 -158 79 -50 15 -20 -82 -165
4085 -165 152 -126 156 2 -71 265 64 69 -137 121 -63 117 -282 92 80 -108 310 -30 -105 93 81 199
4107 199 127 -22 -120 9 -38 -78 -72 -23 166 -5 8 -175 -6 1 -35 5 -108 208 36 254 -24 80 -28 -25 -100
4132 -100 -243 103 57 39 -211 -53 273 -179 -268 21 126 -189 -82 138 -114 273 -33 -154 -10 -109 191
4153 191 16 110 241 -154 -30 -85 -101 -109 4 3 60 -194 68 125 19 -75 -36 -17 143 40 -57 -147 -22 157 -102
4178 -102 -120 -31 12 -23 -223 -32 -49 68 128 -102 313 30 155 179 40 -155 -100 182 98 -253 55 -103 90
4201 90 81 -36 200 -130 -153 195 160 -104 2 -56 -89 10 343 -95 77 15 46 -13 12 174 -210 -150 7 44 109
4226 109 -150 70 169 85 -33 -297 -8 -151 -17 -350 -115 124 -25 51 -246 1 -46 -146 146 240 55 80
4248 80 -280 29 154 157 10 194 46 116 100 -50 -224 -89 43 -86 160 191 -401 108 -96 -59 -33 110 -133
4271 -133 42 -199 -164 54 -9 -86 70 146 48 -109 83 31 17 94 -47 6 45 -22 154 -55 -21 60 81 -110 -99
4296 -99 45 -77 190 -45 113 -228 347 -167 -56 50 -17 -159 -37 -29 -118 172 -285 -130 30 -85 191 187
4318 187 -70 -283 -169 -2 -115 -281 -140 -31 -24 -117 -12 -14 -32 215 38 -164 279 -53 -104 8 -68 -86 13
4341 13 119 -194 142 -44 -85 -62 -123 -105 -1 93 66 -74 30 -20 -127 -81 -275 -64 -96 119 -279 127 -76
4364 -76 -6 159 -115 13 303 -122 -138 -21 -150 -150 104 -135 -236 -66 93 128 108 -29 113 -274 -75 -224
4386 -224 -11 -83 -171 63 -159 121 -114 -198 -130 -80 69 -212 5 242 202 37 244 -15 216 33 -251 -8
4408 -8 18 167 -68 -60 28 86 -188 5 -78 -54 16 180 -107 45 198 -50 -110 -57 -54 75 48 -129 98 -124 139
4433 139 -10 137 -3 225 -209 159 -199 -170 -41 -3 -74 103 -98 -107 -10 25 187 -210 68 -8 -61 -165 232
4456 232 -68 -116 215 23 -48 -57 -322 38 -17 -125 75 27 -60 -14 -366 248 -209 47 -155 -154 -56 -84 53 -19
4480 -19 156 -16 -79 -36 -76 -187 -19 41 49 154 15 -197 -28 -139 -46 -228 -25 23 109 -85 89 22 66 206
4504 206 -1 156 -151 94 -183 -24 116 -161 -35 121 29 31 156 -89 -2 61 98 91 -101 -68 -228 20 2
4527 2 107 -171 -23 -145 32 -105 14 -80 -175 -149 248 -23 54 0 -104 -175 45 -339 -313 -119 -267 -1 -89
4550 -89 98 113 173 5 -131 -19 -231 -94 188 61 114 18 -31 29 -198 337 93 30 -112 -123 152 47 -221
4573 -221 2 171 42 -274 -82 105 37 -76 22 88 286 -4 -191 70 139 25 -94 -44 15 24 -11 -174 151
4596 151 -67 159 261 -60 -135 -69 -41 -39 -124 -37 -23 -242 -29 174 152 182 -39 109 -20 -15 120 25 -77 208
4620 208 -114 -459 -53 -88 144 -56 -36 132 9 146 -75 47 4 -55 29 77 -146 -103 -145 51 167 -168 -9
4643 -9 110 -5 45 -122 211 -195 152 -22 -145 43 166 33 -28 -26 -44 -32 -61 90 -197 108 49 99 -197 -37
4667 -37 53 -182 -168 22 -8 -140 -86 -105 326 -136 -42 13 -204 117 137 -18 52 -80 28 25 -3 298 -75 9 118
4692 118 -5 11 147 -125 63 -104 33 -39 -64 237 -261 -278 151 133 -81 47 -218 89 112 -108 -60 -7 -62
4715 -62 175 -140 -21 -43 85 -27 25 -129 -45 -181 -187 -99 -167 -59 -69 -77 269 100 57 129 124 127 183 -140 71 -118
4741 -118 -129 4 236 -14 92 -57 32 -54 -26 -205 -61 279 -235 -298 -174 138 19 -77 96 -176 -137 188
4763 188 -2 -78 93 41 -15 -13 -72 -20 -99 -33 350 -112 -40 166 -70 249 -132 13 -31 23 -275 -61 4 -189
4787 -189 -22 -129 -110 -140 84 -78 34 207 182 4 -64 -189 -86 7 -83 154 -181 -212 -185 65 -67 -20 50
4810 50 -175 126 46 218 -87 -142 -22 -356 166 -197 204 177 -229 -15 132 -70 202 106 204 273 88 13 -24
4833 -24 -57 29 119 56 55 91 23 -17 159 118 -236 -278 -124 146 149 -70 -23 -93 7 63 46 -385 6 99 330 175
4859 175 -264 -98 7 -163 179 179 -128 -192 -292 120 80 0 -16 -95 152 139 -173 -184 -209 136 65 -183 -82 -246
4883 -246 -144 17 -207 -43 21 86 24 269 -124 74 27 139 18 -202 95 -103 -56 43 105 88 41 130 8
4906 8 -161 233 -123 -148 312 19 4 -129 -40 -197 -150 39 141 -227 98 173 -15 226 65 231 -178 91
4928 91 49 -51 99 -40 -175 -27 182 143 -87 -32 3 87 220 -158 -205 47 -29 -57 -103 -2 -51 -62 -121 208
4952 208 -298 -205 -138 -209 -19 66 -168 82 99 52 56 -65 118 -36 91 51 36 -93 221 72 -138 236 94
4975 94 -78 214 -99 -112 -120 -41 -82 -152 27 -163 197 -112 68 35 -12 -511 374 -170 -155 -173 -1 96 -192 21
4999 21 32 127 238 122 23 -110 179 -77 302 0 -140 -22 -39 -18 234 118 180 -4 -214 -172 -143 -158 -109 -78
5023 -78 -182 27 6 -32 -14 86 71 -186 8 -93 186 -188 -12 -125 -73 -40 -38 -127 39 -59 -98 -100 -46 76 -298
5048 -298 -150 116 54 -52 -68 235 -140 85 -52 90 -12 -106 37 52 167 -269 15 -128 -27 -30 -189 -112
5070 -112 167 -287 -157 172 -160 125 -194 -141 -123 -138 225 11 203 -172 90 163 40 115 375 52 -16 -71
5092 -71 156 -192 15 -166 236 -133 -85 161 193 -25 160 -27 -93 -76 -44 203 -20 143 236 -74 140 -390
5114 -390 -148 -199 -58 9 -90 146 2 27 113 6 -87 61 -88 3 -267 -124 142 -156 -33 127 -219 223
5136 223 -115 95 -38 199 -111 -63 -113 -122 167 -109 113 132 41 233 37 -27 137 -126 79 -17 7 -60 -276
5159 -276 41 107 -38 252 -379 11 209 -30 -63 -178 -158 15 -267 -1 -192 -21 24 -260 -21 -58 -113 -9
5181 -9 70 -13 236 -72 344 -92 8 -242 109 -87 -118 15 164 99 16 11 -60 -100 -37 294 31 -104 75 -183
5205 -183 143 -151 50 -115 60 151 142 -128 148 17 57 93 -130 -38 -201 -46 129 20 -95 97 87 -180
5227 -180 14 -170 -127 -118 -44 4 -130 -66 69 266 203 -56 50 355 -116 25 431 -281 71 304 -90 68
5249 68 -93 -37 145 -176 6 64 -77 -43 -91 -96 121 207 133 -79 203 104 -130 34 61 -227 -16 13 7 277 149
5274 149 -255 64 12 73 -125 190 -236 13 20 40 70 1 -104 322 -337 -111 -71 -125 117 -68 155 -84 10
5297 10 -303 -122 -40 126 144 -95 -251 200 -157 10 -252 -8 143 10 -53 -106 -24 -24 -105 160 156 -35 -292 11
5321 11 33 4 -10 38 -12 -138 -83 146 -135 -324 98 -35 244 16 -167 13 -37 2 -199 149 -56 -128 -169 106
5345 106 107 -57 99 -53 -92 -45 97 -111 -155 29 -33 50 -28 -120 -232 -162 100 -90 -138 -99 -181 35 -27 127 -303
5370 -303 -11 16 -61 -101 -32 192 51 -65 75 -155 48 -53 -105 -187 -27 -77 -38 373 -186 -178 -117 43 254 153
5394 153 -79 54 201 -68 -49 25 127 44 -4 185 115 -71 31 134 -91 -118 -140 75 -353 -58 16 -85 166
5417 166 6 -134 -88 -302 -89 57 34 66 177 -158 -74 -51 -82 83 -25 109 300 12 -53 -165 216 -75
5439 -75 43 66 46 -128 207 -14 -3 106 -20 39 -22 19 0 215 -337 -37 -195 -177 139 -109 71 48 -159
5462 -159 -89 80 -173 -222 66 117 -141 277 66 189 94 -189 -96 -93 -174 87 -259 156 16 -30 45 -19 33 -61
5486 -61 409 314 52 -47 12 -53 -4 14 -96 -383 -7 -57 253 254 -24 -8 135 -299 64 91 93 129 5 -149 125
5511 125 -243 -223 189 -185 -144 -266 16 163 -23 -267 59 -107 -73 58 -23 149 4 -100 -12 -177 -223 17
5533 17 43 -26 -88 -28 -330 53 164 119 -60 -48 -21 -107 58 123 -51 68 -26 -36 52 -50 -18 189 113 258 109
5558 109 60 -191 -44 88 281 73 -172 13 17 -71 -46 136 57 161 182 5 194 34 21 47 44 -77 83 -56
5582 -56 252 -11 -199 151 19 182 -215 -50 -77 -133 34 65 -12 -32 75 -18 -6 157 48 6 -180 -45 57
5605 57 122 -34 -13 33 219 -89 -61 -102 -216 211 197 -75 -52 169 162 79 90 -17 83 -14 -71 187 136 254 49
5630 49 -24 -46 -18 30 -25 344 -19 -133 30 57 78 -98 67 9 -23 21 77 34 109 -128 -5 -71 144 113 145 440
5656 440 67 -62 89 -216 -70 194 -295 -69 -88 231 -23 -43 -60 64 11 9 -20 96 -168 -136 -8 -139 37
5679 37 97 122 95 150 31 -46 -18 34 -356 -48 -301 -347 89 133 128 -203 -147 -39 -23 -82 -157 125 -155 108 208
5704 208 -176 -84 -5 229 46 -22 133 317 74 15 74 37 320 -61 -4 6 30 105 -339 -239 68 -3 53 153
5728 153 24 -68 110 81 11 -52 -34 -100 -160 11 5 -115 145 218 -172 159 -12 125 -51 34 -84 109 34 -279
5752 -279 -321 136 84 -58 -104 -60 -43 7 160 -2 -108 -91 168 71 -151 -324 105 -83 -274 -114 -139 91 297
5775 297 -95 156 -182 78 -99 67 -12 -164 -109 -29 -127 -17 -141 7 148 -122 14 -9 -74 -136 78 73 60
5798 60 -83 -96 -85 -99 -89 99 80 73 191 -95 -115 156 -33 167 -100 -228 -46 25 -105 -71 -10 -22 -128 -105 -89
5823 -89 38 156 -71 50 -126 12 232 -155 -41 107 59 -113 40 189 -155 68 63 153 208 84 109 -14
5845 -14 100 -30 -279 141 30 43 0 52 62 89 21 -250 149 240 21 386 -20 191 -15 -66 192 121 83 -52
5869 -52 288 8 -70 -144 161 -89 152 195 102 -223 5 382 88 214 58 -94 88 42 -54 -18 -328 20 17
5892 17 -120 236 54 199 69 186 11 91 2 -117 7 69 54 87 -16 142 -12 211 -160 -189 -204 1 67
5915 67 -47 43 49 389 -196 67 -141 -78 -165 -289 -148 -122 -150 111 -14 21 -233 -243 -77 -64 64 167 211 -153
5939 -153 93 114 18 158 -10 93 119 -15 -79 -91 24 -80 -36 75 -80 -54 302 213 109 -109 44 80 -9
5962 -9 55 -220 -217 -121 34 25 -101 32 -86 53 -128 18 89 5 -48 -11 283 -175 -138 139 236 -72 20 9 -240
5987 -240 8 -46 6 -202 140 -118 275 115 -14 249 -84 73 -169 -57 -110 -140 49 -22 -375 233 -140 76
6009 76 173 218 -120 -119 -17 -42 207 -54 -114 -67 79 -21 181 -74 18 56 -132 72 -113 -131 282 168 -31 -59
6033 -59 -25 -12 72 -49 -191 -14 25 -104 -193 9 57 -38 -85 53 -243 -112 -172 -226 145 -132 250 -174 132 133
6057 133 77 199 65 -125 115 -29 166 -268 -35 197 -47 25 159 -134 20 134 74 123 89 -72 -124 55
6079 55 -37 28 -112 70 -176 296 12 74 111 -168 -127 -334 -262 -16 49 -7 -57 -91 94 83 231 124 71 -110
6103 -110 -62 -77 74 136 71 -70 100 170 73 -158 194 -74 32 -125 -344 62 94 240 -4 9 -171 -51 -166
6126 -166 46 99 93 -127 94 -219 14 118 38 103 -58 204 -27 -54 -160 -48 62 150 -44 -303 28 13 33
6149 33 79 -184 50 18 -331 34 -90 -12 -244 -62 519 -2 54 -160 -28 173 21 -90 -229 109 152 -57
6171 -57 93 286 -238 -30 -40 74 -30 164 273 -52 -145 -113 -57 -151 113 -81 -53 -493 -92 -12 43 -139 -27
6194 -27 35 165 -77 -83 35 -98 -105 4 8 30 -24 197 -58 8 -221 -319 33 26 -77 174 3 -202 13 -66 -265
6219 -265 43 40 -93 -23 82 178 42 -136 -34 -315 -313 -84 138 241 -162 167 63 68 62 -275 90 41 206 -85
6243 -85 -104 46 -38 85 -123 -189 43 63 96 -2 -151 77 -179 21 -290 -175 -111 31 -80 -30 -132 288 51
6266 51 -15 106 140 209 201 134 87 133 -22 98 -237 64 -61 -23 -215 -40 -30 -219 -194 145 6 37 -20 -192 -145
6291 -145 -168 97 93 6 -56 75 216 -39 -129 -79 -66 -42 -35 -159 -209 128 -7 -359 135 -184 31 -47 97 -182
6315 -182 -33 34 4 297 155 136 -109 24 243 -34 -29 31 -152 224 256 -214 137 42 20 -49 36 -63 255 -419
6339 -419 56 37 -178 51 -57 386 24 99 272 164 -131 -171 33 -23 47 11 -36 17 -15 -92 196 127 49 108
6363 108 154 181 -95 38 -44 64 -129 -295 -193 -77 224 89 4 176 191 21 -82 -7 74 29 100 48 208
6386 208 2 22 46 40 161 168 -43 -44 -43 340 269 59 -53 -150 -10 95 191 70 32 13 -37 -14 64 31 162 -66
6412 -66 188 -18 73 -11 -60 57 -156 -259 75 13 -151 401 110 -36 68 -105 -346 95 19 119 112 -26 49
6435 49 -313 -121 -89 -118 257 -81 65 133 -141 -293 11 30 153 79 112 -176 28 -47 -196 24 -194 44 -93
6458 -93 -31 152 48 201 -120 -98 -102 -222 152 -225 -216 138 159 115 -95 187 -29 -7 -205 -60 -129 -186 -65 48
6482 48 -164 -82 -20 -112 -19 132 -5 -103 -129 33 209 -1 -160 -19 -65 -30 -77 -213 63 47 -57 -171 98 198
6506 198 2 75 5 -4 116 -98 138 -47 36 -180 -78 72 41 56 24 1 -208 -234 9 -44 -11 22 -132 -138 48
6531 48 65 -123 -13 52 21 155 112 67 89 -14 123 77 -127 194 53 16 76 59 102 -132 -49 13 -256 17 -32
6556 -32 209 -90 -38 -147 -101 -38 90 -40 80 -74 131 -20 47 312 270 -64 -35 242 19 258 58 187
6578 187 34 -31 -85 68 118 156 64 -162 158 122 3 -101 -189 -102 -203 -130 213 28 -10 -160 -104 -73 -67 5 -155
6603 -155 34 -43 -139 -147 227 -70 -232 76 -108 89 -203 12 85 101 23 -96 -44 81 -146 70 -243 12 10
6626 10 -117 96 223 -195 113 -58 -29 -178 -106 154 -122 73 -22 81 -72 -110 -133 -30 191 51 -187 201
6648 201 -22 -121 159 -38 77 -34 -138 -112 -95 159 34 170 10 -155 6 -97 -123 65 153 -140 -134 -23
6670 -23 -134 -6 -43 -195 -218 -163 -61 -207 -51 99 -141 172 -63 -37 125 4 38 -42 240 -107 -103 189 -76
6693 -76 -73 183 -62 -121 9 -107 41 215 30 62 -128 56 118 270 28 -341 -60 38 -281 -119 -96 172 -146
6716 -146 -6 -161 -103 81 220 -186 -127 -49 3 82 -20 -111 -31 -29 3 65 217 37 28 -94 147 -131 107 -311
6740 -311 145 -153 23 -24 -76 -33 86 -113 159 -173 -166 -132 77 81 -262 -176 -73 -91 -97 212 -30 76 -163 27
6764 27 121 -84 -161 47 -106 -168 -11 124 145 -273 21 146 101 -308 -82 -178 -87 -46 -2 41 46 20 66 -91 47
6789 47 31 0 112 -121 232 -76 52 -229 -241 135 -144 -56 368 -28 189 195 -60 -61 -188 160 -130 -91 102
6812 102 -117 223 -212 -132 -229 -108 -142 1 -235 56 16 -86 209 -27 29 -1 -165 41 -48 -99 89 95 -25
6835 -25 52 88 154 33 33 131 -128 149 -115 195 132 -6 243 131 -213 23 195 -89 -72 -100 100 35 214 120
6859 120 95 23 -86 47 268 133 101 -188 -213 27 263 -26 105 178 138 204 -191 213 109 164 59 39 200
6882 200 -140 43 -1 -35 -99 186 -117 -146 191 -52 111 -11 41 82 -63 17 -34 -134 7 -6 30 -51 -75 252
6906 252 128 93 -14 33 -158 -67 183 32 -155 69 -270 -77 44 140 1 -200 124 139 -146 -90 -114 -210 188
6929 188 -81 -252 0 -35 63 -102 39 100 -217 -75 92 72 -43 -180 -75 167 79 -218 -300 38 -2 -170
6951 -170 35 -7 151 -45 -299 -99 -87 67 -62 -164 -81 115 -178 -178 -25 -69 283 -35 -52 -209 136 54 -43
6974 -43 35 -19 -136 112 42 -159 26 -36 -6 -142 18 -19 -17 -216 -80 -59 37 33 -11 88 -223 -129 59 92 56 -89
7000 -89 -46 6 64 -17 2 -32 -32 -96 -112 -275 -74 162 106 -7 -284 124 75 110 105 61 -22 -54 -127 -177 -170 -22 -18 -125
7028 -125 -165 56 71 124 -68 55 21 50 -54 -90 -73 77 -25 157 -15 6 23 229 -225 12 -122 103 -25
7051 -25 -213 -5 -26 86 9 69 -274 49 57 121 231 9 -52 -53 -82 39 -156 -146 39 -92 261 108 59 -162
7075 -162 134 52 189 298 100 130 158 169 14 -199 -247 -5 89 71 -117 116 105 -1 22 -182 30 38 -53 -172
7099 -172 149 -151 -129 -66 -80 76 -223 15 -53 -13 -52 54 0 -31 38 -20 -103 73 -14 -20 31 -49 81 32 188 -91
7125 -91 -179 8 -163 54 142 20 -22 26 155 -264 -134 106 -65 167 -25 -179 34 -222 -155 222 -112 138
7147 138 -83 -75 277 -181 128 247 75 81 -177 21 -95 -59 -108 -30 -266 -141 363 -21 -20 -161 181 -138 230
7170 230 193 10 -328 89 90 174 -95 152 -15 -10 -142 -63 -31 -149 151 198 -372 -218 -19 -93 21 184 -77
7193 -77 21 91 -17 -86 -143 234 -172 191 -99 122 -30 22 134 -5 5 63 115 73 -103 135 -5 17 182 97
7217 97 -39 178 54 26 -59 66 -131 68 -68 103 25 -163 -104 118 -22 -39 -14 -192 193 -144 78 -18 -97
7240 -97 -48 161 35 23 20 22 187 164 -127 162 158 83 -187 -20 101 -234 74 264 107 -187 -230 62 -140 -95
7264 -95 65 84 142 -99 47 -192 -1 86 3 -117 -52 39 -46 13 -33 101 -33 170 111 102 -140 -282 -110 -344
7288 -344 -160 234 -191 -15 103 -93 -110 -157 -16 191 -4 -24 47 148 140 -101 -66 174 -103 -132 3 119 -195
7311 -195 -52 7 -86 -54 -186 -21 235 -54 -136 75 -14 -153 -204 55 137 -25 -108 28 -45 -137 -71 -50 119 67
7335 67 43 105 47 39 113 75 11 -180 141 355 95 36 40 56 103 171 -212 298 -89 165 -5 23 233 118 -195
7360 -195 -164 127 104 239 142 -51 164 -2 170 213 147 -135 -50 155 -135 -71 28 -248 94 121 90 -108 148
7383 148 -27 161 34 52 -133 50 32 -113 58 146 317 -55 43 -124 -43 -5 0 -34 -14 -237 407 -60 -78 -50
7407 -50 -20 98 -103 260 -331 -283 149 -185 3 84 165 27 98 -153 175 -82 5 -33 24 146 -193 -118 -221
7430 -221 -139 91 132 -200 84 65 58 96 46 75 45 -157 -85 -36 -174 -114 222 146 -95 -38 -194 46 -15 -21 233 -166
7456 -166 -28 90 236 -133 269 21 355 -85 91 -239 36 162 81 -164 -260 -30 186 -62 -286 -71 31
7477 31 -117 64 69 -136 -36 -4 -118 -119 114 23 -10 19 -70 14 -40 123 -34 283 -43 78 58 -122 -81 -129 114
7502 114 100 -72 242 -164 -94 -407 -61 27 61 -14 -61 -51 61 -50 -203 -14 121 58 115 13 -116 -52 298
7525 298 -37 254 218 -63 -10 -196 45 197 -18 -18 -112 -126 -164 23 6 -8 67 333 6 87 71 -21 237 -138
7549 -138 -222 -106 113 69 30 208 13 -162 -218 -75 -135 -159 -117 116 229 225 -131 97 -59 61 4 -119 148
7572 148 -69 108 56 -216 -100 41 -56 -297 91 211 -327 -91 -119 117 75 -184 -7 -35 -132 196 117 64 289
7595 289 100 -67 -7 108 -164 -102 69 37 64 -49 309 39 232 120 -20 -158 -31 -1 -91 -70 189 -77
7617 -77 -49 -214 90 26 23 -22 128 -53 -32 -81 -30 -231 3 -108 -94 143 -148 -55 -26 -93 -202 -206 67 53 96 4
7643 4 -35 109 15 -100 201 -27 233 70 -120 165 144 161 -298 235 -172 -140 59 -182 38 44 -191 101 24
7666 24 17 -100 219 -253 -33 -25 -203 237 -155 233 -103 44 173 166 -143 -29 119 14 -272 76 -28 -200
7688 -200 135 -13 -141 -182 49 177 32 -253 0 -82 -132 -8 -75 -95 -290 -147 -104 -168 -173 -72 273 -70 64
7711 64 57 145 32 -82 -48 -71 82 103 -441 52 125 -244 254 -70 132 117 -101 -48 -254 40 38 -199 -179 55
7735 55 28 234 -138 -67 57 -278 -74 -217 -30 268 76 63 351 -85 3 -207 -38 125 -43 -47 -79 168 -25
7758 -25 -139 -49 37 207 153 -71 -358 -119 19 130 81 -101 223 108 -14 132 -69 -45 -131 47 -109 -157 33
7781 33 103 41 -44 81 -224 106 38 -1 0 -231 29 244 43 64 40 168 40 -315 287 152 -231 -125 186
7804 186 161 236 97 -68 112 111 5 39 -40 45 308 -38 -109 137 -105 195 -48 -26 -27 59 22 -32 151 7 98
7829 98 136 -46 -154 243 73 -132 156 -20 -39 143 -135 198 263 -7 -245 -58 -297 120 -2 126 -196
7850 -196 -21 -90 -217 51 -99 153 -201 112 -129 -91 -121 -8 82 276 105 -34 124 -85 -65 -157 -123 67
7872 67 -165 -95 52 -315 100 -3 85 -282 155 -40 -25 -137 50 -27 -41 -32 -245 -189 224 -125 -87 -182 -144 197
7896 197 -141 -96 131 -102 3 306 208 165 107 -254 -167 -149 222 57 -154 109 -39 140 101 -41 98 -197
7918 -197 -253 -239 -225 -198 -276 77 -395 38 245 30 121 163 -75 -272 102 208 8 -93 45 -54 31 87 87 -7
7942 -7 38 44 61 3 -70 -50 -168 138 301 45 4 -259 -80 -311 153 86 -27 31 127 -55 -73 149 162 -49 -179
7967 -179 98 3 -243 62 81 32 -30 126 199 32 -9 141 -101 277 -240 -49 70 -30 -47 -44 240 -54 148
7990 148 -148 91 109 -16 53 -39 -125 -63 -68 -55 -85 75 -96 -118 200 -176 -119 45 -179 280 49 58 -73 93
8014 93 147 93 -173 127 -210 121 -153 67 -200 49 -78 -160 -48 -100 24 -177 209 -66 212 75 136 38
8036 38 151 -53 -42 69 -44 -23 9 37 -354 -89 79 -31 87 107 258 28 55 235 -82 137 -113 -114 -108 253
8060 253 79 177 199 99 121 174 62 66 48 129 181 -398 -182 125 179 -238 -27 9 -3 -99 -115 -15 36 4 -38 -51
8086 -51 -25 -5 114 5 109 225 183 -52 154 142 -20 -174 -164 150 110 -119 175 113 -64 252 -99 -23 51
8109 51 -3 -142 -98 -42 -32 169 -1 87 246 143 -143 102 -25 18 276 -8 -109 -29 9 115 -194 53 153
8132 153 159 8 -70 231 -208 -44 7 219 -174 -341 -61 -53 -185 -14 -114 -164 74 110 -81 304 -176 -47 98
8155 98 64 118 137 -200 3 50 -196 92 94 -42 68 115 104 113 -123 -169 -98 201 80 142 -9 149 18 118 116
8180 116 66 -188 21 80 63 175 -92 -59 284 -122 -81
8191h1
##END NTUPLES=NMR FID
##END=
