##TITLE=1H_3-2024
 CDCl3
 8 sc, 
 12.1.2024
##JCAMPDX= 6.0         $$ Bruker NMR JCAMP-DX V2.0
##DATA TYPE= NMR FID
##DATA CLASS= NTUPLES
##ORIGIN= UXNMR, Bruker Analytische Messtechnik GmbH
##OWNER= root
$$ XWIN-NMR		Version 3.5
$$ Fri Jan 12 14:18:54 2024 Russian Standard Time (UT+4h)  she@DPX200
##.OBSERVE FREQUENCY= 200.1313
##.OBSERVE NUCLEUS= ^1H
##.DELAY= (6, 6)
##.ACQUISITION MODE= SIMULTANEOUS
##.ACQUISITION SCHEME= undefined
##.AVERAGES= 8
##.DIGITISER RES= 18
##SPECTROMETER/DATA SYSTEM= spect
##.PULSE SEQUENCE= zg30
##.SOLVENT NAME= CDCl3
##.SHIFT REFERENCE= (INTERNAL, CDCl3, 0, 15.7039)
##AUDIT TRAIL= $$ (NUMBER, WHEN, WHO, WHERE, WHAT)
$$ ##TITLE= Audit trail, XWIN-NMR		Version 3.5
$$ ##JCAMPDX= 5.01
$$ ##ORIGIN= Bruker BioSpin GmbH
$$ ##OWNER= she
$$ F:/spectra/data/she/nmr/H-F/1/audita.txt
$$ ##AUDIT TRAIL=  $$ (NUMBER, WHEN, WHO, WHERE, WHAT)
(   1,<2024-01-12 14:17:37.79 +0400>,<she>,<DPX200>,
      <created by zg, POWCHK disabled, PULCHK disabled
       configuration hash MD5:
       00 E9 B6 7A A2 85 ED C7 34 08 36 98 17 FE 4E 26
       data hash MD5: 16K
       FD 6F A9 85 63 0C C2 BF 37 73 76 83 30 96 EF 57>)
$$ ##END=
$$ 
$$ hash MD5
$$ 79 1E 50 3D 85 08 23 CE 9C D3 FD 79 E6 B5 3A 7E
##$RELAX= 
##$RELAX= 
##$RELAX= 
##$RELAX= 
##$RELAX= 
##$RELAX= 
$$ Bruker specific parameters
$$ --------------------------
##$DU= <F:/spectra>
##$EXPNO= 1
##$NAME= <H-F>
##$PROCNO= 1
##$TYPE= <nmr>
##$USER= <she>
##$AMP= (0..31)
100 100 100 100 100 100 100 100 100 100 100 100 100 100 100 100 100 100 
100 100 100 100 100 100 100 100 100 100 100 100 100 100 
##$AQSEQ= 0
##$AQ_mod= 1
##$AUNM= <au_zg>
##$AUTOPOS= <>
##$BF1= 200.13
##$BF2= 200.13
##$BF3= 200.13
##$BF4= 200.13
##$BF5= 200.13
##$BF6= 200.13
##$BF7= 200.13
##$BF8= 200.13
##$BYTORDA= 1
##$CFDGTYP= 0
##$CFRGTYP= 5
##$CHEMSTR= <none>
##$CNST= (0..31)
1 1 145 1 1 1 1 1 1 1 1 1 1 1 1 1 1 1 1 1 1 1 1 1 1 1 1 1 1 1 1 1 
##$CPDPRG= <>
##$CPDPRG1= <>
##$CPDPRG2= <>
##$CPDPRG3= <>
##$CPDPRG4= <mlev>
##$CPDPRG5= <mlev>
##$CPDPRG6= <mlev>
##$CPDPRG7= <mlev>
##$CPDPRG8= <mlev>
##$CPDPRGB= <>
##$CPDPRGT= <>
##$D= (0..31)
0 1.2 0 0 0 0 0 0 0 0.06 0 0.03 0 0 0 0 0.0002 0 0 0 0 0 0 0 0 0 0 0 0 
0 0 0 
##$DATE= 1705054657
##$DBL= (0..7)
120 120 120 120 120 120 120 120 
##$DBP= (0..7)
150 150 150 150 150 150 150 150 
##$DBP07= 0
##$DBPNAM0= <>
##$DBPNAM1= <>
##$DBPNAM2= <>
##$DBPNAM3= <>
##$DBPNAM4= <>
##$DBPNAM5= <>
##$DBPNAM6= <>
##$DBPNAM7= <>
##$DBPOAL= (0..7)
0.5 0.5 0.5 0.5 0.5 0.5 0.5 0.5 
##$DBPOFFS= (0..7)
0 0 0 0 0 0 0 0 
##$DE= 6
##$DECBNUC= <off>
##$DECIM= 32
##$DECNUC= <off>
##$DECSTAT= 4
##$DIGMOD= 1
##$DIGTYP= 9
##$DL= (0..7)
0 120 120 120 120 120 120 120 
##$DP= (0..7)
150 150 150 150 150 150 150 150 
##$DP07= 0
##$DPNAME0= <>
##$DPNAME1= <>
##$DPNAME2= <>
##$DPNAME3= <>
##$DPNAME4= <>
##$DPNAME5= <>
##$DPNAME6= <>
##$DPNAME7= <>
##$DPOAL= (0..7)
0.5 0.5 0.5 0.5 0.5 0.5 0.5 0.5 
##$DPOFFS= (0..7)
0 0 0 0 0 0 0 0 
##$DQDMODE= 0
##$DR= 18
##$DS= 0
##$DSLIST= <SSSSSSSSSSSSSSS>
$$ [...]
##$SUBNAM2= <"">
##$SUBNAM3= <"">
##$SUBNAM4= <"">
##$SUBNAM5= <"">
##$SUBNAM6= <"">
##$SUBNAM7= <"">
##$SUBNAM8= <"">
##$SUBNAM9= <"">
##$SW= 18.0517328524113
##$SWIBOX= (0..15)
0 0 2 0 0 0 0 0 0 0 0 0 0 0 0 0 
##$SW_h= 3612.71676300578
##$TD= 16384
##$TD0= 1
##$TE= 0
##$TE2= 300
##$TE3= 300
##$TEG= 300
##$TL= (0..7)
0 120 120 120 120 120 120 120 
##$TP= (0..7)
150 150 150 150 150 150 150 150 
##$TP07= 0
##$TPNAME0= <>
##$TPNAME1= <>
##$TPNAME2= <>
##$TPNAME3= <>
##$TPNAME4= <>
##$TPNAME5= <>
##$TPNAME6= <>
##$TPNAME7= <>
##$TPOAL= (0..7)
0.5 0.5 0.5 0.5 0.5 0.5 0.5 0.5 
##$TPOFFS= (0..7)
0 0 0 0 0 0 0 0 
##$TUNHIN= 0
##$TUNHOUT= 0
##$TUNXOUT= 0
##$USERA1= <user>
##$USERA2= <user>
##$USERA3= <user>
##$USERA4= <user>
##$USERA5= <user>
##$V9= 5
##$VALIST= <valist>
##$VCLIST= <CCCCCCCCCCCCCCC>
##$VD= 0
##$VDLIST= <DDDDDDDDDDDDDDD>
##$VPLIST= <PPPPPPPPPPPPPPP>
##$VTLIST= <TTTTTTTTTTTTTTT>
##$WBST= 1024
##$WBSW= 4
##$XGAIN= (0..3)
0 0 0 0 
##$XL= 0
##$YL= 0
##$YMAX_a= 157727
##$YMIN_a= -142937
##$ZGOPTNS= <>
##$ZL1= 120
##$ZL2= 120
##$ZL3= 120
##$ZL4= 120
##$ABSF1= 10
##$ABSF2= 0
##$ABSG= 5
##$ABSL= 3
##$ALPHA= 0
##$AQORDER= 0
##$ASSFAC= 0
##$ASSFACI= 0
##$ASSFACX= 0
##$ASSWID= 0
##$AUNMP= <proc_1d>
##$AZFE= 0.1
##$AZFW= 0.1
##$BCFW= 1
##$BC_mod= 2
##$BYTORDP= 1
##$COROFFS= 0
##$CY= 11.3945322036743
##$DATMOD= 1
##$DC= 2
##$DFILT= <>
##$DTYPP= 0
##$F1P= 15.7292609196834
##$F2P= 12.9074282941183
##$FCOR= 0.5
##$FTSIZE= 0
##$FT_mod= 4
##$GAMMA= 1
##$GB= 0.15
##$INTBC= 1
##$INTSCL= 1
##$ISEN= 128
##$LB= 0.24
##$LEV0= 0
##$LPBIN= 0
##$MAXI= 10000
##$MC2= 0
##$MEAN= 0
##$ME_mod= 0
##$MI= 1.114404
##$NCOEF= 0
##$NC_proc= 0
##$NLEV= 6
##$NOISF1= 3.799351
##$NOISF2= 2.8
##$NSP= 1
##$NTH_PI= 0
##$NZP= 0
##$OFFSET= 15.70392
##$PC= 1
##$PHC0= -24573.42
##$PHC1= 6.4527
##$PH_mod= 1
##$PKNL= yes
##$PPARMOD= 0
##$PSCAL= 0
##$PSIGN= 0
##$REVERSE= no
##$SF= 200.130013532006
##$SI= 16384
##$SIGF1= 3
##$SIGF2= 2
##$SINO= 400
##$SIOLD= 16384
##$SREGLST= <1H.CDCl3>
##$SSB= 0
##$STSI= 0
##$STSR= 0
##$SW_p= 3612.71676300578
##$SYMM= 0
##$S_DEV= 0
##$TDeff= 0
##$TDoff= 0
##$TI= <>
##$TILT= no
##$TM1= 0
##$TM2= 0
##$TOPLEV= 0
##$USERP1= <user>
##$USERP2= <user>
##$USERP3= <user>
##$USERP4= <user>
##$USERP5= <user>
##$WDW= 1
##$XDIM= 8192
##$YMAX_p= 0
##$YMIN_p= 0
$$ End of Bruker specific parameters
$$ ---------------------------------
##NTUPLES= NMR FID
##VAR_NAME=  TIME,          FID/REAL,        FID/IMAG
##SYMBOL=    X,             R,               I
##VAR_TYPE=  INDEPENDENT,   DEPENDENT,       DEPENDENT
##VAR_FORM=  AFFN,          ASDF,            ASDF
##VAR_DIM=   8192,          8192,            8192
##UNITS=     SECONDS,       ARBITRARY UNITS, ARBITRARY UNITS
##FACTOR=    0.0002768,     1,               1
##FIRST=     0,             0,               0
##LAST=      2.2672688,     0,               0
##MIN=       0,             -142937,         0
##MAX=       2.2672688,     157727,          0
$$ Real data points
##PAGE= N=1
##DATA TABLE= (X++(R..R)), XYDATA
$$ [...]
2008b79J153j246J091k84j754J835l63j492J958j174N18J761j957N05R05j512
2024c35O38j48j670J841n13j361J958r60L11J322j706O93J330k081R56J87j224
2041g62J799p67j173K190j096l72J159j880P63Q62j983J081R8q55J699q38q42
2058i17K286r70n29J231j980J120N51k011J463Mq55J494p29n64J694j573n10J072
2076B77j715R42Q10j701J718K99j063J754q93m45J549j920j11J258j725Q98O2
2093fj236J922j46j320J792j103l75J213j859M79J032j606J307M16r88J768m19
2110H71j262J680j019p15J299k129M33J295j844J227O60q97J371p31p94J542j201
2127b14m52R81j582Q54J020j466J451N72j214J380q70j173J425j383n48R78j476
$$ plain form
2008 -279 874 -372 719 435 -1319 516 153 -1339 619 -555 -37 1724 -233 272 1177 -335
2024 -335 303 155 -1515 326 -187 -1548 410 -550 -239 1083 -623 70 1400 -681 275 462 -762
2041 -762 1037 270 -903 1287 191 -181 978 -902 -139 723 -1260 -179 -81 -936 763 -75 -917
2058 -917 1369 399 -130 1101 -879 241 792 -1219 244 248 -607 887 158 -406 1288 -285 -795 277
2076 277 -1438 -496 314 -1387 331 630 -433 1321 428 -17 1532 -388 -499 759 -966 -68 -6
2093 -6 -1242 680 534 -786 1006 -97 -472 741 -1118 -639 393 -1213 94 510 -478 1290 871
2110 871 -391 1289 270 -445 854 -1275 -842 453 -1391 -164 496 -401 970 239 -555 987 -214
2127 -214 -666 315 -1267 -413 607 -859 592 1164 -50 1330 460 -713 712 -671 -1219 -241 -1717
2144a717J200J166j411J703K06j031J526j114r01J367j769k00J022j215J252O92
2160G76j390J542J36j346J074r51p45R34j330M3J404r52J095Q69j090J231pj434
2178a41J267j261q59R88j490K87J385j052R99P16j256J658n13j313J326j086n37
2195h82J158j508P37J295j246J205L66j129J182q78j158J129j017q28J614j484
2211a444Q90J284j294J312N31j297J237o18j373J545j323m25J464j381Q06J085
2227I99j406J087J23j285J072r08p12J481j270j39J449j093Q22Q86j180J032o7
2244H91j351J275q40q61J215j265jJ750j234L77P88j299J316k97j378J539q83
2261b58n19J203j121M63J016j297R64M96j428J251n09j180J318q02n85J567j376
$$ plain form
2144 -1717 -517 649 -762 941 1147 116 1642 528 -373 994 -775 -975 47 -1168 84 776
2160 776 -614 928 1064 -282 792 -159 -904 30 -1300 -1257 147 -805 290 1159 69 1300 1293 -141
2178 -141 1126 -135 -994 -6 -1496 -1209 176 -876 123 839 -417 1241 728 -585 741 -345 -882
2195 -882 276 -1232 -495 800 -446 759 1125 -4 1178 300 -858 271 -746 -1574 40 -1444
2211 -1444 -554 730 -564 748 1279 -18 1219 601 -772 773 -550 -975 489 -892 -86 999
2227 999 -407 680 803 -482 590 -318 -1030 451 -819 -958 491 -602 220 1106 -74 958 891
2244 891 -460 815 -25 -886 329 -936 -937 813 -421 -44 744 -555 761 464 -914 625 -258
2261 -258 -777 426 -695 -232 784 -513 451 947 -481 770 261 -919 399 -403 -988 579 -797
2278g97K93J350j410Q21N44j336J107j60j116J410p46l75J081j420P20P82j363
2295f15P64M87j537J260l72j015J543q38l83J395j406Q25P32j417J221M20j499
2312d35J231m12j091J510j114k18J035j235L84N98j172J127L03j247J496n86o06
2329d32J261j164m9J173j102L83O27j166P43K27j348J218l52r06J256j060k6J128
2347D11j226N46Q24j081J381l14q76J290l96r99J312j269j88J028j351P61L95
2364B48j074J177J51j361J589r56k70R67r54J99R30j487J185L57j045J201l38
2381E19j085J321r75o01J189j284K63R35j171J077M18j041J265m23q32J345r09
2398A1l77J131j234K41R26j149N27N02j384J337m33p36J114r65k45J083p87K20
$$ plain form
2278 -797 -504 846 -564 257 801 -535 572 412 -704 706 -40 -415 666 -754 -34 748 -615
2295 -615 149 636 -901 359 -13 -1028 515 -323 -706 689 -717 108 840 -577 644 1064 -435
2312 -435 796 384 -707 803 -311 -529 506 -729 -345 253 -919 208 511 -736 760 174 -432
2329 -432 829 -335 -384 789 -313 70 697 -469 274 501 -847 371 19 -887 369 -691 -717 411
2347 411 -815 -269 555 -526 855 541 -335 955 559 -440 872 -397 -585 443 -908 -147 248
2364 248 -826 351 502 -859 730 -226 -496 471 -483 -284 646 -841 344 701 -344 857 519
2381 519 -566 755 -220 -821 368 -916 -653 282 -889 188 606 -435 830 407 -425 920 11
2398 11 -366 765 -469 -228 698 -451 76 578 -806 531 98 -638 476 -489 -734 349 -438 -218
2416b18P93j088J075J27r79J070p08p03J309j113j4R11j047L92O96j127R27j03
2434B00j019J349o65n07J179r62K17J033j149N30N35j097R07j06q65R96p87m95
2452g06J219j153K04R99j317Q24N05j200J194j51j136J236o34j49Q93q95J42Q77
2470G52j231P81J97j066R39k04j111J284n53m59J129j084L85J021j305P23O05
2487H03j070Q48k44r72J292p66k23Q15r30K35P93j235M23K70j158J391l15m84
2505e27J242o19l43J391j329J74N65j032O98K40j229J227m24m46J115r01j18R93
2523F77j271K72P47j218Q84l2p24J196m01l66J055n51l11Q58j178K98M02j070
2541g33P35K84j165J306n83l76J145p98j0P98j150N38N73j218R47k0q99J244l82
$$ plain form
2416 -218 575 -513 562 689 -290 780 72 -631 678 -435 -449 462 -585 -193 503 -624 303 200
2434 200 -819 530 -135 -642 537 -425 -208 825 -324 206 741 -356 551 445 -420 576 -211 -706
2452 -706 513 -640 -436 563 -754 70 575 -625 569 418 -718 518 -116 -265 628 -267 -125 752
2470 752 -479 302 499 -567 372 168 -943 341 -212 -671 458 -626 -241 780 -525 198 803
2487 803 -267 581 337 -635 657 -109 -332 483 -447 -212 581 -654 -231 39 -1119 272 -43 -527
2505 -527 715 96 -247 1144 -185 -11 554 -478 220 460 -769 458 34 -412 703 -198 -316 677
2523 677 -594 -322 425 -793 91 59 -665 531 130 -236 819 268 -43 815 -363 -65 337 -733
2541 -733 2 286 -879 427 -156 -532 613 -185 -195 603 -547 -9 564 -654 293 273 -626 618 236
2560B36o75J198j001k51R85j307N20N41j184J174p1n50J130o00l19R46p81J2Q24
2579H27j344O61L34j167J018j87p22J131o22m48R69j074J26O71j011P37N21q54
2597d34R36Op32R87q08l3Q81j112mQ13j157N18L48r08J068m06m09R02n71k37Q09
2618D57j006L54N77q66R46M2p37R41l51m98O47q34j82O24p39K97M86r68J057J39
2638C86q17J049l41n13J146j229K2Q18j134O94L53q50R34j48o67Q64n74m68Q61
2657C86q30j72P80o74L50M15n55Q20K06r96J002l94o62R22r47R3N24q23P21J60
2677C26q46O63o7n84J038o47k73Q79q30J86O60r58P63J4n61P58k82n38Q41p75
2697b33k79J059j248K09N85q10P55L94j059J187n81k38R33o62k91R78r89P6Q07
$$ plain form
2560 236 -439 759 -242 -493 492 -815 -295 246 -938 236 165 -385 745 145 -174 772 -9 3 827
2579 827 -517 144 478 -689 329 142 -580 551 -71 -519 450 -624 -498 173 -838 -101 420 -434
2597 -434 502 508 -224 763 -45 -78 803 -309 -313 500 -657 -139 209 -699 369 -37 -446 456 -115 -352 457
2618 457 -549 -195 382 -484 462 504 -233 708 357 -141 506 -328 -510 114 -625 -328 158 -810 247 386
2638 386 -431 618 277 -236 910 -319 -297 521 -613 81 434 -416 518 370 -297 567 -7 -475 386
2657 386 -444 -616 164 -510 -160 255 -300 520 726 -270 732 338 -324 598 -349 -256 268 -555 166 326
2677 326 -520 143 76 -508 530 -117 -390 489 -341 -155 505 -453 310 324 -237 521 239 -299 542 -233
2697 -233 -512 547 -701 -492 93 -717 38 432 -627 560 -21 -259 674 12 -279 699 -290 -214 593
2716E93j046P56q8q62J038m48m45J068q36p2R64j188N35O22j109J140j65q44R30
2735E43j22p45J046r99l7R19j208M23K90o24N51J88q46Q83j92n64R62p98J41Q05
2755F16j125P10L99j059P31r6q75J138n79k67R07q03J2P80j072O20N81j073P07
2774B52j33k98O35o60L5P27n94J57M33r99P64R4r16O05j80k37O27o01j37Q44j028
2795f10L04O68p91N23K22o94J134n43m52Q70n91k07O56q76J6O48q02N38J31p12
2815e68J031k75n60R64p20j25R28r24L46K92r28P85n9o43R13n27l40R82r33m7
2835d08P20p62J80O19j163J114j11m50P64m24k52P83o74k54Q08p40L66R6p43O62
2855A31J0o14Q72n06l54R05o12l7O18o84M39K80q01O26j36m18P29l15l36P60r98
$$ plain form
2716 593 -453 303 215 -647 391 -57 -502 566 -270 -342 622 -566 -31 591 -518 622 457 -387 543
2735 543 421 -324 722 -277 -314 605 -603 -180 110 -514 37 225 -621 262 70 -494 468 -330 -189 616
2755 616 -509 201 600 -459 272 176 -699 439 -140 -407 500 -303 -291 489 -583 37 618 -455 252
2774 252 119 -179 456 -204 -169 558 -36 121 554 -445 319 413 -503 102 -78 -315 312 -289 -426 418 -610
2795 -610 -306 362 -429 94 316 -378 756 213 -239 631 40 -167 489 -387 -371 277 -525 13 144 -568
2815 -568 463 188 -372 592 -128 -253 675 -249 97 389 -539 246 187 -456 457 -70 -410 572 -361 -408
2835 -408 312 -450 -270 349 -814 300 189 -261 503 79 -173 610 -64 -318 490 -250 116 212 -531 131
2855 131 141 -473 399 -107 -461 444 -168 -205 413 -271 168 448 -353 273 137 -281 448 133 -203 557 -441
2876d41N3O85p71M99J14o36Q74l30n57J039o06r8Q47q13K15M30q18O37J44o62
2896a95N92l19m88Q35n41l99R07p57K46L83p41O84r8p30R52M2m88P63o05j90Q50
2917G03r23Q7M34q36N52K60r44R09l64l41R00p32O7P50p65L03M11r06O44J13o43
2938c21O54j78m84O05l54j59P04q12K91J66p93Q80Op32R15k89j99O79o02m9N95
2959E23q96K84O25r20N60N5p88Q34l27m86R31o63K48K87p90O60L74r55P90j86
2979A60n43J067q74J13Q60r16rN64r20N13q4n04P36j94n60P08k07j32Q87q67K20
3000A8M67r29N11K20q54R14k7q26R10n49k00P34o23j15P60j256O97L48p65Q36
3020B71o6l00Q50p81L0P04p71J40M68j100P32J69q16O17j90k69P47n50j47O43
$$ plain form
2876 -441 -388 297 -474 25 139 -497 377 47 -510 529 -77 -175 672 -141 74 504 -314 323 467 -195
2896 -195 397 78 -410 425 -116 -515 392 -365 -119 264 -477 207 109 -621 331 373 -115 648 43 -147 703
2917 703 -220 -133 301 -535 17 277 -667 242 -122 -463 437 -295 -228 522 -243 60 471 -435 209 322 -321
2938 -321 333 155 -329 276 -78 -237 467 -345 -54 112 -681 199 205 -527 388 99 -100 579 -23 -72 523
2959 523 -373 -89 536 -384 176 231 -557 277 -50 -536 395 -268 -20 267 -523 137 511 -444 346 160
2979 160 -383 684 -190 -77 783 -133 -142 422 -498 15 -69 -573 163 -31 -591 117 -90 -222 665 -202 18
3000 18 485 -444 67 287 -567 347 320 -506 404 -145 -345 389 -234 -349 411 -845 -148 200 -565 271
3020 271 205 -95 755 -26 4 708 -63 77 545 -555 177 346 -470 147 -43 -312 435 -115 -262 381
3040C81p51L99L02p02P09k13p07J030m58k20P19o77L57M10j097L74K93p37P36
3059A48r7o61J038o95q2P30n83J53N00p65M30Q9n57Q05l15m68P72p29J8O09p60
3080d20J87M73n77K69K33p84P24j46k18R08o60j41P25o77M7O03j204R95j39p63
3100e65P82j46o72R82p32l7P85q07L47K81n85N83J34o22R06j89p58Q27o50k60
3120c96R17r61L66J54p43O25J70n90R23n01k15N19m30n2P15p44L21L61j004R75
3140D10l07o53J068n13l32O67p99K06O03p12K20M07p14N05P1n25Q19m40p5M44
3160C50o28k7P72j018N06K09n57N25j56p10Q67l05l17J086q59J13O06o31M82Q3
3180C91n91O29k01o85J074m32k70N38o35R5J87m49N31P2p76P87l27l32P13m72
$$ plain form
3040 381 -370 29 331 -371 338 125 -582 448 -10 -230 489 -188 169 579 -518 -144 149 -588 148
3059 148 51 -610 428 -267 -349 381 -202 -49 451 -314 116 205 -352 453 138 -330 442 -287 -269 340 -420
3080 -420 -233 240 -337 -68 165 -619 105 -41 -259 649 -11 -152 573 -104 -57 546 -658 337 198 -565
3100 -565 217 71 -601 381 -351 -388 397 -410 -63 218 -367 216 350 -272 634 445 -313 514 -136 -396
3120 -396 521 -440 -74 80 -663 -38 132 -458 465 -36 -251 268 -162 -214 501 -243 78 439 -565 410
3140 410 103 -550 518 5 -327 340 -459 -253 350 -362 -142 265 -449 56 127 -398 421 -19 -94 350
3160 350 -278 -305 467 -551 -45 164 -393 132 -24 -734 133 -172 -489 597 -262 -149 457 -174 308 391
3180 391 -200 429 228 -457 617 185 -85 453 -182 -87 100 -349 182 254 -522 265 -62 -394 319 -153
3200a53k7O71n38J31M77o85L17J38p12O69k40n25Q78p99K99M96p53M14K13n91
3220c20L81K91q12R11n03k04Q80n82n6O27q97L36R1o00M14J54n85O07l48j36P29
3241C78o42P6N00m45J96K88o37N20Q7o04N48l29R4N13p86J25L05o78O91p3p56
3262f29R96l49n80Q56l25k73P84n77n9O65n15K43N6r49Q37k92m31N81k07j39Q46
3283E39q87K63M46q84N63J81o72Q84k81m33P27n39n9O56p50K77M50q70L18j42
3303b13j89M92l43k27P14l90r9P66r47N64J73m95N71m0o55P28l53n39R83o51p8
3324b28N42o54K26L19o30O01qm52M90l12l41J051q10J26N83o92M23L03q12O25
3344C50m35n32P44k76k47Q01n60J4N33q07M87Jl34M23J18q13R38l68j21M60o19
$$ plain form
3200 -153 -180 491 -47 84 561 -124 193 331 -381 288 48 -477 401 -398 -99 397 -356 58 271 -320
3220 -320 61 352 -460 451 -52 -256 624 42 -14 613 -284 52 143 -457 -43 111 -474 133 -215 -351 378
3241 378 -264 -188 312 -133 63 351 -286 234 321 -283 265 -64 30 543 -243 -118 187 -491 200 127 -629
3262 -629 367 18 -562 294 -31 -304 480 -97 -156 509 -6 237 293 -656 181 -111 -542 39 -168 -307 539
3283 539 -348 -85 361 -523 40 221 -451 433 152 -281 446 -93 -152 504 -246 31 481 -389 -71 -213
3303 -213 -402 90 -253 -480 234 -156 -255 511 -436 128 301 -194 377 337 -318 410 57 -482 501 -150 -228
3324 -228 314 -340 -114 205 -425 176 168 -284 206 -106 -447 604 -206 -80 503 -189 234 537 -275 350
3344 350 -85 -617 127 -149 -396 405 -155 -141 392 -415 72 73 -261 162 280 -533 405 37 -84 376 -243
3365b43J01N56q01M25O1m32O53m48l19O05k48j83O14n53J18O71r32L54K90n18
3385b29O00o00k48Q78n38M1N55q41M11L59p90M23J96n81M81j97j68P65n99k32
3405c14O20m40O8O69r59O46k29n38P73l43k25O41m42j91N74o96L75K53p98O52
3425I6J63p73P67j57l19P82n08j15J89k51K78j52m71O09J24q35N23q2j8P38o27
3446c9J50L58o07K03K42n05O82k73o90R25l02m50M63m98K97L39q63O96J48n63
3466b87K99k6l40O40k87k44P29n58J57K76q00M91K2m68M44j93l34P52o08k5P77
3487D17n40K6N53q24M20L40o69O20j00l86N39o16J64O47q06K54n3n48P17j17p30
3508f92R11k78m14R07n45m4P90p97L84J37n78L92N4m93M89k84k19O21m37K0M41
$$ plain form
3365 -243 -142 414 -387 38 99 -333 320 -128 -447 158 -90 -273 341 -212 -94 577 -355 -1 289 -229
3385 -229 371 -229 -477 401 -137 -96 459 -382 29 388 -402 21 217 -364 117 -80 -248 517 -82 -314
3405 -314 306 -134 -66 603 -356 290 61 -477 296 -47 -272 369 -73 -264 310 -386 -11 242 -556 96
3425 96 259 -514 253 96 -223 559 51 -64 125 -126 152 0 -471 138 262 -573 -50 -132 -150 588 -39
3446 -39 111 469 -138 65 307 -198 484 211 -479 446 144 -306 157 -341 -44 295 -568 128 276 -287
3466 -287 12 -14 -354 286 -1 -245 484 -74 83 359 -441 50 72 -396 48 -145 -479 273 -335 -360 417
3487 417 -123 -97 456 -368 52 392 -277 343 243 -143 396 -220 -56 591 -215 39 -14 -562 155 38 -692
3508 -692 219 -59 -473 434 -111 -155 635 -162 222 359 -219 173 227 -266 223 -61 -280 341 -96 -76 365
3529C65o64mO41o20M86p4m45O01j06l56O13n35J09M56p01K49J58p05P81l84k29
3550c64N48l20j32L93l50J20N35p21M53K60o41N75j55m42Q53m67k29M70m84J25
3570B7J77m18J42K77p61O40L0n43O47k40j01M69n24J87M56p60L49J99p03O53L1
3591B34m49L15l98J56M08n36K09N8l63M21K8n23O93j97k66O65n75kM63n02k0M78
3613B97o16N31r6n87P27m18k86O26k00l0M54o42K51L63n93N83k71m16O82l79k64
3634b84M88l48o5M20n96L25M06n86K18J36m61N71l18j40P06m96j10L66n02M32
3654A62K71o08L33j28k74N94n62n1O59o84R7J90l25K97K51o21O98k55k18N64l89
3675Ar6M67n03J05L07o19K27L55o81N12j92l07O27m95mO45n62J22M66m77L41n3
$$ plain form
3529 365 -299 -303 338 -282 204 130 -315 286 180 -176 437 -98 11 467 -234 15 173 -532 249 -135 -364
3550 -364 184 -136 -268 125 -225 -105 430 -291 162 422 -219 356 201 -241 612 145 -84 386 -98 27
3570 27 204 -214 -72 205 -556 84 114 -429 218 -22 -123 346 -178 9 465 -295 54 253 -450 203 234
3591 234 -215 100 -298 -142 266 -270 -61 -3 -366 55 83 -440 253 56 -210 455 -120 -122 341 -161 -181 297
3613 297 -319 212 116 -471 256 -162 -448 178 -22 -52 402 -240 11 374 -219 364 93 -323 359 -20 -284
3634 -284 204 -144 -209 211 -385 -60 346 -240 -22 114 -347 224 -94 -234 472 -24 -134 232 -270 162
3654 162 433 -175 158 30 -244 350 -212 -263 396 -288 -191 -1 -326 -29 222 -399 299 44 -174 390 1
3675 1 -95 372 -131 -26 281 -338 -111 244 -437 75 -117 -424 203 -292 -296 349 -213 -91 375 -102 239 186
3697A86m21N65m21p4N34n88O7M16m99R3M64n41L00J1m67O17j48l90N91l80R5L27
3719C37n50M24R6n52L50q0m42O55m08j22N15m76J82K90n37J82N04n05K31P1k80
3740a15M78m03k93P50n04r0K80m39K99J71m31J83K14l63Q39m79l11N47n89L00
3760D4K06m37L70L7n65O55m80k66N32k80P8L22l83K7K67l27L27Q8o06N15l8m06
3782c20P15m34q2M38l62QL73n63L09J76o43N28k71k28M07j21K6L03o34N23L7n25
3804c40N98m0m38O42m76j69M97l40M6K75l43J39J95o37L64K8l99O30j35n72P30
3825B55m16J51K85n08L06L97o94K86J92m24L91m6n42M72l34KM64n29L51K39m25
3846a27M05k5n74M82j17q4M46m38k4N50o49J24Q1l08L95O0n65M36j65k41N02l47
$$ plain form
3697 186 -235 330 -91 -165 369 -219 -152 264 -235 -142 322 -219 81 92 -375 242 94 -296 295 -85 10 337
3719 337 -213 211 307 -245 105 25 -417 238 -170 -292 223 -253 -71 219 -318 -136 368 -137 94 165 -115
3740 -115 363 -40 -333 417 -87 -177 103 -336 -37 134 -297 -114 100 -263 576 97 -214 333 -256 44
3760 44 250 -187 183 220 -345 310 -170 -436 96 -184 -106 216 -167 -140 127 -200 127 215 -391 124 86 -320
3782 -320 395 -39 -121 317 -45 -37 336 -227 82 258 -385 143 -128 -356 51 -70 -44 259 -375 148 185 -340
3804 -340 258 218 -220 422 -54 -223 274 -66 -20 255 -88 51 246 -391 -27 1 -398 232 97 -475 255
3825 255 -161 -10 275 -233 73 470 -224 62 254 -170 221 175 -367 105 -229 -227 237 -292 59 298 -127
3846 -127 278 253 -321 161 44 -40 406 -32 -56 494 -155 -31 50 -258 137 197 -368 68 -97 -338 164 -183
3868a83J02M49n54L90j32l07L86j18m26N46q1k62N47o50L53Q9m89L50j67k86P60
3889C17k94k90M92l03J55K92j81l76N64l89K17L0o50N40k13k98P18m06j43L00
3909H2k86K35K45n27L17J88n78M49j03j33N67n37j53N55n68M15n7l38L07m6m50
3930d16M62l60K5M29k28P2L84n64J92M19o75O99m50l11O77l93j12K75n13J96M71
3951B79m64J38J38l68N97l71j89N91k92o8M78n14M9L69n26N14k21m36M03j26k71
3972b90N87k58k50L49k16r4L93m97L32J55l43L29j00o3J57m9j13K66n12Q9J64
3993C6m55L22K78l65O2J08j95N51m84Q7M65n31L69k0m32K95L03o23K76kl1L70
4015C84n38J27K32l93N9L57m91P6L41k79L32q5k74N64n71K8L64l50RK90l58L56
$$ plain form
3868 -183 -81 368 -186 204 72 -235 151 33 -393 153 72 -190 357 -293 60 149 -340 10 -157 -443 317
3889 317 23 -267 225 -78 77 369 188 -188 376 -13 204 234 -416 124 -89 -387 331 -75 -218 82
3909 82 -204 31 276 -251 66 254 -324 125 22 -111 456 -81 -234 321 -247 168 111 -227 80 34 -416
3930 -416 46 -314 -289 140 -88 -16 368 -196 -4 415 -260 439 -11 -322 355 -38 -150 125 -388 -192 279
3951 279 -185 -47 91 -277 320 -51 -240 351 59 -9 469 -45 4 373 -153 361 140 -296 107 -19 -290
3972 -290 297 39 -211 138 -78 -172 221 -276 56 211 -132 197 97 34 191 142 29 295 -217 -128 36
3993 36 -419 -97 181 -184 -122 -14 -209 342 -142 -55 410 -121 248 228 -204 91 394 -229 47 45 14 384
4015 384 -154 -27 205 -188 -129 228 -263 -187 154 -125 207 122 -152 412 -159 -131 233 -117 -108 182 -176 180
4037A80p2k95N60m55j45L33l14M7K91n19M19L52n49M35k22k16O11m90j23N57m67
4058h2L9J81l91J72J80l01K24j11j71M43k73J2M20o14K93K1j43K82K25o33K07
4079b0J39j83N19o62L6M10p46K97L65k77J65J01m24M84k01n2M68m53P2L44n61
4100a79J87K83o71L98K0l77L92o9l31L78j62P6L44n61L12P5k07L73r5l87M47q1
4122A65l90N27m23R1L07l71m8K29k66M24k78l2M50n27j42N55k63o3L56l85Q1K46
4144B43m18K62L43l38j1j40L9K09j84p0L44m69K36p3k17J54J46J30l1j56J43L9
4166A81n43N46q3k95K96K87o50L08ok34N22m70q9M17m34J45K84n21K80K62m94
4187b91N32o5n17Q45o44m0M49n82L52Q6m33M56j9n17N32j63r3K94k1k45K14k20
$$ plain form
4037 180 108 -187 373 -82 -227 106 -208 -161 130 -389 30 382 -167 268 46 -170 441 -49 -172 385 -82
4058 -82 -43 138 -253 -81 99 -202 22 -89 -260 183 -90 -78 342 -272 21 42 -101 181 406 -227 -20
4079 -20 119 -64 455 -207 -171 239 -507 -210 155 -122 43 144 -280 204 3 -49 419 -34 38 382 -179
4100 -179 8 291 -380 18 38 -339 53 -16 -347 31 -131 -55 289 -272 40 115 -92 281 186 -201 246 165
4122 165 -225 302 -121 -30 277 -94 -142 87 -179 245 -33 -65 385 -142 -284 271 8 -55 301 -84 -3 243
4144 243 -175 87 430 92 81 -59 -20 189 5 -65 279 -190 46 -27 -244 -90 56 186 155 -1 142 181
4166 181 -362 184 101 -194 102 389 -261 47 41 -193 329 -141 -230 187 -247 -102 182 -339 -59 203 -291
4187 -291 241 176 -341 504 -140 -180 269 -313 39 125 -308 148 129 -388 144 -19 -112 182 161 -84 130 -90
4209i0R8J82j35O8Rk72K58J75n51M77j56k35K05k97K88J85k61M6M3k63N04l93
4231a15j3L63l78k7M22n40L83K19o50K15J21r6M23m15r9L50m38J55K54l69L20
4252H5L27m65N3M5j45L31m24M5L44k05j59N15m75J9M66p00M54o7k36K79m2k58
4274b13M08j46M8J37l09K97j66q3R4p6r5K11k45j13L50l91J71J06k67J82J60k62
4296b02N24j59m41N75m68Q1M03k96q7J2q3M19m54j08J76J31k61M83l49N2L31n45
4318b66K18K37k74K17K21o25M04J14k28J88k45j86L85l84K67J59n09K03L5o1K78
4339A48j29n6J33r0m4L16k90J85ol69M69l51k22L40o2j86K94k76J11K36l46J74
4361b1M7j55L65j60j68M38l55JL12n78J70L62m58K20O4l87K18K31m60N66l39O6
$$ plain form
4209 -90 8 190 55 123 132 -140 118 293 -258 219 63 -172 33 -264 24 209 -52 -6 37 -226 278 -115
4231 -115 -128 235 -143 -170 252 -288 95 314 -336 -121 0 -96 327 -88 -187 163 -275 -120 134 -235 85
4252 85 412 -53 0 45 -100 231 -193 -148 196 -9 -168 347 -128 -109 357 -343 111 44 -192 87 45 -213
4274 -213 195 49 97 234 -75 222 56 -27 67 -9 -104 107 -138 -251 99 -292 -121 -15 -282 -100 60 -202
4296 -202 322 163 -278 297 -171 -90 313 17 -70 -58 -141 278 -176 -284 -108 23 -238 245 -104 -52 279 -266
4318 -266 -48 189 -85 132 353 -272 132 246 18 206 -39 -225 160 -224 43 202 -307 -104 -69 -130 148
4339 148 19 -37 96 6 -38 278 -12 173 167 -202 267 -84 -306 34 -28 -214 80 -196 -85 151 -195 -21
4361 -21 26 -129 236 76 -92 346 -9 -8 304 -274 -104 258 -200 20 84 -303 -85 146 -314 252 -87 -21
4383b1K66l62J86J17k37J74J21m88L98k57j57L79k35o0M22k04jR1m26P8L72m10
4405b54N52j95l60O14l54k13O67o39L77J59m81J83p0j94L55k5k72L96k72k19L74
4426A29m30M91pj80o8L08k72K09j17l37N21q7k29L66k59K2j08j55K85N8l90K55
4448El7j55M56k95P1K20k09j27K69l07K48k61j37M73l55K65N4m37N5L60m91K34
4470a01K60k57K97m1k94K67j06k7L05m34K28J34m08J02R3j73L87k82k85M59q0
4491D4k92L39j07n7J57k18L76K3m84L29N1j44M39m06j57J22l12K57J56m64L71
4512B3L85o25L47k08Q0L08l57j2K32k17J39K25m48J81J81j46J89o8k67J12k84
4533b30K04J18l80J23L83l55J93O3k05L13l28j51N40k75j4K28l32J08J34l94L50
$$ plain form
4383 -21 245 -117 69 186 -51 123 244 -244 154 -103 -260 119 -116 -176 246 42 41 132 -294 -216 156 -254
4405 -254 298 103 -257 357 3 -210 457 -182 195 354 -127 56 -14 -208 147 122 -150 246 -26 -245 129
4426 129 -301 190 183 3 -65 243 -29 180 63 -274 247 160 -69 297 38 60 -48 -203 82 140 -250 5
4448 5 -32 -187 269 -26 45 265 56 -71 198 -109 139 -122 -259 214 -141 124 178 -259 -204 156 -335 -101
4470 -101 159 -98 199 158 -136 131 25 -2 303 -131 97 231 -177 -75 18 -155 232 -50 -335 124 44
4491 44 -248 91 -16 -73 84 -134 242 265 -219 110 161 17 456 50 -107 15 -297 -40 116 -348 23
4512 23 408 -217 130 -78 2 310 -47 -59 173 -44 95 320 -128 53 234 88 277 209 -58 54 -230
4533 -230 -26 92 -288 -165 218 -137 56 119 -86 227 -101 -252 288 13 -1 227 -105 3 137 -257 93
4554I3j74n8K27m1j78J99O8k59N06n17K69n9j79K87j17k39L23j66Q7%m1q2J20
4577F9k82K83J78l55J60j3l6J90k04K8J59j95j36L05k55J64J01k67K54L3k13Q3
4599E1j12J6J10k00K76o1j87P9m2j47L49l27J75R5j89J60l5l7l1K74l59J69p2
4622d5n2J83j09k05M01k81Q0K94m48K21L02m76K80j48j32K41j10l08N13l12m7
4643a58M70m29r9L19l14K41jj96J13R5j95K96p9J2L8j84K78r9k42K20j5o2J88
4666A97l73R7Q1k06J38J39k69K70q6j15K16j72n0K04J2j43J01k8J13m1k34J16
4688c3K44o37N10j1K3K7k70Q3J96j57M0K60l79J41J17j83J61m7k36M18k71r8J85
4711H3k42m0J42l10L63j47m8K96j22K5K50j80qK79l58J13j02k7kM3l40L98q3j14
$$ plain form
4554 93 -81 -139 88 47 -131 68 136 -123 383 -134 135 76 -103 184 67 -172 151 -15 72 72 31 -51 69
4577 69 -213 70 248 -107 53 40 4 194 -10 18 177 -18 -154 151 -104 60 161 -106 148 181 -32 51
4599 51 -61 -45 65 -135 141 80 -107 -28 -70 -217 132 -195 -20 75 -114 46 11 -26 -57 217 -142 27 -45
4622 -45 -97 86 -23 -228 173 -108 -28 266 -182 39 341 -135 145 -3 -135 106 -4 -312 201 -111 -158
4643 -158 312 -117 -216 103 -211 30 29 -167 -54 41 -154 142 63 75 113 -71 207 108 -134 86 71 9 197
4666 197 -176 -79 2 -204 -66 73 -196 74 -12 -127 89 -83 -133 71 83 -60 41 13 126 85 -149 -33
4688 -33 211 -426 84 73 96 123 -147 -64 132 -25 15 275 -104 37 154 -29 132 85 -151 267 -4 -102 83
4711 83 -159 -199 -57 -367 -4 -151 -199 97 -25 0 250 70 62 341 -17 96 -6 -33 -35 8 -332 66 -17 -131
4735a31K35l30P3L40k21o3K12l04M36j78p0L46l54j6N2j06J97m2l05L17q2j92
4757a86L10k42Q1J03j73Q8J5J1N8J51n06L95q8j14J19K6j30L12n01L08K57m54
4779a60J50q5k24K98L22k65j5o7j6K10j52Q7J08m45N3J35J19n1J32l40J72P7j58
4802a15J56j34j5L64l28J94K0k16R5J42l32K84l0j38K01l42K44m3r3mO5k29K08
4825d6O1j93K64j18j7J67l25J90L07m37J01J0n1J75L2k28J83K2j95K70k49n0K30
4848A03q7kkm1K00l9k43K14j8J9O6l47M6K63k25M7K72l17O1R3k43J62k37K97K55
4873B97n43K3M00k30j1L99m83L96l17P3Q9m9r5J35l03K00J66n56M49K6l05J64
4895g5O2l5K9lL6K66k94J97K9m14L66j15J24Rl21J11K32k17k24J39K09j62K7m2
$$ plain form
4735 -131 104 -226 -153 187 -34 -97 115 -189 247 69 -1 345 -9 -25 27 -79 118 76 -229 88 6 -186
4757 -186 124 -118 -37 66 -107 -19 -4 7 65 216 -290 105 17 -97 22 48 -82 230 -271 37 294 -160
4779 -160 -10 -95 -319 -21 301 36 21 -46 -62 148 -4 83 191 -254 -201 -66 53 2 134 -206 -34 43 -115
4802 -115 41 -93 -108 256 -72 122 142 -74 21 163 -169 115 85 -53 148 -194 50 7 -86 -90 -25 -254 -46
4825 -46 15 -178 86 -32 -49 118 -207 -17 290 -147 -46 -36 -87 88 120 -108 75 97 -98 172 -77 -127 103
4848 103 16 14 12 -29 171 132 -111 103 85 104 170 -177 -131 132 -93 -46 226 -91 -30 63 -180 -18 -255 42 297
4873 297 -246 -223 177 -53 -64 335 -148 248 -69 4 93 44 -51 84 -219 -19 147 -409 40 66 -239 -75
4895 -75 -13 -48 -19 -22 14 280 -14 183 212 -202 164 49 173 182 -139 -28 204 -13 -237 -98 111 -51 -24 -66
4919f6J2J44l80L88o6j94M13l90J87L52p08J24K89j23jO9j25K7P9o8J96k78J73
4942E4K5n3P4j6j21o1K35k41J07j73q7L79j78k3J07j12q9J80q5M7Q9j14L34qk94
4967b4L22k55rO9k70K16j85p4L17k35N6J99k70Q8O9j70J98J37j55q3K08m35L13
4990B7m8QN1k37K09n1k11J91J07j07K23j60j84K74j60M8P7J7m6Pk79J17%M9J41
5015F3k47J55J51o8k68K21r0k37K97O4L3n7j39J95J6j00M6j30J52J95j51N4q6
5038F9k25J71L09m20n5L16k67J21Q4k00J11j59k0K30n9Lq8o0j7Q7Q9Nk3j3L21
5063C10l56K75l8j57J30p6l21L29k05n2L61l01q0J16M6q4J95j00K43j31j24K51
5085B31j37K5j18o1n3O6L6R4K28m15J47k68L2P4j8p1K78j56J00K05j37k5K73p07
$$ plain form
4919 -66 -54 90 -290 98 32 -162 251 -139 48 400 -308 -184 105 -18 -19 50 -75 -48 31 -37 159 -119 54
4942 54 79 26 100 84 -37 -98 137 -104 3 -170 -257 122 -56 -79 28 -84 -173 7 -78 -31 58 -56 278 270 -24
4967 -24 298 43 34 103 -167 49 -136 -210 107 -128 -72 127 -143 -55 14 -156 42 179 24 -59 149 -286 27
4990 27 -21 -13 38 -199 10 -41 -252 -61 46 -61 162 2 -182 92 -68 -20 57 74 28 35 -244 -127 -127 -78 63
5015 63 -184 -29 122 54 -214 7 -83 -320 -23 41 74 17 -122 73 89 -11 35 -95 57 252 101 155 69
5038 69 -156 15 324 -96 -151 165 -102 19 103 -97 14 -145 -165 65 6 9 -79 -139 -156 -69 20 25 2 -11 310
5063 310 -46 229 191 34 164 88 -233 96 -109 -161 200 -101 -181 -65 -19 -103 92 -8 235 104 -20 231
5085 231 94 119 1 -60 -113 -47 -11 83 311 -104 43 -225 -193 -119 -137 -208 70 -86 14 219 82 57 330 -377
5109c77O80l21m0J77k05j99L08m1k7J55j10j40J6K69N3k70j4K49k07J57J15j14
5131A14j53J08k24Q9J36j35K87m61M5K71J5j21J35k37J60P8k45L37j68j35K00
5152I6m6k54K68n9r4J69k46R7L19m02J54J15l29L67q9j24K20j75j02L16j59K0
5174F2j8k78J72O2r3O1J50k35J39j42J84L9p9j03Q1K0j02Q6l8J11KN0o8k38J36
5199c9J65k64O8J87k07n5K10k36J52J43o2J47n0k41J70j26J8J63m10M87j85m1
5221fJ92j21q5O9L1nJ38k67P2p2n5Q8L4J33K81m42N7Pj39l0K07r1k08M03j99J57
5247A49J43k51r9K05l41K67k30R3J43q4J29q8k12l2K80j99K24R0r8r4k4r6K89
5270A64m53L30j97L74l12j12J06K15r0r0J33q3k0K75l35J46K36m49K59O5j66K07
$$ plain form
5109 -377 303 -18 -58 119 -86 -285 23 -18 -45 110 0 -140 -124 145 198 -72 -86 163 -44 113 228 114
5131 114 -39 69 -155 -66 70 -65 222 -239 -194 77 92 -29 106 -131 29 107 -138 199 31 -104 96
5152 96 50 -204 64 5 -89 80 -166 -69 250 -152 2 117 -212 155 66 -58 162 -13 -115 201 42 62
5174 62 44 -234 -62 0 -93 -32 118 -117 22 -120 64 103 24 -79 2 22 -80 6 -32 79 81 131 63 -175 -39
5199 -39 126 -138 -70 117 -90 -145 65 -171 -19 124 62 209 159 -82 88 -38 -20 143 -267 220 35 -6
5221 -6 186 65 -20 49 80 75 213 -54 18 -54 -109 -21 13 146 427 -15 42 49 -90 -120 87 -4 -212 191 -8 149
5247 149 292 41 -58 147 -194 73 -157 -64 79 -5 124 36 -176 -208 72 -127 97 187 89 -5 -29 -125 164
5270 164 -289 41 -156 218 -94 -206 -100 115 25 -65 68 -15 -35 240 -95 51 287 -162 97 162 -4 203
5292B03k64Q8k3M0m0Qj09J48o9l16L76j64O5K5j02M3J37l00M29j30j48K31k05
5315g7r0K37r7q9L10j35l28N48k38r5K72l00J25l2j47K28j69j49M81k45j04Mk24
5338c14L24m9P4J93q6j48m2Q5j12K07j43L5J02N6l07L83l18M1J2l30N35k04l6
5361d2J33J1j24J02q0K14j23j12R2j51M5L45j02l01J10j01J64k14NR0J04j54J64
5384G5Jk35J97O8j41Q0J2J54j12J0j9O2p0n6J9k18M39l01n6K06j94L7j59L2J83
5409A4m4k0J38O8j43M33n28q3L61r5m1Po8R5j20Q6K7j49q2K81j88R5J92k22k64
5434b50J0K76Q7j52M6j60L00j46Q2J32l32L22j18j46J85p8r8P9k53K14L5j51J36
5457B0k0q7k82M00k0l2j8O5q6n2J26R5j61J67q8j49J16J12k45n6P9M7Q1m0K17
$$ plain form
5292 203 -61 27 4 44 4 12 -97 51 -18 -334 42 -122 -57 -32 -134 -91 46 -254 175 45 -103 128 -77
5315 -77 -167 70 -27 -116 194 59 -269 279 41 -54 218 -82 43 11 -136 92 -77 -226 255 10 -94 -90 -314
5338 -314 10 -39 35 228 142 -6 -48 37 -75 132 -11 24 126 182 -125 258 -60 -19 -7 -337 198 -6 -42
5361 -42 91 102 -22 80 0 214 91 -21 71 -80 -35 310 208 -93 17 -84 80 -134 -129 -39 65 -89 75
5384 75 76 -159 38 106 -35 45 57 211 99 109 90 152 82 26 45 -173 266 -35 -91 115 -79 -42 -201 -169 14
5409 14 -30 -50 88 156 13 446 -82 -165 196 101 60 67 -1 94 -26 60 87 -62 -144 137 -51 44 236 14 -250
5434 -250 -240 36 123 -29 17 -143 157 11 93 225 -107 215 97 -49 136 58 -40 39 -214 0 35 -116 20
5457 20 0 -87 -369 31 11 -21 -39 26 -60 -112 14 109 -52 115 27 -122 -6 106 -139 -195 -116 -69 12 -28 189
5482A89j97N3Q8j45J55l63J07L1O4K9j0q6nK67j89r9J53l59L02K44k69j50L80
5505A90k17J35k66j5O06k20Mj40j71J28J4l88L05K11k99J80p6m6J41k18K65K00
5527C23m81L89l2k07J51m9l15L56n6l39J88O5l25K86l0J30j3k00L51j04j17kJ75
5550A44k83k9L01N1j37j46J32K57n06K78j06l1L3o6p4K20q0q3K71j98k1L22k53
5573dL4j4J72l7l33N39m28l5qj4J33j05P3j52K47L8j93K41o5j17K55j24p6J23
5597A50j85q6L07m37M78l11n5n7j0N5J98N4j74j71K04K74j96n2m1J80j14J14l0
5620I5k5q9j05K94l3l87M04j9k05J83j66M9J17p2K3pj17J02K8j65K08r8j03J8
5644g0n0m1J93k61Q3P3P7J17R4l21J86L7j79K26k45k67M98l44J10L26l52K87j36
$$ plain form
5482 189 -8 45 133 -12 143 -220 -113 -82 -18 11 1 -85 -90 177 -12 -111 42 -317 -15 229 -40 -190 190
5505 190 -27 108 -158 -173 433 213 217 77 -94 34 48 -340 -35 176 -123 57 -19 -65 76 -142 123 323
5527 323 -158 231 199 -8 143 94 -221 135 79 -260 -72 -7 -332 -46 -76 54 41 -159 192 88 -29 -31 144
5550 144 -139 -168 133 184 47 -99 33 290 -216 62 -44 -75 -42 -108 -182 38 -42 -125 146 -52 -73 249 -4
5573 -4 30 16 188 151 -182 357 -71 -106 -114 -128 5 -100 -27 -179 68 106 -87 154 89 -28 227 103 27 150
5597 150 -35 -121 186 -251 227 -84 -139 -196 -206 -151 47 101 -73 -244 -40 234 38 -14 -55 125 11 125 95
5620 95 70 -19 -124 170 137 -250 154 135 -70 113 -53 -4 113 41 64 57 -60 42 70 -95 113 15 -88 -70
5644 -70 -120 -161 32 -229 -146 -73 4 121 215 -106 80 117 -62 164 -81 -348 150 -194 -84 242 -110 177 41
5667D1k20K32n4o8Pp4m2K47j00o4J76l92L34K08l25J79j50L7O7JJ1K9l01K21J96
5692A96l20M54m99J24J69j30j61K15j8o9J78j80K86p9k02K5%j60L50k26J36oj82
5715i9j1R6j08J69NL2j62k0K1J14K1npq1R9p0K28j88Q7j96J65k28o2L07l14r1
5741b98L08r2J00o9N7r1J87j71J2J82j8l4K9k85K36r1q0J10k04K41J06l26J87
5764dkL6M1j7r1Q3k22J70J09j83J10J69j34R5J25l36J11k23Q3J16%j31J69j56
5788h2m8J99R5M5l79K27P9n9q6K03mk4o4k56K30m2j03J02q2N8j19J71Mo6N6j08
5814e3O8n1m6J45j92J86M2j18m2O6j93J66Q2p6J38m6J1k95J80j8%O7J70j46r7
5839e2J77k44JL38l04L9l4PK97j20j60J87k28J6Q9j13K54k12p1K43l7Q3o0j88
$$ plain form
5667 41 -179 53 -1 -69 -62 -136 -178 69 -31 -95 81 -311 23 231 -94 85 -65 -28 39 40 51 80 -221 0 196
5692 196 -124 330 -169 -45 124 -6 -167 48 30 -39 139 -41 245 166 -36 -11 -11 -171 179 -47 89 83 -99
5715 -99 -110 -14 -122 47 52 84 -78 -98 -77 37 58 53 46 -35 64 -6 222 34 121 -75 90 -138 -200 107 -207 -298
5741 -298 10 -82 18 -51 6 -85 102 -69 -57 125 107 73 102 -183 53 -38 -118 -8 -212 29 135 -191 -4
5764 -4 -6 30 71 54 -37 46 -176 -6 103 -80 30 199 65 160 285 -51 60 -163 -80 36 36 -95 74 -82
5788 -82 -130 69 164 209 -170 57 136 77 -9 194 190 166 102 -154 76 34 -69 33 -49 9 -110 61 65 -1 55 -53
5814 -53 15 -36 -82 63 -129 57 99 -19 -61 5 -188 -22 60 -16 122 76 87 -208 -28 -46 -46 21 191 45 -52
5839 -52 125 -119 -118 220 -84 -45 -79 -72 225 105 -55 132 -96 -80 9 -104 150 -62 -133 110 73 156 96 -92
5863i2J2L12q7j00M4J22k13j85J55L14k75p9M1k48J45p4J06J72N3j83J89j26J16
5886A19p0K0j24QJ33J9p9j00P2J3j3N1o1M1k9j71K77j39j5j11K56j25J14j00L0
5911A6K52p3l81K63j33jK11m8j25o1j09P6K68r9L3j72J08k56K31p9L74j72j48
5934b5J46o0RJ04k01J73r0O2l7J07n2n0k92L11P8j85J25j00j93J60J13j46P8K7
5958F2r9K2kj28K00j15k0M4L0j27J40N4o1k35K23k3j16J89Q1k34L25k05R7j05
5982cL4k03j0K40p2J0k11J81K2k29K30q5J29J17k40K46p8p7lL3J21k15M8jL2J63
6008A79k38K6k2p3K09j22n9K16j64K57k09m6J20k82L11Q8j39j72J63j4j71K27
6030H5j6r5p8j47L24j18J0K51j74j57K82q7J0q2q6K98l09mJ59o4N2Nj70j09M53
$$ plain form
5863 -92 -80 232 145 45 89 211 -2 -187 -32 282 7 -72 -31 -279 -134 -208 -102 70 123 -60 129 3 119
5886 119 49 69 -55 -47 86 105 26 -74 -2 11 -2 49 -12 29 0 -171 106 -33 -48 -159 97 -28 86 -14 16
5911 16 268 195 -186 77 -56 -57 154 106 -19 -80 -189 -113 155 56 89 -83 25 -231 0 -79 295 123 -25
5934 -25 121 61 70 174 -27 146 56 118 81 188 136 86 -206 105 183 -2 123 23 -170 -10 103 -43 35 62
5958 62 -37 -15 -17 -145 55 -60 -80 -36 -6 -133 7 61 0 -235 -12 -35 -151 38 119 -115 210 5 102 -3
5982 -3 31 -172 -182 58 -14 -4 -215 -34 -12 -241 -11 -96 33 150 -90 156 78 1 -2 31 152 -63 -15 -16 16 179
6008 179 -59 -33 -55 -128 81 -41 -100 116 -48 209 0 -46 74 -208 103 191 52 -120 43 29 -142 85
6030 85 69 -26 -104 -251 73 -45 -35 216 42 -115 167 80 90 8 -78 220 -89 -93 66 2 54 59 -111 -220 233
6055B33j17Q4j21j71J85j02J92k61K37k08J54q4l0Jl5N5j03L33k42j20J59J02
6077A41j9r3j3O3k09K14k9k27J94q9J7J05k4p4K3k04K49Nj04J50l3j33J66j66
6101i0J88k4k05K36j58L3K78k52j9J36L7m4k08M6j01J92j31P4j97J93J87k63J25
6124C3j40K03o3j26O5J76o0j89L55l00k21L19k82K22J13k07J27j46j6J19L8j79
6146a59J39K1o5N1J0QK8q6k6N9j67L11N5l36L11k77kL7M1j50K81j05j8j14J73
6171B0j72J56LN5K0O2l01J67R7o9K16j91o1k96J75J25N1lK5k33J46M2J7K16l86
6196a19K35j35J33M3O6k47M01j98l73J99j20l0L53l60K12k54J52M8R1n1j38J43
6218E1p6N9j70J41l9j1J67l2j0k97L55j33n0J94j73j98O2R8J38M5k49K13R4L3
$$ plain form
6055 233 116 200 79 -92 93 -9 183 -78 159 -49 105 21 -9 -8 -43 12 -91 242 0 -120 39 141
6077 141 122 29 16 79 -130 84 55 -172 22 -67 -50 55 31 -43 -20 -224 25 30 -74 76 43 -90 76 -90
6101 -90 98 74 -131 105 -53 -20 258 6 -13 123 160 116 -92 -46 -147 45 -86 -12 -209 -16 171 -92 33
6124 33 -107 96 33 -93 -28 148 88 -101 254 -46 -267 52 -230 -8 105 -102 25 -121 -137 -18 20 -159
6146 -159 -20 1 -64 -13 -3 5 33 -53 -79 -20 -187 124 179 -157 154 -123 -125 -88 -47 -197 84 -21 -39 -153 20
6171 20 -152 4 7 62 82 144 -157 10 107 38 254 63 2 -294 -119 6 57 54 79 -154 -8 34 51 267 -119
6196 -119 116 -19 114 157 223 -24 377 179 -194 5 -115 -145 208 -152 60 -194 -42 6 97 46 -92 51
6218 51 -25 34 -136 5 -34 -45 122 90 80 -217 138 5 -45 149 -24 -222 -160 -62 76 121 -128 85 179 212
6242B12r1N9j66j11N0o9K53r0O8j21m7j71J0L10j49m5K2K6q6J7J8R0M2o9L9J65
6268A66l48J80J77q6j59p9J36n2Q8o0P1j50K06Q0o2J42j25j05q7J56j57O7j35
6291a36N4j4L6j8O6K5R7j61P1j31J22n4k0n2K06k2m1J8j41N4J51k49K12J94l09
6316d2Q3K22m95N03k51j27R7J04q2K05l00K38k4k8j34QP9K5M8j42j7L7q1K80k54
6341d8j3Q5j48L99k41po9m7o3L00j90j04J60O8j30J12O2k16J11j44P7J02j91J04
6365c1O2k04J34j34j5L28q5j41J75j98K03j01m7m4j2M9J53L3r1L5j75K76j32J9
6389E7n2PnJ88j68j55K25j93K2K42k37J17j09J6J54K1j22k8j43M81l24N9j31J61
6413H3m9N4l8R1j33J07k00K23m5r3J66k73J98n6L3k8q4N1P1j1j23K11k7l31O1
$$ plain form
6242 212 121 180 14 -97 -47 -116 137 47 115 -6 -53 -224 -214 96 -53 -98 -76 -50 -136 -119 -101 -11 31 -38 1 166
6268 166 -182 -2 175 89 -70 -149 -13 -65 23 -37 34 -116 90 170 108 250 125 20 -67 89 -68 -1 -136
6291 -136 -82 -96 -60 -78 -12 13 110 -51 20 -111 11 -43 -63 -115 91 69 28 46 -95 -41 110 -139 73 267 -42
6316 -42 41 263 -232 271 20 -107 -10 94 12 217 -83 155 131 103 -31 -23 56 81 129 -13 -30 7 -74 206 -48
6341 -48 -61 24 -124 275 34 27 -42 -89 -152 148 -42 -146 14 82 -48 64 126 -90 21 -123 -46 56 -135 -31
6365 -31 31 -173 -39 -173 -188 140 55 -86 89 -109 94 -7 -54 -98 -110 -61 92 125 34 69 -106 170 38 57
6389 57 5 12 7 195 27 -128 97 -96 -74 168 -69 48 -61 -45 109 130 8 -20 -163 318 -6 53 -78 83
6413 83 34 88 50 141 8 115 -85 138 93 0 166 -107 91 35 68 40 -44 7 78 67 -56 155 128 -203 -142
6438a42J95J33j33l71J90L65l55K24k55J23NJ03k16J84K4k3j00J29J5j35J45j13
6460hr0k4L08j38j10n8L8j07k7K32m0K91k26j11j95K64M2J04j01L7k14R4J92j71
6484a8OLJ08m2r6j72L92k71J58P5j47K07k57pJ17r4K4m5J25j13Jj52K17n3M3K14
6510B23n7j97J95J06k67O3j5k02K54j46J16M2k10J88j26m9J80r7k3k5N4j42L07
6533A72l6l60K93j40k0o8J83o0j43L23o7j49M6K38m87K65P6R7J2l54K13pl4j73
6557a80K04J09jP6k68J89p7k87R8K60j93M2J82k94J35m8J7J75j79q2J79k52K36
6580D1j5n3J8k7j18J49j51kJ42K6j40J51j40N9J01J00o0j13j3L3o3L2J20j32N0
6605eM5j28j79K39Q4q5j1O2j63J25K49j44k31J81n0J27j73K21j05L3l89M07k9
$$ plain form
6438 -142 53 186 53 -318 -128 237 -118 106 -149 -26 -21 82 -134 50 74 51 -49 80 95 -40 105 -8
6460 -8 -98 -122 186 48 -62 -120 -82 -189 -216 16 -24 267 41 -70 -265 -1 41 145 44 81 -133 -39 153 -18
6484 -18 -12 -9 99 57 -39 -211 181 -90 68 143 -4 203 -54 -61 56 -38 -14 -59 66 -47 -46 -198 19 -34 9 223
6510 223 166 -31 164 270 3 66 51 -151 103 -43 73 115 -95 93 -33 -82 98 1 -22 -47 7 -135 172
6533 172 136 -224 69 -71 -91 -159 24 -36 -179 144 77 -72 -26 212 -275 -10 66 163 175 -179 34 27 -7 -180
6557 -180 24 133 132 208 -60 129 52 -235 -137 123 -70 -28 154 -140 -5 -53 -36 139 -40 -122 57 -195 41
6580 41 26 -27 -9 -36 -154 -5 -156 -158 -16 10 -130 21 -119 -60 41 141 81 -32 -45 -12 -75 -43 77 -55 -5
6605 -5 40 -88 -267 -28 56 -29 -40 22 -141 -16 233 89 -142 39 -11 116 -57 164 59 92 -297 110 81
6628H1j71K73k15j04J46n7q4K69k96J32P4l1K5J28k72J49n7N1R6q0J12j07N0j28
6652a6J21j86K28n2j90m5L17j13K8j09o0Q9L2j52K14k11P6K15k58jM8J64j19p8
6676e8J44P9m7p0j35J06J92j17n9j3p3O1j34J93N8j72P1k5J05j36j62K22l3P9
6700G6J27j72M6K7l25Q2M4K36k3j25M0j52j19K04N2l2L7j18J78q0j44K21o4q2
6724f6J22q8Q1p1P5n8j00L3Q2l1M0J82j34m4Jr7J23l46L72l8j12k04J62J62k14
6749a68P6J14N5p9r3jL02k60J44j10M3m0n1Lj37L13l26K20k5n2L48l88K24k72
6773a60O2J07R1K1J07l27J9j3O3l8J05j8l2Qj84R4K44q6k5k91K29P0p3q5K10N1
6799A49k27J15j11m9R9J16j33%j84J93m3J17O5j29RJ03r0n8N3J14p6J03k06R3
$$ plain form
6628 81 -90 183 -32 -136 10 -47 -131 138 -158 -26 48 17 42 170 -102 47 -10 41 137 57 169 62 112 -16
6652 -16 105 -81 147 95 -95 -140 177 64 92 -17 -77 12 44 -108 106 -105 -29 186 -72 -73 -25 139 20 -58
6676 -58 86 165 118 48 -87 19 211 94 35 22 -51 10 -124 69 127 -45 26 1 106 -30 -192 30 -3 76
6700 76 203 31 77 104 -221 -139 -95 141 118 -7 33 -119 -238 -34 18 -14 23 -95 83 3 -141 80 16 -66
6724 -66 56 -32 49 -22 53 -5 -105 -72 10 -21 19 201 67 23 24 -73 50 -296 76 38 -74 -278 -116 46 -168
6749 -168 -92 22 77 -2 -95 -96 206 -54 90 -20 23 -17 -68 -65 -202 111 -215 5 -20 -72 276 -112 112 -160
6773 -160 -98 9 100 121 228 -99 -80 -93 -30 -68 37 19 -13 -5 -189 -95 149 63 38 -253 -24 46 -27 -112 98 149
6799 149 -78 37 -74 -123 -24 92 -41 -41 -225 -32 -75 42 107 -22 -13 90 0 -58 -5 109 33 136 -70 23
6823B3O5r2j6K00j24l4j60q5O8J46O9j94J23N6p5N7p3q0L9J30j22Q5m2rMK32k97
6850a06J09Q1j60O6J72l14K77k75J6K27n6j7j24K1K0K4P6j36K52l36J51P2n9K77
6874B58k23m0j41J44l9R1J61l33J03j08MM2j47K66j44L56k35j90L52o8p0j1j09
6897h1K62p6j88K41o0r3R4N7q9j45K2m9N3l1J12M7M2m9j53P4Jl2r5K2Q9p8J56
6924E3R0j57k5j22J58J8Nj24R7K9r3J77k5j65r2J06J69k1J22k84M7J66j52nK8
6949@m2N3K30k38J16j46m9N3J31M1j46k22L15k92J86j95K07K04k92J17j36J78
6971G3L2j01k3J9q3L4J60MJ65l22j8J47P6k06O5O1q1n6m8J09J13k6Rj22q1J72
6997G2N5J1Jl49J70N2k08K60l3n4J48k59J26j8J81j30M7j17K3J56l44L57n0k79
$$ plain form
6823 23 88 -4 -20 180 56 22 -138 -223 -155 -9 60 -134 -11 45 -30 27 -46 -126 -87 43 -79 6 -36 -45 -41 191 -106
6850 -106 3 84 -76 -10 162 -152 125 -150 -134 93 37 20 -104 -83 -63 -39 37 -99 153 -183 -32 40 -19 258
6874 258 35 -5 -146 -2 -41 50 211 -122 -19 -127 -123 -81 -228 38 -106 250 15 -175 177 109 39 28 -81
6897 -81 181 105 -83 158 98 5 99 156 67 -78 -56 -105 -52 -83 29 76 118 69 -84 -10 -9 -41 -136 -114 -25 -103 53
6924 53 143 -14 -39 -161 -3 15 20 -104 -7 22 -71 106 81 -84 -176 -70 99 78 200 -84 -37 129 -23 -28 0
6949 0 -42 11 241 3 119 -27 -76 -23 108 149 3 -219 96 -196 -10 -205 2 206 -86 31 -105 73
6971 73 105 4 -19 0 -83 -49 111 115 280 -42 -60 87 163 -43 22 83 2 -54 -102 7 120 94 103 -19 -100 72
6997 72 127 138 139 -210 -40 12 -196 64 31 -23 125 -134 -8 -26 155 25 72 -45 -22 134 -210 147 97 -182
7021a82L39r0k1M3k11M8O0r6J95l45J84j55L24o4j05j23L60m0k17J2l5J71J05
7044A57k02Q6Q5j20j34J31j8R2k2k6O5Qp8j14r9N9J31%J31O8j64kj6j08N9M9K5
7071D3JJ7m4J16j89k0o9j04K13J98k44M5M6p6O2j67K98k81J23N0J08j88J92l12
7095a82Q7J11j02K10j32j28J54j04n8M38n93J18O9K69j79J25J24l22O4K4K6M4
7117F3J6k23Q3k3J93k74L02j69j8P9j58K79n0k07L2J20R7l65K67O7j60J7k08K38
7141bP7%j95J2r2K60j73N2J6RJ45k97L96k36k4J77L6o4k15j29M23m39L33k23J10
7166d3o6R9PL8L7j14L4N2l91L48N7j28J74r7r8J30J8N4J24k07k8j48P2M1ql5K97
7193B19l41R8j62J55J57j41o5j20L15j85rJ46k44O8J65l9q5j85L47j11m9O9J37
$$ plain form
7021 -182 157 67 46 89 -122 -74 -14 -110 85 -260 -76 -231 93 29 -76 -199 161 121 -96 -84 -119 52 157
7044 157 -45 41 126 6 -128 3 -15 77 55 29 94 102 24 -90 -189 -130 1 1 132 200 36 34 18 -90 -31 18 43
7071 43 44 61 17 133 -56 -76 -145 -249 -36 162 -82 -37 9 -67 -5 -172 126 -155 -32 18 126 -62 130 -182
7095 -182 -95 16 -86 124 -8 -136 18 -86 -144 294 -299 -181 -112 157 -22 103 227 -95 -31 -7 19 63
7117 63 79 -144 -61 -84 109 -165 137 -32 -50 29 -129 150 100 -107 -75 45 142 -223 44 111 -49 -32 -240 -2
7141 -2 75 75 -120 -108 -200 60 -113 -61 -45 -36 109 -188 208 -28 -52 125 161 97 -118 -247 176 -263 70 -153 -43
7166 -43 -109 -10 -3 35 72 -42 -8 44 -347 1 58 -70 104 7 -91 39 57 111 235 28 0 -148 -76 -35 -43 -78 219
7193 219 -122 -24 -186 -31 126 -15 -80 -200 115 -70 -79 67 -177 -109 56 17 -68 -253 94 -17 -66 3 140
7216A40n4n3mJ04k68K1J26L6J5P5o8j63K05m1k98R7R4J7n3kjJ18r7J35k33J35
7242a7J08j5p1j69K80l00J94k20L10j81N7J18j00j19L70k66n1K4j7o5K48k6r3
7265aJ07k49J52r7mJ58j49K56p1j99K37j66p2J56J86l92J6J43K8j1m0Q0j63J42
7289D7p6l9J86j06l9q0r6K36J48j80J1N4q5J44r7j83J17J43Nl53L04l0j76M1j49
7314b53L19p1o1pP8J67q2j49J81p2O6o9j66P1J30k77o1K66q9J15O7K2p2J52k66
7339f1QM8M7Q3o5k10R5K19k77J26K04j33r9J11m8p9q3L3K74j88LN8j22N3O3j1
7365D9oJ68j19o4j3o2J08j00J15j60J85K4k24P1K8J3m0J25k05K61n7Rn0o3J6J02
7391A11j68J43k03J03p5Q1R6o1K25j22j79q5K04K0l5o2J3J51m16J84J78o9K4l00
$$ plain form
7216 140 86 33 29 133 -135 -114 12 48 63 138 70 -93 112 71 -227 -130 -36 -19 -72 -74 -75 43 -54 81 -152 -17
7242 -17 91 76 5 -164 116 -184 10 -210 100 -81 -24 94 -6 -125 245 -21 -72 -48 -65 -130 118 92 -1
7265 -1 106 -143 9 -88 -92 66 -83 173 102 -97 140 -26 -98 58 244 -148 -132 11 39 28 -12 68 -95 47
7289 47 -29 -68 118 12 -27 -107 -203 33 181 1 12 66 -19 125 28 -155 -38 105 110 -243 61 31 -145 -104 -253
7314 -253 66 -5 -66 -73 5 172 90 -59 122 50 116 47 -119 -48 82 -195 -256 10 -79 36 103 125 53 205 -61
7339 -61 -53 -5 42 125 60 -150 -55 164 -113 13 217 84 -15 96 48 -31 -114 -81 193 5 8 66 -56 -3 60 49
7365 49 43 211 92 28 15 -47 61 -39 76 -84 101 125 -99 -28 0 13 -27 98 -107 154 97 106 56 -7 9 111
7391 111 -57 86 -117 -14 -89 -8 88 27 252 130 -49 -134 70 90 55 -7 6 157 -259 -75 103 34 58 -242
7415b42K09Q4J9K6p0m8o5l5J90n3rJ38l09K15O3j78J37p9j0j7j43R3K10p4n9n0
7441e7R6j14KP1qj5P5p0j08M4Q1J72j14k42J8O7P7R0l32K19j01K05n3N1R7j99
7467d8p5L4J17j11K3N3M7J01j00j31J27K4m6J69Mp6p9J10p4P4m1n4jj54J56k9
7493B0L7J34k38k8K32l59J98P0r1j5m6J57j06j36L31Kj01Rj19N1M6L2K6j09o8
7518g1Q4Kj41J61N2j49J67j96J76k87L10j1k28J56j72K89k65k0Q7J39Q5k94J08
7541a8n6o1J46j06P2K40l98J19l8P1M1j06L91k96j10j1J23j20M2J14j20j3M6M0
7565hJ28N8p0j87K6k72L84P4r0j30Q5K09p5j45J59j86J1P5r8O4J15q9L4o8q2j40
7591b18K0J72n6J34K09j98k85L53r8m6P8j25j20J47J10oJ8J3j51m8J47k64J64
$$ plain form
7415 -242 -33 51 70 96 26 -22 -87 -122 68 15 6 144 -165 50 113 -65 72 -7 -17 -34 -177 -84 126 52 -7 -57
7441 -57 39 -75 -73 -2 -10 -25 50 -20 -128 -84 -3 169 55 -187 -169 -102 -25 65 -267 -48 -149 56 3 54 151 -48
7467 -48 -123 -89 28 -83 -60 -7 40 141 41 -90 37 61 15 184 188 112 33 143 69 143 102 48 47 -107 49 20
7493 20 57 191 -47 -75 157 -202 -4 66 -25 -40 -86 71 -35 -171 160 162 61 70 -49 2 48 80 106 -3 -71
7518 -71 13 15 -126 35 87 -62 105 -91 85 -202 108 97 -131 25 -147 142 -123 -143 -56 83 168 -126 -18
7541 -18 -74 -135 11 -95 -23 217 -181 -62 -100 -29 12 -94 297 1 -109 -120 3 -117 -75 39 -81 -94 -48 -8
7565 -8 120 178 108 -79 -53 -325 59 133 43 -87 -2 207 132 -13 146 -40 -29 46 -52 12 127 38 72 4 -78 -218
7591 -218 -198 -26 -82 52 261 63 -222 131 33 -13 65 -60 -180 -33 77 71 89 102 -49 -97 50 -214 -50
7614e0Rn2o3J32q0J53N8k2k10J29K2j59J03J67p1K6q1q0M0J28j25jj32J36J49
7639A26J3j17K79j73j05j4m9ml2J87k70k5J63n8J57j16J38q2n7J40j63k5R3n8
7663e2l0J37l2j94L20n4j36LJ01j21M2K56j27l26J54K05k89J86j85J04j9k7N8
7686b6P1j40j1J89p8n0K6J51j21j54J43k1J8j28J75pjj10r7K65k44P6P7j84J00
7711h1K66p7j21J4J61j5j60l9N3J2J83m9j3p9k4M3k20k6J72L1q4K9J15k25P1J2
7737e1J12j33l0J58R1j63K6L7M3m5k58K90j22J44q5L2N1o6J06k4j2j77L2j4J7
7762d1L0q4j61K56j96L62k33J56j35K36k76R2R8r8j42K00p4m7K8n1J41j39K72
7785A94l40J13n0J43P4k06J23KrJ26j87N9o6R1J20k61K43m36M62n07K95K20j74
$$ plain form
7614 -50 -41 -93 -156 -24 -104 49 107 85 -125 4 26 -133 -30 137 66 92 11 -69 -29 99 -26 -27 -159 -23 126
7639 126 139 22 301 128 23 9 -40 -44 -76 111 -159 -184 -21 -79 78 -38 100 18 -39 101 -62 -87 6 -52
7663 -52 -82 55 23 -171 149 95 -41 -38 63 -58 -16 240 113 -213 -59 146 -143 43 -142 -38 -57 -84 -26
7686 -26 45 -95 -106 83 5 -45 -19 132 11 -143 0 -21 -3 -131 44 37 36 -74 -171 94 -150 -74 3 -181 -81
7711 -81 185 108 -13 1 162 147 -13 -52 1 13 196 147 134 55 31 74 -146 -172 0 31 -53 -24 91 -134 -63 -51
7737 -51 61 -72 -102 56 147 -16 10 47 90 45 -213 77 -45 99 14 46 97 31 137 113 101 -76 -44 -58 -41
7762 -41 -11 -95 -256 0 -196 166 -67 89 -46 190 -86 6 104 6 -136 64 -10 -57 -29 -80 61 -78 194
7785 194 -146 -33 -83 60 134 -72 51 53 44 170 -17 42 -24 67 187 -74 169 -267 195 -312 -17 203 29
7808B9j58J12n6m4K17j65J98m2m2O3r9K8j30K8KQ3o4j35P1J02l4qj7oN5l0k4N8
7836hj7j64R9m1j6L58k66n1J91o6J30j05J47j72L1j72K29k20N5K3lJ4qJ4N6M6
7862H4J7m7L1j51P5M9K0j65O2J59n6r5J14j03o3J31r9m6K42j89m0K6J6J81k67
7887a14K03j79J25kJ26q9q8K8Ol3qj48J26o4K64R5l2j66m0J0KOK6k1j48j3J1J01
7915a6Q5j67J09k3K09j71p4J98j24j7j6j60J91M0r5K8q2J75Kj62L05o0j92N7o5
7940b5p9R7q4j80L43j0J7o3m2j24L72l42M8n6N4K52L4j31j15O1j71L11o5j26J4
7965a0Q5j90K81l08J46j07OK99j73m8n0M7j06J63Q8k93K09k8l9Pr7L3j53J51J54
7990F7r5J37P3l30J48J85j62n8l2J43JK20l51L0K33j08k15Q8J57l2m4j52K2k0
$$ plain form
7808 29 -129 -17 -73 -117 100 -65 133 91 49 112 13 41 -89 -61 -59 24 -40 -175 -104 -2 -36 -44 -61 -67 -12 -42 -66 -8
7836 -8 -25 -189 -90 -131 -147 211 -55 -106 85 19 149 44 191 19 50 -122 107 -113 -58 -35 -38 -24 -32 -18 38 84
7862 84 101 54 85 -66 9 58 78 -87 -25 134 78 -17 97 -6 -69 62 -37 -83 159 -30 -70 -44 -28 153 -114
7887 -114 89 -90 35 33 159 70 -18 10 16 -17 -25 -173 -47 -111 153 248 216 50 10 20 22 28 54 33 -115 -128 -117 -16
7915 -16 69 -98 11 -12 197 26 -48 150 26 9 -7 -167 24 64 -31 -3 -85 90 92 -70 235 175 -17 40 -25
7940 -25 -104 -7 -91 -271 72 62 79 16 -26 -150 222 -120 -72 -128 -74 178 212 81 -34 27 -144 167 102 -24 -10
7965 -10 75 -115 166 -142 4 -103 -97 202 29 -19 -69 -22 -128 35 123 -170 39 11 -28 -21 -118 -85 -238 -87 67
7990 67 -28 109 182 -148 0 185 23 -35 -67 76 77 297 -54 -24 209 101 -114 -26 131 99 55 -97 -75 -95
8014i5J85q6q9O4j29J44J10j51M1n8O6j32M7k5J20N8k47K30j1j39J91Q8k22LM1
8039Dp2L2J5N8N1j18j35o7P5J6J90Ol6M5Q4j83m9K33k20J30J65l11K02q3j04p
8065g9L5M6K59k00j53Q3L8Rj22M5j77J17K22j42nk69L62k39J30K81k84k1n3J01
8089a6J46k8j43j3M9j67J67Q3k10J71j3r6k9J83k71R9qO5j69MJ70Q4j58N2L62
8114C14k99K42j36o4q3L9l4P6n8k1P7J8k6p9J17j40J54j65R1j7N8J8j20K47k88
8139g9kL2m5M6J84j74M6l8j60J95R1j10n2K24j38p3J2r0J21l8NM6J97l08m7P8
8165g7K33p5p8m9J53k5o1J6ON7k00J5J00J0j58K64k18J18J36k70N7r4M9J71k62
8190a82K54
$$ plain form
8014 -95 90 4 -85 -21 -150 -6 104 -47 -6 -64 2 -130 -83 -108 12 70 -177 53 42 -97 94 182 -40 -37 4
8039 4 -68 -36 -21 37 88 -30 -165 -232 -157 -141 49 55 19 64 148 -35 -84 149 -71 59 224 -87 115 32 -72 -79
8065 -79 -44 2 261 61 -92 -9 29 38 -84 -39 -216 -99 123 -19 -24 -293 69 -170 -40 241 -43 -64 -117 -16
8089 -16 130 102 -41 -54 -5 -172 -5 78 -132 39 26 -70 -99 84 -187 -88 -96 -31 -200 -196 -26 58 -100 -48 314
8114 314 15 257 121 57 -26 13 -21 55 -3 -24 53 71 45 -34 83 -57 97 -68 23 6 64 82 -38 209 -79
8139 -79 -81 -49 -94 -48 136 -38 8 -30 -190 5 96 -14 -66 158 20 -53 -41 -131 -10 -48 -43 3 200 -108 -155 -77
8165 -77 156 81 3 -46 107 82 21 37 43 100 -100 -85 15 25 -133 131 -87 31 167 -103 -46 -140 -91 80 -182
8190 -182 72
8191G2
$$ Imaginary data points
##PAGE= N=2
##DATA TABLE= (X++(I..I)), XYDATA
0@%%%%%%%%%%%%%qJ6j6J6j7K5l2M0m8N6o4P2q8J04j20J36j53J77k05K30k58K95
35A58l35L77m24M72n27N89o55P27q04Q90r85J086j197J321j454J600j764J945
53A020k144K367k618K901l228L606m047M574n215O012p038Q416j0374J3402j8752
68a1118L1038j11246n1611J21443j2503K7186J0844Q9247O4447p0110o2819L0459
80E5257j3099k6764p4457l8331Q3728L6052n3627N477K7012M6766J991r5247k0653
93f5895N6752j5646k8990k0009L1694J03610J1862m6994L9394L8048N00m8494
105E5832r4414N1L1501o3535m3689J0077M7376P1090j9743k4150P5658L7892k2451
118F1495l7558l8929M0118K1456p3318j7109M0025K9994J4206n1910j7426O3966
$$ plain form
0 0 0 0 0 0 0 0 0 0 0 0 0 0 0 -8 8 -8 8 -9 16 -16 24 -24 32 -32 40 -48 56 -64 72 -81 96 -109 121 -137 158
35 158 -177 200 -224 248 -279 310 -345 382 -422 468 -517 569 -628 693 -761 839 -925 1020
53 1020 -1124 1243 -1375 1526 -1702 1904 -2143 2431 -2784 3228 -3810 4606 -5768 7634 -11118
68 -11118 19920 -91326 -142937 -21494 -33997 -6811 4033 93280 157727 87617 24798 55257
80 55257 42158 15394 -59063 -97394 -13666 22386 -31241 -25764 1248 48014 50005 -45242 -65895
93 -65895 -9143 -24789 -53779 -73788 -42094 61516 73378 26384 65778 103826 104326 55832
105 55832 -38582 -38531 -7030 -70565 -114254 -104177 -56801 14289 -5454 -29604 46054 83946 61495
118 61495 23937 -14992 25126 46582 -26736 -43845 -3820 26174 40380 -11530 -28956 35010
130C5010j1195n9571k3535l39M6445L740n4349L6372P0174J5676l697l1084J3017
143C6664M8722n0043o6366o24O795J3467k7025m2053N4801N0373k0477j2115l559
156a1440L0964L1406n6782l0436M2915J6463k511k4329j2016N9559J2143n6344
168d08j3624N763J1710o955o1655J147N8540J544j2095k92K1207N7772j1554n2668
182a568J5884J8321p166k5247m6069K3298M3904l1974k2063J3952K1752K6921
194B9945l5253l5458M1536J7687k0258j4101q137M3833K7306m4928o608K8765
206B4329O518o503m4808j6752M3673o556l5315M36J4174L8048L631m2681J8111
219c695L8000q898j7968k5643J0654M0808k6490l3152K0068J8045J1837k1293
$$ plain form
130 35010 23815 -35756 -59291 -59630 -13185 -9445 -63794 -27422 42752 58428 54731 23647 36664
143 36664 85386 35343 -31023 -31647 -24852 -11385 -38410 -80463 -25662 24711 4234 -7881 -11440
156 -11440 19524 50930 -5852 -36288 6627 23090 20579 -3750 -15766 43793 55936 -408
168 -408 -14032 -8269 3441 -3514 -65169 -64022 -5482 -3938 -16033 -16325 4882 62654 51100 -1568
182 -1568 14316 32637 25471 224 -45845 -22547 21357 -10617 -32680 -18728 3024 29945
194 29945 -5308 -40766 770 18457 -1801 -15902 -24039 19794 47100 2172 -4436 24329
206 24329 30847 24344 -20464 -37216 6457 -99 -35414 -34978 -20804 17244 20875 -21806 -3695
219 -3695 34305 25407 7439 -18204 -7550 33258 6768 -26384 -6316 11729 23566 2273
231B273l6566L0764K3986l2731j6861O06K6460K8593l3382j1483M2701J2389j0047
244B6702k4909j8067L4735L39m8906l951J8180J8812O484l3770R661M7419q564
257B4165k3539j1503K850K9912j7471m0572K2312K7609L206p598k2901K3061L1380
270D0911l5145k7357M259Q555J2916k7230k0637M3876K3644j2449o284k565K8284
283C0778J0253m8814j4415K0070J658n841k6477J245M9346K957k5798L900J1499
296A0361J8651j1257m5852Q863K8419j1152j2494q776J9266L9740j9103k6932
308a0266J8650J0241k055k4412l0737K6759K1589k5105n627J2063K5107K0597
320C6804l1486j4116L0202q77k0026k1945j0049L2702N161l2287Q564K4998J5338
$$ plain form
231 2273 -34293 -3529 20457 -12274 -29135 -28529 -2069 26524 -6858 -18341 24360 36749 26702
244 26702 1793 -16274 18461 18800 -30106 -34057 -15877 2935 9419 -24351 -14690 32729 24165
257 24165 626 -10877 -8027 21885 4414 -36158 -13846 13763 16969 9371 -13530 9531 40911
270 40911 5766 -21591 -17332 -8777 4139 -23091 -43728 148 23792 11343 5059 2494 30778
283 30778 41031 -7783 -22198 -2128 -470 -6311 -32788 -31543 17803 20760 -5038 -1138 10361
296 10361 29012 17755 -28097 -19234 9185 -1967 -14461 -23237 -3971 35769 16666 -10266
308 -10266 8384 18625 16570 -7842 -38579 -11820 9769 -15336 -20963 -8900 16207 36804
320 36804 5318 -8798 21404 20527 501 -21444 -31493 1209 6370 -25917 -17353 7645 22983
333B2983M35l1095L952L2187j7212k6566n579P853K6294j1524k8919K5369K4450
346B2628n651j3462j9860J6490K2001l2254j8800J6307J5169J3007j8688j2655
358a5768L6932J0999k3931j2307n205J7716L512l9139k726K8239N496l006j5418
371a4606L776L6930o303k9096M163R333J2400p973l0402J6352K7831j3238j3157
384c990p205R636K0919k5775k5464J9807J2499N29j0320j1181L2353K0231k4689
397G350p289P654R814L624l3264j1879K8587J028j4351p926J816K9205M1l2189
411a7779M669J6513K254n953k1699J1221L4533q893j4333O707R847J4751j8879
424A2959l2417J3286R091j6276j2469r512K1367K5649j8579m731K3032J1324L735
$$ plain form
333 22983 23418 -7677 -3725 28462 11250 -15316 -20895 -13042 13252 1728 -27191 -1822 22628
346 22628 16977 3515 -16345 145 22146 -10108 -28908 -12601 2568 15575 -3113 -15768
358 -15768 21164 32163 8232 -4075 -9280 8436 11948 -27191 -29917 -1678 3818 812 -14606
371 -14606 -10830 26100 19797 -9299 -5136 4197 16597 8624 -21778 -5426 22405 9167 -3990
384 -3990 -11195 -1559 19360 -6415 -31879 -12072 427 956 -9364 -20545 11808 32039 7350
397 7350 61 7715 17529 21153 -12111 -23990 4597 5625 -8726 -16652 -14836 14369 14410 -17779
411 -17779 -13110 3403 5657 -296 -21995 -10774 23759 14866 533 7240 17087 31838 12959
424 12959 -19458 -6172 2919 -13357 -25826 -35338 -13971 11678 -6901 -11632 11400 22724 26459
437B6459k0354j5804K4298J270k4507m834M315J8748O998k7589J606K2793n421
450G978j3003j7950j604K5972p332j9833J5828J9194J6064j067j9979J4583J7849
463C6700k2594k0324j0064K929J3303k1151j5104K6064J5316R93n948q490K2637
476A4267R460k8333p735Q400Q570O555j9008k32L1251J178j4804q207n274J2496
490H584r495l4001L653J6429L792K998p241J7552L3265q274j5263L008M07L197
504A8611k0603k7626J4865J3207q995j966m9J9823J8334k2467j1998J2295k19
517C212m768j7508r091K8960J0856j2774O055J1005J5213R95l1191o654J1897
530F207j3372j5989j2139L837K8466J050j1430J9144J7181P703p387k3849N961
$$ plain form
437 26459 6105 -9699 14599 15869 -8638 -13472 -9157 9591 16589 -11000 -9394 13399 7978
450 7978 -5025 -22975 -24579 1393 -5939 -25772 -9944 9250 25314 24247 4268 18851 36700
463 36700 14106 -6218 -16282 -13353 -50 -21201 -36305 -10241 5075 6068 120 -8370 14267
476 14267 23727 -4606 -12341 -3941 4629 11184 -7824 -8056 23195 24373 9569 1362 -3912 8584
490 8584 -911 -34912 -31259 -14830 -11038 -8040 -15281 2271 35536 27262 11999 15007 15414 18611
504 18611 -1992 -29618 -14753 -1546 -10541 -12507 -12556 7267 25601 3134 -8864 3431 3212
517 3212 -1556 -19064 -28155 805 11661 -1113 4942 15947 31160 32155 964 -5690 6207
530 6207 -7165 -23154 -35293 -31456 -2990 -1940 -13370 5774 22955 30658 23271 -578 5383
543E383J0797k2336j4353k08R874J8675j0677r101K3904R093q454j2507j4430
556a4340J2778M885k5482k073J5806J2928J0322j1569J200K6186l793k0169j0146
569c467o073R272p335k5727R501K0699M282J668o665J1103K2560j4560j8966K771
583i37K079M296j2173j6947J9963J5929r291l851j443J0797R542k4184j1980J3872
597d328K329j659q541k455K6495P736j6955J502N242O009l189k6017j665J7768
611B272n816p983k850O495K2418n088j7880J0508Q671j662p814j6544J1060J7068
625A2855j3968o826O278Q480J0273j6201j4620J6513K790j1275p283m627J7862
638B51J0372j7300J752J5372M665j31j6718n117J8359o335j7120n60L702J3977
$$ plain form
543 5383 16180 -6156 -20509 -20717 -10843 7832 -2845 -11946 11958 21051 12597 90 -14340
556 -14340 -1562 3323 -22159 -24232 -8426 4502 14824 3255 4455 30641 26848 6679 -3467
569 -3467 -9540 -268 -7603 -33330 -23829 -3130 1152 2820 -3845 7258 29818 15258 -3708 -937
583 -937 1142 5438 -6735 -23682 -3719 12210 2919 -932 -2375 8422 17964 -6220 -18200 -4328
597 -4328 -1999 -3658 -12199 -14654 11841 19577 2622 4124 9366 15375 12186 -13831 -15496 2272
611 2272 -3544 -11527 -14377 -7882 14536 9448 -8432 2076 10747 9085 1271 -15273 -4213 12855
625 12855 -1113 -7939 -1661 6819 17092 891 -13729 2784 5574 -5701 -12984 -17611 251
638 251 10623 -6677 -4925 10447 15112 14981 -1737 -6854 11505 5170 -11950 -12510 -8808 5169
652E169o27j7968R753J5639m787o560j0063M866J6517j2992j2298J1235P822O442
666A2148p135j2910J5321Q195j6488p808k374P369Q278j7524l670J9886M768j549
680F507o191l696J7390n79k0510J12N673M662N37j6000N112J9830n464r105k608
695d330J539J1893r431j7949J0513R766J11k051p344J3121J5085j4480q659L837
709A621J498L029j4526j1036J7300N391p120j84L55J3666N740j9236k153R749
723D094j930l034j1124k91K0187j328j0294N142M516P809m195j9717M823R534
737D192q816n123l958P200J7220q162p992J2202M385K48r043j3579J0957N755
751E486j4320k033M278Q869R401j2753l032J5443j387p681p837n387J2823m87
$$ plain form
652 5169 4542 -13426 -3673 11966 7179 619 -9444 -4578 11939 -1053 -13351 -2116 5706 12148
666 12148 5013 -7897 7424 15619 -869 -8677 -11051 -3682 4596 -12928 -16598 3288 8056 6507
680 6507 316 -3380 14010 13431 -7079 -6967 -1294 3368 3905 -12095 -6983 12847 7383 -1722 -4330
695 -4330 -2791 9102 -329 -18278 -7765 2001 2112 61 -7283 5838 20923 6443 -2216 1621
709 1621 3119 6148 -8378 -19414 -2114 3277 -3843 -4027 -3672 9994 15734 -3502 -5655 4094
723 4094 2164 -870 -11994 -12285 7902 6574 -3720 1422 5938 13747 9552 -10165 -5342 4192
737 4192 -4624 -9747 -13705 -6505 10715 2553 -5439 6763 11148 11396 2353 -11226 -269 5486
751 5486 -8834 -10867 -6589 2280 11681 -1072 -4104 11339 9952 2271 -5566 -10953 1870 1383
765A383j5327N464R749N226K463j1754L434J4307r266j0520j850L92J0067n652
779a884j2240J2622R947k194j887q052P044Q787j5750p834N668K519N343p507
793e418n249J8139M878q462j562k589P237J751j8382j260J0967p32k26o093J203
808e798J7314l659j1912K977J941L778l592j4383P936J2085n672j681q55N042
822C521J1507j1117j1201Q285R72k303n973q104J2871Q370j0585J40M651N243
836F277M628j3478m563J2974k103o016k383j087J3105Q51j4011M138O059p38j996
851A657j2288K232J3335o804n718M190M169J0048m393j1804R833M814p256m302
865b287o947O703R453j1605l414R765K760L003q103p203J2216J68j1311o88Q63
$$ plain form
765 1383 -13944 -8480 1269 6495 8958 -2796 638 14945 5679 -4841 -6691 -6299 3768 -1884
779 -1884 -14124 -1502 8445 6251 4364 -3688 3356 12143 -3607 -11441 -5773 -3254 2089 -5418
793 -5418 -10667 7472 12350 3888 2326 -263 6974 8725 -9657 -10917 50 -682 -908 -7001 -5798
808 -5798 11516 7857 -4055 -1078 863 4641 1049 -13334 -5398 6687 1015 -666 -1521 3521
822 3521 15028 3911 -7290 995 1967 -336 -6309 -14413 -1542 6828 -3757 -3617 1034 6277
836 6277 10905 -2573 -7136 5838 3735 -2281 -4664 -5751 7354 8205 -5806 -1668 4391 3653 1657
851 1657 -10631 -8399 4936 -1868 -7586 -3396 773 10821 6428 -5376 4457 9271 2015 -2287
865 -2287 -9234 -2531 6922 -4683 -8097 1668 4428 7431 -672 -7875 4341 4509 -6802 -7490 -6627
880f627Q763M940j1777L668J1983j911l020p772k934J0670p003j2317M862M661
894c814N419M62q668R388J0578q230m801k592Q31O821j0645p863J1598M173N78
909C235j553m450J1272M323j4325l155J928L59K044j0933q12J5815Q63l468J160
924B303J52R638k551j5986K552M439l287r29p092N362J4352n484m515M677R56
939D587M202p427j2602Q036M264o437j65j021Q755R632r943k709P886j544j705
954C809q338o784J1410L87q592L749M000O938L274j1395J478Q225o245n321m987
969h392p66J1564l221p295R254N518K818j480j0297M553N494j1556m954K23K576
984e961Q236n708l447J3178L119l065k702o453O195P44j3314j91N278K491M579
$$ plain form
880 -6627 2136 7076 -4701 -1033 10950 9039 6019 -1753 -4687 5983 -1020 -13337 -8475 -3814
894 -3814 1605 2067 -6601 2787 13365 5135 334 -2258 -1427 5394 -5251 -13114 -1516 2657 3235
909 3235 1682 -2768 8504 12827 -1498 -4653 -2725 -2366 -322 -11255 -12067 3748 4611 1143 2303
924 2303 2455 12093 9542 -6444 -3892 547 -2740 -3669 -10761 -5399 8953 3469 -1046 3631 4587
939 4587 8789 1362 -11240 -3204 1060 -5377 -5542 -6563 2192 11824 1881 -828 7058 5514 3809
954 3809 -4529 -11313 97 484 -8108 -4359 -359 6579 9853 -1542 -64 8161 1916 -3405 -8392
969 -8392 -9158 2406 -815 -8110 1144 6662 9480 8000 -2297 2256 7750 -3806 -8760 -8537 -5961
984 -5961 2275 -3433 -6880 6298 9417 6352 3650 -2803 3392 4136 -9178 -9369 -4091 -1600 2979
999B979n665J499J3524l020o729j421l402M224l671j2694N338P763m06K614k537
1014a604N088J1113p920p176K622j759R32n937q462R851O298m981K197J86N311
1029E759N361j1826l981O016k674j826l864k633J2230K429o782M411K527K791
1043G938M14j2022j88O746o034k660j086R72J0604k376o950P501K595r51j819
1058B684q427M374O186q203j272L071K300O244n576n397Q747k54n192k004m420
1073g139O742L152r288K344O844N91K207o241j646R679m484o835J447n88N554
1088B339J82q748N856O375l643o10n025J160P241p618n124N744J370L381j503
1103A377n647R070L402p475q52k053J699L836r307j515Q886l33N79j493k503Q903
$$ plain form
999 2979 -2686 -1187 12337 9317 2588 1167 -2235 1989 -1682 -14376 -9038 -1275 -1681 933 -1604
1014 -1604 3484 14597 6677 -499 2123 364 1296 -4641 -13103 -3252 3046 -1935 262 448 5759
1029 5759 11120 -706 -4687 1329 -1345 -3171 -7035 -9668 2562 4991 -1791 2620 5147 7938
1043 7938 8352 -3670 -3858 2888 -3146 -5806 -6892 -5920 4684 2308 -4642 2859 5454 4503 2684
1058 2684 -5743 -1369 4817 -3386 -4658 -1587 713 6957 1381 -4016 4731 4477 -715 -2719 -7139
1073 -7139 -397 2755 -6533 -4189 2655 3246 5453 -788 -2434 7245 2761 -4074 -2627 -3215 2339
1088 2339 2521 -6227 -371 6004 2361 1751 -3274 -2114 5127 -2491 -7615 -1871 -501 2880 1377
1103 1377 -4270 4800 8202 727 -125 -2178 -479 3357 -5950 -7465 1421 1088 1667 174 -2329 6574
1119F574p15r789J969O65Q47J131p604K749R494l119j458M70l82O400m788r064
1135f620M926J650j949j10m187O009P804o712j394L185m06K605o735n863Q043
1150B46M32m099J263o63O832L639q705Q46M345k456o20o279j781R059k450m457
1166d848M199J107M822n1q468L958L855n644j448k877J386P981n061k988P337
1181C260R49R46k550o238N225J518p912k78P07K343N185n936L22Q582j339j698
1197C086k450l243N884j491q554K994K841J297K195n335K887P437n180l549K04
1212i77j553M305l567o571P134L038j081J403l091M481N019q341k017K138j617
1227a297J912m323l659Q737P91l490J815r94M097J512q595Q38M325k632N30k967
$$ plain form
1119 6574 5859 -3930 -1961 -1296 -449 682 -6922 -4173 5321 2202 744 1214 832 7232 2444 -6620
1135 -6620 -1694 -44 -1993 -2103 -6290 -281 7523 811 -583 2602 2196 4801 -1934 -7797 246
1150 246 678 -3421 -2158 -2821 4011 7650 -1055 -209 4136 1680 1060 -5219 -7000 2059 -391 -4848
1166 -4848 -649 458 5280 5229 -3239 719 4574 -1070 -2518 -5395 -4009 3972 -1089 -4077 3260
1181 3260 4209 5155 2605 -3633 1592 3110 -4802 -5080 -4373 -2030 3155 -2781 -2459 6123 4784 3086
1197 3086 636 -2607 3277 1786 -6768 -3774 -933 364 2559 -2776 111 7548 2368 -1181 -977
1212 -977 -2530 1775 -1792 -8363 -1229 1809 728 2131 -960 3521 8540 199 -1818 320 -1297
1227 -1297 615 -3708 -7367 1370 2161 -1329 486 -508 3589 5101 -3494 -2656 1669 -963 -433 -3400
1243c400J01Q431k157m419L311KJ369j323p581L326M136m505O8m01J592O757m956
1260C51l191N754o17p60j742m423O141K108o182J511J674J003K786o154j559O242
1276B942k894k396k29j593N945P9n885M394K264l79Q90n094J114N550n199j999
1292b490J687m30M314k421n189N895R39l194q9k780K456M447o202K68M452k91
1308A372K419k840k781O351j310n355J252j513K373J644o328K203N453k264L88
1323A064k122j121N833l567m396L547M26J884Q06m658M539L987m864n62j233q06
1339a243L047n402l116N593k01O68P58j847N422K042n891Q83K11j088J560n214
1355c818n73O483j546o66J555j107M188j281o930K167R87k405O97l374K556O655
$$ plain form
1243 -3400 -3299 5132 2975 -1444 1867 1869 3238 1915 -5666 -2340 1796 -2709 -2641 -3042 -1450 5307 351
1260 351 -2840 2914 2297 1537 -205 -4628 1513 3621 -2561 -1050 624 1627 4413 -1741 -3300 2942
1276 2942 48 -2348 -2577 -4170 1775 1854 -4031 363 2627 2248 3138 -1956 -842 4708 -491 -2490
1292 -2490 -803 -1233 3081 660 -4529 1366 2305 -889 -978 -3758 -1302 3145 -3057 -2789 1663 1372
1308 1372 3791 951 -1830 4521 3211 -2144 -892 -2405 -32 1612 -4716 -2513 2940 676 1064
1323 1064 -1058 -2179 3654 87 -4309 -762 -336 1548 2354 -2304 2235 6222 1358 796 -437 -1243
1339 -1243 1804 -3598 -6714 -1121 -1322 -654 104 -1743 3679 5721 -170 713 924 -164 1396 -3818
1355 -3818 -4391 2092 546 -120 1435 328 4516 3235 -3695 -1528 -541 -2946 -2249 -5623 -3067 3588
1371C588k761q8L455o79K329k841n931L349l49m028N46j551L171M723m146O63
1387e50M319j347N46l470l329M712j339l907K821M70K871K731m551J635L606l915
1403A303j178k577k143M305k627k993M543J474J896J357l688L654K516n645q91
1418f94p76r14L371l797j473N912R6k03N12k882L174N37o495P14J336m85K257
1435A90k768P42O624j630j472Q97k230K326j886n979K707J788j773J905j570K092
1451c7N070l376j798K251j897J008k332m161M518J471k468K024j51K107L046n181
1467I4q33K702k625n09j840j843N474l08k342L079Q12J082J087n180N71K680l968
1484a867o54k03m70M849j436k232M387J58k24l14l760J726J636m455O6J309L45
$$ plain form
1371 3588 827 739 4194 3515 5844 3003 -2928 421 72 -3956 -3410 -4961 -1790 2933 -1213 -550
1387 -550 3769 2422 2968 -502 -3831 881 -458 -4365 -1544 -1074 1797 4528 -23 1612 5218 1303
1403 1303 125 -2452 -4595 -290 -2917 -5910 -1367 107 2003 3360 -328 3326 5842 197 -694
1418 -694 -1470 -2384 987 -2810 -4283 1629 1725 1522 2034 -848 2326 2863 -3632 -2918 -1582 -2067 190
1435 190 -2578 -1836 4788 3158 1686 2583 353 2679 793 -5186 -2479 -691 -2464 -559 -2129 -37
1451 -37 5033 1657 -141 2110 213 1221 -1111 -5272 -754 717 -1751 273 122 2229 5275 94
1467 94 -739 1963 -662 -1171 -3011 -4854 620 312 -2030 1049 1861 2943 4030 -1150 -579 2101 -1867
1484 -1867 -2521 -2724 -3194 1655 219 -2013 2374 2532 2308 1994 -1766 -40 1596 -2859 -2793 -1484 -1139
1501a139L326k547j358N024j275j576n1k531K449P08m590J977K009l73K096k237
1517h8n19M279k552k385J128j784J909N1m204L726J965j698J521j858N46L481
1533C518m039j343K549j368J371n24k723M427O76l191J042j176M02J850m356j12
1549b997L579j271P16K30r94L978p23l740K223p50m60O12l561J647L218k426N39
1566a80O08n51K924k134l290K990n38j207O88k093K824K769l006J066J239q67
1582A242J622l154k281L328j968j398J173j019K743J617l073K116J628j598M82
1597A460k446j036L548k489j229K214n42K462K23l170K433Q77l073M24j666l30
1613b340K937k732n71L566l14J451n3k521L032r5l461P85j115K58J767k997Q47
$$ plain form
1501 -1139 2187 -360 -1718 3306 2031 455 404 -2127 322 1030 -3560 -1583 426 53 2149 -88
1517 -88 -607 3672 1120 -1265 -137 -1921 -12 39 -4165 -439 1526 -172 1349 -509 37 3518
1533 3518 -521 -1864 685 -683 688 164 -2559 1868 2544 -647 395 -781 -379 1471 -2885 -2997
1549 -2997 582 -689 27 257 -737 3241 2518 -1222 1001 251 -209 403 -3158 -1511 1707 -719 -180
1566 -180 428 -123 2801 667 -2623 367 -171 -1378 -690 -2783 41 2810 -196 870 2109 1242
1582 1242 2864 -290 -2571 757 -1211 -2609 -1436 -2455 288 1905 -1168 948 2576 978 1460
1597 1460 -986 -2022 1526 -963 -2192 22 -520 1942 2165 -1005 1428 2305 -768 -344 -2010 -2340
1613 -2340 597 -2135 -2706 860 546 1997 1944 -577 2455 2360 -1101 -316 -1431 -1173 594 -2403 -1556
1630a556L606j544N10J10j920K613j410l300J816k6m7J746k210K026L101k367
1646A148J64M44j711J879k312l109K877l71m42J476j671J986K491l065N65R66
1662A315j693J256k167j544L504n42q81J626o82J773R50l754J251P64k409Q78
1678c55j872o58L486j495q92K662o78J496L95l009J965P46k655Q56p70j87K556
1695A591k466l59K695j355M80j75k319K425M19k968J670l56K03K043k238J53L143
1712B586j966J48P5j417K275j126k811J985l13o49J428k261R43K539k330J69J525
1729H00j021K098q62k158K841m67j404P51j635P77J700l024O56J396j041J267
1745F74j206j391K973j017j290J379j130J261J465k775J638J900j773O73j029
$$ plain form
1630 -1556 2050 506 1016 1126 -794 1819 409 -2891 -1075 -1101 -1148 598 -1612 414 3515 1148
1646 1148 1312 1756 45 1924 -388 -3497 -620 -991 -1433 43 -1628 358 2849 -216 349 1315
1662 1315 -378 878 -1289 -2833 671 129 -752 874 192 1965 2915 -839 412 1176 -1233 -355
1678 -355 -2227 -2885 601 -894 -1786 876 198 1694 2089 -920 1045 1791 -864 -8 -778 -965 1591
1695 1591 -875 -1234 1461 106 586 411 -1908 517 936 -2032 -362 -718 -515 1528 -710 -557 2586
1712 2586 620 768 843 -574 1701 575 -2236 -251 -564 -1213 215 -2046 -1103 1436 -894 -725 800
1729 800 -221 1877 1015 -1143 1698 1231 -173 578 -1057 -280 1420 -1604 -948 448 -593 674
1745 674 -532 -1923 1050 33 -1257 122 -1008 253 1718 -1057 581 2481 708 1381 352
1760C52j241K224k142j923K081p91O41P66j700K429J602k362J135m95o57J863
1776A782k562p74K407j374K29J103j729K339M82k862J256p68q96J445k518K42
1792b198K862j175N55J358r63K272m86k798J450o32j602R87k056N51K588j890
1808a177R97J498r90J484n97k246J712q30j479J096j076J202J974j885R73J991
1824B647j749O73j271j907K141j574j689J673o91J455J874j933J617J480k029
1839G17O16j049j736J841j826j290K407n04R29J520j938K083P36k617O47j059
1855e23j110J460j798m58K942o98P51J027j272J592J0k742Q80m95j290J452j489
1872a761K39K859j203L03J388j520J207m15k747J481n54j237J578j226Q85K683
$$ plain form
1760 352 -889 1335 -807 -2730 -649 -1440 -799 -33 -1733 696 2298 -64 1071 576 -81 1782
1776 1782 -780 -1554 853 -521 -292 811 -918 1421 1903 -959 297 -471 -1367 78 -2440 -2198
1792 -2198 664 -511 44 1402 439 2711 2225 -573 877 245 -1357 -370 -2426 -1875 713 -1177
1808 -1177 -180 1318 328 1812 1215 -1031 681 -149 -1628 -532 -1608 -406 1568 -317 656 2647
1824 2647 898 1571 300 -1607 534 -1040 -2729 -1056 -1747 -292 1582 -351 1266 2746 717
1839 717 1333 284 -1452 389 -1437 -2727 -320 -824 105 1625 -313 1770 2506 -111 536 -523
1855 -523 -1633 -173 -1971 -2429 513 -185 566 1593 321 1913 1923 -819 61 -434 -1724 -272 -1761
1872 -1761 -1522 1337 134 437 1825 305 1512 1097 -1650 -169 -723 -1960 -382 -1608 -723 1960
1888A960j954O95J113j642J034p85k135K074q39j174J858p47N21J580k145P41
1904A55J261k127Q92q45j176J811n72p80K138o77P05J364k197P86O98k141M93
1921b12k39j308K095j182o51K242p65K59J346k258J177O11k440J279L9r21K098
1938A170j229m07K208j292j51N06j652Q49j1k107J466J64p45J894r63J01K248
1955B049j820R5R45j861J054j83j848J638N0q40J522j361K39J629k106m9J412
1972E65j836J295j34j273K367k81j251J968j118R4J329k551M85J002j874J033
1988a80j04j027K137p75j278K025j026l9J055j909J031R06j427R40M17j175J959
2005A530j138j176J854j506m99J195j933J177J000j938J636N08r67J697j515n65
$$ plain form
1888 1960 6 701 1814 172 1206 421 -1714 360 -479 -1653 205 -542 -21 1559 -586 155
1904 155 1416 -711 181 -664 -1840 -29 -601 -1381 757 80 785 2149 -48 738 1436 -705 -212
1921 -212 -451 -1759 336 -846 -1497 745 -20 239 1585 -673 504 1115 -1325 -46 -7 -928 1170
1938 1170 -59 -466 1742 450 299 805 -847 2 -9 -2116 -650 -486 -1231 663 -300 -199 2049
1955 2049 229 324 1269 -592 462 279 -1569 69 119 -721 801 -560 -321 1308 -798 -847 565
1972 565 -1271 24 -110 -1383 984 703 -548 1420 302 396 1725 -826 -341 661 -1213 -180
1988 -180 -284 -1311 826 51 -1227 798 -228 -267 788 -1121 -90 816 -611 329 746 -429 1530
2005 1530 392 -784 1070 -436 -935 260 -1673 -496 504 -1434 202 710 -257 1440 -75 -640
2021f40J580j083n41R69j195J282O54k120J902P9j251J195j267p22J691j736j2
2038a215J398j148J260M70j375J756J88j592J419j362n84J489j936J97J478j351
2054i08J472J46j247J619l76j493J271j088l72J359j693O83J452j231J105L16
2070A015j375J947p47j540J399j316l77J115j813J066J384j638J457J43j129J535
2086A126r18j177J509r59j76J236j713J201J182j769J110K49j328J266j501p71
2102a433K199j673k92J385r72J018P61j482J497Lj352J147j039n91J691j302k33
2119f68J481j455J102K68j876J671j74j263J002n41m02J354j218L69J351j193
2135a92J044J46j476J494l07j538J222q70m1J091j522K78J584j755R15N24j319
$$ plain form
2021 -640 940 -143 -684 285 -910 372 1026 -1094 808 887 -364 831 -436 -1158 533 -1203 -1215
2038 -1215 183 -965 295 765 -610 1146 1334 -258 1161 -201 -785 704 -1232 -1035 443 -908
2054 -908 564 710 -537 1082 706 -787 484 -604 -976 383 -1310 -627 825 -406 699 1015
2070 1015 -360 1587 840 -700 699 -617 -994 121 -1692 -626 758 -880 577 720 -409 1126
2086 1126 208 -969 540 -419 -595 641 -1072 129 1311 -458 652 901 -427 839 -662 -1433
2102 -1433 766 -907 -1199 186 -786 232 993 -489 1008 1011 -341 806 -233 -824 867 -435 -668
2119 -668 813 -642 460 728 -1148 523 349 -914 88 -453 -855 499 -719 -350 1001 -192
2135 -192 852 998 -478 1016 709 -829 393 -477 -518 573 -949 -671 913 -842 73 597 -722
2152g22J498n35j248J672r17K3J161j523N42J280j716O38N80j424J410o56j063
2169a000J291r48j80J224j527Q87R87j545J156N44j232J373o97q77J480j213l03
2186e80R20j313P46P23j577J413R5j214J546p31p06J373j082l29J284j297O48
2203h1P64j519J758M8j358J205o16p81J147j281j76J280j559Q44P26j250J670
2220H21k0j095J372p97p15R71j330P9J301j427O23Q01q58R46L3j389J324p87q00
2239i47J318j262J27J141j145Q76R72j497J524j88j417J561j273p09J014j318
2255a223N91R36j412J347N12j119J051m72q52J313j330m07J267j072P37O98j075
2272e10J338K29j103J224j036p12J208j432m68J521j410Q29P79r95J317L77j358
$$ plain form
2152 -722 776 241 -1007 665 -252 -229 932 -591 -49 1231 -485 153 733 -691 719 63 -1000
2169 -1000 291 -657 -837 387 -1140 -253 734 -811 345 889 -343 1030 333 -544 936 -277 -580
2186 -580 340 -973 -227 496 -1081 332 427 -787 759 28 -678 695 -387 -716 568 -729 -81
2203 -81 683 -836 922 970 -388 817 201 -580 567 -714 -890 390 -1169 -325 401 -849 821
2220 821 801 -294 1078 281 -434 537 -793 -714 587 -840 -217 584 -274 672 705 -684 640 -147 -947
2239 -947 371 -891 -764 377 -768 108 1080 -417 1107 919 -498 1063 -210 -919 95 -1223
2255 -1223 -632 304 -1108 239 751 -368 683 211 -641 672 -658 -1065 202 -870 -133 565 -510
2272 -510 828 1057 -46 1178 142 -570 638 -794 -1262 259 -1151 -322 457 -538 779 1156 -202
2289b02J119n97p99J052j256L6J187j241O89P74j080J276k95j445J293p36r97
2306a222J378j082K25J280j224Q97Q17j024J098k88j265J042p24q57J252j228
2322i25L02R74j259J235K77j103J276n04j115J373p04o03J074r69O15J062j438
2339d32J131J39j090R85m96j035J121r04n86J319r79O30R81j464J099M06j381
2356e56J179l22r46J276j001l09J464j040J94P32j291Q39K78j430J314p02n67
2373h88J200q53O0J287j042M73O21j275J023k4j418J433n77n83J103r95J24J158
2391H27j388N63O22j510R79J96j068J400m78q26J561r90K89R09j550P96J13j234
2409g89R73k67o62J271p98m12J297q96M5R02j402Q28M59j214Q93j04o94J387n61
$$ plain form
2289 -202 917 320 -479 573 -683 -647 540 -701 -12 762 -318 958 663 -782 511 -225 -1222
2306 -1222 156 -926 -701 579 -645 252 1069 45 1143 855 -410 632 -92 -949 303 -925
2322 -925 -623 351 -908 327 604 -499 777 273 -842 531 -173 -776 298 -671 -56 1006 -432
2339 -432 699 838 -252 733 237 -798 323 -581 -1167 152 -827 -197 784 -680 419 825 -556
2356 -556 623 301 -645 631 -370 -679 785 -255 -61 671 -620 219 497 -933 381 -321 -888
2373 -888 312 -541 -481 806 -236 237 858 -417 606 582 -836 597 20 -563 540 -455 -331 827
2391 827 -561 2 624 -886 93 289 -779 621 143 -683 878 -112 177 1086 -464 332 445 -789
2409 -789 184 -83 -745 526 -272 -684 613 -283 -238 664 -738 90 549 -665 228 124 -570 817 256
2428B56o12J261j128K11Q04j595P87K55j338J128j37p33J423o02o02J351j044
2445c15K13O29j074P88K05j081J059k39o31J134o81m02R65j139J44O75j104O77
2463a77L49r37J261l61n39J314q28j19R04j185K13P04j418J027J21j120J221l52
2481G8o12J230j100J1R06j403O71N78j083J021K56j142J497n94m36J061j321K39
2499a43O35j334P03L43j019J243l07o89J157o03n98J271j066N5Q13j134N92P05
2517F24j084J004j24q06J107p77j50P58j168J25P76j156P62J61p36J163k05o95
2535d21J224o94k57P14r09L39O39j197O98K72j068R20q8q55J129r22Q0O99q69
2554e66L90N31r63R37K08j013J106l64o60R80q49j85J101j158J69P57j122R48
$$ plain form
2428 256 -356 905 -223 -12 792 -803 -16 239 -1099 29 -108 -841 582 -20 -622 729 -315
2445 -315 -102 527 -547 241 446 -635 424 185 -446 688 7 -395 570 -569 -425 250 -854 -177
2463 -177 172 -765 496 135 -404 910 82 -37 867 -318 -105 599 -819 208 329 -791 430 78
2481 78 -534 696 -404 -393 513 -890 -219 359 -724 297 553 -589 908 314 -122 939 -382 -143
2499 -143 492 -842 -139 204 -815 428 121 -568 589 -14 -612 659 -407 -352 461 -673 -81 624
2517 624 -460 544 420 -386 721 -56 -206 552 -616 -491 285 -871 -109 52 -684 479 274 -421
2535 -421 803 109 -148 566 -343 -4 635 -562 136 408 -660 260 172 -683 446 -476 -396 303 -566
2554 -566 -176 355 -608 329 537 -476 630 266 -394 586 -263 -448 653 -505 -336 421 -701 247
2572B47r0j051J253k93p95J315q04OQ90q48L53L16q99O67L00j028Q59m13n76J126
2592E35q35j73R11j114O84L43q74Q62Lr01J292m74o31J135j064M08N55q03M25
2611B84M8r94J006r4j201J346l64o99R11n41J82O80r59M91M11r52R10j00o71R86
2631F80o64l43Q96j024K26M80r15O52J61q66J002k88l29Q47l92k31P82o55O4M16
2651D99j031R35Q8j139J115k26q53J223p66k60P61r74K31O98r47Q12K29r60J229
2670F64l79o28J181q15l20Q71j049L14M95j102Q90L06r95R03k30n87J019p42k58
2689d62R72j045L64N69r70R88p7m94Q19l52n78P48o91j8M63j017O13J62p24J014
2709B84L3q41R52j72p05J033p55K5O33j019O15L64r95J225m45o70R12n03n52J239
$$ plain form
2572 247 157 -894 359 66 -729 586 -218 -212 678 -170 183 499 -400 267 567 -461 398 -15 -591 535
2592 535 -300 -473 438 -676 8 351 -523 339 342 -559 733 259 -372 763 -301 107 662 -141 284
2611 284 332 -662 344 250 -951 395 31 -668 243 -298 -116 564 -395 96 507 -445 465 365 -306 680
2631 680 16 -327 569 -455 -229 251 -664 -12 149 -717 285 -3 -332 515 123 -108 674 19 83 499
2651 499 -532 403 491 -648 467 241 -612 611 -155 -415 346 -628 -397 301 -646 166 395 -565 664
2670 664 285 -343 838 23 -297 574 -475 -161 334 -768 122 428 -567 336 106 -481 538 -204 -462
2689 -462 510 -535 -171 398 -572 416 339 -155 664 312 -266 482 -209 -227 236 -781 -168 -6 -730 284
2709 284 317 -524 428 256 -449 584 -171 -146 487 -532 83 447 -548 677 232 -438 474 -29 -581 658
2729F58j130P9M90p26O92J11m19Q14k88n09J000o14k28O85q97J57N38j056P13
2748G0j33m98J021m23m67J037r05P5M56m94K05N23r14O01L02p77J004m91n83P58
2768C67n41k83P43j117M75O50r83R44J10r93J118n69l0N19p19RQ62q28M60K75
2788D69r52P06j13n66O34nn86Q36q08J9R43j020K79N08p05P44j22p10J022n20
2808E3l63J116r01J21L29r65O62K39j067P41j13l22P32m34j62P59n52o5P54j062
2828e00P79J16p61P75k62n78O23k97l73J008q67M3P33q98L62L94q51Q67m26l86
2848d99R86m22k46O71p40L47L69r28N07J39q53P92j22m41P56o07j40P08p22K96
2868a49N22o85M84J30q17J059m19m47Q53o58r1O68o34J90L16r67P08N7p01P35
$$ plain form
2729 658 -472 -393 97 -629 63 174 -245 569 281 -228 772 158 -70 615 -282 -125 413 -643 70
2748 70 -63 -561 460 37 -430 607 -298 -223 233 -261 -56 467 -447 154 456 -321 683 192 -391 367
2768 367 -174 -457 286 -831 -356 294 -689 255 365 -628 490 -79 -109 410 -309 -300 562 -266 194 469
2788 469 -483 223 110 -456 178 173 -413 423 -385 -366 577 -443 -164 344 -361 383 261 -449 573 53
2808 53 -310 806 -95 26 355 -610 52 291 -776 -35 -148 -470 262 -172 -334 425 -127 -192 562 -500
2828 -500 279 395 -366 409 147 -431 192 -105 -478 530 -337 -294 439 -459 -97 297 -554 313 -113 -499
2848 -499 487 65 -181 490 -250 97 466 -462 45 184 -669 123 1 -440 316 -291 -431 277 -445 -149
2868 -149 373 -312 172 302 -515 544 125 -322 531 -127 -218 450 -184 6 322 -645 63 120 -581 154
2888A54l49l43Q68o24K06P91r85N92L02j083Q31j90o33R12m11m15Q04q11L81L00
2908B97o85L84M20q99N97q9m54Q81m99n7N92n63J78N02r70N00J03q75P81j01o02
2929e59J025m99l52R46j108L49N74q29O54J91p77N56P8n73Q04m30j59O84r68K16
2949a77L92p31M85J98p88Q86k09m41J039o99p1P91j002L00M71o58K36K77p26P41
2969C14j08n25P91p87O2N60p22Q3N53p79P25K15q60R13j55m70R31p35J44L96q83
2990c37J97M95q86O13R2m86N84m18N3N60o26k00P84o26K56M83j003O54N5o24Q43
3011D63k23k61N38p32J91K62q44O88K13j149J061j90l67O72l91k23R90q79L80
3030A99M13j081P18J44o95N82k90p05R98m47j64P13j039N81M31r77O09J15p10
$$ plain form
2888 154 -195 -538 330 -294 -88 703 -282 310 612 -471 360 170 -463 449 38 -377 427 -384 -3 297
2908 297 -388 -4 416 -483 114 25 -429 452 -47 -104 488 -75 103 605 -365 135 238 -637 144 43 -559
2929 -559 466 -33 -385 561 -547 -198 376 -453 201 392 -385 171 249 -324 480 50 -109 575 -393 -177
2949 -177 215 -516 -31 167 -621 265 56 -385 654 -45 -116 675 -327 -27 444 -214 22 299 -427 314
2969 314 206 -319 472 -315 -253 307 -415 -332 221 -558 167 382 -478 435 280 -190 741 6 150 546 -337
2990 -337 -140 355 -531 82 174 -312 272 -146 -93 467 -159 -359 425 -201 55 538 -465 189 244 -380 463
3011 463 240 -21 517 -215 -24 238 -606 82 295 -854 207 17 -350 322 -69 -292 698 -181 199
3030 199 612 -469 249 393 -302 280 -10 -715 283 -164 -328 385 -654 -73 358 -619 -10 105 -605
3049f05R45j76m64P30l57j25N93o78r7P23r81O26r1o89R23n65l41J100p66J71
3069a24M93p52L20M23o38O47j45o23Q80l15n03N99l60k15N42p41L29N73j106Q99
3089A83J6q19J149o43j13Q57p62O7N10q65M95L56q61N34Rl76M47l78j81N21n85
3110d39R7Q66j108M79N82p46O82l90l69Q92l96m50P23p19K04K99p59M39K42p32
3130f03P71q4o69J054n62k69Q51o12P6K63o26O74J21q26P67q0n68Q99q32K00O50
3151E95j058K59N45p51O23K06q60Q11k94m43R65o93J75K56o65L19L47p42M75J87
3171B57p10P65k79m24R63q50J28O39p72J28M79q19O06K23o58N98k26j52P60o86
3191c0k9M29p68L15L65o68M19j44m81J067n69j54N52m74N4L49n20L74L09j021
$$ plain form
3049 -605 340 164 -300 430 73 -52 541 -137 -234 489 -492 134 43 -646 277 -288 -629 471 -295 -124
3069 -124 369 -383 -63 360 -278 369 224 -399 481 166 -337 262 -98 -313 229 -512 -183 390 -716 183
3089 183 199 -620 529 -114 -227 630 -132 -65 445 -420 75 431 -430 104 113 -263 184 -194 -375 146 -439
3110 -439 -342 524 -584 -105 477 -269 413 23 -346 546 150 -300 423 -296 -92 207 -552 -113 129 -603
3130 -603 168 84 -585 469 -93 -362 489 -123 -47 216 -410 264 385 -441 326 246 -322 577 -255 -55 595
3151 595 -463 -204 341 -410 213 419 -441 370 76 -367 598 -95 80 336 -329 -10 337 -405 70 257
3171 257 -453 312 33 -391 572 -278 -150 489 -283 -155 324 -495 111 334 -324 274 48 -104 656 -30
3191 -30 -59 370 -398 -83 282 -386 33 -111 -592 475 -94 -248 304 -170 -116 233 -287 87 396 -625
3211f25R41k27m93Q14j83p62Q98o05L8N69n98L33J75q18P64j28m32O33l43q1O31
3232E01o42K09L50n50M38r1o06P09l06n04O77n68K78M40p67M00L81p42O11K14
3252D32n87N64l64j38O25o10R2M91r27K21M55o19L25M7n89R40m99m44P57j83O4
3273E3L54p61M16K75o33N99l08l63Q91n82l99R77r25Q8N53p96O25L39q18O60j66
3294G9m17Q02n43j99R26p44J42M45p66M73J64j128O62L5n80Q45m39O9P08o86N4
3315i8L69n99L66J51l47N32k32l53O54n13k73P85o41R0M41q02M85K2l14K98j18
3336i7l43Q82o06k66R51q68M56M93p32K82K7o75N24P2n74Q64n28l21M97m30M07
3357A5J26n41M96J41n85P23l28k13N85m61k48Q58o72rN30q13M02J37o69O32k40
$$ plain form
3211 -625 316 89 -404 410 227 -535 363 -242 -204 365 -233 100 275 -543 221 93 -339 294 -49 -130 501
3232 501 -141 68 418 -132 306 215 -391 318 12 -492 185 -383 -105 335 -432 -32 349 -393 218 432
3252 432 -155 409 45 -93 532 -78 14 505 -422 -201 254 -365 -40 7 -582 358 -141 -585 172 -11 53
3273 53 407 -354 62 337 -296 303 -5 -368 523 -59 -458 519 -406 -318 235 -561 64 403 -415 245 79
3294 79 -338 464 -79 -278 648 -96 46 491 -275 198 362 -766 -104 -69 -649 196 -243 -174 534 -152 -98
3315 -98 271 -328 38 189 -158 374 142 -211 443 -70 -343 442 -199 -109 332 -470 15 37 -277 21 -97
3336 -97 -440 442 -164 -430 521 -347 109 602 -130 152 179 -496 28 100 -474 390 -138 -459 38 -392 15
3357 15 141 -400 96 237 -348 375 47 -166 419 -42 -290 568 -104 -113 417 -396 6 143 -526 106 -134
3378a34j01P43o41j10N35n29M14J11o02M92K3m49L60m73L58L96o35Q8M65o27K40
3399g6K00p14O83j76k59O95l13l38O75l79L6N86p89M97m4p17O88j44m48O91l61
3420gk35O47p42J63N40n37j05M07o21P44j73n17P72j61k56O05n11K01K84q26K18
3441a10M01q42M59j6l42O46j39k18N41p11L67K08l70L06R4p29O77j86k59O79p07
3462b51R3O38o67J02J80o31N67J36o19L66k6l00J110o37l3N74o80R3J97o46N71
3483A37j31l75N63l42k48N91n25J45O71r64N42Pn62P06o6m57Q03n80R1L87m62
3504f9p6L90m54R2M20o89M60j63k78N19k32o4N84o34K06M05q10N70Q7n80N65o0
3526A89l15N85m65k25O93n76j34L11l37L62J42n20L06M8j29M77l97j54P23n11
$$ plain form
3378 -134 -235 508 -133 -243 292 -237 177 288 -314 178 201 -248 112 -361 -3 393 -242 -154 311 -316 -76
3399 -76 124 -590 93 -83 -342 353 40 -298 377 -2 34 620 -169 328 284 -433 255 111 -337 354 -7
3420 -7 -242 405 -337 -174 366 -171 -276 131 -490 254 81 -436 336 175 -81 524 13 214 498 -328 -110
3441 -110 291 -551 -92 -108 -450 196 57 -161 380 -331 36 244 -126 180 274 -455 222 36 -223 456 -251
3462 -251 -158 480 -187 -85 95 -536 31 167 -452 -86 -112 -412 698 61 28 602 -78 15 212 -434 137
3483 137 6 -369 194 -148 -396 195 -330 -185 486 -478 64 71 -491 215 149 -308 495 -85 6 393 -69
3504 -69 -145 245 -209 -117 303 -386 74 -89 -367 152 -80 -144 440 -194 12 417 -393 177 264 -316 249 189
3526 189 -126 459 -6 -231 462 -114 -248 63 -274 88 230 -290 16 64 -65 412 15 -139 584 73
3546G3R7N9n36O84n9q15P85l41j63M93l22l29P63o67K92J76l71M17J6l84M54k25
3568I7m29N92m65K03M90p16K33K74n74M80j54l48N09j50l73P50p45M09K58o38
3588b97K37K26l52M31k20l29O18j45l99P15o97J8M95o95K95M50o37M38j77m59
3608d84O82j55j04N32m34j40M74n56K34L05p14M45j16l63N35k03k35P14o19N4
3628a48K35l58M10O7n13M24J24m70N38l40j4L09l29J6K49o01M62P8m42M66j73
3649a0k11N50n17J53O45p48P5M47m79L92j13m77O38k07m94N44l59o0L57n09L23
3670f0R4m92M72P1n00P03l30j71O52n01nL74n69L36L08q32N90p5m05O06o34K34
3692a34K59l86R6M98n86M35j26k25L50K9l67M39k25m28O07n11K05K15m49K51Q3
$$ plain form
3546 73 170 229 -307 377 318 -497 288 -53 -216 277 -45 -374 389 -278 14 190 -181 236 252 -132 322 97
3568 97 -332 260 -205 -2 488 -228 5 279 -295 185 31 -317 192 42 -331 419 -326 83 341 -297
3588 -297 -60 166 -186 245 25 -304 314 169 -230 485 -212 -194 301 -394 -99 351 -286 152 -25 -484
3608 -484 198 43 -61 471 37 -103 371 -185 49 354 -360 85 -31 -394 141 -62 -297 417 -202 -148
3628 -148 87 -271 139 206 -307 117 241 -229 309 -31 -45 264 -65 -49 200 -401 61 139 -303 163 -10
3649 -10 -221 329 -188 -35 610 -138 -63 384 -95 297 184 -293 345 138 -356 188 -171 -231 126 -383 -60
3670 -60 34 -458 14 85 -415 288 -42 -213 439 -62 -67 307 -262 74 382 -450 140 65 -340 266 -368 -134
3692 -134 125 -261 -165 333 -253 182 56 -169 181 210 -157 282 57 -371 236 -275 -70 145 -304 -53 30
3713C0m39N59J81n76M73m07J1O12l71j31L18m77N25K20p86M07j2m01M45m68k4
3734c11O26o68K08K41m53N52n5j77L96k21l61M80l36k2M55n62K23K00m68K52O
3755El71P31l90k46M88l09j94N96n48J60N51o09K72K2l89L93l64O5L86m40J17
3776g4K34m13L76K4o67O72J09m22M31m10m6M05l49QM68m23N3J13l97N70j21l75
3798b34M73l86n8L66n22K95M48p17L67K46n97M36L0l98M74k40p7M22m49J70J93
3819B42m46L09j52l06N32O3o40N87l6j83J99m13J76M92o49K55J74n34O51m09k73
3840c61P07k96k97L87o45M87J69n50M14l5j61K09j21n8M40m39P0N39o73M78J40
3861D04m30J09N7m41M79k39l70N86k94r9M39m85K08J24k56K95Q3m10N18k29M2
$$ plain form
3713 30 -409 150 331 -245 228 -179 -168 444 73 -58 260 -217 308 528 -258 149 137 -264 181 -287 -311
3734 -311 315 -353 -145 96 -357 195 140 -37 359 138 -223 257 -79 -101 354 -208 15 215 -253 -1 5
3755 5 -366 365 -25 -271 217 -92 -286 310 -238 -78 473 -136 136 158 -231 162 -202 -137 249 -191 -74
3776 -74 160 -253 123 147 -520 152 261 -161 270 -140 -186 219 -130 -122 346 -77 -24 89 -308 262 141 -234
3798 -234 239 -147 -205 161 -361 -66 382 -335 32 278 -319 117 147 -251 223 -17 -94 328 -121 49 242
3819 242 -204 105 -47 -353 179 242 -398 189 153 -30 169 -244 -68 424 -225 30 204 -330 321 -88 -361
3840 -361 346 50 -247 140 -505 -18 151 -399 15 -20 -181 28 -93 -151 289 -150 -80 459 -214 264 404
3861 404 -26 83 140 -301 178 -61 -431 155 -139 -238 201 -284 -76 48 -208 87 170 -240 278 49 91
3882I1N94o74O6K58n28K28N4o62N01m0l56L37N8k38N92m74N6N34m95J81M35p71
3904b53O19j85n04N19j26l22M08m82K90L00m78K50M5l58K46N6j98M74k22q2K12
3925B09l47K24K47m94J89O9l57M57l85L5J08k89P6L05j49K33K68q18P59j53k90
3946a03K16k0k37N46l34j08K35l56K71q5l85L99L1l64L87k59P3K76l20P9M56n05
3968a07K78L7m69N05q9m16N31m43j82L92m15L73K86n80L16Q5k67M95k61k23J83
3989B9k08QM29j67o7K21l73%K29j74L04k77m19O95n40n1L55j97N7M57m86K54J0
4012H9l47N65j55l52L69j60m8K20k84qK27m71L15J29m19N19l71m8M13k19j65L96
4034A95k90J5L54l10O0J01j79K66k13k10O37n27l5L41l02K44P3n78N60K8n36P16
$$ plain form
3882 91 685 11 77 335 -193 35 89 -573 -72 -112 -468 -131 -73 -311 281 -193 -137 397 -98 83 518 -253
3904 -253 366 181 -323 196 70 -252 156 -326 -36 264 -214 36 81 -277 -31 25 -173 301 79 -3 209
3925 209 -138 86 333 -161 28 97 -260 197 -188 -153 -45 -334 -258 47 -102 131 399 -419 340 187 -103
3946 -103 113 93 -144 402 68 -40 195 -161 110 25 -360 39 70 -294 93 -166 -93 183 -137 -58 398 -107
3968 -107 171 208 -261 244 155 -261 270 -173 -355 37 -378 -5 281 -299 17 102 -165 330 69 -154 29
3989 29 -179 -171 258 91 24 245 -128 -128 101 -73 231 -46 -465 230 -310 -361 -6 -203 -146 311 -175 79 89
4012 89 -258 307 152 -200 169 9 -39 181 -103 -111 116 -355 -40 89 -330 189 -182 -230 183 -36 -201 195
4034 195 -95 -80 274 -36 24 125 -54 212 -1 -211 426 -101 -136 205 -97 147 220 -358 202 230 -306 410
4056D10l86j5J95n46K84L90k89j98L30l86M09j83k56M85j99k96N73m71J66K70
4076B87m41J58L12m79L49Q9m91L72q7j23K71l47J7L28n92L14K15m57N04j41l28
4097b70N05k3j76LK5k5J75l41l6L09l48L66k55l01N36k73j4J1j17J4M50m07Q6
4120a06K50l27M14k71%M06m52r9N90n30n4N03n59J14J00l38M29L3k56K53l27J26
4142a01L09k07p6K84l52K69k9k63M09j20m24M19k03j87L07j44J46o0k49L48n9
4163A7k41O25l92r8J44k01P9K72m45J76L67l81K29M5m62M88l03j89M15l13K19
4184E1Q7k87m4N71l60Q8Q5k85K34k73K03L1j58k7Q2k28L62J20n37K80O2j08K61
4207B10l22j47L65p0j38K94o06L31M45o06M45j6l18K70j60j75N21m71O4K62n00
$$ plain form
4056 410 24 9 204 -342 -58 332 43 -155 175 -211 198 15 -241 244 45 -251 322 -149 17 287
4076 287 -154 4 316 -163 186 275 -216 156 69 -54 217 -130 -113 215 -377 -63 152 -305 199 58 -270
4097 -270 235 212 36 39 64 39 214 -127 -163 146 -202 164 -91 -392 144 -129 -143 -132 -249 -235 215 -192 -106
4120 -106 144 -183 231 -40 -40 366 -86 -185 405 -125 -179 324 -235 -121 -21 -359 70 103 -153 100 -227 -101
4142 -101 208 1 -75 209 -143 126 97 -166 243 123 -301 118 -85 -272 35 -109 37 -23 -272 76 17
4163 17 -224 401 9 -89 55 -146 -67 205 -240 -64 303 -78 151 196 -266 222 -81 -270 145 -168 51
4184 51 138 -149 -193 378 18 106 191 -94 140 -133 70 101 -57 -84 -2 -230 132 252 -285 -5 57 -51 210
4207 210 -112 -259 106 36 -102 192 -414 -83 362 -244 201 185 -133 137 -23 -198 323 -148 -84 178 -322
4228c22O02j22m10L11J9k51K17j26k12O85o95L51K80m45K51N4l67L39j30m18O17
4249B28k16j91L47m07J23j7J70J61j10k52N01m39j37O51n07n7K73j66J08K39l81
4270g9J00n8k91K89q7m9K95k48J24R8j27J90J25k65J82M7k94M81m96j60J92k10
4292b41J12K76l39J75J22k88L60j44j65L47l46J79L70l60j7K21n21J69L23o15
4312c82N53j07m11L73n1k18O28m22o4L81m03J13J56k97L59j33j57Q6n3K2K34k52
4334d5q8L77o33J84J24j61K60Q0j80L58m69J14L17l19K58j32k10L98j3m44N69
4355C45l14j27L11k45p6K42l90J95R2l80M76n3k94N04k42j38M16k49q5o2k86L31
4377b9K07m76M33j21l43K65j36J35M15m79j0K91k28J84J94l65J73P7k51L27n23
$$ plain form
4228 -322 280 158 -252 59 78 -173 44 -82 -294 391 -304 47 327 -118 133 187 -180 159 29 -389 228
4249 228 12 -179 168 -239 -116 -133 37 198 88 -164 337 -102 -239 412 -95 -152 121 -45 63 302 -79
4270 -79 21 -37 -328 -39 -126 -175 120 -128 -4 94 -33 157 282 17 199 246 -48 433 -63 -223 -31 -241
4292 -241 -129 147 -192 -17 105 -183 177 33 -132 215 -131 48 418 58 41 262 -259 -90 233 -382
4312 -382 171 64 -347 26 -25 -243 385 -37 -101 280 -123 -10 146 -151 208 75 -82 4 -49 -27 207 -45
4334 -45 -133 244 -389 -205 -81 -242 18 98 -82 276 -193 -79 238 -81 177 45 -165 233 220 -224 345
4355 345 31 -96 215 -30 -106 136 -254 -59 33 -347 129 76 -218 286 44 -94 322 73 -12 -74 -360 -29
4377 -29 178 -298 135 14 -329 -64 -200 -65 350 -129 -139 152 -76 108 302 -63 110 187 -64 263 -260
4398b60K12K27n30P1L86l35L04%l04L99j58k55L57k40k03Q18o01oM80m66J41O9
4420A06l46K35j22K5J69l62J89J35k32L1M40p17N16J13m56N21l29n9M19j20k98
4441a42K75j97J38J13m47K37L9k79L84k72R4N6j00q9M07m89L51K5j33J77Mj95
4463d3J54jl63L68k97L0K98m49J65J93m30M91M1l57L24k10k82M51Q0k60K24l5
4485I2l1L17n71K32m5j50L79l63LK99m34K03K01k40J08J38l85M10j5k08K33l66
4507a93K47J44m78K51J98r5o5P8k67J27J34k97J68l0j66L08j43p0N74o94L89k44
4529a24j6K73j72L8Q4r2j57K19r5M9J20j53J7J25k23L37j32k3K43l24p3K63r0
4552I4k89K37k60L41M3m02M62k22l4J41k57R1K03l05J56J4L4M6p0k09O8J89l46
$$ plain form
4398 -260 -48 179 -351 -280 106 -229 75 75 -229 170 12 -243 114 -126 -329 489 -112 -118 362 -104 37 106
4420 106 -240 -5 -127 -102 67 -295 -106 29 -203 -172 268 -449 67 180 -276 245 -84 -143 276 156 -142
4441 -142 133 -64 74 187 -260 -23 16 -263 121 -151 -57 -1 -101 -190 217 -272 79 104 -29 148 152 -43
4463 -43 111 110 -253 115 -182 -152 146 -303 -138 55 -375 116 157 -200 124 -86 -368 83 163 -97 127 92
4485 92 61 378 -193 39 -6 -156 223 -140 -137 162 -272 -69 132 -108 0 138 -247 163 148 -60 173 -193
4507 -193 54 198 -280 -29 169 74 9 87 -180 -53 81 -216 -48 -78 -244 64 -79 -149 425 -269 120 -124
4529 -124 -140 133 -39 -1 83 -9 -166 53 -42 7 127 -26 -9 116 -107 230 98 75 318 -6 -79 184 94
4552 94 -195 42 -218 123 166 -236 226 4 -30 111 -146 -55 148 -157 -1 13 47 93 23 -186 -118 71 -275
4575b75M42k57j5J89j86j65M15k77J89L7l02K94J31l75M02l45oM34n23J71L2r4
4597h4J94J29m88J89N0p7K09j07K0J37m84L32j45J9K22j46m3J92L2l20M09k71
4619c1L0P6r2O2J08k86P5K4j56N07m89k9L46m80J62K48j97M93k25k76K32l0k45
4642a73M91j09l66M08n74K38L55m38M20o5m23M90j15m54L99k49n2O33m83M7K53
4663B33n46K41RJ14J27p2l16M00j18j69K66m33K73j1k10K96j46k66M51j36j80
4684a93N19n52J52M76m72o0J69j47J42j59l2R6O0j89K59j34j90L70j08MJ22k95
4706a62K78M7j96J96l18K1L38l64J31J15j91J72j53n2K70q3k88L77l20J37J73
4727A28k50J22J54k37L40n8k97K30r1r3L39l37j88K04k25K65R6j85L40n1l26J61
$$ plain form
4575 -275 167 -90 -105 84 -102 -267 148 -129 60 97 -205 89 220 -155 247 -98 -104 330 -193 -22 10 -84
4597 -84 110 239 -249 -60 -10 -87 122 15 35 172 -312 20 -125 -106 116 -30 -73 119 151 -169 240 -31
4619 -31 -1 75 -17 45 153 -133 -58 -34 -190 317 -172 -201 145 -335 -173 75 -122 371 146 -130 102 72 -173
4642 -173 318 209 -157 251 -323 -85 270 -168 252 187 -236 254 139 -315 84 -165 -217 416 -67 -20 233
4663 233 -313 -72 -63 51 178 106 -210 190 72 -97 169 -264 9 -2 -212 84 -62 -328 123 -13 -193
4684 -193 326 -226 -74 402 -70 -130 39 -108 34 -125 -157 -61 -1 -190 69 -65 -255 115 7 11 133 -162
4706 -162 116 163 -33 163 -155 -134 204 -160 -29 86 -105 67 -86 -138 132 49 -239 138 -182 -45 128
4727 128 -122 0 154 -83 257 199 -98 132 41 -52 287 -50 -238 -34 -259 6 102 -83 257 206 -120 41
4749D1K7j72L74l10J59j8k80K01K28l94J75J13l87K20j2k60L07j8k0J90k17J84
4771A31P9j39j24J12k04K34r8O4J03l64K63J56k86j8Jj07K1M0j48M34L6k06K22
4794B02k67K1K23l20L72m0l68M03k63l55N05k31r7J16K54j46K53m63J76p0n8L84
4816B31k80j26L27j83J4J48l15J68K10k42J99j30p1P4M9k90K43L1l4Q6n6o6J36
4839A23l02P6K06l36K44J12k06K07J8j60J85l40K16J12j53M3l7k69L89j5k42P7
4861e2j4r9K81j30k19M78l03l2P8k21K51j40j5K10j08q7K20l78K67Q3k87L72Q
4884A63k56J37p3J50Pj81k5L9j57k4J78q8L00l65K24k8J66k43K84l03p1L8Q1R4
4908D7K5k28L90j47k67K19k3r4J41k36j32O25n28J18K67k96L08o0l14K47j7p4
$$ plain form
4749 41 68 -104 270 -40 119 101 -179 22 250 -144 31 144 -243 -23 -35 -295 12 -6 -26 164 -53 131
4771 131 210 71 -53 59 -145 89 -9 55 158 -206 57 213 -73 -91 -90 -197 -176 -136 -284 150 186 -20 202
4794 202 -65 -44 179 -141 231 191 -177 226 -37 -392 113 -118 -215 -99 155 9 262 -201 -25 -95 -153 231
4816 231 -49 -175 152 -31 -17 131 -184 -16 194 -48 151 21 -50 24 73 -217 26 57 23 109 53 -13 123
4839 123 -179 -103 103 -233 11 123 -83 124 142 -18 167 -173 43 155 2 45 8 -261 128 113 -129 -52
4861 -52 -66 -165 116 -14 -233 245 -58 -90 -12 -233 18 -122 -137 73 -35 -122 98 -280 -13 70 -217 155 163
4884 163 -93 44 -29 121 128 -53 -78 -39 -196 -220 -42 -130 170 -195 29 1 167 -76 208 -95 -166 -128 -47 47
4908 47 72 -156 234 87 -180 39 16 -78 63 -173 -305 320 -208 -90 177 -119 189 129 -185 62 45 -29
4930b9L04k98O8K5n8M5K44n05K77q7l96O17j95j30K23l94M35O5m34M08j5k97J68
4953D1L1j67J64k7j9N6P5j15k3l22L64r0j15J74L3J0P1l0j03K69k92J13L4k82
4977a50K83j96o4J53j02r3J16j86L14L3k45K8J97j46J59m2j69K60p5j74Pj49K35
5000fJ18k90KJ84j4k58K73l7K25m21L5L26k52K67j9k94L2K78l28M29k34m5J67
5023A38k08J8J19j44N2J01q1M1j58j34M38o7k5J10l12O0J77j35O0L1q5q5J22l27
5047b94L56J23l20K50k28mJ67k90K49m0j00M6J86l02L20p0j55Q6J20M6r9p0J65
5070A42R0l47mK58k20R9J34k83J34n7K83j89J1m1o3j9J86j2l0J43k84N3J39q4
5094C9o0J27j33j97Q3ko4K01j55J75P2l09K36q3M2K05p8m0K1P5J4j08k10K88j95
$$ plain form
4930 -29 275 -23 45 70 12 57 301 -204 73 -14 -410 207 12 -118 105 -289 146 211 -223 185 170 -127 41
4953 41 72 -95 69 42 23 79 154 39 16 -306 58 -32 -147 27 60 70 141 111 8 277 -15 98 132 -150
4977 -150 133 -63 -127 26 -76 -169 -53 -239 75 108 -137 -109 88 -58 101 59 -110 150 75 -99 -92 -241 -6
5000 -6 112 -178 -176 8 -6 -264 9 -28 197 -224 -189 137 -115 152 133 -161 -129 149 -179 250 16 -29 138
5023 138 -70 -52 67 -77 -25 76 -5 36 -122 -256 182 115 90 200 -112 -52 125 -10 50 81 -4 -89 33 -294
5047 -294 62 185 -135 115 -113 -117 50 -240 9 -31 -131 -85 101 -201 119 49 -106 -20 100 146 47 -23 142
5070 142 232 -115 -119 139 -81 18 152 -131 3 -54 229 40 51 10 -53 -72 114 102 72 215 -69 -16 123 39
5094 39 -21 106 -27 -224 -141 -143 -207 -6 -161 14 86 -223 13 -70 -28 177 99 59 80 155 169 61 -149 139 -56
5119e6m1QJ29L0l1j25J9P2l58L66R9k25L27k14j03K00mQ2q4j23J25j02q5J88m2
5144E2j13N7l3K1L18m62PK73n6L7n8j2K33j34k22J05j35j78N87m72j1L58l02J07
5168c3j41J13J32j63n7K54Qj87L51j78k62L12k49K03p7r3j14k5J50q7K29j59J69
5191I6j75k8L88m19K65o8k04K88j92p0L35k50M5Ok54K23J0j17J43o3k37K10J00
5214C2j72L20j24R0j12n1R9nO8K00l60p7J64k55R5K15j64n5K49k54n8J10l7J61
5238G9k5j16J62m0j78L1J6J20o9o8O8J16j25N9j49RJ11r8q1L89k55K06j79j75
5262a92J76l5K5M2j9L1J06j95K97j7l44MK37m14K53N7k20K03j70R2l8J97p2j1
$$ plain form
5119 -56 -97 -89 40 70 39 -86 -67 5 -353 13 112 -113 214 0 -103 97 93 175 91 -32 93 -9 -94 94 52
5144 52 -61 -4 -37 -16 302 -160 -153 120 64 101 43 31 264 130 -92 13 -122 -300 287 -185 -196 162 -140 -33
5168 -33 -174 -61 71 -92 -149 105 113 -74 277 99 -163 149 -100 103 26 -67 -181 -206 -56 -143 86 -73 96
5191 96 -79 -107 281 -138 127 59 -145 143 -49 -119 216 -34 11 17 -237 -14 -4 -121 22 -41 -278 -68 32
5214 32 -140 180 56 146 34 -17 82 77 145 345 -15 -92 72 -183 -88 127 -37 -92 157 -97 -155 -45 -82 79
5238 79 54 -62 100 60 -118 -87 -71 49 -20 -88 -20 96 -29 30 -119 -110 1 -97 -178 211 -44 162 -17 -192
5262 -192 -16 -51 -26 16 -3 28 134 -61 236 219 -125 -121 116 -298 -45 12 -208 -5 -175 -83 -121 76 4 -7
$$ [...]
8191B3
##END NTUPLES=NMR FID
##END=
