##TITLE=1H_3-2025-Bay
 CDCl3
 8 sc, 
 10.1.2025
##JCAMPDX= 6.0         $$ Bruker NMR JCAMP-DX V2.0
##DATA TYPE= NMR FID
##DATA CLASS= NTUPLES
##ORIGIN= UXNMR, Bruker Analytische Messtechnik GmbH
##OWNER= root
$$ XWIN-NMR		Version 3.5
$$ Fri Jan 10 14:16:23 2025 Russian Standard Time (UT+4h)  she@DPX200
##.OBSERVE FREQUENCY= 200.1315
##.OBSERVE NUCLEUS= ^1H
##.DELAY= (6, 6)
##.ACQUISITION MODE= SIMULTANEOUS
##.ACQUISITION SCHEME= undefined
##.AVERAGES= 8
##.DIGITISER RES= 18
##SPECTROMETER/DATA SYSTEM= spect
##.PULSE SEQUENCE= zg30
##.SOLVENT NAME= CDCl3
##.SHIFT REFERENCE= (INTERNAL, CDCl3, 0, 15.7039)
##AUDIT TRAIL= $$ (NUMBER, WHEN, WHO, WHERE, WHAT)
$$ ##TITLE= Audit trail, XWIN-NMR		Version 3.5
$$ ##JCAMPDX= 5.01
$$ ##ORIGIN= Bruker BioSpin GmbH
$$ ##OWNER= she
$$ F:/spectra/data/she/nmr/H-F/1/audita.txt
$$ ##AUDIT TRAIL=  $$ (NUMBER, WHEN, WHO, WHERE, WHAT)
(   1,<2025-01-10 14:15:19.29 +0400>,<she>,<DPX200>,
      <created by zg, POWCHK disabled, PULCHK disabled
       configuration hash MD5:
       00 E9 B6 7A A2 85 ED C7 34 08 36 98 17 FE 4E 26
       data hash MD5: 16K
       52 20 46 00 A1 19 30 AE 69 9A 5C C3 3E 6A A3 A7>)
$$ ##END=
$$ 
$$ hash MD5
$$ 3D 4E 26 14 8E A9 D2 AF 2D C2 17 82 4D 2A E9 55
##$RELAX= 
##$RELAX= 
##$RELAX= 
##$RELAX= 
##$RELAX= 
##$RELAX= 
$$ Bruker specific parameters
$$ --------------------------
##$DU= <F:/spectra>
##$EXPNO= 1
##$NAME= <H-F>
##$PROCNO= 1
##$TYPE= <nmr>
##$USER= <she>
##$AMP= (0..31)
100 100 100 100 100 100 100 100 100 100 100 100 100 100 100 100 100 100 
100 100 100 100 100 100 100 100 100 100 100 100 100 100 
##$AQSEQ= 0
##$AQ_mod= 1
##$AUNM= <au_zg>
##$AUTOPOS= <>
##$BF1= 200.13
##$BF2= 200.13
##$BF3= 200.13
##$BF4= 200.13
##$BF5= 200.13
##$BF6= 200.13
##$BF7= 200.13
##$BF8= 200.13
##$BYTORDA= 1
##$CFDGTYP= 0
##$CFRGTYP= 5
##$CHEMSTR= <none>
##$CNST= (0..31)
1 1 145 1 1 1 1 1 1 1 1 1 1 1 1 1 1 1 1 1 1 1 1 1 1 1 1 1 1 1 1 1 
##$CPDPRG= <>
##$CPDPRG1= <>
##$CPDPRG2= <>
##$CPDPRG3= <>
##$CPDPRG4= <mlev>
##$CPDPRG5= <mlev>
##$CPDPRG6= <mlev>
##$CPDPRG7= <mlev>
##$CPDPRG8= <mlev>
##$CPDPRGB= <>
##$CPDPRGT= <>
##$D= (0..31)
0 1.2 0 0 0 0 0 0 0 0.06 0 0.03 0 0 0 0 0.0002 0 0 0 0 0 0 0 0 0 0 0 0 
0 0 0 
##$DATE= 1736504118
##$DBL= (0..7)
120 120 120 120 120 120 120 120 
##$DBP= (0..7)
150 150 150 150 150 150 150 150 
##$DBP07= 0
##$DBPNAM0= <>
##$DBPNAM1= <>
##$DBPNAM2= <>
##$DBPNAM3= <>
##$DBPNAM4= <>
##$DBPNAM5= <>
##$DBPNAM6= <>
##$DBPNAM7= <>
##$DBPOAL= (0..7)
0.5 0.5 0.5 0.5 0.5 0.5 0.5 0.5 
##$DBPOFFS= (0..7)
0 0 0 0 0 0 0 0 
##$DE= 6
##$DECBNUC= <off>
##$DECIM= 24
##$DECNUC= <off>
##$DECSTAT= 4
##$DIGMOD= 1
##$DIGTYP= 9
##$DL= (0..7)
0 120 120 120 120 120 120 120 
##$DP= (0..7)
150 150 150 150 150 150 150 150 
##$DP07= 0
##$DPNAME0= <>
##$DPNAME1= <>
##$DPNAME2= <>
##$DPNAME3= <>
##$DPNAME4= <>
##$DPNAME5= <>
##$DPNAME6= <>
##$DPNAME7= <>
##$DPOAL= (0..7)
0.5 0.5 0.5 0.5 0.5 0.5 0.5 0.5 
##$DPOFFS= (0..7)
0 0 0 0 0 0 0 0 
##$DQDMODE= 0
##$DR= 18
##$DS= 0
##$DSLIST= <SSSSSSSSSSSSSSS>
$$ [...]
##$SUBNAM2= <"">
##$SUBNAM3= <"">
##$SUBNAM4= <"">
##$SUBNAM5= <"">
##$SUBNAM6= <"">
##$SUBNAM7= <"">
##$SUBNAM8= <"">
##$SUBNAM9= <"">
##$SW= 24.0689530833862
##$SWIBOX= (0..15)
0 0 2 0 0 0 0 0 0 0 0 0 0 0 0 0 
##$SW_h= 4816.95568400771
##$TD= 16384
##$TD0= 1
##$TE= 0
##$TE2= 300
##$TE3= 300
##$TEG= 300
##$TL= (0..7)
0 120 120 120 120 120 120 120 
##$TP= (0..7)
150 150 150 150 150 150 150 150 
##$TP07= 0
##$TPNAME0= <>
##$TPNAME1= <>
##$TPNAME2= <>
##$TPNAME3= <>
##$TPNAME4= <>
##$TPNAME5= <>
##$TPNAME6= <>
##$TPNAME7= <>
##$TPOAL= (0..7)
0.5 0.5 0.5 0.5 0.5 0.5 0.5 0.5 
##$TPOFFS= (0..7)
0 0 0 0 0 0 0 0 
##$TUNHIN= 0
##$TUNHOUT= 0
##$TUNXOUT= 0
##$USERA1= <user>
##$USERA2= <user>
##$USERA3= <user>
##$USERA4= <user>
##$USERA5= <user>
##$V9= 5
##$VALIST= <valist>
##$VCLIST= <CCCCCCCCCCCCCCC>
##$VD= 0
##$VDLIST= <DDDDDDDDDDDDDDD>
##$VPLIST= <PPPPPPPPPPPPPPP>
##$VTLIST= <TTTTTTTTTTTTTTT>
##$WBST= 1024
##$WBSW= 4
##$XGAIN= (0..3)
0 0 0 0 
##$XL= 0
##$YL= 0
##$YMAX_a= 38018
##$YMIN_a= -103522
##$ZGOPTNS= <>
##$ZL1= 120
##$ZL2= 120
##$ZL3= 120
##$ZL4= 120
##$ABSF1= 10
##$ABSF2= 0
##$ABSG= 5
##$ABSL= 3
##$ALPHA= 0
##$AQORDER= 0
##$ASSFAC= 0
##$ASSFACI= 0
##$ASSFACX= 0
##$ASSWID= 0
##$AUNMP= <proc_1d>
##$AZFE= 0.1
##$AZFW= 0.1
##$BCFW= 1
##$BC_mod= 2
##$BYTORDP= 1
##$COROFFS= 0
##$CY= 11.3945322036743
##$DATMOD= 1
##$DC= 2
##$DFILT= <>
##$DTYPP= 0
##$F1P= 15.6554695791079
##$F2P= 12.8336369535428
##$FCOR= 0.5
##$FTSIZE= 0
##$FT_mod= 4
##$GAMMA= 1
##$GB= 0.15
##$INTBC= 1
##$INTSCL= 1
##$ISEN= 128
##$LB= 0.24
##$LEV0= 0
##$LPBIN= 0
##$MAXI= 10000
##$MC2= 0
##$MEAN= 0
##$ME_mod= 0
##$MI= 1.114404
##$NCOEF= 0
##$NC_proc= 0
##$NLEV= 6
##$NOISF1= 3.799351
##$NOISF2= 2.8
##$NSP= 1
##$NTH_PI= 0
##$NZP= 0
##$OFFSET= 15.70392
##$PC= 1
##$PHC0= -26575.79
##$PHC1= 17.38744
##$PH_mod= 1
##$PKNL= yes
##$PPARMOD= 0
##$PSCAL= 0
##$PSIGN= 0
##$REVERSE= no
##$SF= 200.130013532006
##$SI= 16384
##$SIGF1= 3
##$SIGF2= 2
##$SINO= 400
##$SIOLD= 16384
##$SREGLST= <1H.CDCl3>
##$SSB= 0
##$STSI= 0
##$STSR= 0
##$SW_p= 3612.71676300578
##$SYMM= 0
##$S_DEV= 0
##$TDeff= 0
##$TDoff= 0
##$TI= <>
##$TILT= no
##$TM1= 0
##$TM2= 0
##$TOPLEV= 0
##$USERP1= <user>
##$USERP2= <user>
##$USERP3= <user>
##$USERP4= <user>
##$USERP5= <user>
##$WDW= 1
##$XDIM= 8192
##$YMAX_p= 0
##$YMIN_p= 0
$$ End of Bruker specific parameters
$$ ---------------------------------
##NTUPLES= NMR FID
##VAR_NAME=  TIME,          FID/REAL,        FID/IMAG
##SYMBOL=    X,             R,               I
##VAR_TYPE=  INDEPENDENT,   DEPENDENT,       DEPENDENT
##VAR_FORM=  AFFN,          ASDF,            ASDF
##VAR_DIM=   8192,          8192,            8192
##UNITS=     SECONDS,       ARBITRARY UNITS, ARBITRARY UNITS
##FACTOR=    0.0002076,     1,               1
##FIRST=     0,             0,               0
##LAST=      1.7004516,     0,               0
##MIN=       0,             -103522,         0
##MAX=       1.7004516,     38018,           0
$$ Real data points
##PAGE= N=1
##DATA TABLE= (X++(R..R)), XYDATA
0 0 0 0 0 0 0 0 0 0 0 0 0 0 0 0 -6 8 -8 8 -8 8 -12 16 -16 17 -21 24 -27 30 -35 37 -44 50 -54 62 -70 77 -86
37 -86 94 -105 116 -127 142 -157 173 -191 214 -236 265 -296 335 -379 433 -500 585 -701 864 -1107
57 -1107 1516 -2326 4539 -24337 -59031 4905 9983 -37568 -21760 9286 -9656 -5872 4084 -13001
71 -13001 -2088 17696 -9949 -8322 25550 1687 -24810 11073 14194 -18141 846 12161 -21239
84 -21239 -9680 18180 -8821 -14569 17708 1453 -17083 16263 18467 -7043 11554 19526 -5259
97 -5259 12134 30929 -221 -1712 28286 8715 -7577 21256 18994 -3824 9987 13512 -517
110 -517 19096 22390 -7143 9854 35291 2368 -2844 38018 22626 -9586 18411 31754 6787
123 6787 13217 24037 7110 14418 27201 7728 12608 32989 10475 552 31431 25096 1428
136 1428 22035 25718 -741 15169 32316 4733 5290 29652 10765 -217 26839 21748 2488
149 2488 19555 22440 5873 22607 29016 4167 13581 32674 8385 4625 30962 17132 -3290
162 -3290 15439 16365 -132 12679 13215 -6805 6366 17364 -7643 -2388 21932 87 -14033
175 -14033 13836 12387 -9737 3812 10764 -6862 1111 10070 -6526 -1411 10861 -8232 -9428
188 -9428 12874 655 -13123 6924 4240 -14061 3786 11115 -12264 -4529 12590 -7419 -10238
201 -10238 11870 994 -12963 4135 3562 -8874 4146 4883 -12063 1628 10443 -10844 -4432
214 -4432 15071 -4362 -14011 8378 3938 -11566 2109 2404 -12885 -1342 4320 -13596 -4901
227 -4901 8753 -12207 -13336 9958 -545 -14543 4165 4330 -11171 1934 8048 -7452 128
240 128 9174 -7017 -3831 12587 -1872 -8627 9022 1827 -9987 7233 6991 -10959 1510 10593
254 10593 -8112 -3692 13659 -1673 -8660 8779 4287 -5375 7311 5617 -5892 7013 9266
267 9266 -5873 4932 15610 -3507 -3165 16750 5746 -4711 11622 9563 -3096 8681 10785
280 10785 -2532 6726 13084 -4011 1018 16274 771 -4929 12169 5512 -6588 8349 8428 -6209
294 -6209 4040 9236 -5877 -56 11693 -3576 -5951 9084 -755 -8094 7380 2093 -10911
307 -10911 2755 5353 -11076 -2099 8760 -8756 -8709 6948 -2240 -9621 3642 -473 -9786 1976
321 1976 1075 -10640 1034 4770 -12420 -4988 8440 -6607 -10726 5435 -1335 -11869 1880
334 1880 1556 -10098 -588 2513 -10678 -3127 6722 -8063 -7615 6380 -3297 -10003 4973 1298
348 1298 -10375 1909 3874 -9563 -705 6931 -7366 -5173 7038 -3201 -6808 6631 -38
361 -38 -8265 4518 3243 -8635 2681 7464 -8293 -2604 9560 -2794 -5858 7708 886 -6251
375 -6251 5910 3219 -5724 4785 5414 -7590 2194 10153 -4686 -3197 10591 -30 -6217 7934
389 7934 4519 -5795 4906 5769 -5357 3702 8680 -4622 -287 10034 -1473 -3260 9777 2110
403 2110 -5614 6870 5456 -5976 4504 7722 -5609 -695 8632 -2883 -3498 7326 -541 -5674
417 -5674 5812 1728 -6504 4738 4965 -7888 939 8513 -5388 -3054 8395 -1239 -5595 6167
431 6167 1626 -5726 4337 2785 -6647 3194 6079 -7150 -1740 7797 -4438 -5604 7058 -752
445 -752 -7298 3865 1903 -7149 1907 4125 -6963 -863 5570 -5427 -3591 6540 -2681 -6008
459 -6008 5573 406 -7835 3646 3102 -8564 193 5683 -6140 -3870 5475 -3636 -5892 4773
473 4773 -1162 -6586 3650 878 -7688 2565 4904 -7279 -1295 6747 -4468 -5011 6364 -1009
487 -1009 -6211 3690 291 -6885 2397 2224 -8144 -595 4520 -7053 -3624 6151 -3634 -6234 5235
502 5235 349 -5689 4204 3426 -5347 2952 7087 -2790 1748 9038 -221 351 10002 3498 -852 9738
518 9738 5939 -2395 7938 8978 -2096 3654 9931 -1193 -276 9018 1277 -2006 7455 1884 -3593
533 -3593 6235 4653 -4739 3320 7211 -4040 277 8638 -658 -2801 7385 1671 -3718 5451 2789
548 2789 -5186 2918 3891 -6333 -686 4847 -5740 -5159 4284 -3668 -7467 2092 -1700 -9342 -193
563 -193 434 -9113 -2839 1269 -7842 -5082 2339 -6030 -7304 1594 -4089 -8747 1036 -950 -9817 -1698
579 -1698 1593 -8794 -5406 2053 -6508 -7034 1154 -4793 -7961 960 -2617 -9016 -98 378 -8572
594 -8572 -1709 4017 -5729 -3899 4528 -2278 -4667 4847 411 -5085 3536 2978 -5608 1430 4225
609 4225 -5236 -1685 4940 -4106 -4701 4332 -1877 -6555 2920 552 -6806 905 3230 -5733 -580
624 -580 5107 -3372 -2179 5523 -1510 -3226 6008 1131 -4505 4942 4408 -4708 2116 6982 -2736 -1180
640 -1180 6437 -460 -2311 5650 825 -3700 4563 2188 -4664 2735 4652 -4755 107 6192 -2595
655 -2595 -1641 6425 183 -3184 5928 2834 -3827 4168 4773 -3981 1182 5564 -3489 -1696 5231 -2337
671 -2337 -4563 3816 -791 -6433 1661 909 -6907 -845 2030 -6653 -3234 2296 -5198 -5113 2533 -3360
687 -3360 -6818 1687 -817 -8441 -128 1702 -7832 -2937 2100 -6189 -5423 1874 -4183 -6802 1121
702 1121 -2809 -7808 -218 -662 -8248 -2123 1066 -7346 -4159 2154 -5780 -5967 2380 -2578 -6623 1788
718 1788 435 -6887 -55 2821 -5373 -1518 3525 -3361 -2495 4454 -1214 -3615 4809 1334 -3992
733 -3992 3446 3832 -4184 1504 5494 -2426 -415 6083 -413 -2054 5918 1059 -3629 4630 3025
748 3025 -3966 1830 4664 -3404 -343 4959 -1945 -2558 4462 -28 -3154 4493 1453 -3541 3622
763 3622 4332 -3175 1812 6202 -1594 127 7496 787 -817 6911 3494 -1712 5199 5637 -1435 3395
779 3395 6056 -1079 1533 6365 -499 -766 6135 879 -2106 5374 3391 -3072 3524 5007 -2140
794 -2140 1789 6722 -689 385 6935 1219 -909 6748 3299 -2249 4967 4896 -2160 2351 5571 -1490
810 -1490 67 5358 -1234 -2477 4101 -378 -4328 2628 842 -5740 150 1558 -5445 -1637 2341
825 2341 -4515 -4347 2376 -3258 -5566 1523 -748 -6226 47 481 -5692 -1847 1392 -4961 -3671 1477
841 1477 -4459 -5471 1690 -2695 -6697 308 -515 -6695 -1090 1297 -5690 -3101 2059 -4096 -4032 2566
857 2566 -2084 -4916 1998 503 -4833 1353 2450 -3954 -40 3834 -2727 -1253 4750 -800 -2549
872 -2549 4165 812 -3347 3104 2840 -3552 1758 4077 -2941 -689 4862 -1361 -2188 4548 676 -3257
888 -3257 3728 2346 -3046 2237 3698 -2446 804 4548 -1692 -639 4810 -512 -2527 4284 1394
903 1394 -3482 2631 3082 -3497 974 3962 -2606 -976 4016 -1557 -2389 3553 181 -3959 2422 1600
919 1600 -4200 752 2375 -3528 -578 3262 -2875 -2155 3736 -1146 -3819 2546 451 -4121 1470
934 1470 2207 -4173 111 2844 -3511 -2100 3280 -2555 -3691 2823 -514 -4744 1370 677 -4740 8
950 8 2091 -4000 -1410 2656 -3362 -3063 2560 -1567 -4033 2335 410 -4879 921 1933 -4393 -666
966 -666 2592 -2912 -1966 3197 -1726 -3393 2773 -55 -4124 1671 1232 -3861 533 2834 -3174 -1016
982 -1016 3676 -2142 -2378 3820 305 -3009 2909 1983 -3074 1623 3285 -2696 278 4506 -1337 -998
998 -998 4703 136 -1884 3955 1837 -2660 2831 3199 -2374 1523 3970 -1561 366 4879 -275 -1526
1014 -1526 4635 1341 -2401 3761 2988 -2382 2244 3993 -2011 272 4623 -554 -825 4569 550
1029 550 -1984 3755 1862 -2754 2398 3236 -2759 883 3899 -2169 -1020 4233 -828 -2095 3328
1044 3328 610 -3168 2227 2015 -3224 661 2882 -2804 -848 3160 -2187 -2513 3202 -456 -3840
1059 -3840 2013 256 -4159 205 1569 -4335 -1180 2210 -3296 -2963 2102 -2047 -3947 1650 -769
1074 -769 -4175 715 1142 -4753 -606 1818 -3846 -2156 2076 -2371 -3304 2013 -1111 -3748 1402 223
1090 223 -4200 167 1603 -3868 -1044 2491 -2787 -2462 2702 -1351 -3402 2422 770 -3521 1241
1105 1241 1846 -3402 395 2838 -2369 -740 3759 -1040 -2024 3481 642 -2778 2682 2115 -2976 1458
1121 1458 3351 -2235 22 3601 -1237 -941 3710 146 -2152 3437 1647 -2127 2579 3155 -2138
1136 -2138 1156 3824 -1004 -459 4267 108 -1364 4156 1267 -2240 2729 2007 -2471 1003 3258
1151 3258 -2028 -219 3434 -656 -1702 3609 612 -2329 2652 1742 -2247 1644 2861 -2345 211
1166 211 3075 -1518 -999 3507 -391 -2215 2922 962 -2876 1994 2348 -2988 327 2695 -2196 -1126
1182 -1126 3168 -1210 -2462 2405 -264 -3069 1336 371 -3626 164 1556 -3644 -1407 2013 -2594
1197 -2594 -2485 2406 -1453 -3528 1382 -122 -4077 282 702 -4187 -1322 1447 -3745 -2505 1760
1212 1760 -2423 -3003 1588 -685 -3865 754 858 -3611 -137 1532 -3311 -1303 1973 -2160 -2214 2147
1228 2147 -1284 -2981 1948 484 -3267 803 1992 -2791 -20 2817 -1432 -1050 3054 14 -1762
1243 -1762 3037 1108 -2142 2417 2493 -1881 1505 3654 -1474 609 3919 -449 -1038 3965 1495 -1386
1259 -1386 3322 2692 -1418 2418 3550 -1174 727 3954 -880 -503 3663 134 -1589 3173 1404
1274 1404 -1793 2201 2670 -1708 1157 3390 -1183 187 3881 -275 -1257 3144 249 -2275 2250
1289 2250 1406 -2795 931 2454 -2465 -405 2993 -1608 -1560 2599 -633 -2056 2051 867 -2603 1326
1305 1326 1656 -2458 3 2220 -2291 -1748 2459 -1330 -2407 2020 -276 -3204 1240 1019 -2839 -10
1321 -10 2079 -2776 -979 2467 -1688 -2108 2260 -756 -2699 1788 492 -3051 920 1797 -3008 -226
1337 -226 2382 -2211 -1333 2815 -1003 -1947 2493 767 -2682 1623 1767 -2761 351 2322 -2168 -1161
1353 -1161 2642 -867 -1309 2649 112 -2299 2186 1286 -2190 1547 2743 -1823 171 3232 -1233
1368 -1233 -727 3208 -103 -1894 2742 1341 -1844 1791 2274 -1645 1180 3564 -1083 -201 3641 230
1384 230 -1101 3418 1064 -1812 2577 1908 -1795 1273 2737 -1408 -40 3352 -1167 -579 3200 470
1400 470 -1694 3177 1414 -1831 2008 2144 -1978 418 2754 -1398 -633 2689 -625 -1914 2369 592
1416 592 -2487 1525 1304 -2689 409 1931 -2011 -819 2697 -1486 -2069 2158 -553 -2763 1181 908
1432 908 -3223 488 1365 -2510 -779 1541 -2395 -1478 1685 -1484 -2904 1581 -352 -2970 531 945
1448 945 -3081 -426 1569 -2816 -1741 1665 -1977 -2712 1397 -834 -3276 690 185 -3289 24 1102
1464 1102 -2679 -1081 1553 -2020 -1994 1880 -720 -2702 1206 168 -2907 717 721 -2752 -217 2218
1480 2218 -2178 -1092 2576 -550 -1918 2324 313 -2109 1735 1208 -2320 733 2058 -1525 128
1495 128 2666 -764 -1081 2818 346 -1898 2266 1396 -1786 1505 2471 -1648 868 2899 -801 -531
1511 -531 2817 -161 -1209 2421 642 -1662 1769 1798 -2053 716 2610 -1194 -63 2676 -533 -1113
1527 -1113 2420 71 -1900 1945 821 -2167 1281 2131 -1990 -105 2302 -1815 -1211 2162 -435
1542 -435 -2152 1654 250 -2354 668 1016 -2560 -234 1496 -1956 -1128 1724 -1397 -2331 1415 -390
1558 -390 -2666 1044 605 -2628 -81 1329 -2447 -1254 1484 -1792 -1848 1210 -1100 -2220 1056 92
1574 92 -2517 389 661 -2507 -731 1453 -2155 -1564 1536 -1581 -2192 1444 -263 -2632 751 764 -2820
1591 -2820 15 1523 -1972 -636 1706 -1350 -1566 2103 -179 -1811 1242 702 -2012 648 1520 -2022
1607 -2022 65 2225 -1534 -1122 2388 -652 -1719 2017 737 -1719 1262 1874 -1566 891 2487
1622 2487 -1274 -170 2484 -271 -742 2267 183 -1167 2095 1560 -1579 1373 2240 -1010 458 2521
1638 2521 -536 -425 2901 436 -1121 2084 1028 -1600 1701 1856 -1486 563 2302 -1239 -407 2472
1654 2472 -305 -1136 2112 648 -1990 1383 1136 -1649 404 1447 -1453 -33 2005 -1525 -1306 1888
1670 1888 -489 -2173 1257 346 -2415 621 970 -2332 -475 1697 -1681 -1274 1472 -1093 -1958 1398
1686 1398 -496 -2524 734 328 -2498 57 883 -2691 -1432 1328 -1359 -2041 1046 -715 -2631 794
1702 794 -48 -2475 -58 679 -2430 -746 1040 -1833 -1459 1613 -980 -2077 1110 45 -2228 480
1718 480 1018 -2220 69 1368 -1783 -602 2053 -868 -1597 1691 -417 -1712 1066 1070 -1533 566
1734 566 1520 -1410 -197 1906 -824 -662 2277 55 -1083 2103 868 -1454 1544 1393 -1545 598
1750 598 2241 -856 -221 2269 -137 -879 1871 474 -1071 1477 1232 -1745 580 1911 -862 498
1766 498 2249 -419 -967 1913 0 -1041 1935 1022 -1823 862 1615 -1358 -206 1544 -1409 -781
1782 -781 1526 -751 -1607 1477 -85 -1989 868 690 -2070 -291 1160 -1639 -1257 1161 -1114 -1559
1798 -1559 1223 -805 -1994 745 251 -2017 -70 830 -2125 -528 1361 -1904 -1619 1067 -920 -2091
1814 -2091 839 -308 -2246 187 301 -2433 -544 857 -1814 -956 951 -1164 -1967 1209 -586 -2216
1830 -2216 657 422 -2168 -1 1011 -1898 -873 1138 -1690 -1321 1233 -687 -1968 531 -177 -2309
1846 -2309 688 770 -1738 -220 1443 -1070 -603 1534 -475 -1053 1708 90 -1430 1308 1249 -1144
1862 -1144 588 1837 -723 169 2105 -300 -1060 1887 328 -874 1505 984 -1069 834 1532 -944
1878 -944 497 1865 -785 -106 2208 262 -902 2038 827 -1023 1506 1748 -873 924 2042 -559
1894 -559 -92 2021 -253 -558 1922 445 -1327 930 924 -1529 696 1357 -1089 -198 1497 -908 -616
1911 -616 1149 -310 -1100 1231 202 -1449 646 836 -1722 -105 1468 -1524 -908 1295 -691 -1408
1927 -1408 1237 -153 -1879 596 199 -1836 -78 732 -1767 -522 1294 -1314 -1295 1014 -793 -1914
1943 -1914 840 -101 -2035 484 591 -1820 -162 1184 -1492 -744 1145 -762 -1388 1199 -356 -1577
1959 -1577 538 587 -1619 112 956 -1281 -252 1227 -824 -1162 1513 -286 -1551 897 343 -1234
1975 -1234 595 1192 -1511 -104 1223 -847 -586 1889 -259 -874 1369 560 -894 1138 1163 -1190
1991 -1190 517 1413 -438 116 1603 -504 -584 1796 596 -1037 1479 945 -1120 907 1521 -612
2007 -612 -3 1503 -211 -383 1431 18 -839 1470 951 -975 1173 1124 -843 390 1678 -375 -222
2024 -222 1732 224 -612 1832 880 -612 1354 1001 -855 472 1357 -823 -141 1693 -892 -857 1451
2041 1451 -170 -1198 776 74 -1161 457 846 -1372 -253 976 -1024 -1453 778 -756 -1311 704
2057 704 62 -1321 444 367 -1493 46 785 -1153 -461 953 -1125 -849 741 -273 -1699 451 133
2074 133 -1756 152 556 -1457 -242 884 -1102 -1242 1050 -599 -1540 905 -356 -1494 611 599
2090 599 -1038 -72 1009 -1037 -131 1508 -612 -456 1244 4 -944 793 831 -1209 462 1170 -1033
2107 -1033 231 1407 -491 -351 1546 -4 -751 1162 810 -1021 886 914 -849 379 1268 -547
2123 -547 -189 1219 -30 -401 1431 463 -750 1268 827 -1086 545 1156 -698 -30 1124 -304 -470
2140 -470 1287 227 -930 949 533 -991 711 1301 -1152 1 1664 -563 -581 1263 -400 -860
2156 -860 1096 74 -1170 541 299 -1388 315 960 -971 -334 891 -650 -1327 926 -219 -1412
2172 -1412 421 -53 -1562 76 641 -1431 -431 727 -1214 -944 697 -831 -1206 680 -407 -1595
2188 -1595 152 263 -1889 -480 850 -1685 -913 829 -660 -1226 451 -712 -1231 353 -207 -1893
2204 -1893 -101 199 -1457 -666 810 -1148 -1018 1038 -446 -1022 549 344 -1113 368 922 -444
2220 -444 216 1257 -536 -229 1758 -55 -837 1101 658 -1177 772 761 -1026 480 1234 -940 -130
2237 -130 1383 -288 -401 1405 442 -327 1333 975 -612 1413 1273 -602 608 1471 -273 20 1554
2254 1554 251 -186 1248 815 -753 831 850 -895 559 1255 -595 -168 1400 -340 -849 1505 5
2271 5 -1083 806 690 -1150 385 958 -946 -86 1268 -740 -602 911 -329 -778 882 137 -1185
2288 -1185 369 706 -1331 -45 710 -962 -458 844 -652 -1234 1228 -165 -1025 418 360 -822 180
2305 180 616 -1034 -286 917 -844 -781 1001 -225 -916 376 106 -1395 199 304 -912 69 757
2322 757 -1101 -609 734 -733 -1218 709 -9 -1318 243 222 -1465 -67 463 -1000 -497 431 -674
2339 -674 -776 707 -393 -1286 636 6 -1692 114 533 -1087 -3 625 -926 -393 621 -224 -861
2356 -861 497 466 -911 700 711 -877 242 803 -641 -222 1512 29 -142 1388 368 -420 884
2373 884 666 -733 1059 933 -952 158 987 -282 184 1329 178 -419 1138 683 -559 648 1054
2390 1054 -358 323 1123 -465 141 1155 115 -220 816 182 -838 721 219 -742 295 526 -900
2407 -900 -398 907 -520 -1252 799 -537 -1206 59 153 -1061 -216 153 -1220 -72 631 -808 -844 754
2425 754 -725 -1223 646 -345 -1368 270 368 -1356 -305 309 -1125 -664 1009 -825 -1006 843 -5
2442 -5 -1104 391 245 -1320 390 745 -1144 69 946 -610 -440 648 -182 -622 1145 284 -859
2459 -859 525 530 -716 180 904 -661 -211 943 -212 -893 1012 349 -596 921 864 -736 471 1311
2477 1311 -422 218 1114 -441 -122 1113 -74 -433 982 441 -821 1060 1185 -455 210 1558 -583
2494 -583 -109 1110 -61 -776 958 210 -287 926 948 -744 848 1046 -203 139 1222 -95 -80 1521
2512 1521 468 -356 895 469 -1025 750 769 -498 435 1187 -363 -203 988 -175 -939 952 304
2529 304 -928 562 432 -797 76 903 -521 -314 838 -396 -825 685 -9 -1069 430 0 -833
2546 -833 87 306 -985 -73 760 -670 -839 657 -522 -1122 133 -117 -1110 231 56 -1060 -107 698
2564 698 -884 -525 879 -428 -539 704 -281 -969 564 540 -1158 87 183 -1137 -615 615 -616
2581 -616 -704 542 -56 -819 870 299 -672 633 742 -849 149 892 -759 -432 501 -181 -530 1322
2599 1322 203 -818 787 803 -688 310 944 -893 -104 826 -208 -369 1011 22 -636 780 213
2616 213 -838 341 664 -989 -161 703 -532 -329 1050 -112 -506 749 307 -843 658 682 -716
2633 -716 253 968 -466 -176 987 -445 -991 785 -93 -1044 446 235 -1135 331 639 -763 -313
2650 -313 540 -689 -459 967 -546 -607 337 2 -991 92 67 -1030 -472 574 -828 -391 671 -586
2668 -586 -961 259 -149 -1120 506 -215 -1129 -84 581 -934 -835 739 -977 -853 470 -510 -1055 -154
2686 -154 -176 -1305 -21 267 -1144 -285 481 -892 -655 658 -785 -703 536 -342 -1045 116 162 -995
2704 -995 -8 424 -1019 -279 751 -491 -609 442 -152 -839 357 244 -887 255 892 -797 -41
2721 -41 771 -405 -73 785 15 -370 889 264 -698 676 841 -611 322 875 -262 -61 984 -54
2739 -54 -369 901 345 -627 820 440 -643 695 873 -534 51 1039 -411 -399 1322 197 -465 930
2757 930 491 -569 636 734 -455 470 799 -633 -263 1060 -86 -617 991 -2 -926 347 158 -536
2775 -536 411 583 -645 -388 709 -170 -447 497 -565 -753 529 -126 -1216 408 19 -1046 184
2792 184 673 -894 -659 682 -677 -521 305 -109 -1242 228 61 -1034 -220 142 -937 -567 641
2809 641 -746 -1022 99 -281 -1048 98 -83 -939 240 143 -1103 -5 471 -869 -475 808 -440
2826 -440 -765 420 92 -913 298 391 -789 147 578 -594 -86 892 -435 -575 915 -156 -647 366
2844 366 200 -521 382 1113 -572 24 1019 -443 -311 742 -137 -559 606 355 -544 685 760 -466
2862 -466 270 1166 -94 161 900 -479 -26 865 238 -630 755 313 -688 209 799 -371 -112 928
2880 928 -789 -105 1108 -170 -623 807 90 -534 549 688 -823 91 1016 -630 -342 685 -270
2897 -270 -406 604 21 -766 715 241 -878 -23 526 -814 -153 592 -1034 -572 626 -80 -761 830
2915 830 -116 -1010 107 498 -865 -112 452 -809 -416 570 -253 -923 500 -386 -836 205 300 -975
2933 -975 -248 626 -959 -560 768 -521 -867 452 -62 -953 474 244 -463 282 490 -965 -246 552
2951 552 -260 -361 977 -76 -766 571 389 -934 561 611 -375 422 675 -477 67 1248 39 -498
2969 -498 951 74 -319 560 472 -423 474 1027 -471 98 885 -279 -207 707 196 -342 826 641 -195
2988 -195 345 595 -552 229 811 -642 -274 1056 -109 -351 904 207 -473 719 486 -504 73 792
3006 792 -398 -134 1107 -175 -65 505 210 -751 596 200 -487 188 413 -912 -5 814 -662 -163
3024 -163 678 -332 -714 853 134 -711 318 429 -1003 -141 838 -351 -526 804 -351 -733 589
3041 589 198 -652 362 188 -726 55 506 -944 -161 511 -436 -510 746 -416 -1023 472 -17 -1101
3059 -1101 -245 174 -1159 -315 18 -822 -465 839 -459 -1008 112 -382 -863 375 -67 -969 15 219
3077 219 -641 -401 500 -682 -532 639 -67 -359 673 229 -671 376 640 -532 -201 641 -55 -195
3095 -195 735 22 -253 845 341 -230 666 742 -510 805 1111 -243 89 1069 -65 123 1173 551
3113 551 -299 938 616 -512 499 609 -323 114 974 -232 -97 812 -236 -347 861 293 -478 393
3131 393 970 -620 568 729 -606 -238 643 -467 -402 881 74 -749 699 468 -442 60 348 -831
3149 -831 53 721 -600 -711 238 -146 -517 89 56 -928 356 510 -1011 -13 523 -587 -466 738 -435
3168 -435 -524 485 -146 -864 266 -86 -648 153 275 -296 -535 473 -427 -722 455 -110 -575 292 193
3187 193 -755 11 504 -922 -86 221 -554 -343 530 38 -938 562 198 -369 345 414 -639 162 773
3206 773 -359 151 784 -83 -330 925 -71 -142 588 0 -302 345 644 -404 28 1146 -402 -286 693
3225 693 352 -407 719 315 -277 204 653 -578 160 811 -309 -288 661 41 -122 831 389 -474 855
3244 855 295 -559 301 836 -220 53 689 -273 -239 888 265 -537 538 223 -581 110 605 -691 63
3263 63 692 -302 -180 804 -82 -364 576 134 -1333 485 219 -551 -135 280 -815 -302 528 -761 -252
3282 -252 354 -271 -786 335 -17 -788 93 -35 -1059 -304 20 -426 -582 433 -227 -705 376 -416 -772
3301 -772 190 111 -557 -359 503 -623 -616 557 -270 -404 370 -390 -949 166 -50 -735 54 48 -1017 -117
3321 -117 391 -711 -239 519 -268 -412 279 60 -1020 138 86 -405 -190 564 -625 -529 668 -301 -449
3340 -449 483 145 -451 505 603 -654 228 528 -517 82 752 -436 -400 771 102 -229 771 28 -368
3359 -368 341 670 -428 -3 775 10 104 625 -194 -320 726 292 -555 545 330 -548 429 567 -516
3378 -516 -85 479 -353 -437 760 11 -528 458 510 -590 332 424 -629 -10 531 -497 -295 621 -589
3397 -589 -602 665 85 -807 145 30 -571 -177 434 -498 -387 494 -310 -665 317 174 -630 279 128 -502
3417 -502 -5 292 -945 -200 366 -500 -428 518 -91 -530 610 -53 -690 261 101 -1019 -58 225 -635
3436 -635 -244 242 -353 -500 165 -122 -765 126 24 -729 -125 510 -673 -127 518 -400 -339 307 -362 -596
3456 -596 414 260 -674 253 655 -288 28 816 -141 -148 719 -444 -170 713 84 -549 291 388 -167 245
3476 245 777 -238 26 357 -457 -296 914 323 -165 434 400 -212 573 633 8 173 767 -241 -284 796
3496 796 76 -28 372 349 -436 931 398 -472 61 699 -126 -349 580 33 -119 555 -151 -290 408 283
3516 283 -457 194 430 -666 16 598 -517 -274 684 -139 -578 295 -20 -606 507 62 -695 -198 285
3535 285 -636 -447 357 -473 -461 488 -68 -738 5 339 -638 -101 519 -783 -260 375 -524 -385 628 -101
3555 -101 -565 340 219 -476 45 187 -461 -35 501 -337 -40 801 80 -305 619 -58 -284 332 257 -569
3575 -569 370 508 -317 12 683 -306 -181 419 -340 -563 726 248 -203 239 511 -346 98 620 -198 -243
3595 -243 563 318 -380 416 310 -327 614 461 -257 236 411 -82 -192 625 -100 -182 543 270 -402 482
3615 482 662 -424 81 440 -376 204 610 -290 -287 523 -180 -491 559 307 -592 93 286 -558 -57 416
3635 416 -425 71 396 -222 -442 562 207 -264 310 67 -611 -91 481 -733 -61 403 -663 -665 447
3654 447 33 -479 97 -53 -738 85 -91 -476 -123 338 -384 -492 371 -288 -329 80 -136 -664 240 195 -469
3675 -469 -71 -29 -784 -320 804 -132 -469 365 146 -609 269 40 -413 320 403 -608 -153 501 -303 -285
3695 -285 515 -139 -532 461 247 -833 32 246 -237 23 587 -627 -285 573 15 -270 754 -98 -616
3714 -616 517 389 -237 207 314 -568 -77 613 -446 -195 436 256 -439 293 216 -859 382 403 -66
3733 -66 15 353 -316 -250 519 -216 -7 401 316 -696 246 16 -516 159 589 -48 10 608 -211 -260 435 82
3755 82 -288 609 295 -161 230 343 -196 94 441 -621 -137 527 -154 -374 374 35 -526 275 362 -635
3775 -635 115 58 -584 -304 479 -296 -593 365 5 -576 368 235 -871 -96 228 -597 -193 47 -468 -271
3795 -271 106 -358 -756 328 -46 -528 58 356 -445 -100 593 -187 -270 523 -690 -386 576 1 -477 216
3815 216 139 -816 -270 398 -502 -59 426 -114 -233 343 -123 -382 585 109 -395 372 627 -196 229 610
3835 610 -306 25 375 49 -304 520 151 -403 373 490 -62 189 106 -11 156 735 -108 -66 686 369 -206
3856 -206 536 276 -229 504 393 -408 188 613 -228 58 513 53 238 649 133 -157 225 301 -489 120
3876 120 156 -109 267 375 -354 -101 305 -160 -365 217 181 -324 -55 579 -68 -316 599 -180 -763 729
3896 729 50 -424 200 -19 -414 82 205 -487 46 412 -231 -239 -62 -217 -669 489 22 -587 317 -289
3916 -289 -479 -231 154 -411 -169 153 -161 -403 618 -356 -547 314 179 -365 -207 -10 -459 -137 224 -491
3936 -491 -370 458 -100 -129 139 324 -491 139 299 -525 34 255 -295 -411 652 -449 -140 312 177 -189
3956 -189 278 551 -588 383 315 -347 53 814 -181 -12 528 -133 -333 253 307 -49 443 564 -6 74 304
3977 304 -386 -56 482 -157 -24 351 422 -234 505 316 -253 508 487 -218 -203 633 49 -437 781 -196 -406
3998 -406 559 154 -267 72 489 -459 -65 528 -247 -311 373 -93 -61 152 100 -253 313 419 -639 181 190
4019 190 -667 -531 188 -415 -374 232 -155 -598 306 402 -691 131 109 -445 -83 359 -388 -338 239 -12 -699
4040 -699 -23 -2 -428 194 61 -864 -53 253 -485 -47 29 -492 -567 521 -453 -608 -17 35 -329 515 70
4061 70 -567 -21 305 -502 -327 273 48 -398 395 105 -238 123 289 -539 154 633 90 -194 396 23
4081 23 -48 836 -19 -178 404 456 -287 329 237 -237 24 590 -90 -342 841 -11 -324 864 43 -390 504
4102 504 119 -329 253 438 -174 -109 671 -49 -396 283 -97 -568 168 242 -195 297 579 -274 37 756 29
4123 29 -327 277 180 -794 104 144 -457 300 187 -447 281 619 -336 -354 495 -121 -374 398 -218 -431 146
4144 146 258 -670 170 585 -436 -206 -28 -270 -519 286 84 -577 -291 79 -672 95 437 -268 -99 -16
4164 -16 -190 -427 321 -102 -466 392 77 -600 -2 -78 -349 159 245 -349 -155 243 99 -428 241 287 41
4185 41 135 122 -486 184 478 -8 -65 388 -165 -121 498 -83 -51 198 -61 -275 135 368 -272 177 340 -28
4207 -28 -90 475 78 -404 479 156 -393 337 739 -398 -143 281 -112 -43 627 -260 -150 442 135 -256 537
4228 537 280 -287 178 451 -219 222 735 -222 -176 614 -15 -487 455 106 -232 273 457 -128 -124 284 -362
4249 -362 -178 460 -165 -476 71 -116 -398 534 175 -357 125 111 -597 -268 265 -103 -252 317 -366 -306 -152
4270 -152 -13 -457 293 -30 -538 -20 415 -631 -503 633 -316 -556 97 -150 -534 76 23 -308 -125 180
4290 180 -550 -296 428 -387 -513 352 -148 -296 216 -117 -357 139 146 -169 154 489 -204 -9 160 -176 -227
4311 -227 455 -339 -344 413 172 -272 -55 465 -94 -111 393 62 -77 574 65 -408 557 306 -425 435 204
4332 204 -204 -50 256 -232 53 902 -94 40 286 352 -589 216 527 -332 164 642 -65 -44 529 -218 -328
4353 -328 437 -174 -452 189 336 -95 395 704 -265 -1 478 -235 -218 408 146 -310 13 306 -468 235
4373 235 377 -732 -94 518 -320 -288 300 -78 -319 106 101 -348 12 158 -224 -16 377 -397 -1 449 -392
4394 -392 -384 370 84 -830 296 -262 -271 -68 65 -199 -299 139 -483 -300 23 -97 -380 -139 -100 -530 300
4415 300 110 -140 -381 217 -14 -100 -62 -153 -261 683 121 -330 -26 463 -197 128 313 -297 -16 296 -374
4436 -374 -256 442 -452 -72 31 586 91 489 255 -242 292 657 -290 181 444 -156 -501 426 96 -454
4456 -454 227 227 -397 102 316 -141 48 417 123 -129 581 -248 113 359 186 -293 207 126 132 342 450 -190
4478 -190 -222 713 -29 -251 317 125 -305 158 393 -4 189 512 -111 10 664 -270 -215 433 79 -116 75
4499 75 57 66 74 334 -222 129 407 -40 137 328 -217 -469 365 -217 -241 -239 376 -293 431 316 -694 -280 406
4522 406 -209 -356 96 202 -186 265 104 -525 36 -288 -425 -220 321 -468 -266 75 -90 -471 328 101
4542 101 -407 -31 184 -296 -447 286 -138 108 202 -343 -273 453 -155 -46 164 -2 -263 -229 95 35 -70
4563 -70 241 -299 -113 345 219 -284 322 111 -577 225 119 -262 148 555 -106 -185 90 -327 -174 465 317
4584 317 -419 70 57 -249 153 75 -538 -21 547 43 -65 530 318 -182 143 310 -350 91 340 -277 302
4605 302 611 -141 -265 405 60 -183 303 273 -279 -52 352 -266 332 234 -121 -134 538 -67 -478 342 24
4626 24 -414 406 199 -305 285 -34 -408 -71 168 -418 -112 126 -308 -366 313 27 -675 324 178 -653 -61
4647 -61 381 -162 -290 105 -162 -141 109 -105 -365 68 121 -431 13 400 -468 -83 218 -156 -161 311 -151 -104
4669 -104 -84 -260 -353 136 -33 -490 -126 177 -41 -357 293 -289 -343 218 0 -283 8 -146 -274 191 103
4690 103 -122 -125 376 287 27 332 -137 -141 289 362 -237 185 605 -100 34 335 -4 -229 49 39 -298 329
4712 329 165 175 -112 323 -228 440 220 2 -34 360 44 140 562 68 -204 237 177 -273 211 472 170
4733 170 -69 391 -257 65 503 114 -272 139 366 -480 284 163 -193 -292 461 -41 -126 275 42 -344 244
4754 244 138 -104 347 44 -407 -36 50 -458 -194 77 -321 -412 354 158 -308 217 56 -238 6 81 -191
4775 -191 141 -61 -186 -287 495 -308 -146 301 -409 -439 -135 154 -470 -42 496 -491 302 59 -73 187
4795 187 231 -336 -366 287 -172 -166 474 219 -812 -17 253 -310 -164 508 18 -189 1 123 -259 58 320
4816 320 -271 105 -28 -246 3 347 -361 -226 559 174 -166 417 316 -382 293 241 -87 153 490 441 154
4837 154 319 -92 -275 262 445 -249 477 178 -238 171 233 -54 234 109 -124 -7 182 415 -314 272
4857 272 -41 -211 -34 216 -212 -50 277 -398 -168 223 -71 -531 27 168 -286 -22 273 -420 -110 412
4877 412 -125 -176 144 -122 -212 -17 171 -634 -187 17 -494 -266 139 -142 151 48 -104 -543 119 -547 -346
4898 -346 376 30 -262 -30 -3 243 -59 64 -461 -201 326 -183 -324 385 199 -357 165 -396 -179 50
4918 50 218 -140 -49 158 -3 -519 262 58 -254 259 52 -106 -5 -158 -375 302 214 130 -104 386 5
4939 5 -215 237 27 -446 24 188 -254 188 363 -323 -50 123 -515 -381 94 275 -55 140 263 -482 -34
4960 -34 330 -242 -73 288 -427 151 -9 104 -176 107 263 -272 26 483 14 161 465 -261 -129 374
4980 374 41 -14 60 -179 -83 259 51 -145 -134 349 -112 -561 282 82 -138 143 -130 91 328 11 -251
5001 -251 490 242 -402 166 73 -115 -191 185 48 -258 247 -36 -190 106 -20 -445 -115 131 -361 -220 90
5022 90 -10 -546 31 -100 -533 59 -325 -328 37 -120 -432 -229 39 -272 -381 44 218 -181 210 -123 -231
5043 -231 42 115 -157 -61 267 109 -115 97 -91 -177 277 -353 -145 84 290 -229 272 7 -263 78 340
5064 340 99 -98 251 208 -367 333 198 -225 31 319 52 97 178 -320 -3 73 -70 -21 341 91 -185 274
5086 274 124 -304 140 77 -395 -3 404 -157 -183 192 98 -199 78 2 -57 95 135 26 -435 312 -127 -464
5108 -464 161 57 -287 257 46 47 499 311 -176 -63 243 -144 -265 -198 -14 37 389 58 -440 -40 300
5129 300 -382 86 76 -184 138 17 -293 -295 240 -231 -360 384 -74 -308 35 -80 -348 -487 268 -300 18
5150 18 80 -266 -104 86 46 -130 137 69 -234 306 129 -387 -218 223 -105 -324 293 68 -151 211 -162
5171 -162 -214 246 254 -220 207 253 -711 11 436 47 -56 143 241 -217 35 217 4 472 451 152 68 338
5193 338 38 -32 277 -183 167 228 227 -48 87 266 -297 61 302 -109 -90 89 161 -98 289 -25 219 197
5215 197 251 -332 -398 281 -172 -87 195 -210 -157 28 328 -153 24 -259 -25 120 173 -298 -410 331 67 90
5237 90 94 -31 -352 46 -122 -259 20 -176 -78 0 8 -406 -343 -157 -314 -515 212 -247 -434 79 -3 -365 -117
5260 -117 16 -123 -131 18 -68 -240 173 -63 -276 0 -73 -381 -31 -63 -457 -123 375 -209 100 173 -187 -144
5282 -144 100 298 -194 -59 -230 -144 -315 373 -152 -42 372 -187 2 311 -196 -257 -30 400 32 -7 234
5303 234 -526 -28 512 -164 -34 495 -205 -168 54 192 -308 62 336 -106 -152 165 -172 -19 -149 -117 40
5324 40 100 366 21 376 325 -154 -69 234 -385 113 456 35 16 374 204 -27 263 -162 -374 166 302 43
5346 43 77 158 -344 -13 511 231 126 -24 123 189 447 739 -163 118 241 -166 -115 529 -71 -319 371 202
5368 202 -280 205 96 -382 0 51 -202 -25 -160 -42 -68 460 -150 -114 245 91 -431 -116 432 -16 -20 -72
5390 -72 -137 -157 72 -62 -16 -49 287 -361 -151 397 -495 13 125 -252 -39 149 -390 -466 177 -236 -13 -111
5412 -111 192 -408 43 -5 -261 227 196 -53 -188 206 -14 -215 133 186 -281 104 88 -205 190 12 127
5433 127 -167 191 40 -263 448 -67 -42 212 32 -271 38 301 -271 -35 -197 117 -132 -107 91 26 225
5454 225 105 -191 57 88 -10 -9 154 -180 -38 239 -117 -2 344 16 59 390 134 -115 -71 19 -155 -212 248
5477 248 -259 -146 114 114 -173 345 30 -330 -251 333 -492 248 137 -118 5 31 -39 -334 268 129 -47 381
5499 381 -64 -753 -73 -62 -124 -136 344 -320 -39 231 -90 -50 -67 260 -78 174 -14 -304 -131 315 -374 207
5521 207 95 -411 -62 -30 -90 -145 6 -27 -328 -261 176 -341 -124 106 -314 -248 324 -119 174 165 1 -267 -197
5544 -197 142 -361 -21 25 8 -253 53 -182 -101 164 87 -110 -68 64 255 -109 327 19 -329 123 -85 149
5566 149 514 -18 -199 130 -11 -179 482 241 113 93 194 274 8 129 -223 281 137 -7 -319 219 254
5587 254 -174 -31 255 -374 -256 -44 -20 -123 142 -275 35 351 -113 -195 -213 -160 -156 71 199 -228 -28 188
5609 188 -125 -426 14 88 -419 155 178 -512 71 167 -544 -275 193 -142 -183 -291 -122 -141 -88 89 -393 1
5631 1 23 -450 -268 124 -91 -442 272 3 -241 -197 145 -227 -122 116 -528 117 77 -313 -2 98 -332 27
5653 27 297 -254 79 -56 -130 -268 -10 25 -128 -233 119 -113 18 42 -152 -116 -17 95 1 347 216 -313
5675 -313 88 215 34 -286 155 52 -93 262 310 -185 231 239 -351 231 -103 78 180 302 -96 -39 471
5696 471 -15 -3 124 225 -302 -105 344 -102 -36 176 171 -331 93 184 281 380 22 -373 320 390 -158 -40 190
5719 190 -7 63 -13 -205 72 146 37 -45 -3 131 -414 -82 86 -260 -256 83 -161 -126 352 -67 -113 402 -141
5742 -141 -372 329 203 -529 168 -22 -390 -78 154 -38 -134 -71 -49 -386 116 164 -153 282 233 -296 -190 -182
5764 -182 -360 -249 25 136 -355 -124 -363 -585 -207 5 -142 -567 205 -188 -85 277 -246 -81 170 -290
5784 -290 -289 311 -114 -43 55 171 161 -520 292 -115 -128 204 -331 -120 193 -258 -124 239 -130 22 -26 307
5806 307 -20 -196 -90 -61 -303 -71 -69 -74 156 -107 46 250 324 -49 -95 119 -99 241 188 -69 -46 33 270
5829 270 -254 137 89 -126 -173 442 -95 -413 118 72 -94 147 342 94 58 -98 -554 241 22 -38 153 171
5851 171 -173 -109 287 144 -295 21 252 59 -77 76 -374 -210 225 32 -207 187 -87 -298 109 142 -177
5872 -177 162 99 26 -18 -76 177 -249 139 -133 -242 204 -68 -278 50 -94 -58 74 103 18 -215 176 -208
5894 -208 -126 47 29 -47 111 355 -468 -138 295 12 -592 546 -126 -286 -51 -526 -83 168 309 -381 -46
5915 -46 -2 -315 143 -20 72 35 309 120 -235 60 51 -79 -56 325 -313 -154 258 -90 208 15 -187 -180 275
5938 275 -195 -371 147 -53 -119 165 232 -134 -6 49 -102 -275 51 -170 -405 464 54 58 133 60 -236 -79
5960 -79 191 -509 234 295 -324 -200 595 -24 -108 119 61 268 -59 127 -342 348 156 -25 99 140 -249 -179
5982 -179 448 -51 -161 93 100 -262 168 173 -104 -26 -158 -327 -276 27 29 -214 4 77 -240 -2 161 17 -294
6005 -294 61 5 -209 35 -493 -237 50 -142 -137 247 -95 -204 -114 31 -192 -399 136 -315 283 68 -323
6026 -323 170 28 -126 -189 179 214 -396 236 539 -263 -197 28 -172 -41 171 32 -98 17 244 -156 34
6047 34 252 -10 86 -1 -198 66 281 -183 -269 5 -45 -131 70 110 -153 253 288 -200 78 66 298 12 194
6070 194 217 121 134 314 -26 35 185 -219 47 80 -227 -68 256 35 13 40 -128 -182 187 103 -341 -169 161
6093 161 -277 118 132 63 -199 -246 217 -184 132 34 -347 51 270 -241 -167 179 70 -458 242 34 -152 209
6115 209 269 -264 -278 -74 -93 -175 184 8 -421 9 184 -249 289 166 -6 -18 80 83 76 126 -262 -127 264 -95
6139 -95 -263 184 -113 -27 -38 127 -202 -30 525 -25 -51 36 11 -32 145 -231 -34 -180 120 -388 -137 228
6161 228 -222 -107 -146 -185 -74 131 -79 51 117 260 16 8 18 -64 -99 -7 7 -51 187 -108 -265 241 -139 -14
6185 -14 319 -2 28 155 -102 -76 112 372 244 293 176 185 -68 94 464 18 149 286 -81 201 0 156
6207 156 -105 190 -259 -71 65 69 -145 -74 333 -356 -44 -190 -118 -488 107 -13 -217 139 -247 132 39 239
6229 239 -242 -301 335 -211 -241 150 -278 -34 -117 58 -41 218 94 -443 286 -102 -29 -61 407 -60 -143 367
6251 367 69 -73 148 -170 -137 190 184 -351 52 36 -99 -43 -156 -197 -36 15 331 -372 220 -45 -230 244
6273 244 -65 -383 97 43 -263 79 570 -42 -253 115 183 -363 219 15 -404 -208 7 85 -10 154 -54
6294 -54 -218 -2 242 114 420 293 136 447 453 -107 93 214 58 16 27 -104 -55 346 94 -172 136 175
6316 175 -136 -244 113 -8 -217 268 6 82 8 -293 -59 -54 212 -47 -114 82 -64 -128 203 -227 33 380
6338 380 -25 -167 -11 -50 -379 -266 -127 -54 158 84 -239 58 140 -116 -360 46 -88 -53 -6 105 77 -250
6360 -250 259 84 16 125 148 -173 68 -247 -21 -12 -72 -288 -138 -31 -220 94 71 -398 -140 -61 103 -138
6382 -138 -199 -85 18 -98 -54 -251 151 7 -79 -213 -194 -46 196 240 423 -11 -31 286 -124 -237 124 217
6404 217 -400 362 -53 -120 11 13 -98 294 -148 -78 194 314 -206 -150 520 -407 -19 412 -237 -111 522 72
6426 72 161 260 119 -367 220 147 16 -193 -149 312 78 116 47 -183 504 -95 -8 -178 250 15 124 0 -407
6449 -407 78 -39 -17 -212 122 -75 -191 84 106 -258 12 120 -62 -393 118 -63 -85 -52 -256 -109 187
6470 187 -37 -432 255 163 -383 -166 454 -293 -21 408 -9 62 21 -62 50 320 123 -214 227 85 -228
6491 -228 -240 147 53 54 454 43 -22 175 -164 -231 -77 -5 -275 87 121 -282 -307 -71 -181 301 322 293 -309 -92
6515 -92 -105 -194 116 -181 -223 101 -72 -159 -40 102 -52 -117 229 -86 -222 109 277 89 -23 -79 -7 -21 6
6538 6 186 173 -124 195 -5 -96 -28 6 263 139 -316 -139 35 -115 -147 -113 -108 -76 138 82 16 35 16 -35 -189
6563 -189 186 170 12 153 -75 -230 71 -47 -174 176 419 -210 108 328 -229 -262 360 -202 96 478 224
6584 224 -135 -73 197 -144 119 254 -132 -72 328 135 159 134 -63 -383 101 -142 12 221 273 -128 -74 149
6606 149 -208 -155 184 -129 -369 68 -142 -206 73 -76 -9 3 423 -297 -96 -188 -355 -46 -64 -181 -74 -6
6628 -6 331 -217 162 -148 79 -259 -393 218 -81 -98 99 -101 16 -2 -149 -80 28 -358 -186 167 56 204
6650 204 148 136 -172 307 -81 69 213 315 -75 72 26 -156 70 61 -183 -10 366 6 37 -93 -32 -330
6672 -330 47 -190 -219 19 344 7 -25 419 13 -189 146 213 43 -29 49 -361 190 7 50 236 -140 238
6694 238 381 53 -23 51 182 -106 198 434 133 -115 -175 324 -136 192 107 0 54 -1 102 29 -49 -348 8
6717 8 132 -13 187 -95 153 288 -180 -20 171 57 -105 106 -82 -145 125 23 -93 -163 52 -336 -136
6738 -136 67 -195 94 -108 -286 159 127 -80 -188 -56 -44 -172 -57 -60 -49 145 -212 -8 73 240 -164 26
6760 26 -55 -154 27 20 -106 -291 73 -174 -194 168 -62 13 -66 193 -314 112 319 -179 169 -11 -120 -133 12
6783 12 -12 25 96 -8 272 -198 154 -237 -144 179 -214 -181 272 -219 -32 1 35 -110 -41 42 68 -40 65 24
6807 24 -103 -87 63 244 314 33 -253 244 86 91 67 338 331 124 50 -172 103 199 -204 -158 24 102 -269 146
6831 146 -1 320 398 209 101 61 23 -182 -471 274 50 -122 89 -141 88 -262 83 39 -141 173 -108
6852 -108 -196 -262 -168 83 -50 33 -104 -70 19 -113 -23 -72 -112 -209 253 -177 29 155 -241 -46 -92 35 -295 93
6876 93 238 -276 -165 -102 16 -171 -65 30 15 148 -51 -25 15 -11 -121 -85 66 -133 49 128 273 -134 121
6899 121 -29 -135 -55 -117 -237 -123 137 -46 -35 194 -124 171 546 90 20 209 107 -153 155 102 -59 -26
6921 -26 24 97 -133 354 -110 -130 401 -11 -125 45 267 -220 -206 81 -56 -153 28 -1 -95 -19 312 -147 97
6944 97 -32 -144 223 86 145 133 -61 -37 40 -7 115 4 227 -62 90 -64 263 -33 -13 99 307 229 112
6967 112 19 93 2 236 8 -269 370 -89 200 270 189 -142 144 -241 -218 302 222 -178 57 482 -69 205
6989 205 21 -71 -198 84 -82 -34 31 16 -205 -21 -153 -109 -294 -29 -49 34 79 -205 -124 428 -175 -242 -61
7012 -61 -59 53 80 154 -123 -121 156 17 -41 92 -202 -134 74 -48 -255 316 -228 -175 44 234 -236 -13 -108 -10
7036 -10 -301 357 105 -254 57 53 -270 -42 468 134 65 207 80 -71 37 211 -123 80 265 50 109 155
7058 155 -232 -8 272 -30 5 -58 -189 -194 276 -129 1 221 23 32 49 90 107 196 263 -275 100 116 47 -64
7082 -64 -57 -145 30 261 -112 -380 278 157 -287 102 -86 -349 -71 18 -78 -277 -101 -75 -30 22 -167 -281 -340
7105 -340 -3 -279 -52 188 62 -20 143 251 -268 204 343 -68 -64 355 -297 -229 301 -105 -30 284 80 35
7127 35 -26 -248 175 -168 -206 -254 -204 113 -129 -145 99 -164 -22 -270 -192 2 -40 -186 218 -52 -32 99 243
7150 243 -92 -48 -23 186 72 -331 320 273 6 -167 211 -118 49 72 31 89 130 -242 -55 42 54 -186 -60
7173 -60 360 -127 -86 72 -64 -87 129 177 -225 274 403 -132 16 450 -139 229 91 -83 77 329 40
7194 40 -77 210 -85 -231 194 122 -97 173 -7 -269 -20 -72 141 399 209 -26 -195 230 -158 16 137
7215 137 -75 -16 -30 20 -39 -52 -39 108 -111 119 -327 -149 41 274 -121 -5 104 -268 -106 258 -87 -465
7237 -465 4 37 -245 68 -3 -55 155 -14 61 14 115 38 16 308 131 -170 294 -62 -217 57 206 -110
7259 -110 71 92 -138 -6 370 -232 66 -53 156 2 105 1 -36 -192 -113 -291 -83 81 -356 -224 43
7280 43 183 62 3 69 -150 59 258 -242 199 13 -165 73 189 -161 336 -243 62 -114 228 55 -469
7301 -469 167 -44 14 -135 431 -68 -185 411 200 -198 8 -142 41 1 174 199 -205 132 -408 -108 -125
7322 -125 13 -192 -132 -121 -232 -244 236 -146 75 173 53 -37 -113 -141 -50 186 -236 92 376 -37 24 -210 88
7345 88 -60 -138 221 78 -440 163 -37 -684 115 97 -93 219 -53 -359 233 -7 -408 -46 153 -91 -173
7366 -173 96 54 -200 -57 100 101 76 273 85 -69 104 -110 -306 297 -63 -326 128 -47 23 304 17 -86
7388 -86 -70 -89 -238 -50 -75 -160 -126 343 -174 -16 163 123 -193 -189 -5 76 -165 -68 -260 -72 -103 -150 -169 -21 116
7413 116 -1 89 56 -196 -71 -193 -202 -251 213 28 71 204 -99 -40 -40 189 132 72 -112 -122 31 123 77 98 378
7438 378 128 -108 -148 165 -234 207 128 -131 -299 -225 11 -210 -25 452 79 89 -196 -449 207 155 -393 177
7460 177 -115 0 72 31 2 -75 -84 -126 -279 -128 -119 -438 105 -253 -117 -13 203 -239 -78 403 -3 -93 178
7483 178 -91 -98 -73 37 -368 44 -73 195 -54 -247 71 -221 87 100 -143 -313 101 19 -203 -45 261 -47
7505 -47 12 -280 -171 223 34 82 10 93 -422 -30 -78 -89 227 24 158 39 -88 -25 -318 259 142 12 224
7528 224 186 -282 -342 111 3 -23 -23 -219 -164 286 -203 -180 21 100 128 -134 -31 433 236 -171 44 -31 45 -38
7552 -38 10 -44 303 -184 268 12 -30 -66 433 -146 -29 293 -294 -151 31 -39 -158 195 17 -607 -61 -103
7574 -103 -114 237 278 272 157 448 -165 -168 77 -52 -272 103 -183 -94 -133 184 -91 8 -29 -226 12 31 152 -239
7598 -239 154 -83 224 75 -212 -85 -178 36 -466 -82 104 50 111 -94 -124 -324 289 -31 -131 -318 332
7619 332 -261 -20 227 -327 148 56 -25 -15 -11 124 -373 155 178 -181 51 62 -118 -298 27 -28 -18 5 40 -191
7643 -191 199 355 -122 20 440 -400 196 -134 -167 135 97 -63 -228 417 31 -170 379 236 -161 178 192
7664 192 9 212 43 -85 23 -131 120 -35 420 72 -215 306 -19 -6 192 187 -259 -324 119 130 -83 164
7686 164 73 36 207 206 -55 -101 341 5 -109 -156 -138 -276 -37 173 -262 90 135 13 -11 -50 49 -102 109 248
7710 248 -275 52 84 158 94 -220 102 -167 215 -70 -156 -464 124 71 -50 -55 23 107 130 29 126 73 -82 27
7734 27 84 47 -291 138 33 -90 42 142 137 -157 284 -74 -171 310 -21 -215 146 203 -210 254 127 -111
7756 -111 -51 73 109 62 -119 20 223 -194 -464 46 296 35 20 -9 57 -199 284 246 -11 99 40 -70 -158
7779 -158 139 -46 23 143 58 -195 173 -67 -137 24 -63 -81 -223 128 -73 -287 101 -124 -84 253 194 -130
7801 -130 9 75 9 -27 -278 -249 -178 301 -193 -164 67 -96 -223 94 297 -130 193 122 51 -114 -79 -175 -133 -31
7825 -31 -105 401 30 242 -134 4 266 -203 -5 69 -59 5 7 146 -2 70 19 -118 -308 -57 -245 -189 -80
7848 -80 -255 -23 -228 -181 -140 271 -107 -38 -260 216 -25 -19 -79 -54 72 -160 -437 -77 -117 -110 -75 -184 -40 57
7872 57 -45 334 21 80 90 -379 -61 -125 21 -83 129 -65 -86 57 -19 -332 2 353 -199 119 -63 -79
7894 -79 -3 131 183 65 169 33 -120 -44 192 71 17 -92 -36 -117 210 70 268 58 169 -125 406 47
7916 47 -9 115 -245 -94 -45 97 109 -61 11 171 -154 114 97 -290 196 156 168 -48 101 -134 99 286 -60
7939 -60 -195 -94 -41 121 233 -6 -106 -291 162 243 256 75 158 -118 515 -127 -336 69 111 -19 97 40
7961 40 -57 -58 273 -39 -475 -19 67 -74 -82 165 -226 -91 -141 -211 -337 107 -254 -270 -141 -103 -180 -141 72 -430
7985 -430 208 24 -34 38 124 -172 -5 185 -15 -32 -47 -37 -242 161 -267 -547 -110 -72 -133 -104 -126 29 -23 38
8009 38 -44 -73 55 -21 -150 -195 320 -175 -203 -65 -57 -5 76 196 -202 -71 122 -94 -89 132 -155 280 112 -258
8033 -258 -60 272 70 170 519 -123 8 182 259 66 213 145 -340 -64 45 186 -211 67 -1 -219 308
8054 308 119 -201 -73 186 -25 201 -86 -294 -169 474 268 -56 99 19 236 -298 -285 -292 127 54 -62 0
8076 0 35 196 -183 313 59 -204 94 -188 -148 48 -135 -147 -300 -174 89 -150 160 -280 175 -57 -4 91
8098 91 31 351 80 -98 323 38 317 -19 -308 -186 68 -8 -16 -112 -3 -127 62 24 -367 179 -29 56 -291
8121 -291 169 192 -181 121 301 -49 -119 -43 11 111 77 -205 -368 59 -62 68 164 115 -98 202 343 -221
8143 -221 6 158 49 271 -256 -220 -84 330 232 278 286 -235 64 178 178 49 251 215 -137 40 139 -195 20
8166 20 484 5 43 103 256 -50 21 250 56 -115 152 120 112 100 210 0 311 76 -207 130 -10 -75 -20
8189 -20 420 -184
8191a84
$$ Imaginary data points
##PAGE= N=2
##DATA TABLE= (X++(I..I)), XYDATA
0 0 0 0 0 0 0 0 0 0 -8 8 -8 8 -8 16 -16 17 -24 29 -32 40 -48 56 -64 73 -82 97 -110 125 -142 159 -179 201
32 201 -225 254 -281 314 -350 390 -431 478 -529 586 -648 720 -795 882 -980 1093 -1221 1371
50 1371 -1546 1755 -2012 2338 -2761 3337 -4177 5521 -8023 14332 -68347 -92688 -39452 -103522
64 -103522 -86157 -56155 -71277 -83266 -51706 -59599 -53956 -36980 -54544 -62571 -19537 -26404 -54890
77 -54890 -26844 -11753 -46719 -30737 -2184 -27530 -31570 -1285 -21361 -32535 4854 228 -30807
90 -30807 -7227 4380 -20683 -6325 12536 -14066 -10842 14725 -6230 -11529 22724 11442 -14518
103 -14518 12569 24183 1378 12560 24013 5126 13598 26172 2899 9395 34152 3076
115 3076 -15984 24043 21099 -18129 67 18903 -11193 -11762 10065 -3201 -7842 5471 -10173
128 -10173 -12414 12157 -1106 -20082 4815 5066 -21838 -4049 10731 -17404 -14794 6807 -14229
141 -14229 -19658 9370 -3694 -25287 -1076 4279 -17024 -2748 7875 -12690 -5851 9105 -9575
154 -9575 -5972 16794 -3276 -16265 12259 10827 -11485 5263 13915 -6348 2273 15222 -927
167 -927 4834 19537 -2226 -4352 24465 11590 -10401 13401 18902 -7374 2748 18966 901
180 901 -320 12741 -338 -959 16302 2992 -6897 13595 7965 -9652 8894 14022 -9341 -730
194 -730 13258 -7799 -7048 13407 -4346 -17205 5698 2628 -15620 -1104 3952 -13442 -4720
207 -4720 4226 -10424 -3506 8932 -10342 -11407 12054 334 -15202 5352 6962 -13422 -1529
220 -1529 7737 -8313 -3395 6394 -9844 -6231 11752 -4477 -13530 8288 3316 -14733 2902
233 2902 10247 -9144 -3063 8838 -5190 -2652 11690 -1881 -6292 11739 3403 -7042 10954
246 10954 10248 -6631 6190 13639 -3612 3273 16878 -1247 -4606 15372 5479 -6786 9558
259 9558 9375 -6940 3776 8941 -3549 3193 9452 -6186 -1012 14548 -1199 -7302 12562 6167
273 6167 -9442 6143 10710 -5661 1172 8581 -4705 -501 10542 -4156 -6031 10236 -355
286 -355 -10551 7240 5992 -10733 387 7057 -7460 -2465 8458 -6186 -6380 8349 -1898
299 -1898 -8652 6846 1533 -10971 2836 4902 -9598 -146 6843 -9661 -6083 8822 -4849
312 -4849 -11482 5782 -375 -12883 299 2526 -10267 -2288 1375 -11259 -3800 5913 -9254 -8912
326 -8912 7418 -3776 -12751 5102 3869 -11276 -553 5395 -7684 -1169 6830 -6063 -3874
339 -3874 8176 -2859 -6862 8928 2698 -8919 4324 6657 -7005 2012 8653 -5332 -1958
352 -1958 10176 -1994 -4017 10197 2524 -6092 7168 6748 -4534 5052 8599 -4760 2658 11753
366 11753 -2210 -2114 12147 2419 -5170 9822 7337 -3923 5380 7810 -3245 4371 9951 -3251
380 -3251 512 11595 -979 -4507 11434 4085 -7258 5761 7178 -5943 2114 7661 -4944
393 -4944 -1088 7982 -3402 -4020 8441 -742 -7266 6312 3354 -7757 2878 5334 -7892 -1097
407 -1097 7186 -5780 -4748 6462 -2945 -8155 4244 -172 -9232 577 905 -9941 -1878 2913
421 2913 -10116 -6070 4096 -7626 -9869 3631 -2330 -11594 -88 -344 -9514 -1689 1362 -9565
435 -9565 -3806 3342 -8298 -6655 5288 -4543 -10649 3130 -142 -10393 -142 2005 -9093 -2804
449 -2804 3303 -7378 -4690 4940 -4719 -7016 5063 -625 -7736 3774 2789 -7457 1972 6517
463 6517 -5583 -835 8405 -2420 -3713 8571 1946 -4310 5923 4244 -3769 5408 7047 -3806
477 -3806 3320 8995 -2215 199 11477 1765 -2722 9656 6014 -1942 7097 8311 -1571 5586
491 5586 9769 -715 3373 11134 487 -938 10296 3210 -3629 7017 5220 -5215 3205 5890
505 5890 -4290 -108 6199 -3910 -2957 6456 -835 -4767 5786 1698 -5530 4396 4673 -5370 1804
520 1804 7143 -4187 -1186 8133 -591 -4206 6236 1448 -4936 3803 2776 -5376 1610 3815 -6371
535 -6371 -1065 5833 -5212 -5433 5168 -1333 -7189 3149 1042 -6768 1379 3551 -5684 -30 5375
550 5375 -4769 -2231 6265 -1713 -4458 5884 759 -6251 3815 3161 -6043 438 4150 -5542 -2797
565 -2797 4780 -3735 -4931 4041 -1657 -5987 3568 849 -6756 2192 3710 -5735 81 6371 -3634
580 -3634 -3360 6112 -737 -4769 4768 1276 -5596 2611 2631 -5404 713 4364 -5583 -2265 5760 -3162
596 -3162 -4609 5092 181 -5644 3895 2803 -4877 2092 5186 -3772 593 7243 -1828 -1269 7818
611 7818 1389 -2464 6714 4002 -3417 4747 6171 -3524 1983 7085 -2251 -866 6672 -651 -3154
626 -3154 5507 953 -4234 4355 3297 -4855 2791 6069 -4083 -519 7138 -1415 -2794 6647 1614
641 1614 -3880 4641 2704 -4006 3025 3839 -4326 608 5172 -3556 -2227 5776 -1300 -4172 5253
656 5253 1250 -4803 3201 3357 -4806 1473 5267 -3613 -1108 5687 -2102 -3585 4943 -45 -4761
671 -4761 3144 1345 -5761 857 2510 -6086 -2440 2996 -5285 -4959 2378 -3884 -6810 1344 -1585
686 -1585 -7858 183 630 -7984 -2452 2738 -6075 -4385 3574 -3633 -6111 2221 -1207 -6519 825
701 825 172 -7058 -827 1324 -7038 -3361 1986 -5801 -5977 2225 -3777 -7417 993 -1204 -7924 -240
717 -240 1504 -6927 -2339 3215 -4759 -3235 3947 -1701 -3936 3737 646 -4381 3768 2834 -4176 2018
733 2018 5339 -3248 -469 6159 -1024 -1822 5682 1380 -2686 4735 3281 -3225 3393 5342 -3120
748 -3120 762 5645 -1350 -1389 5555 173 -3031 4296 1306 -3800 2168 2399 -4554 185 2894 -4856
764 -4856 -2724 3604 -3538 -5234 2813 -1280 -6150 1762 634 -6153 -270 2152 -5472 -2821 2517
779 2517 -3635 -4251 2635 -2274 -5211 2082 -698 -6197 734 1137 -6469 -1736 2690 -5277 -3658 2540
795 2540 -3155 -5190 2066 -848 -5605 1610 1592 -5086 276 3609 -3624 -566 5147 -1579 -1664 4989
811 4989 741 -2444 4895 2692 -2732 3504 4328 -2368 1439 5516 -1702 -492 5537 369 -2134
826 -2134 5181 2334 -2876 3692 3964 -2676 1874 5318 -1471 355 5585 32 -957 5361 1081 -1957
842 -1957 4790 3106 -3045 3285 4627 -2608 449 5473 -1443 -1472 4857 -27 -2550 3765 1791 -3689
858 -3689 2663 3118 -3690 891 4548 -2539 -722 4730 -820 -1949 4534 1155 -2845 4106 2972
873 2972 -3182 2366 4556 -2312 473 5342 -1449 -1376 4758 265 -2663 3784 2092 -3697 2248 3119
889 3119 -3288 350 3960 -2390 -1711 4060 -1716 -2940 3269 -203 -4111 2150 1490 -4755 69 2726
905 2726 -4422 -2114 3117 -2669 -3416 2281 -1448 -5011 1343 -166 -5343 -18 1206 -5143 -2194
920 -2194 1709 -4397 -3433 1948 -2889 -5092 1294 -1311 -5814 357 318 -5642 -1474 1373 -4794 -2788
936 -2788 2104 -3489 -4307 2270 -1409 -5173 1309 475 -4785 75 1581 -4140 -1112 2724 -2701 -2231
952 -2231 3129 -1335 -3309 3040 787 -3817 2043 2521 -3695 311 3996 -2405 -1089 4359 -509
967 -509 -2029 3907 1193 -2497 3054 2754 -2677 2137 3967 -1929 504 4698 -964 -932 4811 730
983 730 -2004 4223 1968 -2440 2870 3921 -2159 1135 4559 -1467 -254 4552 199 -1843 3996
998 3996 1478 -2575 3124 2857 -2574 1408 3928 -1966 -154 3859 -1188 -1747 3753 173 -3019 2679
1014 2679 1493 -3294 1539 2447 -3391 -495 3594 -2588 -1977 3208 -916 -2842 2723 638 -3676
1029 -3676 1136 1585 -3843 -21 2446 -3635 -1820 2430 -2279 -3596 2813 -1273 -4787 1329 220
1044 220 -4914 -88 1929 -4019 -2012 2275 -3037 -2721 2325 -1325 -3823 1919 35 -4388 1066
1059 1066 1450 -3672 -312 2335 -3018 -2138 2701 -1851 -3214 2480 -230 -3896 1419 1321 -3567 144
1075 144 2385 -3058 -1124 3322 -1651 -2188 3093 -232 -2852 2817 1657 -2913 1821 2694 -2713 484
1091 484 3787 -1673 -677 4292 -250 -2061 3295 1262 -2654 2764 2932 -2368 1360 3724 -1442 82
1107 82 4303 -406 -1170 4196 944 -1915 3656 2343 -2341 2296 3667 -2113 632 4420 -882 -739
1123 -739 3863 304 -2040 3118 1344 -2753 2038 2552 -2972 535 3342 -2179 -767 3522 -972
1138 -972 -2115 3107 208 -3054 1563 1400 -3440 890 2134 -2978 -1090 2933 -2034 -2477 2609 -1423
1154 -1423 -3671 1504 -108 -4387 233 817 -4265 -1514 1107 -3444 -2954 1509 -2472 -3741 1004
1169 1004 -1062 -4473 599 128 -4148 -380 1734 -3276 -1551 2189 -2610 -2996 2047 -1194 -3280
1184 -3280 1424 396 -3748 694 1312 -3133 -705 2460 -2258 -1586 2940 -719 -2447 2699 717
1199 717 -3070 1890 2101 -2770 598 3283 -1676 -307 3520 -709 -1356 3383 492 -2208 2561 2111
1215 2111 -2647 1639 3442 -1933 383 3652 -876 -889 3285 246 -1932 3161 1331 -2590 1809
1230 1809 2868 -1886 1210 3447 -1307 -525 3450 -368 -1544 3022 715 -2232 1797 1734 -2861 550
1246 550 2296 -2576 -328 3033 -1253 -1238 3292 267 -2320 2389 1305 -2608 1460 2053 -2446 189
1262 189 2590 -2080 -1362 2571 -1201 -2530 2120 -31 -3309 1272 1221 -3131 174 2025 -2717 -1598
1278 -1598 2244 -1774 -2231 1989 -1154 -3052 1359 22 -3873 241 1049 -3564 -1201 1947 -2964
1293 -2964 -2492 2298 -1357 -3090 1081 -190 -3932 333 249 -3794 -767 1099 -3340 -1823 1817 -2268
1309 -2268 -3051 1656 -729 -3184 1109 745 -3286 514 2057 -2726 -847 2644 -1640 -1986 2212 -270
1325 -270 -2353 1978 611 -2688 1463 1982 -2073 336 3069 -1347 -258 3417 14 -1197 3129
1340 3129 1005 -1871 2697 1864 -2179 1202 3129 -1513 82 3455 -28 -928 3428 778 -1276
1355 -1276 2892 2085 -1479 2080 2773 -1347 1111 3741 -1174 -612 3743 -35 -1412 2870 1505 -1709
1371 -1709 2462 2516 -2087 954 3064 -1117 -46 3518 -281 -826 2830 319 -1717 2297 1246 -2143
1387 -2143 1004 1913 -2290 -43 2739 -1641 -1100 2525 -463 -2148 2446 654 -2547 1238 1744 -2652
1403 -2652 -223 1754 -2069 -1345 2323 -1504 -2332 1837 -114 -2710 931 509 -3315 485 1335 -3068
1419 -3068 -626 1959 -2059 -2061 2073 -872 -2872 1436 198 -2931 315 1081 -2606 -450 1500 -2110
1435 -2110 -1320 2163 -985 -1770 2132 -6 -2775 1507 934 -2650 391 1962 -2118 -635 2476 -872
1451 -872 -1256 2466 -55 -2007 2131 1495 -1671 1510 2431 -1568 588 2817 -799 -545 3192 -126
1467 -126 -975 2975 1055 -1259 2278 2324 -1451 1258 2823 -1246 -97 3162 -107 -1099 3211 1403
1483 1403 -1590 2616 1881 -2002 1662 2398 -1297 182 2812 -708 -825 2835 -105 -1304 2431 1161
1499 1161 -1995 1618 1879 -1729 525 2437 -1381 -673 2563 -652 -1423 2118 328 -1907 1199 804
1515 804 -2452 451 1569 -2053 -892 2053 -1721 -1823 1866 -499 -2616 1200 566 -2645 123 981
1531 981 -2578 -1025 1622 -2411 -1766 1727 -1396 -2725 1378 -314 -2860 353 444 -2946 -386 1061
1547 1061 -2565 -1519 1123 -1682 -2000 1340 -752 -2788 991 319 -2894 -19 1019 -2535 -636
1562 -636 1835 -2071 -1425 1838 -567 -1942 1084 419 -2186 821 1321 -2091 211 2022 -1657 -1002
1578 -1002 2370 -970 -1265 2118 466 -1663 1839 1307 -1270 1299 2251 -1382 261 2727 -682 -713
1594 -713 2640 660 -1213 2529 1478 -1258 1661 2271 -1382 655 2553 -850 177 2871 31
1609 31 -517 2815 526 -1414 2056 1462 -1617 1093 2194 -1299 -146 2550 -645 -870 2191 366
1625 366 -1570 1873 1275 -1665 903 1296 -1919 -51 2394 -1607 -972 2133 -719 -1773 1580 137
1641 137 -2234 581 726 -2458 5 1624 -2039 -1110 1556 -1291 -1627 1213 -491 -2100 1080 447
1657 447 -2554 156 1298 -2232 -1079 1301 -1848 -1655 1168 -914 -2186 1231 -88 -2979 579
1672 579 1073 -2577 -325 1394 -2179 -1095 1302 -1424 -1952 1222 -182 -1890 1148 771 -2134 548
1688 548 1510 -1853 -463 1815 -1389 -1374 2269 -190 -1798 1797 910 -1779 1099 1274 -1730 170
1704 170 2039 -1286 -259 2261 -157 -928 2262 574 -1118 2000 1641 -1079 935 2420 -796 121
1720 121 2453 -298 -740 2493 420 -1332 1689 1439 -1027 1080 2090 -1027 313 2174 -220 -268
1736 -268 2360 211 -870 2250 896 -1244 1319 1449 -1335 646 2237 -1170 143 1948 -396
1751 -396 -1033 2137 130 -1503 1333 859 -1500 167 1278 -1796 -295 1459 -1005 -876 1097 -836
1767 -836 -1746 1016 -12 -2044 255 659 -2058 -56 1420 -1742 -1245 1404 -1310 -1716 1307 -426
1783 -426 -2172 924 390 -2112 -23 881 -1912 -961 1119 -962 -1662 1044 -868 -1983 949 45
1799 45 -2202 163 530 -2045 -315 1136 -1300 -1252 1662 -813 -1685 1628 295 -1897 561 415 -1880
1816 -1880 -233 1358 -1580 -743 1466 -799 -1139 1577 -4 -1596 872 661 -1739 456 1062 -1456
1832 -1456 -103 1869 -789 -828 1839 -86 -1345 1590 658 -1577 858 1371 -1148 362 1964 -921
1848 -921 -346 1663 -429 -805 1684 10 -1268 1149 865 -1237 1109 1689 -1063 121 2088 -486
1864 -486 -477 1939 -11 -1153 1543 916 -1258 968 1602 -1292 224 1698 -1013 -148 2018 -498 -1051
1881 -1051 1211 139 -1955 720 856 -1876 101 1183 -1503 -619 1194 -1015 -1000 1236 -317 -1852
1897 -1852 561 152 -1826 20 597 -1991 -478 1256 -1625 -1236 912 -948 -1804 668 -656 -2287
1913 -2287 169 -132 -2538 -646 317 -1959 -1118 738 -1393 -1702 700 -541 -2178 525 -307 -2161
1929 -2161 -244 437 -1922 -443 576 -1196 -1119 1101 -544 -1571 1100 91 -1689 585 1086 -1133
1945 -1133 465 1523 -673 -237 1665 -290 -903 1443 318 -865 1403 992 -1145 945 1425 -883
1961 -883 568 1977 -217 -449 2199 532 -875 1420 959 -915 1178 1244 -774 332 1883 -361
1977 -361 -29 2276 259 -227 1751 774 -987 1191 1079 -921 517 1137 -961 24 1427 -680 -868
1994 -868 1391 -206 -1268 1257 437 -1221 855 864 -1467 -219 1188 -980 -721 1309 -386 -1216 1074
2011 1074 298 -1322 518 726 -1662 13 1067 -1524 -1020 1016 -1224 -1664 796 -723 -2045 304
2027 304 197 -1715 -266 552 -1643 -588 970 -1016 -895 1303 -506 -1343 822 130 -1537 415
2043 415 798 -1505 -65 995 -1071 -686 1043 -652 -1095 822 -97 -1674 497 811 -1859 165
2059 165 1046 -981 -172 954 -657 -994 948 -279 -1154 1087 612 -946 948 1181 -981 47 1345
2076 1345 -343 -500 1486 257 -696 1296 718 -760 713 1084 -718 908 1596 -470 237 1726
2092 1726 -490 -492 1460 297 -1070 1372 1027 -902 791 1608 -720 54 1524 -612 -281 1745 173
2109 173 -701 1719 791 -672 1011 1270 -987 625 1825 -821 115 1722 -192 -606 1104 -98
2125 -98 -979 917 432 -1228 539 848 -1453 -510 974 -800 -488 989 -233 -1341 905 -98 -1178
2142 -1178 500 817 -1287 -181 1118 -1038 -1000 830 -492 -1187 473 -3 -1457 68 422 -1630
2158 -1630 -393 408 -1274 -741 999 -947 -1332 874 -415 -1546 704 274 -1624 430 234 -1479
2174 -1479 -135 1213 -635 -574 937 -524 -979 492 -106 -1340 356 522 -1152 57 1168 -786
2190 -786 -569 1244 -841 -773 885 -275 -887 954 662 -1275 719 779 -1083 -192 1050 -404 -355 1313
2208 1313 -134 -1014 1006 417 -792 767 709 -862 154 1151 -692 -129 1271 9 -736 1425 481
2225 481 -607 1024 518 -1038 716 1205 -48 445 1600 -17 -441 1427 181 -789 1029 829 -680
2242 -680 820 1024 -745 325 1055 -614 -201 1107 -9 -735 926 98 -1183 675 524 -1201 313
2259 313 792 -811 -376 690 -735 -1086 1038 -605 -1229 551 -152 -1325 22 148 -1207 -441 876
2276 876 -937 -1110 818 -794 -1313 423 -158 -1242 495 544 -1106 -192 783 -1219 -453 603 -1017
2293 -1017 -1208 694 -511 -1421 431 -156 -1717 -18 412 -1028 -554 924 -694 -763 1036 61 -581
2310 -581 729 371 -974 650 1030 -828 756 1137 -674 257 1381 -123 -288 1544 405 -688
2326 -688 973 813 -211 791 1346 -355 48 1537 -79 -43 1562 546 -102 1318 904 -828 962
2343 962 1023 -498 384 1489 -254 229 1561 -77 -139 1209 686 -918 923 781 -826 349 926
2360 926 -315 17 1097 -513 -717 874 -172 -869 644 22 -1075 475 415 -1003 -28 897 -966
2377 -966 -875 823 -438 -1479 354 198 -1393 217 181 -1628 -432 325 -1160 -668 673 -721 -767
2394 -767 635 -252 -1587 500 -191 -1454 134 744 -1151 -775 575 -581 -828 523 -342 -952 545
2411 545 151 -1200 84 549 -1418 -276 536 -1354 -685 589 -707 -1042 659 -441 -1042 275 575
2428 575 -849 234 654 -925 -142 936 -530 -612 947 95 -841 655 57 -975 346 621 -1071
2445 -1071 -204 834 -898 -546 1255 -562 -401 671 281 -683 693 743 -996 580 1343 -659 224
2462 224 1200 83 -546 1004 163 -560 1008 452 -681 552 1026 -749 107 1010 -370 -117 1243
2479 1243 92 -418 955 673 -644 1005 619 -762 86 737 -273 182 1246 98 -660 914 2
2496 2 -743 722 379 -867 59 1018 -977 40 1015 -402 -743 755 -76 -778 815 -53 -1004 462
2514 462 358 -987 38 641 -687 -385 905 -349 -728 878 -143 -917 559 257 -1033 267 445
2531 445 -745 -586 423 -794 -960 446 -406 -877 644 201 -1105 136 273 -918 -158 418 -568
2548 -568 -322 874 -498 -804 833 -244 -1118 525 466 -882 135 908 -1032 -234 951 -248 -542
2565 -542 1048 288 -775 786 839 -1011 709 652 -697 -16 1330 -229 219 1168 -13 -186 974
2582 974 718 -284 957 1032 -377 269 937 -27 215 1250 76 -61 1039 472 -442 761 795 -414
2600 -414 421 1335 -345 702 1216 -137 31 1038 358 -440 667 377 -636 267 949 -590 106 1119
2618 1119 -560 -501 959 -433 -565 609 255 -980 217 416 -1020 127 799 -1042 -99 682 -395
2635 -395 -498 1080 -19 -1069 -91 -51 -962 91 119 -1076 -427 667 -891 -847 524 -793 -1195 346
2653 346 -448 -1265 -165 385 -1506 -672 399 -1061 -425 374 -658 -1131 740 -349 -817 266 -63
2670 -63 -1235 393 550 -767 131 1067 -451 -518 860 -397 -911 633 -14 -742 303 388 -1157 87
2688 87 567 -883 -260 840 -192 -651 909 375 -742 857 329 -407 546 1115 -793 -103 905 -269
2706 -269 17 1072 446 -472 856 639 -340 684 480 -463 279 701 -414 -218 928 -335 -676 950
2724 950 18 -1081 307 262 -785 183 673 -623 -307 707 -252 -479 808 -163 -691 580 358 -1076
2742 -1076 332 605 -449 -248 794 -670 -341 777 -322 -1269 676 -15 -943 138 152 -1036 270
2759 270 457 -890 -216 513 -385 -836 927 -95 -1114 430 -78 -1281 14 491 -948 -630 653
2776 653 -594 -538 477 -440 -860 312 -99 -1031 79 210 -853 -190 477 -717 -574 627 -436 -707
2794 -707 481 -362 -678 586 559 -816 424 439 -959 -151 472 -420 -350 835 -196 -652 553 93
2812 93 -716 288 484 -930 332 905 -736 -228 838 -204 -399 836 110 -608 720 384 -649
2829 -649 360 557 -677 -323 897 -292 -203 622 108 -834 877 521 -694 420 752 -333 244 701
2847 701 -385 -286 810 -46 -407 780 495 -637 434 346 -295 178 1058 -520 -183 1047 -296 -490
2865 -490 720 -129 -632 727 -193 -1126 142 677 -1028 -233 539 -681 -440 739 -385 -761 466
2882 466 -77 -977 -142 133 -980 -109 549 -986 -553 373 -884 -722 377 -503 -858 297 -261 -982
2900 -982 -46 537 -1044 -526 488 -883 -811 533 -63 -919 245 -215 -870 141 210 -1024 53 187
2918 187 -750 -55 389 -566 -844 534 15 -813 188 135 -971 -113 465 -666 -375 836 -589 -254
2936 -254 735 -144 -514 782 169 -659 412 406 -590 190 636 -455 -411 552 -318 -480 662 384 -667
2955 -667 610 837 -194 512 871 -101 18 1029 -128 -482 1019 477 -202 673 643 -309 499 654 -376
2974 -376 159 870 -206 -274 804 -91 -658 364 337 -742 160 471 -756 92 879 -179 -207 883 -446
2993 -446 -371 468 -115 -856 475 500 -701 -130 525 -696 -100 522 -709 -817 428 -578 -809 126 -224
3012 -224 -878 -46 192 -1118 -141 222 -814 -840 233 -581 -938 -4 -163 -806 -44 370 -986 81 263
3031 263 -922 -395 467 -659 -701 325 -464 -924 296 -57 -780 382 314 -458 -446 964 -378 -480 698
3050 698 -267 -486 778 184 -607 515 463 -601 319 963 -339 -199 1001 -246 -174 810 27 -378 715
3069 715 315 -615 654 509 -469 148 836 -375 67 1025 -29 -473 406 522 -797 487 503 -959
3087 -959 155 665 -490 -147 507 -485 -451 651 -26 -1005 327 263 -965 -29 490 -438 -356 538 -483
3106 -483 -566 628 -312 -742 249 -45 -830 255 625 -953 -259 424 -359 -44 523 -255 -716 540 -190
3125 -190 -825 264 295 -740 -82 116 -923 -72 633 -609 -774 432 -365 -752 351 39 -798 430
3143 430 485 -969 -35 583 -1046 -309 397 -363 -614 369 -117 -973 -234 139 -1205 -97 298 -320 -301
3162 -301 680 -445 -856 327 -381 -591 306 -90 -414 -171 700 -606 -383 741 -369 -251 438 29
3180 29 -479 583 -70 -718 761 614 -409 -203 629 -164 -65 668 -116 -158 919 497 -567 266 606
3199 606 -328 839 628 -132 73 1093 -63 -393 867 229 -473 637 390 -523 603 600 -172 433 978
3218 978 -155 -81 780 299 -472 834 12 -447 313 527 -509 152 424 -438 -90 518 -560 -136 746
3237 746 -19 -491 524 349 -599 243 585 -817 -200 626 -423 -492 603 -34 -815 457 -142 -708 325
3256 325 241 -996 130 263 -464 -335 739 -252 -547 454 -316 -661 290 128 -537 -275 428 -736 -522
3275 -522 515 -841 -568 389 -232 -654 546 161 -475 55 274 -586 168 672 -363 -274 568 -248 -717
3294 -717 203 307 -507 184 306 -694 115 353 -394 -184 592 16 -336 727 52 -296 748 468 -358
3313 -358 387 592 -261 220 757 -278 86 796 103 -72 605 359 -526 643 599 -764 587 779 -138
3332 -138 42 891 -174 -308 616 -31 -405 756 668 -103 339 282 -202 16 543 -162 -204 628 -162 -582
3352 -582 131 34 -585 363 401 -496 213 472 -495 -356 364 -159 -387 689 -27 -543 237 67 -342 200
3372 200 505 -581 -304 342 -567 -399 225 53 -736 50 -76 -678 140 55 -648 -219 456 -991 -607 80
3392 80 -337 -634 336 -179 -802 121 -107 -543 -44 584 -334 -449 291 -210 -184 731 -324 -682 211 -37
3412 -37 -850 222 446 -602 -155 405 -374 -440 563 -307 -440 435 211 -664 196 204 -344 34 329 -412
3432 -412 64 422 -282 -132 772 52 -232 408 498 -186 581 703 -181 1 617 -116 -454 734 -456 -732
3452 -732 494 439 -310 393 778 -499 138 715 -132 -173 529 -164 -421 402 172 -229 436 111 -565 369
3472 369 280 -361 -248 22 -486 -456 519 -134 -659 408 110 -564 196 121 -622 -17 32 -471 -529 419 -402
3493 -402 -265 320 235 -749 -80 260 -776 -238 399 -571 99 212 -385 -501 143 -171 -529 81 -67 -933
3513 -933 -5 261 -638 -185 331 -678 -510 277 -293 -376 174 101 -595 102 24 -531 -155 -71 -342 -163 615
3534 615 -348 -453 384 -4 -506 236 38 -407 45 446 -210 -298 440 -489 37 665 -260 -332 463 8 -400
3555 -400 430 45 -278 187 491 -155 -418 719 -204 -206 787 -168 -401 344 343 -455 321 604 -184 271 689
3576 689 159 -318 683 107 -170 504 560 -492 376 578 -79 -28 476 -167 173 546 -138 -311 717 134
3596 134 -584 336 622 -364 401 261 -229 -6 457 -348 -392 572 -36 -580 560 183 -511 530 28 -302
3616 -302 -76 244 -290 -5 691 -479 -716 28 129 -717 158 239 -886 37 674 -794 -266 489 -351
3635 -351 -497 456 -67 -764 371 -228 -1001 -14 345 -643 4 461 -200 -56 347 -535 -505 168 -75 -617
3655 -617 59 182 -429 188 377 -642 -224 454 -263 -489 156 -263 -431 267 115 -376 -79 658 -404
3674 -404 2 583 -79 -152 748 59 -284 342 202 -306 -13 801 -444 -121 613 -224 44 705 311 -148
3694 -148 681 345 29 492 469 -400 413 571 70 -20 699 -78 5 671 49 -389 482 88 -316 396 560
3715 560 -100 -163 636 -118 -96 817 -45 -166 592 -139 -4 359 243 -599 -215 332 -635 -374 419 -90 -398
3736 -398 155 -41 -632 259 -8 -380 76 275 -217 -376 580 -415 -491 502 -6 -633 195 19 -441 133
3756 133 144 -397 -91 391 -862 -40 296 196 -492 189 18 -476 -47 167 -581 -163 405 -440 -132 446
3776 446 -279 -221 148 -217 -247 306 58 -612 182 235 -579 69 584 -154 -100 313 97 -501 185 -26 -323
3797 -323 182 192 -248 186 497 -633 -126 572 -12 -187 610 -142 -62 402 140 -237 361 340 -227 155 840
3818 840 -144 178 632 240 -261 577 147 -290 530 -6 -501 224 403 27 232 600 43 -40 515 117
3838 117 -424 231 322 -363 -319 484 -336 -253 405 -44 -324 357 -406 -350 166 166 -343 309 169 -565 -227 261
3860 261 -461 -327 267 -232 -317 319 111 -740 257 130 -595 -225 366 -491 -240 313 -469 -293 333 54
3880 54 -147 -9 -406 -351 300 -14 -159 -241 200 -273 -346 287 -53 -610 -158 -19 -775 -54 233 -552 -151
3901 -151 251 -250 -187 393 -188 -358 309 -153 -317 151 95 -582 -17 271 -266 -80 632 -134 -270 781
3921 781 196 -97 119 194 -487 255 193 -241 314 344 -188 155 688 -106 -90 803 145 -259 638 488 -409
3942 -409 190 562 -155 9 517 88 344 575 -146 -395 636 398 -89 146 646 -127 -60 525 -42 239
3962 239 810 -59 -455 758 -25 -270 417 241 -459 260 461 -139 -203 472 -178 -401 497 -66 -258 -114
3982 -114 175 -365 201 93 -225 85 529 -364 -260 584 -285 -476 83 223 -225 217 32 -573 -220 231
4002 231 -226 -298 197 -151 -342 182 2 -600 -83 -82 -519 -56 -112 -511 -138 270 -285 -356 286 -15 -183 -112
4024 -112 97 -329 145 411 -214 -356 87 -175 -316 357 29 -272 173 -268 -630 246 178 -551 194 443
4044 443 -76 264 446 -170 -473 182 -147 -36 333 99 -378 93 501 -219 333 346 -200 48 572 -2
4064 -2 4 275 227 -434 255 486 -230 207 412 -160 360 427 -101 -416 342 46 119 300 61 -89 374 166
4086 166 64 294 323 -398 -197 449 -45 -541 459 95 -470 166 493 -207 11 340 -456 158 552 -139
4106 -139 -485 283 -32 -424 271 56 -418 369 23 -662 -261 302 -508 -5 271 -284 -443 244 -120 -615
4126 -615 65 -103 -613 -288 196 -197 -525 214 -286 -184 126 -184 -570 274 461 -256 19 -80 -466 -275
4146 -275 321 -346 -601 363 218 -510 85 448 -374 268 -127 -663 -37 355 -197 -201 442 71 -350 382 26
4167 26 -38 182 300 -140 82 773 -334 -268 615 -132 -382 243 344 -394 509 285 -456 551 513 -479 218
4188 218 534 -80 138 588 -3 -165 381 -238 -18 426 584 -298 4 708 104 46 484 -73 30 182
4208 182 124 -395 268 110 -634 545 454 78 -112 332 -400 73 297 185 2 428 148 -555 496 298
4228 298 -220 233 406 -273 -202 319 -321 -379 471 -107 -254 120 467 -358 -246 124 -393 -457 386 -195 -334
4249 -334 124 -102 -263 128 -172 -494 28 316 -257 -242 398 -173 -391 225 -401 -551 425 -394 -58 111
4269 111 -39 -274 73 509 -77 -1 449 -63 -327 372 -212 -607 539 220 -569 302 360 -466 -144 18
4289 18 -467 -418 815 -8 -212 176 56 -302 337 157 -468 112 184 3 36 474 -28 -241 342 292 -207
4310 -207 385 72 -349 -58 319 -211 174 676 -116 -76 567 -56 -224 404 64 -430 96 40 -330 -29 610
4331 610 56 12 528 -163 -376 316 127 -357 483 263 -143 177 315 -267 -388 283 -357 -341 295 -224 -295
4352 -295 -42 -42 -429 141 328 -486 5 235 -340 -390 494 -205 -659 -145 34 -269 -109 262 -269 133 305
4373 305 -275 -207 353 -387 -682 244 -168 -530 195 27 -337 191 187 -229 26 292 -431 -168 187 -141 -163
4394 -163 -9 -7 -412 -161 195 -378 -83 249 -164 -144 340 -117 -137 280 -83 109 260 68 -256 281 285 -55
4416 -55 75 409 -25 19 602 120 -191 16 327 -158 260 68 -278 -33 685 290 78 444 -76 -97 191
4437 191 354 -199 375 -176 -233 184 76 -27 -239 332 -294 -395 404 -42 -574 488 378 -641 323 96
4457 96 -522 34 663 -101 -448 835 -220 -434 190 55 -74 419 305 -369 -143 234 -352 67 132 -235
4477 -235 -229 99 35 -558 4 161 -394 -88 44 -200 -131 286 -126 -291 324 -52 -644 -17 -84 -71 -55 90
4499 90 -555 -206 370 -708 -149 163 -259 -267 136 -235 -320 143 6 -453 88 193 -537 -89 289 -143 -101
4520 -101 424 97 -310 658 0 -290 105 204 -368 -66 467 -298 63 141 -30 -93 150 127 -171 488 487 -402
4542 -402 19 499 -318 446 467 139 -15 718 -11 -302 116 302 -163 179 245 -141 377 269 -86 215 461
4563 461 141 8 458 14 -374 271 396 6 86 279 -200 5 393 313 -273 371 -140 -272 43 168 -269
4584 -269 316 390 -394 -134 118 -38 -484 196 -122 -377 515 48 -316 203 342 -132 -405 291 -366 -320 410
4605 410 -200 92 232 -17 -568 141 -28 -498 -127 -165 -368 -323 190 -439 -236 337 -136 25 175 88 -511
4626 -511 70 223 -670 3 526 -453 -2 587 -56 -435 -168 205 -442 32 60 -327 -108 71 -124 -134 217
4647 217 -63 -437 360 66 -395 178 253 -203 9 335 -270 240 251 -215 -261 464 -165 -57 494 -141 -562
4668 -562 332 520 -522 206 150 -378 118 388 -197 -24 434 10 -277 -141 347 -238 231 258 68 -185
4688 -185 535 137 16 133 -177 -122 37 275 -271 226 164 136 -70 525 -146 23 82 -37 -118 86 -123 -262
4710 -262 -286 525 63 362 216 -2 -9 426 -52 -203 256 -356 -325 75 112 -496 -170 -82 -243 -12 345 -221
4732 -221 -54 30 -43 -472 333 241 -303 17 174 -591 -282 156 36 -124 132 0 -252 11 162 -512 103
4753 103 -99 -89 129 296 -606 -147 220 -47 -156 47 -56 -275 205 83 -364 104 186 -439 -211 -88 -137
4774 -137 -19 573 -296 -256 -67 -29 -272 136 438 -192 80 327 -165 -373 452 -100 -88 329 -182 -27 217
4795 217 -20 -85 267 245 -106 327 76 -462 44 336 419 -123 167 203 48 359 51 -354 97 572 86
4816 86 40 257 7 -162 255 -23 32 484 83 -144 466 114 12 74 181 65 -67 128 -159 23 346
4837 346 89 -313 116 -208 -185 120 290 -325 -78 251 -162 -63 536 43 -496 210 2 -385 64 81 -636
4858 -636 286 251 158 -160 99 -77 -199 344 -117 -141 -59 301 -367 8 272 -246 -2 227 -32 -285 155
4879 155 -180 -476 213 226 -388 205 278 -205 -183 223 -217 -328 197 -178 -311 64 177 -183 268 209 -15
4900 -15 -140 299 64 -115 141 45 -168 86 197 -89 125 43 160 60 407 -211 137 580 -135 -4 256
4921 256 -254 -36 153 349 -176 348 382 -293 315 380 -54 -389 357 -41 9 166 -122 -266 173 23 127
4942 127 52 375 -158 -152 184 65 -82 225 379 -454 618 188 218 158 162 -274 52 249 104 -372 284 216
4964 216 -340 283 329 -25 -67 147 -340 -15 57 -105 -264 138 -204 -310 272 -49 -475 157 325 -184 -110
4985 -110 225 -305 -60 126 -328 154 355 45 -314 218 -33 -391 -35 195 -28 -210 -107 -368 -265 -77
5005 -77 -173 -266 -80 75 -73 533 -36 119 143 -29 -243 -27 204 63 -134 348 -152 -289 -157 -103 -235 171
5027 171 302 67 260 -125 -271 -16 160 -221 -555 331 132 93 258 181 -14 183 650 -386 193 538
5047 538 117 -59 352 146 67 404 -217 -7 340 188 -19 -4 470 -328 -75 224 -169 143 -229 307 52
5068 52 50 448 -471 -149 317 -362 62 220 -71 -33 226 174 -393 40 -265 -363 261 316 -49 -315 354 -410
5090 -410 -115 5 64 -187 210 -148 -208 307 24 -420 -86 131 44 -71 381 -97 -297 26 6 -217 102
5111 102 -175 -42 -87 430 -97 -331 115 209 -177 -33 -321 132 -39 96 -459 -10 206 -157 -94 198 -342
5132 -342 -272 86 -6 -417 -31 61 -29 307 -17 -342 74 230 -360 -47 187 -272 26 537 -162 63 354
5153 354 150 -100 -114 83 -159 -49 533 -115 108 -54 -106 -160 -53 -133 -89 231 -239 35 24 359 50 162
5175 162 465 -71 -261 345 -105 -212 278 -2 -277 366 16 -232 -36 85 -131 -225 -5 298 -459 185
5195 185 252 -324 229 -11 -30 159 442 -324 51 305 -24 167 -1 -118 -59 -82 260 132 68 36 -275 -142
5217 -142 229 -98 -238 258 -167 -112 146 37 -221 415 215 -175 -155 -105 -149 -93 86 -314 -307 -107 21 -205
5239 -205 88 -95 -523 -13 173 -192 -59 232 -165 -122 261 5 -265 47 -135 -315 133 -33 -310 8
5259 8 289 -35 -203 517 43 -169 94 -146 -365 315 160 88 51 373 -95 -397 203 219 117 21 18 -191 279
5282 279 189 -211 294 59 -173 132 174 -191 -146 366 339 -180 -25 251 -64 31 203 40 163 249 154 -19
5304 -19 323 -62 146 345 63 -130 34 175 -485 54 158 -166 241 303 -29 -234 255 48 -119 -9 -202
5325 -202 -236 -231 219 290 -221 274 -157 -318 175 -68 -458 240 69 -341 174 258 -367 -73 446 -366 5 320
5347 320 -289 -411 133 -197 -385 18 -144 -396 -41 247 -361 80 -164 -29 -167 23 -30 -320 -14 -36 71
5368 71 -172 0 -43 -186 95 -225 -121 213 -306 -246 167 44 -115 192 -108 14 -18 85 23 -108 162 -51
5390 -51 -157 307 25 -226 288 -112 7 68 419 -69 -157 -42 -27 -130 60 -127 38 121 66 -296 147 -110
5412 -110 -252 426 -2 -131 -80 246 -124 117 260 60 -111 50 -299 -263 247 187 -100 314 113 -65 -156
5433 -156 202 232 119 326 34 -213 165 222 -174 26 293 38 129 120 -124 -10 423 176 -325 -377 163 -232
5455 -232 -7 -57 46 334 -110 -208 -156 277 50 -159 143 102 -347 138 -16 -45 -229 127 -241 37 -248 70
5477 70 -2 52 -118 -402 210 -91 81 70 2 -90 18 330 64 -59 -28 11 -314 307 198 -124 -132 198 56
5500 56 -195 -163 -15 -77 207 -64 -183 335 21 -391 -33 225 -341 212 199 -12 -281 486 124 -46 116
5521 116 33 -28 -80 8 -299 -96 168 -95 -223 318 -88 46 175 -113 -16 472 44 -288 413 98 -74 277
5543 277 228 88 -292 318 -3 8 113 -18 -404 178 54 -102 216 -146 -12 -181 -126 159 -108 355 -116
5564 -116 -303 195 -2 -264 2 408 -143 -122 160 -210 112 124 -225 -46 319 146 -339 -58 435 69 181
5585 181 173 -340 62 -27 104 -186 -140 -4 -313 412 23 -440 11 -216 -27 114 274 -141 -30 7 -194 75
5607 75 -200 67 -372 -75 218 -154 -102 182 -45 -145 112 82 26 385 161 -124 -196 7 -186 -4 -24 -116
5629 -116 174 271 -320 -14 152 -210 -205 -92 219 -225 183 24 -104 10 10 -318 193 288 65 -324 341 332 3
5652 3 138 -27 -150 17 47 -250 60 -123 -57 68 136 -200 129 443 52 -151 404 170 -61 227 289 35
5674 35 81 370 -245 8 527 -42 -256 -23 347 -236 20 270 -245 -320 107 -394 -168 265 133 -228 -200
5695 -200 71 125 -187 79 -213 -27 310 -340 217 152 -9 -133 56 -44 -105 177 -63 -92 -3 -276 -426 -206
5717 -206 342 -265 -37 -189 199 -133 -46 258 111 392 -180 -150 11 -39 -370 -262 490 -198 -138 134 -198
5738 -198 -209 -39 208 -199 219 216 -43 -49 -81 -107 -103 -5 -215 -276 156 -34 -386 156 257 -22 221 279 -105 -348
5762 -348 15 -133 -301 637 -62 -314 347 -165 -245 -174 -35 -253 -99 316 -150 238 10 139 -174 584 63
5783 63 -236 366 211 259 -433 270 -42 40 558 -175 -311 143 218 -103 271 105 187 218 380 -268 -52 339
5805 339 -245 1 75 53 -233 154 -146 -106 -145 98 -101 -458 220 -137 -267 73 -48 -273 194 -4 -111
5826 -111 -51 82 -230 3 -263 -83 -544 37 -66 -274 -137 -80 -132 -160 188 -188 -66 186 -257 -81 89
5847 89 -132 -18 247 123 -241 96 84 -253 -21 276 3 -71 315 -148 -44 -75 -189 -151 150 286 -164 -156
5869 -156 -90 -239 -158 -190 -93 184 222 49 23 34 -194 -161 312 164 -96 -208 154 159 387 276 -71 -1 237 138
5893 138 -229 334 232 -146 550 80 -96 203 -35 -209 64 -14 -141 -49 226 -133 150 19 397 -165 225
5914 225 170 132 51 78 -263 -446 71 -263 0 42 95 -50 -27 -32 -141 -144 201 -173 -40 151 -133 -286 345 -203
5938 -203 -27 211 148 -224 151 231 -80 74 54 35 -134 265 -47 -138 134 194 -209 76 150 -118 37 355
5960 355 150 -245 61 110 -356 107 -53 -356 -1 -33 -417 -64 -118 -141 91 215 -75 181 -195 -72 -228
5981 -228 208 214 -166 173 -135 -182 -112 -86 123 -122 -165 -158 -78 36 -109 -238 -54 336 185 121 51 188 -134 74
6005 74 -128 -8 378 -146 40 281 188 -243 107 106 -70 -82 482 -143 -250 354 132 -28 455 -31 -56 44
6027 44 184 -112 66 169 -91 7 41 124 8 181 97 -31 -128 55 10 -329 -100 58 4 199 -326 98 658
6050 658 -43 111 87 174 100 156 234 180 -38 424 -320 80 16 -236 -311 228 138 -348 138 151 -1 -112 467
6073 467 -106 -125 166 -267 -131 -94 -162 -11 66 94 -334 -153 -143 -155 54 348 -171 42 24 124 -51 116 135
6096 135 -116 49 57 -137 -70 -5 -65 -195 277 439 28 -92 72 -161 16 150 -480 -64 -18 160 -93 -16
6118 -16 -143 -170 191 -106 -162 -52 30 -73 397 123 -35 168 328 -193 -114 175 -119 -146 94 -15 -220 -36
6140 -36 -37 -104 286 154 -25 -274 159 -27 -220 -59 -1 177 318 420 19 213 260 -256 -69 -35 23 15 354
6163 354 -2 -85 415 -58 -162 -137 -71 -358 -153 240 -309 321 -15 -464 40 369 182 -263 -3 135 120
6184 120 27 113 -59 5 48 -190 36 70 265 154 176 -54 -240 32 110 -357 82 65 -20 -411 14 12 -196 -47
6208 -47 -430 -371 -170 211 87 398 231 -48 -1 -13 -308 -265 181 -49 -93 270 -159 41 -93 356 -88 -247
6230 -247 27 -25 -225 -143 -134 -281 -146 167 -74 -121 92 -251 -24 57 -11 -58 363 -302 -91 288 59 -75 -164
6253 -164 193 19 224 231 -144 -69 -57 19 -62 394 -89 -90 79 -32 73 -63 4 33 16 147 15 159 89 212
6277 212 -68 159 -169 -201 192 -13 10 314 275 -168 -360 -83 -340 -211 349 -87 65 188 210 -230 2
6298 2 26 -166 -55 192 -170 -111 128 187 -57 359 6 -21 -45 148 -97 152 515 -215 22 98 22 -44 122
6321 122 -401 -6 138 -2 -260 112 198 -71 -86 295 -257 -171 175 -253 -125 339 258 -117 73 -73 -48 213
6343 213 278 -9 -99 70 -73 -269 35 12 -444 429 117 -61 56 33 -31 -37 -268 30 -307 152 -139 -130 12
6366 12 -69 -37 129 318 -435 52 -186 -38 -151 240 -262 -348 196 85 -128 -14 281 178 22 185 -176
6387 -176 -191 126 65 10 141 -350 -48 411 53 -58 182 56 -200 327 247 -202 -115 -131 73 374 295 -157
6409 -157 -290 286 368 -59 -107 80 -132 97 243 -102 -6 151 168 -112 -46 332 64 421 232 -129 -148 -47
6431 -47 44 -259 355 -315 -259 -25 66 -75 -25 -16 -70 180 -109 -267 180 53 -18 -153 202 37 -169 34 194
6454 194 31 28 164 -63 -194 191 -172 -241 -63 75 -94 0 -139 183 -213 169 -140 49 85 -394 75 232
6476 232 -170 -379 -110 156 -376 150 276 -122 -277 56 -298 -156 276 -16 -108 117 271 -228 229 -61
6496 -61 21 360 56 11 156 366 122 160 88 -178 -370 253 320 -46 425 -161 -14 77 -85 -117 -108 200 -85
6519 -85 -164 199 -186 -32 -92 -19 -41 9 -39 -210 254 364 -179 95 5 36 -108 188 141 -131 -77 211 -79 -118
6543 -118 123 304 -75 -25 -89 -142 -24 -23 -174 -273 318 -299 103 141 -113 141 -60 103 193 16 -244 -269 168
6566 168 121 142 -59 137 -156 -314 21 -247 147 181 46 -134 -281 125 -240 -159 -23 -309 -154 57 -7 -173
6588 -173 197 -186 -216 132 -109 -42 -183 -143 -526 105 267 -137 -270 67 -146 19 20 183 -110 13 -221 -306
6610 -306 28 238 -82 -79 106 -347 216 -153 42 -253 295 217 194 338 53 -75 220 -123 -134 202 153 95
6632 95 52 280 -21 -46 223 12 377 171 54 -135 264 359 140 236 84 -72 162 51 20 -18 203 261 -232
6655 -232 256 86 30 -184 159 135 205 118 -125 129 302 48 95 87 144 -315 -19 64 -280 276 41 -258 -189
6678 -189 92 -62 -373 -296 -54 -282 -210 6 62 -195 328 -401 -138 165 -296 -100 192 -5 -74 -45 352 -48
6700 -48 -42 149 -374 -106 -17 -59 -10 132 33 -285 234 -49 -200 -103 -135 -33 -88 161 -167 57 248 151 -61 356
6724 356 61 -97 116 195 42 157 -11 -105 -199 120 213 -101 -28 155 -389 285 222 141 -121 180 -142 -81 173
6747 173 -124 -143 281 170 -63 492 67 106 -99 152 -8 73 289 -99 -262 -71 -98 11 230 16 -150
6768 -150 175 -57 80 24 25 -178 78 86 185 -40 285 173 83 55 288 -123 -129 -346 -276 47 343 -21 -264 124
6792 124 -155 58 333 121 -179 -166 -238 -336 -309 71 20 301 256 84 -132 -7 343 -41 28 21 -32 74 -326
6815 -326 -132 -25 325 395 -89 2 -210 -132 207 -72 -182 -155 522 -239 -41 223 56 100 108 51 -311 -55 82
6838 82 -89 10 95 -547 56 -308 -159 108 322 88 115 372 -337 4 -199 -213 -124 208 -289 -326 -311 276 -246
6861 -246 -16 353 -37 97 155 94 -7 -95 -70 -79 124 -66 -74 -177 182 -239 -234 -138 -240 48 214 -272 -124 -271
6885 -271 239 -163 131 217 -47 -79 269 91 -104 -250 56 335 193 74 -266 304 101 -31 -133 342 195
6906 195 -129 202 279 122 247 386 -30 -123 140 -46 204 176 -85 -239 -66 -80 -193 267 -49 -16 -40 -65
6928 -65 -316 150 114 73 -41 130 -149 -147 -9 -21 -319 151 112 -278 344 160 -218 63 118 -15 -416 -63 -46
6951 -46 -231 -147 321 -138 -54 107 49 34 33 46 -145 165 -161 -164 -60 -2 -73 268 46 -433 -15 241 -118 -106
6975 -106 214 118 -105 156 -142 -417 162 -3 -555 -293 212 -253 122 53 99 -127 133 16 -108 67 -9
6996 -9 87 358 289 -337 -203 67 -209 -187 260 91 -113 159 -164 53 125 63 -63 -189 279 -109 -9 396
7018 396 152 -264 137 254 54 70 69 -175 25 -202 -23 -40 304 104 -91 -171 -6 82 76 297 223 -162 249
7041 249 281 -98 14 -94 8 258 -15 -122 -59 -135 -2 -114 -101 -228 -88 -94 -88 214 190 -72 77 301 34
7064 34 -121 5 61 -62 -67 -15 -184 -182 209 -380 -366 -101 218 -228 188 280 -228 249 -18 -222 219 98 88
7087 88 -261 351 -420 67 142 63 -199 -333 159 -182 158 156 -41 114 311 -136 -242 193 -269 -230 155 268
7109 268 -43 63 -79 136 -5 42 -258 105 197 -236 119 24 44 -33 69 -159 -86 91 158 -303 274 -80
7131 -80 133 108 91 0 -43 27 -138 65 258 43 62 -60 138 -139 249 194 5 -254 114 165 -48 348 -76
7154 -76 -270 15 76 -59 -61 48 -217 -328 -78 -22 -32 142 43 -272 43 125 -50 -56 14 -24 -89 101 -326 -406 271
7179 271 -2 44 136 -27 -265 33 170 -475 -274 155 78 -278 50 372 -160 -7 -16 53 -113 107 -367 178
7201 178 170 137 -180 76 -119 40 -5 104 89 163 31 -93 123 119 -54 -81 -81 -63 -236 9 -340 -65 101 43
7225 43 -118 221 223 -242 61 128 35 -39 343 12 -131 239 134 8 56 -32 -380 -115 83 104 141 75 -24 6
7249 6 364 -2 -305 38 -38 -71 76 74 -131 -19 32 -250 188 180 -27 -157 49 197 169 182 277 -36 18 57 -222
7274 -222 90 -83 208 -152 -147 -23 -199 361 -154 -71 118 161 -150 53 353 -162 44 -92 -452 -95 -55 149
7296 149 202 -47 -207 -115 -263 546 -120 -74 -33 -7 -126 191 108 -307 127 -88 -223 37 257 27 -243 -220
7318 -220 64 -84 63 256 -168 -86 223 -324 -270 10 -145 -336 -33 -14 -278 225 50 -147 356 -75 60
7339 60 -284 82 12 -162 139 -416 70 190 -21 -62 107 -256 -187 -56 205 -341 55 -95 -502 -156 78
7360 78 36 -219 -164 -160 -238 213 -34 85 390 124 -298 -4 177 -563 165 -146 36 34 144 -213 285 381 132
7383 132 125 60 113 -79 -8 34 -62 15 80 166 -196 299 134 -300 256 158 48 98 176 -16 -245 -65 -114 -114 -9
7408 -9 -19 243 142 237 -349 39 212 -7 232 -334 118 -64 -10 -18 -90 -266 -360 225 45 -350 -273 -26 43 115
7432 115 3 -126 -69 18 -4 -49 45 67 -48 -197 -24 -46 -223 374 21 -181 -38 365 100 -206 -117 331 434
7455 434 -37 28 -223 -261 90 -189 -274 -98 -27 86 140 -309 -265 -50 -98 142 -100 324 -25 325 212 -81
7477 -81 -194 29 -34 -9 156 -193 152 178 -66 -101 -4 295 -17 27 208 43 -23 -144 -34 -237 300 124 -124
7500 -124 60 -208 57 -223 181 -88 22 149 74 -165 178 1 -265 154 79 -236 142 375 -40 -190 129
7521 129 35 -379 165 11 -37 276 351 146 -131 -14 -55 -79 270 -176 -78 151 368 12 5 29 -86 -298 -141
7544 -141 58 150 128 193 -176 -165 -39 -8 347 44 -58 70 208 51 -24 51 -319 21 20 -144 -44 161 145
7567 145 -226 21 -47 6 -80 151 -112 -86 52 99 52 28 9 -80 52 49 129 -265 -119 -146 61 171 -196 -173 228
7592 228 -59 -463 110 229 -57 -12 -204 -249 46 196 -82 -258 100 -106 -73 -67 30 -343 11 269 53 -122
7614 -122 20 -215 -456 -18 -98 -205 69 74 -271 243 -75 -84 -70 475 -134 -4 151 -234 143 81 144 79 133
7637 133 -55 165 168 528 -369 -54 422 -83 12 498 -220 -206 -52 -184 163 -75 -110 -195 163 56 -106 72
7659 72 227 111 -172 203 -19 130 286 13 -394 192 292 -403 -113 234 -68 -31 45 100 -301 -41 -13 136
7681 136 38 123 -48 147 -19 -236 -326 -66 33 -92 230 -235 -19 -104 222 53 177 114 56 -210 333 -190
7703 -190 50 -141 -138 -162 59 82 57 156 -194 -139 -343 360 -375 -240 34 -59 116 223 -82 -23 -165 108 -226
7726 -226 -124 82 390 17 198 -8 -168 364 -22 -92 146 -265 -85 275 199 96 24 262 93 -341 61
7747 61 44 108 215 -228 -115 90 -103 70 36 -502 10 -150 12 204 -23 145 -37 29 -58 195 -128 267
7769 267 155 -106 5 -199 -45 -45 -96 -207 -157 -214 364 -126 7 -71 -262 292 -50 -219 56 -3 181 -20
7791 -20 -30 -147 38 -13 98 -92 -110 -1 65 102 141 45 -219 105 -18 49 -27 94 -232 6 476 -57 79
7814 79 182 -302 -19 102 -384 -172 -217 150 104 -194 58 189 -34 174 -175 48 13 -159 203 -263 29
7835 29 65 -72 295 -142 -105 75 -95 291 275 82 -117 153 -199 -47 -163 241 224 -159 -36 -198 361 8
7857 8 -320 -96 9 240 -195 83 -38 136 -38 34 -19 162 233 164 92 -8 -54 -259 -146 72 -17 103 -154
7880 -154 186 -18 191 -67 17 162 -126 128 -238 -84 -139 71 -180 -220 -64 -179 94 -102 306 -3 17
7901 17 220 -338 -134 -5 179 -158 14 -133 -294 411 53 -155 -79 -107 -219 -504 109 -124 18 47 135 -317
7923 -317 286 -131 -166 194 -54 71 -161 -250 10 -100 182 32 -474 55 62 -424 -23 159 -78 -51 -34 -99
7945 -99 -34 -91 -242 -191 90 34 6 115 19 -296 -159 196 22 141 312 -117 163 -104 -60 20 -9 -194 -308
7968 -308 49 236 -308 18 171 1 -177 146 137 -113 114 -54 201 119 26 -227 153 247 -336 106 -120 -43
7990 -43 -56 -12 -53 -224 245 165 -178 -89 224 -311 -333 162 85 152 55 -396 -307 94 44 177 -3 227 -98 26
8014 26 165 -125 -93 107 -129 42 98 -145 -173 188 34 -408 81 -283 102 -306 93 116 -219 151 -85 -192
8036 -192 83 206 -19 80 -325 -51 -88 -84 -71 -196 8 75 72 123 305 -259 177 31 -68 33 151 33 -85
8059 -85 82 203 194 208 -70 128 -301 -114 -300 -125 56 23 -61 148 -35 -91 133 -42 -109 -113 15 -33 94 277
8083 277 -293 -35 8 -68 5 238 -254 -245 -107 251 -177 128 49 -53 61 -66 104 -44 102 -171 -79 277
8105 277 304 -110 141 335 91 53 266 -145 -148 190 204 -200 221 3 83 -324 -345 -107 9 132 -394 -77
8127 -77 -1 101 -27 75 55 -94 38 -148 56 172 115 -57 25 133 3 73 -9 -100 -45 47 101 -243 -1 268
8151 268 197 -2 -89 9 21 -86 47 -121 242 -95 -55 88 126 -189 130 -113 -289 221 242 146 -174 68 -58
8174 -58 2 -197 -31 -59 321 -282 -82 -93 244 -157 -20 -171 -255 -516 -32 5 -254
8191b54
##END NTUPLES=NMR FID
##END=
