##TITLE=1H_3-2021
 CDCl3, 8 sc, 
 1.02.2021
##JCAMPDX= 6.0         $$ Bruker NMR JCAMP-DX V2.0
##DATA TYPE= NMR FID
##DATA CLASS= NTUPLES
##ORIGIN= UXNMR, Bruker Analytische Messtechnik GmbH
##OWNER= root
$$ XWIN-NMR		Version 3.5
$$ Mon Feb  1 10:36:41 2021 Russian Standard Time (UT+4h)  she@DPX200
##.OBSERVE FREQUENCY= 200.1315066352
##.OBSERVE NUCLEUS= ^1H
##.DELAY= (6, 6)
##.ACQUISITION MODE= SIMULTANEOUS
##.ACQUISITION SCHEME= undefined
##.AVERAGES= 8
##.DIGITISER RES= 18
##SPECTROMETER/DATA SYSTEM= spect
##.PULSE SEQUENCE= zg30
##.SOLVENT NAME= CDCl3
##.SHIFT REFERENCE= (INTERNAL, CDCl3, 0, 15.7039)
##AUDIT TRAIL= $$ (NUMBER, WHEN, WHO, WHERE, WHAT)
$$ ##TITLE= Audit trail, XWIN-NMR		Version 3.5
$$ ##JCAMPDX= 5.01
$$ ##ORIGIN= Bruker BioSpin GmbH
$$ ##OWNER= she
$$ F:/spectra/data/she/nmr/H-F/1/audita.txt
$$ ##AUDIT TRAIL=  $$ (NUMBER, WHEN, WHO, WHERE, WHAT)
(   1,<2021-02-01 10:35:24.59 +0400>,<she>,<DPX200>,
      <created by zg, POWCHK disabled, PULCHK disabled
       configuration hash MD5:
       00 E9 B6 7A A2 85 ED C7 34 08 36 98 17 FE 4E 26
       data hash MD5: 16K
       97 E3 06 0C BE 67 BD FF DA 74 78 47 63 49 28 36>)
$$ ##END=
$$ 
$$ hash MD5
$$ 03 01 C1 A1 30 91 B0 F4 39 5D 38 42 E3 B6 D3 A6
##$RELAX= 
##$RELAX= 
##$RELAX= 
##$RELAX= 
##$RELAX= 
##$RELAX= 
$$ Bruker specific parameters
$$ --------------------------
##$DU= <F:/spectra>
##$EXPNO= 1
##$NAME= <H-F>
##$PROCNO= 1
##$TYPE= <nmr>
##$USER= <she>
##$AMP= (0..31)
100 100 100 100 100 100 100 100 100 100 100 100 100 100 100 100 100 100 
100 100 100 100 100 100 100 100 100 100 100 100 100 100 
##$AQSEQ= 0
##$AQ_mod= 1
##$AUNM= <au_zg>
##$AUTOPOS= <>
##$BF1= 200.13
##$BF2= 200.13
##$BF3= 200.13
##$BF4= 200.13
##$BF5= 200.13
##$BF6= 200.13
##$BF7= 200.13
##$BF8= 200.13
##$BYTORDA= 1
##$CFDGTYP= 0
##$CFRGTYP= 5
##$CHEMSTR= <none>
##$CNST= (0..31)
1 1 145 1 1 1 1 1 1 1 1 1 1 1 1 1 1 1 1 1 1 1 1 1 1 1 1 1 1 1 1 1 
##$CPDPRG= <>
##$CPDPRG1= <>
##$CPDPRG2= <>
##$CPDPRG3= <>
##$CPDPRG4= <mlev>
##$CPDPRG5= <mlev>
##$CPDPRG6= <mlev>
##$CPDPRG7= <mlev>
##$CPDPRG8= <mlev>
##$CPDPRGB= <>
##$CPDPRGT= <>
##$D= (0..31)
0 1.2 0 0 0 0 0 0 0 0.06 0 0.03 0 0 0 0 0.0002 0 0 0 0 0 0 0 0 0 0 0 0 
0 0 0 
##$DATE= 1612161324
##$DBL= (0..7)
120 120 120 120 120 120 120 120 
##$DBP= (0..7)
150 150 150 150 150 150 150 150 
##$DBP07= 0
##$DBPNAM0= <>
##$DBPNAM1= <>
##$DBPNAM2= <>
##$DBPNAM3= <>
##$DBPNAM4= <>
##$DBPNAM5= <>
##$DBPNAM6= <>
##$DBPNAM7= <>
##$DBPOAL= (0..7)
0.5 0.5 0.5 0.5 0.5 0.5 0.5 0.5 
##$DBPOFFS= (0..7)
0 0 0 0 0 0 0 0 
##$DE= 6
##$DECBNUC= <off>
##$DECIM= 32
##$DECNUC= <off>
##$DECSTAT= 4
##$DIGMOD= 1
##$DIGTYP= 9
##$DL= (0..7)
0 120 120 120 120 120 120 120 
##$DP= (0..7)
150 150 150 150 150 150 150 150 
##$DP07= 0
##$DPNAME0= <>
##$DPNAME1= <>
##$DPNAME2= <>
##$DPNAME3= <>
##$DPNAME4= <>
##$DPNAME5= <>
##$DPNAME6= <>
##$DPNAME7= <>
##$DPOAL= (0..7)
0.5 0.5 0.5 0.5 0.5 0.5 0.5 0.5 
##$DPOFFS= (0..7)
0 0 0 0 0 0 0 0 
##$DQDMODE= 0
##$DR= 18
##$DS= 0
##$DSLIST= <SSSSSSSSSSSSSSS>
$$ [...]
##$SUBNAM2= <"">
##$SUBNAM3= <"">
##$SUBNAM4= <"">
##$SUBNAM5= <"">
##$SUBNAM6= <"">
##$SUBNAM7= <"">
##$SUBNAM8= <"">
##$SUBNAM9= <"">
##$SW= 16.9725356469052
##$SWIBOX= (0..15)
0 0 2 0 0 0 0 0 0 0 0 0 0 0 0 0 
##$SW_h= 3396.73913043478
##$TD= 16384
##$TD0= 1
##$TE= 0
##$TE2= 300
##$TE3= 300
##$TEG= 300
##$TL= (0..7)
0 120 120 120 120 120 120 120 
##$TP= (0..7)
150 150 150 150 150 150 150 150 
##$TP07= 0
##$TPNAME0= <>
##$TPNAME1= <>
##$TPNAME2= <>
##$TPNAME3= <>
##$TPNAME4= <>
##$TPNAME5= <>
##$TPNAME6= <>
##$TPNAME7= <>
##$TPOAL= (0..7)
0.5 0.5 0.5 0.5 0.5 0.5 0.5 0.5 
##$TPOFFS= (0..7)
0 0 0 0 0 0 0 0 
##$TUNHIN= 0
##$TUNHOUT= 0
##$TUNXOUT= 0
##$USERA1= <user>
##$USERA2= <user>
##$USERA3= <user>
##$USERA4= <user>
##$USERA5= <user>
##$V9= 5
##$VALIST= <valist>
##$VCLIST= <CCCCCCCCCCCCCCC>
##$VD= 0
##$VDLIST= <DDDDDDDDDDDDDDD>
##$VPLIST= <PPPPPPPPPPPPPPP>
##$VTLIST= <TTTTTTTTTTTTTTT>
##$WBST= 1024
##$WBSW= 4
##$XGAIN= (0..3)
0 0 0 0 
##$XL= 0
##$YL= 0
##$YMAX_a= 595185
##$YMIN_a= -558783
##$ZGOPTNS= <>
##$ZL1= 120
##$ZL2= 120
##$ZL3= 120
##$ZL4= 120
##$ABSF1= 10
##$ABSF2= 0
##$ABSG= 5
##$ABSL= 3
##$ALPHA= 0
##$AQORDER= 0
##$ASSFAC= 0
##$ASSFACI= 0
##$ASSFACX= 0
##$ASSWID= 0
##$AUNMP= <proc_1d>
##$AZFE= 0.1
##$AZFW= 0.1
##$BCFW= 1
##$BC_mod= 2
##$BYTORDP= 1
##$COROFFS= 0
##$CY= 11.3945322036743
##$DATMOD= 1
##$DC= 2
##$DFILT= <>
##$DTYPP= 0
##$F1P= 15.9154993809931
##$F2P= -4.1035820241983
##$FCOR= 0.5
##$FTSIZE= 0
##$FT_mod= 4
##$GAMMA= 1
##$GB= 0.15
##$INTBC= 1
##$INTSCL= 1
##$ISEN= 128
##$LB= 0.24
##$LEV0= 0
##$LPBIN= 0
##$MAXI= 10000
##$MC2= 0
##$MEAN= 0
##$ME_mod= 0
##$MI= 1.114404
##$NCOEF= 0
##$NC_proc= 0
##$NLEV= 6
##$NOISF1= 3.799351
##$NOISF2= 2.8
##$NSP= 1
##$NTH_PI= 0
##$NZP= 0
##$OFFSET= 15.70392
##$PC= 1
##$PHC0= -10757.75
##$PHC1= 11.40095
##$PH_mod= 1
##$PKNL= yes
##$PPARMOD= 0
##$PSCAL= 0
##$PSIGN= 0
##$REVERSE= no
##$SF= 200.130013532006
##$SI= 16384
##$SIGF1= 3
##$SIGF2= 2
##$SINO= 400
##$SIOLD= 16384
##$SREGLST= <1H.CDCl3>
##$SSB= 0
##$STSI= 0
##$STSR= 0
##$SW_p= 3612.71676300578
##$SYMM= 0
##$S_DEV= 0
##$TDeff= 0
##$TDoff= 0
##$TI= <>
##$TILT= no
##$TM1= 0
##$TM2= 0
##$TOPLEV= 0
##$USERP1= <user>
##$USERP2= <user>
##$USERP3= <user>
##$USERP4= <user>
##$USERP5= <user>
##$WDW= 1
##$XDIM= 8192
##$YMAX_p= 0
##$YMIN_p= 0
$$ End of Bruker specific parameters
$$ ---------------------------------
##NTUPLES= NMR FID
##VAR_NAME=  TIME,          FID/REAL,        FID/IMAG
##SYMBOL=    X,             R,               I
##VAR_TYPE=  INDEPENDENT,   DEPENDENT,       DEPENDENT
##VAR_FORM=  AFFN,          ASDF,            ASDF
##VAR_DIM=   8192,          8192,            8192
##UNITS=     SECONDS,       ARBITRARY UNITS, ARBITRARY UNITS
##FACTOR=    0.0002944,     1,               1
##FIRST=     0,             0,               0
##LAST=      2.4114304,     0,               0
##MIN=       0,             -558783,         0
##MAX=       2.4114304,     595185,          0
$$ Real data points
##PAGE= N=1
##DATA TABLE= (X++(R..R)), XYDATA
0@%%%%%%jRj6J6j6K4l2M0n6P2q8J04j28J56j85K21k64L12l63M21m86N60o47P43
$$ 0 0 0 0 0 0 0 -1 8 -8 8 -8 16 -16 24 -32 40 -48 56 -72 84 -101 120 -144 168 -195 226 -260 300 -347 396
30C96q47R63j091J233j390J562j752J962k190K436k706L002l326L681m069M494
$$ 396 -451 512 -579 654 -736 826 -926 1036 -1154 1282 -1424 1578 -1748 1933 -2136 2358
46B358m954N456o008O613p282Q023q845R760j0783J1940j3261J4784j6560J8659
$$ 2358 -2596 2860 -3148 3465 -3817 4206 -4639 5121 -5662 6278 -6983 7801 -8759 9900
60I900k1185K4289k8205L3311m0252N0239o5806R3282j54621M94158p1417q82476
$$ 9900 -11285 13004 -15201 18110 -22142 28097 -37709 55573 -99048 395110 323693 -558783
72e58783J153968p59602J14870O28372j010913O13989K44772q07780O69368k86485
$$ -558783 595185 -164417 -49547 578825 -432088 181901 426673 -381107 288261 1776
82A776j51543N40518o25486J77160L36569m46598K04362j1131j58221L31813k18482
$$ 1776 -149767 390751 -234735 -57575 278994 -167604 36758 25627 -132594 199219 -19263
93a9263j84044M43426k89035p80K10509l84608M17929n3857m70409O01121k67318
$$ -19263 -203307 240119 -48916 -49696 160813 -223795 194134 140277 -330132 270989 3671
104C671j85934N06322o61943L90107K81298q41815P44471j91476l79737P09430
$$ 3671 -182263 324059 -337884 52223 333521 -508294 236177 44701 -335036 374394
114C74394p03332K09522N02032q06248M77624Q1196m61315N99736m26095n8528
$$ 374394 -328938 -119416 382616 -423632 53992 135188 -326127 273609 -152486 -211014
124b11014N19711n21203J64089J54022k71991K79412j23775j73582L27020j43541
$$ -211014 308697 -212506 -48417 105605 -166386 113026 -10749 -184331 142689 -852
134h52j20330K17533j82394J11985P8136k82387K62905K1259k44942K70911j59204
$$ -852 -121182 96351 -86043 25942 104078 -178309 84596 105855 -139087 131824 -27380
145b7380k9741L10498m46788K29789J80940m33830M12497k09601j34907M56992
$$ -27380 -57121 253377 -193411 36378 217318 -216512 195985 -13616 -148523 308469
155C08469m91276J29227K90503m65682L51793q1149k76479M99542l72982j6829
$$ 308469 -182807 -53580 236923 -228759 123034 41885 -234594 264948 -108034 -124863
165a24863L24393l63018K24811O763k38623L16359j24135j41922K46129j63791
$$ -124863 199530 -163488 61323 68086 -170537 145822 21687 -120235 125894 -37897
175c7897K7413J19949k27780J70343L4690j94564J62475l8296r4012J79183j78231
$$ -37897 -10484 109465 -118315 52028 86718 -107846 54629 16333 -77679 101504 -76727
186g6727O184K11276k84773J53484M6912k14201K87048j88954n9785K82584k84432
$$ -76727 -70543 140733 -144040 9444 56356 -157845 129203 -59751 -119536 163048 -121384
197a21384J05493J25768k77516K91960j05231j69274L33879k65330N9443J49963
$$ -121384 -15891 109877 -167639 124321 19090 -150184 183695 -81635 -22192 127771
207A27771k65889K26378l5590j74390K35939j28353m4554J69956k00044J03949
$$ 127771 -138118 88260 52670 -121720 114219 -14134 -58688 111268 -88776 15173
217A5173O7984j88225J61807l7909q3052J36035r7889j7981J34438j49877M4205
$$ 15173 83157 -105068 56739 18830 -64222 71813 -26076 -44057 90381 -59496 -15291
228a5291R6862j73606J48776l5700j10604J89736j35980j1723J44715j78983R6710
$$ -15291 81571 -92035 56741 21041 -89563 100173 -35807 -47530 97185 -81798 14912
239A4912N7124j89735K07125q8188q8592K05439j98535P9448Q2568j84735J60897
$$ 14912 72036 -117699 89426 1238 -87354 118085 -80450 -1002 81566 -103169 57728
250E7728l3892j09204J73441j22462q913J34328j77629J09416K1814j30749J48542
$$ 57728 23836 -85368 88073 -34389 -43302 91026 -86603 22813 44627 -86122 62420
261F2420p2508m3071J16167j01000J3372Q6246j30053Q2420K6262j18117J33379
$$ 62420 -10088 -53159 63008 -37992 -24620 61626 -68427 13993 40255 -77862 55517
272E5517o6130l8540J14314j09184K5787P9440j25506Q2192J8855j14569J48456
$$ 55517 -10613 -49153 65161 -44023 -18236 61204 -64302 17890 36745 -77824 70632
283G0632q8785l0497J29869j42109O8739L9447j16136J17034l5597p5523J36196
$$ 70632 -18153 -48650 81219 -60890 7849 47296 -68840 48194 12597 -62926 73270
294G3270j03369P378R2014j41500J08101q152r0407J19142o9432j6514Q4015r3815
$$ 73270 -30099 -22721 69293 -72207 35894 27742 -62665 56477 -12955 -29469 54546 -39269
306c9269L6097N4389j10165Q9887j4503o3480J02100p8978P715O5016q3076L7232
$$ -39269 -3172 51217 -58948 30939 16436 -47044 55056 -23922 -16207 48809 -34267 2965
318B965L4856q0114P3570j4731o2859J06363q1160N905O6046r3693O1387P689
$$ 2965 37821 -42293 31277 16546 -46313 60050 -21110 -15205 50841 -42852 18535 26224
330B6224p2909Q2883l3807m5647R5232q9998K6803N1443j03477Q9334k5621m8371
$$ 26224 -46685 36198 2391 -43256 51976 -38022 -11219 40224 -63253 26081 460 -47911
342d7911Q2847o1722J80N9236p5999M1981K5918p7580Q4033l7296k4537O9949
$$ -47911 34936 -26786 -26606 32630 -43369 -1388 24530 -53050 30983 -6313 -30850 39099
354C9099o3748K2870L1566n5416L6013J5495n5085N8962k5879k7413O9045o9218
$$ 39099 -24649 -1779 29787 -25629 10384 25879 -29206 29756 3877 -23536 45509 -23709
366b3709K2542L3536o1405M4449k636m3503O4325l6011k6664P3994p3962L6350
$$ -23709 -1167 32369 -29036 15413 12777 -30726 33599 -2412 -29076 44918 -29044 7306
378G306K0536o7206P8580l5727k6725O1412m7344Q849L5433o5115N2409L132n8620
$$ 7306 27842 -39364 39216 3489 -23236 38176 -9168 -319 35114 -30001 22408 25540 -33080
391c3080O6919m0781J080L4102n4490K9536J7894m5044K3856Q702l4761M7174
$$ -33080 33839 -6942 -5862 28240 -26250 3286 21180 -23864 -8 8694 -26067 21107
403B1107l8905q805N4059n5254J6530J5650l3581L6117j1922l9212O4416l4199
$$ 21107 -17798 -26603 27456 -27798 -11268 4382 -29199 6918 -5004 -44216 20200 -13999
415a3999j7361M9217o0841N4131o289n3375P0940k9717j0896L6352m3293L2104
$$ -13999 -31360 17857 -42984 11147 4858 -48517 22423 -7294 -18190 18162 -25131 6973
427F973K3453o4907N4647m058k6651M3034m8557K7949K0460m4573J7197J4237
$$ 6973 30426 -34481 20166 16108 -10543 32491 -16066 11883 32343 -12230 4967 19204
439A9204k0186J3440j1562j7133M7582l6435j1506L3717k2343J3123p22k5748
$$ 19204 -982 12458 896 -16237 31345 -5090 -16596 17121 -5222 7901 7179 -18569
451a8569L9400J389m4636N1180k3749M270K8340o5364O1168l703m4548M3991l0692
$$ -18569 20831 22220 -22416 28764 5015 9285 37625 -27739 33429 29726 -14822 29169 -1523
464a523Q840K5473o3655L5316K1727n8263M2713l2853N690L6341o3185K6770J7150
$$ -1523 7317 32790 -30865 4451 26178 -32085 10628 -22225 -16535 19806 -43379 -16609 541
477E41k1206P609n765l216K9514j9548j9697L9983j2134m266L895j0216K0238
$$ 541 -20665 -13056 -18821 -22037 7477 -12071 -31768 8215 -3919 -8185 -4290 -14506 5732
490E732P012l9058K5080J6886l5895L3859l6201J8263L1903o4396L9251L198j9446
$$ 5732 12744 -26314 -1234 15652 -20243 13616 -22585 -4322 27581 -36815 2436 5634 -13812
503a3812L2513m1546J3608M4588o0675K8746J0069k8793N2838n6613J4347M1777
$$ -13812 18701 -22845 -9237 35351 -25324 3422 13491 -15302 37536 -19077 -4730 37047
515C7047m7555J9398m254n138K4822k3706j3263L5156j4283r677Q430o866J7256
$$ 37047 -10508 8890 4636 -502 24320 614 -12649 22507 8224 -1453 6977 111 17367
528A7367o819j5900Q699K4116k8868N904Q680j7546L6885m4614P107L3271m0678
$$ 17367 10548 -5352 3347 27463 -1405 4499 13179 -4367 32518 -12096 -4989 28282 -12396
541a2396J9221r335j4472M0273m0059q011M2580m4765L0096j2373k5258O1617
$$ -12396 6825 -2510 -16982 23291 -16768 -24779 17801 -26964 3132 -9241 -34499 27118
553B7118n1117Q977K3636k6645L0290j7391j2095L6262j6451j0708J9267j5908
$$ 27118 -23999 -15022 8614 -18031 12259 -5132 -17227 19035 2584 -8124 11143 -4765
565d765J7389r094j3430J7250k741o071j0618J6381j2553P703n582j6190L5901
$$ -4765 12624 3530 -9900 7350 4609 -1462 -12080 4301 -8252 -549 -6131 -22321 13580
578A3580k7091L37J7481j9820K1447n036k1917M0878k0883p920L1413m0688M0488
$$ 13580 -13511 -13174 4307 -15513 5934 898 -21019 19859 -1024 -8944 22469 -18219 22269
591B2269j2652k6900M6896l6514J2845Q115k8213L0148j0132k0034K7874j8893
$$ 22269 9617 -17283 29613 -6901 5944 14059 -14154 15994 5862 -14172 13702 -5191
603e191K496J2339k7192K6776j0750n263R960q086R033p620N882o948J0078k988
$$ -5191 -2695 9644 -17548 9228 -1522 -6785 3175 -4911 4122 -3498 2384 -4564 5514 2526
617B526r276J5863j2597L984O563j5300J2343K840k1084K7526j9282j229K5120
$$ 2526 -6750 9113 -3484 500 7063 -8237 4106 6946 -14138 13388 -5894 -7123 17997
630A7997l9380L4053j1314j5072L2924l0761J2112J1097k4192K2040o189j4903
$$ 17997 -21383 12670 1356 -13716 19208 -11553 559 11656 -12536 9504 3315 -11588
642a1588K7843k5417P932J1245k4105K5489j7525J429R486j0593O507n394L575
$$ -11588 16255 -9162 -1230 10015 -14090 11399 -6126 -4697 4789 -5804 703 -4691 -1116
655a116N5M48m653M621L113l644j698N216k432J528L260j5366K4878j6517j780
$$ -1116 -1061 -613 -5266 -645 2468 -1176 -2874 2342 -90 1438 4698 -10668 14210 -2307 -4087
670d087J6186k4561K7120j6057q807K4575j9525M344P619j8171K1366o402j8938
$$ -4087 12099 -12462 14658 -1399 -10206 14369 -5156 -812 6807 -11364 10002 3600 -15338
683a5338K9881k1801R477L238j9216K7766j6353j317O663m626O240m127o160R072
$$ -15338 14543 -7258 2219 5457 -13759 14007 -2346 -3663 3000 -1626 4614 487 -5673 3399
697C399J751r143M524l028Q049o961j680K384K332L730j6587J6717p543K694K102
$$ 3399 5150 -3993 531 -2497 5552 -1409 -3089 -705 1627 5357 -11230 5487 -2056 638 2740
712B740j5780K2245q954q039J0367o439M049M928k0749K0420j78j7010K0096k0497
$$ 2740 -13040 9205 251 -7788 2579 -3860 189 5117 -15632 4788 4610 -12400 7696 -12801
726a2801J7240K27k0163K0696o926J74J735p178Q847M821j4901Q638J864j679
$$ -12801 4439 4666 -15497 5199 -1727 -1553 182 -6996 1851 6672 -8229 409 2273 594
740E94M766j3104J4395k727j782k941J812Q373r999M556n955R479j077j0729P568
$$ 594 5360 -7744 6651 3924 2142 -799 1013 9386 -613 3943 -2012 7467 6390 -4339 3229
755C229J002k065M6m769K515J0963k0194J0935R42o927J3715k2029J5518K714
$$ 3229 4231 2166 2212 -2557 -42 10921 -9273 1662 2604 -4323 9392 -12637 2881 5595
769E595j1485P396m295K981M951j0675K872J0538j2307P479o350K936P928j4378
$$ 5595 -5890 1506 -2789 192 5143 -5532 -2660 7878 -4429 3050 -3300 -364 7564 -6814
783f814P851k716M429l815l203M300j383J821p192N832l50m48l647K440P7K755
$$ -6814 1037 -1679 2750 -1065 -4268 32 -1351 470 -6722 -890 -1240 -1688 -5335 -2895 -2818 -63
799f3l474l883J2849j2283Q378l989j356J2137j4297P273J611k312L864k537k893
$$ -63 -3537 -7420 5429 -6854 1524 -2465 -3821 8316 -5981 1292 2903 591 4455 1918 -975
814i75J0100p895r56Q506j1196J2492j0617J573O280q930N779n299L277j256o63
$$ -975 9125 1230 274 8780 -2416 10076 -541 1032 7312 -1618 4161 -1138 2139 883 220
829B20k265K369j055j440J412k426M729n619N035m430M597o46m488R584r630Q122
$$ 220 -2045 324 -731 -2171 -759 -3185 1544 -4075 960 -3470 1127 481 -4007 5577 -4053 4069
845D069l884j232O310o810K819J043l162J011J509p204R946r648J887N232j1159
$$ 4069 185 -1047 5263 -1547 1272 2315 -847 164 1673 -5531 4415 -5233 -3346 1886 -9273
860i273J1631j0291M354K708n943M515j569J460K5O16j591O470n645L734j124
$$ -9273 2358 -7933 -3579 -871 -6814 -2299 -3868 -2408 -2383 -1767 -3358 3112 -2533 1201 77
875G7N67M138p254P873n157N281l788k023P417p902M842m476J560L466l585k739
$$ 77 644 4782 -2472 5401 244 5525 1737 -286 7131 -771 4071 -405 1155 4621 1036 -1703
891a703N669k936l20J581p250J3408j0988K240L835o851R971j0741L841L314k844
$$ -1703 3966 1030 710 2291 -4959 8449 -2539 -299 3536 -3315 6656 -4085 -244 3070 226
906B26Lp62n24M233m224l446Q303o395O072o731K945N203p845N711p077Q793k704
$$ 226 229 -533 -1057 3176 -1048 -4494 3809 -2586 3486 -3245 -300 4903 -2942 2769 -4308 4485 1781
923A781m796M297k238L362l289l240M200R10p516O213o270O319j80j0506J3930
$$ 1781 -3015 1282 -956 2406 -883 -4123 77 987 -6529 -316 -6586 -267 -447 -10953 2977
938B977q672M667j894m046J1815p607M34K774P85J622m39n542R255l504k972M914
$$ 2977 -5695 -1028 -2922 -6968 4847 -2760 -2326 448 1233 2855 2416 -3126 6129 2625 -347 4567
954D567p075J1553j0792J490L012l956M639q962N918k58j742n72m85K104K522
$$ 4567 -2508 9045 -1747 -257 2755 -1201 3438 -5524 394 136 -1606 -2178 -2663 -559 1963
969A963o326L042M730n278Q168j0724Q531K067r648J0418q641P821k749n941O874
$$ 1963 -4363 -1321 3409 -1869 6299 -4425 4106 6173 -3475 6943 -1698 6123 3374 -2567 4307
984D307k081j042K78l951L437K439j0066R552n686K527K716j0281J2206q263L988
$$ 4307 2226 1184 1462 -2489 948 3387 -6679 2873 -2813 -286 2430 -7851 4355 -3908 80
999H0j502j363N888n441P73P95J055N05j330l073Q071p841K997N11n075J1259
$$ 80 -1422 -2785 3103 -2338 -1565 -770 285 790 -540 -3613 4458 -3383 -386 125 -4950 6309
1015F309j3123P764J84o040Q693r352N880J279m247L062O81l851P490q274L066
$$ 6309 -6814 950 1134 -4906 3787 -5565 315 1594 -2653 409 1090 -2761 4729 -3545 -479
1030d79N166r901J0710r876N451J444p222P917o642M697j600k204L305r14p86
$$ -479 4687 -5214 5496 -4380 1071 2515 -4707 3210 -3432 1265 -335 -2539 766 -148 -934
1045i34K405k809K519J576o068R575q999O443q54o024J0704j1112P708k325l975
$$ -934 1471 -1338 1181 2757 -3311 6264 -2735 3708 2854 -3170 7534 -3578 4130 1805 -2170
1060b170O926o371J393K804n388L633Q71o987J0133r449M579K658r350J1947r212
$$ -2170 4756 -1615 -222 2582 -2806 827 1698 -5289 4844 -4605 -26 2632 -6718 5229 -3983
1075c983M807J9m087O476n021J612R05j618J357M01m089O449n973K659P67n707
$$ -3983 824 843 -3244 3232 -1789 -177 728 -890 467 868 -3221 3228 -2745 -86 681 -5026
1091e026J0216j1003O510j020l645P549r147O192p9k874L188k684J61N840p613
$$ -5026 5190 -5813 697 -323 -3968 3581 -5566 626 547 -2327 861 -1823 -1662 4178 -3435
1106c435L781K876o879R684j1663P120J483p396Q268o384M349J33m868M339j75
$$ -3435 346 3222 -3657 6027 -5636 1484 2967 -4429 3839 -2545 1804 1937 -2931 1408 1233
1121A233j698K460m166K590L382p534P807o142N277j587m996Q891p401N155l464
$$ 1233 -465 1995 -2171 419 3801 -3733 4074 -2068 3209 1622 -3374 5517 -1884 3271 -193
1136a93j109N926n464L42J728j360K050j437l990Q590q088L438L71n379J1160
$$ -193 -1302 4624 -840 -498 1230 -130 1920 483 -3507 5083 -3005 433 804 -4575 6585
1151F585j2392N710Q90l385N358o674K857L040l685l0J970k817N890o909J901
$$ 6585 -5807 -97 793 -2592 2766 -3908 -1051 1989 -1696 -1726 244 -2573 3317 -3592 -1691
1166a691M380o362O801p940O103K06n002M799m612N458k864j985K912K13j694
$$ -1691 2689 -3673 3128 -4812 1291 1497 -3505 1294 -3318 2140 -724 -2709 203 416 -1278
1181a278J522l049L796R03p042Q792o490N189j452n235R782p326L586j090j334
$$ -1278 244 -2805 991 1894 -5148 3644 -2846 2343 891 -4344 5438 -1888 1698 608 -726
1196g26M564k973j935M342k231j2J751n687Q868o530J158J932m325O712p613L922
$$ -726 3838 865 -1070 3272 1041 1029 2780 -2907 5961 -569 589 2521 -1804 4908 -2705 1217
1212A217J81j359J354k908K468M89k183k46K264k938L619m659L323J051n158O504
$$ 1217 1398 39 1393 -1515 953 1442 -741 -987 1277 -1661 1958 -2701 622 1673 -3485 3019
1228C019p317O136q63l749M862m172K507m08j907J452J809m599M757l739J328
$$ 3019 -4298 1838 975 -2774 2088 -2084 423 15 -1892 -440 1369 -3230 1527 -2212 -884
1243h84K829p213P957n875K508L11l247N039m112K255o30L97L53J17j365K676
$$ -884 1945 -5268 2689 -3186 -678 -367 -3614 1425 -2687 -432 -1062 -665 -312 -195 -1560 1116
1259A116j502k72K819m308O122n765L520L18l768O111o114M470j434r76K060j447
$$ 1116 -386 -658 2161 -2147 3975 -1790 1730 2048 -1720 4391 -1723 2747 1313 337 2397 950
1275I50n37J753k085M43K488n692O448n069J790J910n378O710n479K455k36j141
$$ 950 413 2166 81 524 3012 -2680 3768 -1301 489 2399 -2979 3731 -1748 707 471 -670
1291f70J890j786K60P96P7j832K619l564M633l769J55K866m059M958o295M375
$$ -670 1220 -566 -306 490 567 -1265 1354 -2210 2423 -1346 -1191 1675 -2384 2574 -3721 654
1307F54k98k049K143l128L191q79j405P4K114k904K950l146J671K877o326O084
$$ 654 356 -1693 450 -2678 513 -366 -1771 -1697 417 -2487 463 -2683 -1012 1865 -4461 1623
1323A623m360L580m61m057N399k759J585j312N3J760P84l309K517K55j213K390
$$ 1623 -2737 843 382 -3675 1724 -1035 550 -762 -709 1051 1835 -1474 1043 1298 85 2475
1339B475n191O368l291M02Lj902N100m962J640m94Q61kk120O66K176j583j465
$$ 2475 -2716 3652 361 763 766 -1136 3964 -998 642 148 1009 1007 -1113 -447 1729 146 -1319
1356a319K280k379N201n977J569L056l841M204n939M302R24l683J698n91J140
$$ -1319 961 -1418 3783 -2194 -625 2431 -1410 2794 -3145 1157 2081 -1602 96 -495 645
1371F45r7k073K22L997n232L179k806J475L035p269O266l359L038j747k164L307
$$ 645 548 -1525 -1303 2694 -2538 641 -2165 -690 2345 -4924 1342 -2017 1021 -726 -2890 417
1387D17j225O81j587J490Q57L41l297L593j043N49N58m862P942n614J633K7j574
$$ 417 -808 -127 -1714 -224 633 974 -2323 1270 227 776 1334 -3528 4414 -1200 433 460 -1114
1404a114N026n930K285Q48l12n23L38q82K894l532l48L684m099N316n912J784
$$ -1114 3912 -2018 267 1115 803 280 618 -264 2630 -902 -1250 2434 -1665 3651 -2261 -477
1420d77L665m621K690l622L691J76k315M53O49l17l25q26MK837m203L386l057
$$ -477 3188 -1433 1257 -2365 1326 1502 -813 -360 289 -28 -353 -1179 -1175 1662 -2541 845 -2212
1437b212K761M40m561N687m422L434j376j903L322k046n71J219O79l72O24m218
$$ -2212 549 989 -3572 2115 -2307 1127 -249 -2152 1170 -876 -1447 -228 451 79 703 -3515
1453c515N032l163J352J863n079O744n818K152R82j549J932k873K364M62q68m15
$$ -3515 1517 -1646 -294 1569 -3510 3234 -2584 -432 550 -999 933 -1940 424 886 18 -397
1469c97J268j539L087k624q57K930l754M553m699L229K54k967L587m024M183j475
$$ -397 871 -668 2419 -205 -1062 1868 -1886 2667 -2032 1197 1451 -1516 2071 -1953 2230 755
1485G55j381J575k79r17J589k207J369J949n058N534m484K595N74m157N644m458
$$ 755 -626 949 670 -247 1342 -865 504 2453 -2605 2929 -1555 1040 1614 -2543 3101 -1357
1501a357K633o13j534K328j449p72J807j046m31K039l926M707l427O74J804m083
$$ -1357 1276 663 -871 1457 8 -764 1043 -3 -434 1605 -2321 2386 -1041 -367 1437 -2646
1517b646M996m512K914m26j335K351k687J553L56j153M20Q01k287L742l700K192
$$ -2646 2350 -2162 752 326 -1009 1342 -1345 208 564 -589 -169 632 -1655 2087 -1613 579
1533E79J003m583N624n196K814M90k973M196l953J873N25j334J378n30j981L255
$$ 579 1582 -3001 2623 -2573 241 731 -2242 1954 -1999 -126 399 -935 443 -87 -2068 1187
1549A187k277j83K509m619N566m217J486J607l089L963m133L100o67j112J165
$$ 1187 -1090 -1273 1236 -3383 2183 -2034 -548 1059 -2030 1933 -2200 900 233 -879 286
1564B86l47m76J620j273k50K074l575M343l425J337J414m091M679m067L171q68
$$ 286 -61 -537 1083 -190 -440 1634 -1941 2402 -1023 314 1728 -2363 2316 -1751 1420 552
1580E52j265K284j508o32K41k48O18J994m051M115l481J756R68l963M987l816
$$ 552 -713 1571 63 -569 -328 -576 42 2036 -2015 2100 -1381 375 1343 -2620 2367 -1449
1596a449K289n22j986L164j574M95J08o35N61m29r19K381k376o15K604l030M945
$$ -1449 840 318 -1668 1496 -78 417 525 -110 451 22 -897 1484 -892 -1507 1097 -1933 3012
1613C012n478K403K46k250L622m234K439N80r39J35J537j920K228j691k11K346
$$ 3012 -2466 -63 183 -2067 1555 -2679 -240 340 -599 -464 1073 -847 1381 -310 -521 1825
1629A825n173N548l722K667j47l297M238k661K303j099q97J947n36j114J244m26
$$ 1825 -3348 2200 -1522 1145 998 -2299 1939 -722 1581 482 -415 1532 996 -118 1126 700
1645G00l52J374l401M187k946J120M99k736L840l895K396l72j599K354j961P40
$$ 700 348 1722 -1679 2508 -438 682 1181 -1555 2285 -1610 786 414 -1185 1169 -792 -52
1661e2P81j228J27J303k836L899l398O50J662l632M975l985J475J83j397K069
$$ -52 729 -499 -372 931 -1905 1994 -1404 -754 908 -2724 2251 -1734 -259 -76 -1473 596
1677E96j694Q13j09j01n44J386k622L176k148l8K045l859M673l760J911N10k314
$$ 596 -1098 -285 -394 -495 -1039 347 -2275 901 -1247 -1285 760 -3099 1574 -2186 -275 235 -2079
1694b079L142l034K064%l77L21M49r24J736j449J27K009l295L860l139J670P00
$$ -2079 1063 -1971 93 93 -284 37 486 -438 1298 -151 -24 1985 -1310 2550 -589 1081 1781
1711A781k796L311l098K264m43j097R69l64m33R05q95n1J804l571L415k431J244
$$ 1781 -1015 2296 -802 1462 1019 -78 891 527 94 999 104 53 1857 -1714 1701 -730 514
1728E14P04l368M280l056J474k43q24J688j314l7M51J2o55J184k626L190j952
$$ 514 1218 -2150 2130 -926 548 305 -519 1169 -145 -182 269 281 -374 810 -1816 1374 -578
1745e78k10J473k703L980m048J853K45j242J716k341J668j75l85j96J306j519
$$ -578 -788 685 -2018 1962 -2086 -233 12 -1230 486 -1855 -187 -362 -747 -943 363 -1156
1761a156J913j704j2K738l687L563k955K102L67k407K497j910J684p28l25L66
$$ -1156 757 -947 -959 1779 -1908 1655 -1300 802 1169 -1238 1259 -651 1033 305 -20 346
1777C46Q29j799J069k29j64J706l762L667k291J240q6j973L358k816J039n24o
$$ 346 1175 -624 445 216 52 1758 -2004 1663 -628 612 526 -1447 1911 -905 134 -390 -396
1794c96J183j313n9N55J20j286J440k288L486k840K48J694k128L403l749K047
$$ -396 787 -526 -585 -30 90 -1196 244 -2044 1442 -1398 -1150 544 -1584 1819 -1930 117
1810A17j24n89R12j007R32N94o35j411K099k250K083j232J85K262l773L326l049
$$ 117 -7 -596 316 -691 241 835 200 -1211 888 -1362 721 -511 -326 1936 -1837 1489 -1560
1827a560K066n21j754K603j072L73o74P51K5R38j540J332m12L45R70l448M713
$$ -1560 506 -15 -1769 834 -238 135 -539 212 237 1175 -365 967 555 900 1870 -1578 3135
1844C135k517R37k56k123K236j974O92n67J137l34j93j358J734q19q70J953l100
$$ 3135 618 1555 1299 -824 1412 -562 130 -437 700 366 173 -1185 549 -270 -1140 813 -2287
1861b287L981k875K54K019k086J992k103J277J46J47k44J7j19J94m48j126K831
$$ -2287 1694 -1181 -927 1092 -994 998 -1105 172 318 465 221 238 119 313 -135 -1261 1570
1878A570k763J469j879Q47J635k704K955k670J972j89j145J559n99J15J00K09
$$ 1570 -1193 276 -1603 -756 879 -1825 1130 -1540 432 243 -902 657 58 173 273 482
1894D82p17J651k815K564q32n02J175k594L160k364O67K72j220K177j464N5J76
$$ 482 -235 1416 -1399 1165 333 -169 1006 -1588 1572 -792 -125 147 -1073 1104 -360 -305 -129
1911a29N83p55P11j234J596m97n42J606l121L664k836Q93M83j208J802k532J831
$$ -129 454 -301 410 -824 772 275 -267 1339 -1782 1882 -954 -61 422 -786 1016 -1516 315
1928C15n00k63j73R68j162O61l91o46K033k574K799j937P87J074k331K685k017
$$ 315 -185 -448 -621 347 -815 -154 -545 -1191 842 -1732 1067 -870 -83 991 -1340 1345 -672
1945f72R91k86k60O31j9j96K78K47j215J845k292K265j410k8J329k405K872k408
$$ -672 319 33 -227 404 385 189 467 714 -501 1344 -948 1317 -93 -121 1208 -1197 1675 -733
1963g33J534m12m82J192r06L40K9o1n11J341k104J898j356PJ487k857L113k552
$$ -733 801 389 -93 1099 193 533 562 501 -10 1331 -773 1125 -231 -224 1263 -1594 1519 -1033
1981a033J355j94q83J421j393J143n93J08l83R39j388J597p43n24J696k806L069
$$ -1033 322 128 -755 666 -727 416 -177 -69 -452 487 -901 696 -47 -571 1125 -1681 1388
1998A388k226P31M58j786J908j839J183m63J85k70K69k90Q04o39n43J993k434
$$ 1388 -838 -107 351 -1435 473 -1366 -183 -646 -461 -731 -462 -752 52 -587 -1130 863 -1571
2015a571K495k066P37J402k325K535k358J856l10r26J061r6j7o3j73m83J815k710
$$ -1571 924 -1142 -405 997 -1328 1207 -1151 705 395 -531 530 434 417 354 181 -302 1513 -1197
2033a197K581j875O29J175k943L091k599J414l32p10J036o71J1J21K60p11J451
$$ -1197 1384 -491 138 1313 -1630 1461 -1138 276 -56 -766 270 -401 -390 -269 -9 -720 731
2050G31j869J943r06m09J510k268L047k596J179K19r18J511j681J273l16k0o88
$$ 731 -1138 805 -101 -510 1000 -1268 1779 -817 362 581 -337 1174 -507 766 450 430 -258
2067b58R76j237J237r49m35J858k714K794k541J245O93j552J740j738J225k69
$$ -258 718 -519 718 -231 -666 1192 -1522 1272 -1269 -24 669 -883 857 -881 344 75
2083G5m21L78O56q62N52m46L7J593k739K795j867P16M57k015K679k499J348n93
$$ 75 -346 32 688 -174 378 -68 -31 1562 -1177 1618 -249 467 924 -1091 1588 -911 437 -156
2101a56j43O55q96J02K7J37n95J208j932K197j636J26J469k395K902k551J643
$$ -156 -299 356 -540 -438 -411 -274 -869 339 -1593 604 -1032 -906 563 -1832 1070 -1481 162
2118A62k14o63R69j052J014l62J27m44J268j569J499r09k48J609k376K458k130
$$ 162 -52 -715 254 -798 216 -146 -19 -463 805 -764 735 -174 -422 1187 -1189 1269 -861
2135h61J104J53j171J751j507R24o23L29m65N69r39R51p2q17J313k064K652j916
$$ -861 243 396 -775 976 -531 393 -230 99 -366 203 -736 215 143 -674 639 -1425 1227 -689
2153f89J212L52j705K405j962J124m57m14N76k36j3K66j31n58J694k339J984j467
$$ -689 523 875 -830 1575 -387 737 280 -134 442 206 193 459 328 -230 1464 -875 1109 -358
2171c58K07P19j883K259k077J460l19n33M25j58P0j40L85o48J217j675J893r80
$$ -358 -151 568 -1315 944 -1133 327 8 -525 -100 -258 -188 -328 57 -591 626 -1049 844 -136
2189a36J88P99j667K571k311J212k86n21J087j130O41o5K27r85J025j229J552
$$ -136 52 851 -816 1755 -556 656 370 -151 936 -194 447 382 609 -376 649 -580 972
2206I72j165m84J752k524K639k533J200L81j430J523j087J104p56N05n72P61p65
$$ 972 -193 -677 1075 -1449 1190 -1343 -143 238 -1192 331 -756 348 -408 97 -475 286 -479
2223d79Q25l26l88J542k235K194j883P45M73j392J632j415J188r06N6L66l0o10
$$ -479 346 20 -368 1174 -1061 1133 -750 -5 468 -924 708 -707 481 -425 -369 -3 -33 -643
2241f43J00N25q65J240j846K165j143J20R02j464K095j841J200k17j93O73o41
$$ -643 -543 -18 -883 357 -1489 676 -467 -347 555 -909 1186 -655 545 328 135 808 167
2258A67q9O22K3r55J510j696J296j132j31J521j924K002j737J009J11j054J044
$$ 167 78 700 723 -232 1278 -418 878 -254 -385 1136 -788 1214 -523 486 597 -457 587
2275E87r84R22l51K75o62J064j062P47o76k63J565k231J900j683J021j31j300
$$ 587 -397 525 174 449 -213 851 -211 536 -140 -403 1162 -1069 831 -852 169 38 -1262
2292a262J611j368Q66l74K82m65P37o85P43m0o20J308k031K247j182K22N63j065
$$ -1262 349 -1019 -153 -527 -245 -710 27 -658 85 45 -575 733 -1298 949 -233 -11 552 -513
2310e13J417j475R22l93J98m57J40j84K60L19j149J802j919J774j139L12J138
$$ -513 904 -571 351 -42 156 -301 -161 -345 -85 234 -915 887 -1032 742 -397 -85 1053
2327A053j593J806j644J285j69n07Q18p62L82q9K56q54J267j528J073o34n34J424
$$ 1053 -540 1266 -378 907 738 231 1049 287 669 580 836 -18 1249 -279 794 160 -374 1050
2345A050j864J634j385Q86k02o66J037p17M07l37J50n28J007j020O42k56o46J497
$$ 1050 -814 820 -565 321 119 -547 490 -227 180 -157 -7 -535 472 -548 94 -162 -808 689
2363F89k252K103j502L00N07p45R75j227P86m12K52k45M43k77N14K13r48J493
$$ 689 -1563 540 -962 -662 -155 -900 75 -1152 -366 -778 -526 -771 -328 -605 -91 122 -826 667
2381F67j808J995j142j0R32j266J730j456P75m10J31k24J13l45J89M87r00J435
$$ 667 -1141 854 -288 -298 634 -632 1098 -358 417 7 138 -86 27 -318 -129 358 -542 893
2399H93j656J470p58m4J067j492K028j686R82k37lN17m91K45j99O5o95J184j265
$$ 893 -763 707 -51 -95 972 -520 1508 -178 804 567 564 1081 590 835 636 701 6 1190 -75
2418g5J097o56l98J243j883J302j062M11k17n09R47q51N99k54K24l41O23q64P82
$$ -75 1022 366 -32 1211 -672 630 -432 -21 -238 -747 200 -651 -52 -306 -82 -423 200 -664 118
2437A18r1k77P43j449J855j320N24q6o26J214j164O64l81N70m04m0k71N03K6p44
$$ 118 27 -250 493 -956 899 -421 103 17 -609 605 -559 105 -276 294 -110 -150 -421 82 108 -636
2457f36J274j635J201j023J34R88j666J822j080P10m05l8K82K99l11j07M20p58
$$ -636 638 -997 204 -819 -685 303 -1363 459 -621 89 -316 -354 -72 227 -84 -191 229 -529
2475e29J703j602J184m94j44P51j555J650j131P63n17j50L18k78N0k52N82q67
$$ -529 1174 -428 756 262 118 869 -686 964 -167 596 79 -71 247 -31 19 -233 349 -518
2493e18J129j325J041k61n97J012j385J840j542O67M20p49Q71o84J36K83j07m56
$$ -518 611 -714 327 66 -531 481 -904 936 -606 61 481 -268 603 -81 55 338 231 -225
2511b25O18l42L82j06n29J091j753J599q79K86K71r97J337j106M76L6q4l69K18
$$ -225 393 51 433 327 -202 889 -864 735 -144 142 413 -584 753 -353 123 159 75 -294 -76
2530g6l04L62j91o02J333j646J619r01L05N79j328J362j154P44k86L04J66J63
$$ -76 -380 -18 -209 -811 522 -1124 495 -406 -101 478 -850 512 -642 102 -184 120 286 449
2548D49l43J12K79m56J146j610J314q23j84P55j441J505j357P37k74l09L48n59
$$ 449 106 218 497 41 1187 -423 891 68 -116 639 -802 703 -654 83 -191 -500 -152 -711
2566g11M04l63N82n46O87o94Q13m68j49J011j301J492q73M49R5o07R70r31N76
$$ -711 -307 -670 -88 -634 53 -641 172 -296 -445 566 -735 757 -116 333 428 -179 791 -140 436
2585D36n35J91l29N90r41N36j67n05J136j517J514j028J99N91r56J106j127Q22
$$ 436 -99 92 -237 353 -588 -52 -219 -724 412 -1105 409 -619 -420 171 -785 321 -806 16
2603A6k41K9j88O20n09L19J71n83J309j396J150r05K86O13j155J223j008P17k01
$$ 16 -225 -196 -384 236 -273 46 217 -366 943 -453 697 -208 78 691 -464 759 -249 468 267
2622B67j26L10j82m1o0K06q99J212j177R95n10J70O95j637J593j329P53k00k44
$$ 267 141 451 269 228 168 374 -525 687 -490 505 -5 165 860 -777 816 -513 240 40 -204
2641b04N19n12M21l76N08o95P81o99P05j76p41J130j466J649j417N50L38r05R52
$$ -204 315 -197 224 -152 356 -339 442 -257 448 272 -469 661 -805 844 -573 -23 315 -590 362
2660C62q74N98n50K59n28P79n84L86r8n29J168j442J271q82M27L82o13Q45q12
$$ 362 -512 86 -464 -205 -733 46 -538 -152 -250 -779 389 -1053 218 -664 -237 145 -468 377 -435
2679d35P10m32J41l6M24r30Q07k64p40J049j254J502k59J58j97p90J667j311M57
$$ -435 275 -157 -16 -52 372 -558 249 -15 -755 294 -960 542 283 441 244 -546 1121 -190 267
2698B67k34j97N20p28L48j46j1l99J575j819J330o07j93R93q45J299j294L01K95
$$ 267 33 -164 356 -372 -24 -170 -181 -580 995 -824 506 -101 -294 699 -146 1153 -141 160 455
2717D55l84K61j04K02l96K82q37J036q10N98l62p4M30j171M16m38M21L63p54L49
$$ 455 71 332 228 430 34 316 -521 515 -295 303 -59 -133 297 -874 -458 -896 -475 -112 -866 -517
2737e17J27N4J13N92k29j0k22m00N60m81J135j309J247q15OM51p68R29q88N59
$$ -517 -390 -336 -223 369 140 130 -92 -492 68 -413 722 -587 660 -155 -149 302 -466 463 -425 134
2757A34o7j9k83K68j28m3M77p73J304j087J039n43k91P87q88J106j044N31l8j85
$$ 134 67 48 -235 33 -95 -138 339 -434 870 -217 822 279 -12 775 -113 993 -51 480 442 257
2777B57J21j76J19k44K64p65P75q96J029p75j69J096j524J529r66N58j09k64N64
$$ 257 378 202 321 77 341 -424 351 -545 484 -291 -460 636 -888 641 -325 233 124 -140 424
2796D24l68K22n91O55p28Q37p25M37j04o61J023j683J535r47J87L14p65P52p56
$$ 424 56 278 -313 342 -386 451 -274 163 59 -602 421 -1262 273 -674 -487 -173 -938 -186 -942
2815i42N58k09M93n78O49k60K08K93o24J214j310J059p69K33M58q69J005r43M47
$$ -942 -384 -593 -100 -678 -29 -289 -81 212 -412 802 -508 551 -218 15 473 -396 609 -334 113
2834A13pK7j0J63l62l02Q80p01Q74j059R06l15k89N62r38J355j100N41j68k00
$$ 113 106 133 123 286 -76 -378 502 -199 675 -384 522 207 -82 480 -458 897 -203 338 170 -30
2854c0M43l94L39m07L91m10M41p42R31m04k03Q00j233J070q64M56K05m56K98l70
$$ -30 413 19 358 -49 342 -68 373 -369 562 158 -45 755 -478 592 -272 184 389 -67 231 -139
2874a39M02n47N93m79M07o13K46l7l46P35p80R27r03K84J63l59N34n66N40k80
$$ -139 263 -284 309 -170 237 -376 -130 -167 -513 222 -558 369 -534 -250 -87 -446 88 -478 62 -218
2894b18J99m38N77k01l7J17n96J015r85J042p00k20O45p31J242r62L75Pp1r1P3
$$ -218 -19 -457 120 -81 -118 -1 -597 418 -567 475 -225 -445 200 -531 711 -251 124 131 60 -31 42
2915D2j72q7N28p53J000j037R62o40n6M65q62J061n84N09k7l94N0K43j01oL57
$$ 42 -130 -217 311 -442 558 -479 483 -157 -213 252 -610 451 -133 376 349 -45 5 248 147 141 498
2936D98n54P22q53O91j23n20Q63j219R88o90K29l9n22O26n07M03n20L29k41M27
$$ 498 -56 666 -187 504 381 -139 724 -495 493 -197 32 -7 -529 97 -410 -7 -527 -198 -439 -12
2956a2o50N88J81q73Q49p27J068p58K92L44n32O53q36P46m64K88m49O59m44k13
$$ -12 -662 -74 107 -766 83 -644 424 -334 -42 302 -230 423 -413 333 -131 157 -292 367 -77 -290
2976b90L56p60J357j469R13l50k02N63p35P91n76N29N4k03K76J1q9l00O24q46
$$ -290 66 -694 663 -806 107 -243 -445 118 -617 174 -402 127 181 -22 254 265 176 -124 500 -346
2996c46J102j242J066n13j36Q36j067R36n97L51l13m1J74l4J09l38L41o46P76
$$ -346 756 -486 580 67 -69 767 -300 636 39 390 77 36 210 176 285 -53 288 -358 418
3015D18q06O17j02n10P47r57J210q74L62n6m18L82l85L32m48N98o81O99n06K01
$$ 418 -388 229 127 -383 364 -593 617 -257 105 49 -369 13 -372 -40 -488 110 -571 128 -378 -177
3035a77J69m71R63j099J210r78L18K32n24O84p22L46N0J37l41L97k95j52O24q17
$$ -177 -8 -479 484 -615 595 -383 -65 167 -357 327 -395 -49 1 138 -203 194 -101 -253 371 -446
3055d46R19j454J009l90L71J20l99O91q00O39j65J96qJ25kk61N13q21Q96q99N75
$$ -446 473 -981 28 -362 9 129 -270 421 -379 260 95 291 283 408 406 145 658 -163 733 -166 409
3076D09k12m88R88j403J398p02L45k54j33K36n68N33j48K12n15P03o76L94k06
$$ 409 197 -291 697 -706 692 -10 335 81 -52 184 -384 149 1 213 -302 401 -275 119 -87
3095h7l52Q78j000R61r87N61n1k06M52n15Q73r42M67o01M06l68k11J218r61R49
$$ -87 -439 439 -561 400 -587 -26 -77 -283 169 -346 527 -415 52 -549 -143 -511 -722 496 -465 484
3115D84j308R59n91K47L13n55O33p56P54o56N51l61M43l66j7O54r51J109q55N07
$$ 484 -824 135 -456 -209 104 -451 182 -574 180 -476 75 -286 157 -209 -226 428 -523 586 -269 238
3135B38k32J04L33j000J153q09N19k01N0k10O6J32lK70n87M73n93P96k16k66L94
$$ 238 6 110 443 -557 596 -213 306 105 155 -55 11 143 140 410 -177 296 -297 499 283 17 411
3156D11r22J069m91L67J52o31L35P3k12n08M30q67R88l88N02R8j0J22j221J193
$$ 411 -511 558 67 434 586 -45 290 363 151 -357 73 -794 194 -194 308 406 396 518 -703 490
3176D90j371J179K60o06L58q87J05P83P5j295J350j354Q51j00n9l20J123k91n73
$$ 490 -881 298 558 -48 310 -577 -472 311 386 -909 441 -913 -62 -162 -221 -541 582 291 -282
3195b82l06N17M8J340k651J376j064J075k21L42N82p42J262p60L93j178J135r46
$$ -282 -588 -71 -23 1317 -1334 42 -1022 53 -168 174 756 14 1276 516 909 -269 866 -80
3213h0K39j37n69J678q81N82r26M93p55l35J037q30K09rJ984k651J623r1j304
$$ -80 159 22 -547 1131 250 832 -94 399 -356 -691 346 -484 -275 -284 1700 -951 672 581 -723
3232g23M71K41N04m89l61R80q11R63o93j49K17K07p07P62p45P5k6J5N29j296J416
$$ -723 -252 -11 493 4 -357 623 -188 775 82 -67 150 357 -350 412 -333 -258 -284 -269 260 -1036 380
3253C80p10P28o49j93O82o81K73J35l8k64P17o94L11J30m28P65j127R36r1m69
$$ 380 -330 398 -251 -444 238 -443 -170 -35 -73 -337 380 -314 -3 127 -301 464 -663 273 182 -287
3273b87L64p5J01n91N48l58O38l29l8N35n60J17k3M02o67R48J47o85K09o55R80
$$ -287 77 2 103 -488 60 -298 340 11 -27 508 -52 65 42 444 -223 725 872 187 396 -259 721
3294G21r92R73k73m04K05l54M31l66N97p44L26o42P00m68K06M75p99Q18p55N61
$$ 721 -271 702 429 25 230 -124 307 -59 538 -206 120 -522 178 -290 -84 391 -408 410 -345 216
3314B16k13o3J55l35N63m01L24n27M67n05J46J78l16O80j030Q48l98J45R2l99
$$ 216 3 -60 95 -240 323 -78 246 -281 186 -319 -173 5 -311 369 -661 187 -211 -66 26 -373
3334c73N41n12K70l21L33k34K54k92Q0J21m27Q83j016J054m14k25P44r35Q30l90
$$ -373 168 -344 -74 -395 -62 -296 -42 -334 -254 -133 -560 323 -693 361 -53 -278 466 -469 361 -29
3354b9N18l45j78N2O5J52j58K27l47M23p08R43m97J9J99o62P74o90O67m91L34
$$ -29 489 144 -34 18 83 235 77 304 -43 380 -328 615 118 137 336 -326 448 -242 425 -66 268
3375B68j82L1L04m16M91n94N52n31K88j22l00R92j070O20l76J47J97m40M76p52
$$ 268 86 117 421 5 496 -98 454 -77 211 89 -211 781 -289 331 -45 102 299 -141 335 -417
3395d17M36k16K78k99M39k73o6J09n64R49r22N57j63j4J62n59Q09p72N09m91L98
$$ -417 19 -197 81 -218 221 -52 -118 -9 -573 376 -546 11 -152 -166 -4 -563 246 -526 -17 -508 -110
3416a10k53Q6kr4O89r84Q48o55Q60n35J27J82l66M05l71M07l59K03N3O6J2j91
$$ -110 -363 -277 -279 -373 316 -668 180 -475 385 -150 -23 159 -207 198 -173 234 -125 78 131 197 209 18
3438A8K93l82N88n60Q0R1o04P74n98N43l10K27O2j97K92l36K89l04O91r40J008
$$ 18 311 -71 517 -43 37 128 -476 298 -300 243 -67 160 222 25 317 -19 270 -34 657 -283 725
3459G25p45L36q6m28M51n93Q61m86Q0m7j45J09n84M82k38M59l59L58k51j73L65
$$ 725 -20 316 230 -198 253 -340 521 35 115 68 -77 32 -552 -70 -308 151 -208 150 -101 -274 91
3480I1n77P36p99P02k19j4K44l92O8j76L21k52K81l82L42l1l8j0m29Q42p34K56
$$ 91 -486 250 -549 153 -66 -80 164 -228 -160 -336 -15 -267 14 -368 -26 -57 -95 -105 -534 308 -426 -170
3502a70m7k25O37m48N38l23J22N9j96L51j34Jj94K99p48Q37m97M56l1l09L32n45
$$ -170 -217 -442 195 -253 285 -38 84 143 -53 298 164 165 -29 270 -478 359 -138 318 287 -22 310 -235
3524b35O42n25K06r9M5L21l29K90n99O87o03N98o62L23J43m01N88q77P56k04K2
$$ -235 407 -118 88 -11 34 355 26 316 -283 404 -199 399 -263 60 203 -198 390 -487 269 65 87
3545H7M8k99K06k18J06k33M13k7q8m55K96J82o79R77n54M06k85O7k0m1L70o05
$$ 87 135 -164 42 -176 -70 -303 110 83 -5 -460 -164 18 -661 316 -238 168 -117 -50 -70 -111 259 -346
3567c46M38l56N12k91j5L30m65M23p57Q47n47L74K11n60M05n90N83l92L49j45
$$ -346 92 -264 248 -43 -58 272 -193 230 -527 320 -227 147 358 -202 203 -387 196 -196 153 8
3587HM00o20K44L12n00M63k72J33m57M77K3j63M23o43M82k15K25j93qn5L6K43
$$ 8 408 -212 32 344 -156 307 35 168 -289 188 211 48 471 -172 310 95 320 127 119 64 100 343
3609C43k75P5m85N03m9J20J48o40L01l68Q00p05Q0M0J38J67l74L48n48R00o74
$$ 343 68 143 -342 161 112 232 380 -260 41 -327 473 -232 -152 -112 26 193 -181 167 -381 519 -155
3630a55K01p60N77lO49Q24j279j08J2k30O8n48R91j28L9L7k4j09j04R6k40K01
$$ -155 46 -714 -137 -140 509 1333 54 -54 -42 -272 -204 -752 239 111 150 187 163 54 -50 46 -194 7
3652Gj91O77o82L89o1k34L42n15N72n54M50k92L76l92J57K28l76L65l44M31n93
$$ 7 -184 493 -189 200 139 -95 247 -268 304 -250 200 -92 284 -108 49 277 -99 266 -78 353 -240
3673b40N74j61k82M51m31M38m05M38j77k89L04j37J94n87L10m56M20j13J8J6k09
$$ -240 334 173 -109 342 -89 349 -56 382 205 -84 220 83 277 -310 0 -456 -36 -149 -131 -115 -324
3694c24N60o42M98l06J62r2p1J68j24Jj31K11k2K28m14K06K32m03M40k99K84m77
$$ -324 236 -406 92 -214 -52 -144 -215 -47 -171 -170 -301 -90 -112 116 -298 -92 140 -263 177 -122 162 -315
3716c15L95p2J9J97k16K0k95N09m89K35J48J2L4l92M30l26K85oj81K62k72M20
$$ -315 80 8 27 224 8 28 -267 242 -247 -12 136 148 182 -210 220 -106 179 173 -8 254 -18 402
3738D02p15M22J38k01K83l49%K7K77n09K66l13L59K7k05M47p04O22m19K68j79
$$ 402 -313 109 247 46 329 -20 -20 7 284 -225 41 -272 87 114 -91 356 -348 274 -145 123 -56
3759e6o2J79q2J36j06O6m08O65o17L47k02NK42n30N08l74J08pj25N69m84K58l67
$$ -56 -118 61 -21 115 9 75 -333 332 -285 62 -140 -135 107 -423 85 -289 -181 -188 -313 256 -228 30 -337
3782c37J62j42L33k46m2M33o74P00o23N14j66k08M57n48O08j52mk79L40O7n6q4
$$ -337 -175 -317 16 -230 -272 161 -513 187 -436 78 -88 -296 161 -387 221 69 65 -214 126 193 137 53
3804E3j44J69j19N58q01L64j3j78M02l64M84k98J28%j9j10j52J7J42K40l53O1
$$ 53 -91 78 -41 517 -284 80 67 -111 291 -73 411 113 241 241 222 112 -40 -23 119 359 6 67
3826F7k4j1N7q3M07o79O71m92L35j41J5O5j88n8j72J47j49K32j92J9L71m37M60
$$ 67 43 32 89 6 413 -266 405 -87 248 107 122 187 -1 -59 -231 -84 -233 -1 -193 -174 197 -240 220
3849B20k96L27m51j46M15l81M67m10R0l14L30l14N76j28j19J02j03K44m97L97
$$ 220 -76 251 -200 -346 69 -312 155 -255 -165 -479 -149 -463 113 -15 -134 -32 -135 109 -388 9
3869IJJ20k82k16L52k82M21m56K58qk11M44k27K98n49P61n62K22l08K89O2n95
$$ 9 10 130 -152 -368 -16 -298 123 -333 -75 -83 -294 150 -77 221 -328 433 -129 93 -215 74 136 -459
3891d59J201j284M67j2m41J206M63q83P86q85l81R22n65j17M35o80P47n3k46r8
$$ -459 742 -542 -75 -87 -528 678 1141 258 1044 159 -222 700 135 18 453 -227 520 467 221 123
3911A23m43M21j21J22l67N72m17K42j96L94l55O9j22o9L39l82N73m80r1M85p22
$$ 123 -320 101 -20 102 -265 307 -110 132 -64 330 -25 44 -78 -147 192 -190 383 -97 -188 297 -425
3932d25L47l37L30j20L57o37L43j23j23N07o04O25l30L00k25l2J17K8L26l52K06
$$ -425 -78 -415 -85 -205 152 -485 -142 -265 -388 119 -485 140 -190 110 -115 -147 -30 -2 324 -28 178
3953A78k82K77j23k17K66l17N16l98M32n75Q0K45k91K92k81M75m08J41N8L33m59
$$ 178 -104 173 50 -167 99 -218 298 -100 332 -243 -163 82 -209 83 -198 277 -131 10 68 401 -58
3974e8J06p5k8K46l58M56l37J26j13J14J89n87P70n44L8K12l00K90k30K84l00
$$ -58 48 -27 -55 191 -167 289 -48 78 -35 79 268 -319 451 -93 -55 157 -143 147 -83 201 -99
3995i9J17j64K33l6J4J57m14L35m22M29j83j90L83m18K72m36M36j97k3k3P1K63
$$ -99 18 -146 87 51 65 222 -192 143 -279 150 -33 -223 160 -258 14 -422 14 -183 -206 -229 -158 105
4017A05k36K30n17N81n85L13n7J07M5j33N42o91M20n3j80L28j45R9k31J94l00
$$ 105 -131 99 -418 163 -422 -109 -166 -59 -14 -147 395 -296 124 71 -109 219 74 173 -58 136 -164
4038a64N52n79M38l9k51N20n67L84l78O7M9J46j86L3M19p86O03o97K75M64K04
$$ -164 388 -191 247 208 -43 477 -90 294 -84 -17 32 178 -8 25 444 -342 261 -436 -161 303 507
4059E07L70j167N76q24M99J12n1J74L17j8k81m78M82O72q35N43O0k53p19o9J287
$$ 507 877 -290 286 -538 -39 73 22 196 513 495 214 -264 218 890 55 598 658 405 -314 -383 904
4080I04k70o66m50L22K87j08l96L94O54p43J16k21m12M44n8k53Q6P90l04Q64j014
$$ 904 634 -32 -482 -160 127 19 -377 17 671 -72 44 -177 -589 -145 -203 -456 -370 420 116 980 -34
4101c4K73J3n20M42j53l18N03Jj10R3m26K48L99j635J209L52r02J589o82M9o14
$$ -34 239 252 -268 174 21 -297 206 207 97 190 -236 12 411 -1224 -15 337 -565 1024 342 391 -223
4122b23N35n05K12K80P5k74l77J54J85j51l55O90l57P4K70o23K93l96J111p71
$$ -223 312 -193 19 299 374 100 -277 -123 62 -89 -444 246 -111 -37 233 -390 -97 -493 618 -153
4142a53L64K78n68M02J91n91m02M53q3K19o88L57k47l2N89o32K76k08L53n80l67
$$ -153 211 489 -79 323 514 -77 -479 -26 -109 110 -578 -221 -468 -500 89 -543 -267 -475 -122 -702 -1069
4163a069R65n1jM38p41nQ84p50O14p2l45M45m46L57L3o29R19o65jO44J82k94k22
$$ -1069 -104 -155 -156 282 -459 -464 420 -330 284 212 -133 312 -134 223 256 -373 546 -119 -120 524 706 412 190
4186A90J39k80Q2L08O50j558Q03k85O59o60J29K63m12M18O1q06N17k37M99o13
$$ 190 329 49 131 439 1089 -469 334 49 708 48 177 440 28 446 507 -299 218 -19 480 -133
4206a33L58n80P19k47M6k81l3M25k31n16r6J100J1r33j18N49m8j45R72p54J81
$$ -133 225 -355 364 117 163 -118 -151 274 43 -473 -569 531 542 -391 -509 40 -8 -153 819 65 246
4227B46l42Q8o8l98O54k35L6l64R4J58q9J01n26oO57J15K98k98J44q75O01K2k56
$$ 246 -96 -8 -76 -474 180 -55 -19 -383 -289 -131 -220 -119 -645 -651 6 121 419 121 265 -610 -9 13 -243
4250b43J52j72N66l57p7p5M30l21O08q37M42l89K75J91K83n2m39N78o79N11J13
$$ -243 -91 -263 303 -54 -131 -206 224 -97 511 -326 116 -273 2 193 476 424 -15 563 -116 395 508
4271E08p48Q78p92J80p47J268r34K18MK29M82m69N2l15M80q24M28J63l26M57j70
$$ 508 -240 638 -154 26 -721 547 -387 -169 -165 64 546 77 129 -186 294 -530 -102 61 -265 192 22
4292B2O6K83q30J66O9L4m4K38q0K16n34K76j10M84m71J40j68j78P10j142Q41K31
$$ 22 88 371 -459 -293 -224 -190 -234 4 -76 140 -394 -118 -228 256 -215 -75 -243 -421 289 -853 -12 219
4314B19o55L71J8K68l36L99m11M40k49m21M0J3L89k28O48o28L76m23L76K0m70
$$ 219 -436 -65 -47 221 -115 284 -127 313 64 -357 -317 -304 85 -143 505 -123 253 -170 206 226 -244
4335b44M63j50m48N09l35L72O8m25K96m3K67L43J6q07L33q63R61j17M33n78p15
$$ -244 219 69 -379 130 -205 167 235 -190 106 63 330 673 689 -118 215 -648 313 196 629 51 -664
4356f64Q04m57Q42j052R56N84j042j70m70M84l33J075r42O78k51N46o83M64m17
$$ -664 140 -317 525 -527 429 1013 -29 -199 -669 -185 -518 557 -385 293 42 588 -95 369 -48
4375d8j31R1J99m20J34N31k76j69J75j98O30o16mM07p46L65M43N18j324j52P07
$$ -48 -179 -88 111 -309 -175 356 80 -89 86 -112 518 -98 -102 305 -441 -76 367 885 -439 -591 116
4396A16P8n00j76L28M91p32L5N85j71M3J74l30M04n87N77p00L47l60O39k72o5
$$ 116 194 -306 -482 -154 337 -395 -360 225 54 97 271 -59 345 -242 335 -365 -18 -378 261 -11 -76
4417g6N23l07L8p21N56J29J26J43l85J75q4K31J00N47m60Q4mr89O18o73M46m36
$$ -76 447 140 178 -543 13 142 268 411 26 201 117 348 448 995 535 619 615 -374 244 -429 17 -419
4439d19Q50j97J27r31P10O79p78J20l99O16o65n2J054j195R37o26j02O02m73J26
$$ -419 431 234 361 -570 140 819 41 161 -238 378 -287 -339 715 -480 457 -169 -271 331 -142 -16
4459a6N8J60l50J77l38R1j88N84k98j45L52q3J36l03K07j8n4j7J37k23Q9L12m51
$$ -16 42 202 -148 29 -309 -218 -406 178 -120 -265 87 4 140 -163 44 26 -28 -45 92 -131 -42 270 -181
4482a81N23j64r9J5m36K28R2K11k57J24K8j94J95j33J05k12L47j89o7j59qM18
$$ -181 342 178 79 94 -342 -114 -22 189 -68 56 84 -110 85 -48 57 -155 192 3 -64 -223 -231 187
4504A87l15M49l36J12j16L32l11j16K05j72J31j39K48k58J88oj91K39l24K49q1
$$ 187 -128 321 -15 97 -19 313 2 -114 91 -81 50 -89 159 -99 89 83 -108 131 -193 56 -25
4525b5R7r8P5p6l59O72l14K01n50N30j69o2q9k2L98l29K41k31Kr6NK25k39L67
$$ -25 72 -26 49 -27 -386 286 -28 173 -377 153 -16 -78 -167 -189 209 -120 121 -110 -108 -204 -199 26 -213 154
4549A54k78J59l63K51L7K64k56L3J60j85K93l58o2K40k64J52q9L29j95J04k25
$$ 154 -124 35 -328 -77 -40 224 -32 1 161 -24 269 -89 -151 89 -175 -23 -112 217 22 126 -99
4570i9J81J06l65M21k84J41r7K70k72r6L32n47M10k55K80n5Q7o4m0N4j12J95j45
$$ -99 82 188 -177 244 -40 101 4 274 2 -94 238 -309 101 -154 126 71 158 94 54 108 -4 191 46
4593D6j74kK01K5l71M98m90L17k0J68l88k03K21P3QM7J83o01M50L8l35L95j52
$$ 46 -128 -130 71 96 -275 223 -267 50 30 198 -190 -393 -172 -99 -91 -44 139 -462 -12 26 -309 86 -66
4616f6R9j05K55l77J4J73j05N08n54K46J1j18L87j47j64j5L4j43J51P1J5l64N50
$$ -66 33 -72 183 -194 -180 -7 -112 396 -158 88 99 -19 368 221 57 42 76 -67 84 155 170 -194 356
4639C56m06J22L59o28M19k72J95l40K25K76p25L84L19K8l77P6JM7l9J82L00p87
$$ 356 -50 72 431 -197 222 -50 145 -195 30 306 -419 -35 284 312 -65 11 12 59 20 202 502 -285
4661b85K84l95P14j59n86N71l19p0N68k67l62M10m1Q2o6k70L93q5j67r3j59M43
$$ -285 -1 -396 318 159 -427 144 -175 -245 323 56 -306 104 63 145 79 -191 202 117 -50 -143 -302 141
4683A41k61j29J69k24j08N31l80o8pL70n6m32M78l17J44O41l34n98m5K57L65k73
$$ 141 -120 -249 -80 -304 -412 119 -261 -329 -336 34 -22 -454 24 -293 -149 492 158 -440 -485 -228 137 -136
4705a36Q8N66j108KJ312j80l99n42LL15M48k10N08l48k16J56m21N3Q21r46K24
$$ -136 -48 518 -590 -588 724 544 145 -397 -394 -79 369 159 667 319 103 259 -162 -109 712 -234 -10
4726a0j13O45r00m51J73P69R8J21K72n84J9n1k59k16P25j16q37O78m88J161p33
$$ -10 -123 522 -378 -829 -656 113 211 332 604 20 39 -12 -271 -487 238 122 -715 -37 -525 636 -97
4747i7M80m01K68l53k09M34N05K46j464J737r77N72k86n35j67k83O59q4M55l70
$$ -97 383 -18 250 -103 -312 122 627 873 -591 1146 169 741 455 -80 -247 -530 129 45 500 130
4767A30j69N45j78o81L30k87r30J316J0o29Q82k72j83m59O61m78j17Q5K40P39
$$ 130 -39 506 328 -353 -23 -310 -1240 76 86 -543 339 67 -116 -575 86 -392 -509 -424 -184 555
4787E55j157J197m63j0J37p06O71l44Q32o82Nm1j91M59m80O81j059J265o65N11
$$ 555 -602 595 132 122 259 -447 224 -120 712 30 35 -6 -197 262 -218 463 -596 669 4 515
4807E15q79J90M57n80Q27m17K48k57r0k67K93J01K1rk44L75j79k7j18K23M7k64
$$ 515 -364 -174 283 -297 530 113 361 104 14 -253 40 141 162 153 -91 284 105 78 -40 183 230 -34
4829c4K74n57L67j45K52j82m0R9l15K39OQ1k7n5j30j82K82j39J81k82O71m46m
$$ -34 240 -317 50 -95 157 -25 -65 34 -281 -42 -36 45 18 -37 -167 -349 -67 -206 -25 -307 364 -82 -86
4852h6N51l61n16O04k41R38L26j729N34J48k46M10p4n88L5R03o94K54L00n36O80
$$ -86 465 104 -412 192 -49 889 1215 -514 20 168 -78 332 258 -330 -295 608 -86 168 468 -68 612
4873F12o79N96r60O00j29l71Q91r95O6N52l35K36M61k95j83j11N6K90m11j81L68
$$ 612 -67 529 -431 169 40 -331 560 -435 -369 183 -152 84 545 250 67 -44 12 302 -109 -290 78
4894G8k49K36k18K54k30J27p6K0Jk44M72k96K87k68L7p9K39J0l42M66k70J20j18
$$ 78 -171 65 -153 101 -129 -2 -78 -58 -57 -301 171 -125 162 -106 -69 -148 91 101 -241 225 -45 75 -43
4917d3l6J0L7p4j34K37k40K19p1R6J49p2j41q8K42J2lj09J84k25K53k68J12J07
$$ -43 -79 -69 -32 -106 -240 -3 -243 -24 -95 1 150 78 -63 -151 91 103 100 -9 175 -50 203 -65 47 154
4941A54j60J45j83N4K48j85O9o3M00o69L14K9k09K9LQ3m0m0J18O0m5P9k61J8J43
$$ 154 -6 139 -44 10 258 73 142 79 479 -190 124 153 -56 -27 -24 59 19 -21 97 157 112 191 -70 -52 91
4966I1m09L68o5K23l94K65Q6q6K72m55K7j12K86k58J07J30m88P71m30J58j98J6
$$ 91 -318 50 -15 208 -186 79 165 79 351 -104 -77 -189 97 -161 -54 76 -412 359 -71 87 -111 -95
4988i5J19k55L58n03M74k64K75r8q9P1k74J84m6K09p3l2J7K0N3k89M88k93N0k5
$$ -95 24 -231 127 -376 98 -166 109 11 -78 -7 -281 -97 -143 66 -7 -39 -22 -2 51 -238 250 -43 7 -18
5012a8J89p3M2rJ22j74j71K0r9J01J4l77N96j08J47k24J96K2n15M39l88K62n06
$$ -18 171 98 140 131 253 79 -92 -72 -171 -70 -56 -433 163 55 202 -22 174 196 -319 120 -268 -6 -512
5035e12M68N74o92m47M37R3j6L62n71K23j96j7p1M37l08j37R99n88M82m8m32J51
$$ -512 -44 530 -162 -609 -172 -79 -95 267 -304 -81 -277 -294 -365 72 -236 -373 626 38 520 472 40 191
5057A91p38O79j69M27o12K8J73m00N98m16L35j78J26j09o6N2K88j33l5J45j93
$$ 191 -547 132 -37 390 -222 -194 -21 -421 177 -239 96 -82 44 -65 -131 -79 209 76 41 186 -7
5078gK40k81J85p8M1l6j40J58j22J40k97K3J84j7K22k19Q6j98K83k33K74l21K1
$$ -7 233 -48 137 59 100 64 -76 82 -40 100 -197 -174 10 -7 215 -4 82 -116 167 -66 208 -113 -92
5101i2O6J4l6j02K30k23M79q5l31J44p3O5O7o2n9N9j39j55J50k9K04N8j38J67
$$ -92 -26 -12 -48 -150 80 -143 336 251 -80 64 -9 56 123 61 2 61 -78 -233 -83 -112 92 150 12 179
5125A79k09L6nJ41k53J60l01J47m8O0Q8o0L78m72J61pj09K23k50J60p6L08k75
$$ 179 -30 6 1 142 -111 49 -252 -105 -153 -93 -5 -65 313 -159 2 -5 -114 109 -141 19 -57 251 -24
5148b4O0J6j53K57l04L69j89J47k2r3n4l34L66q9J07j79K55k11J89l3l6J11q7
$$ -24 36 52 -101 156 -148 221 32 179 157 64 10 -324 42 -47 60 -119 136 -75 114 81 45 156 69
5171F9M39p20K89k53K33K19j82k8k00K62L6o6n7j20K94m22K18M7qr2L95o15K95
$$ 69 508 -212 77 -176 57 276 94 66 -134 128 164 98 41 -79 215 -207 11 58 50 -42 353 -262 33
5194C3Q8k90J51p8K48l46N23k52k23L0oJ04j48K51n2K11l17j94M58l27L77n68
$$ 33 121 -169 -18 -96 152 -194 329 77 -146 -116 -122 -18 -166 85 33 244 -73 -267 191 -136 241 -327
5216c27L65m66M01J11j79M5j26K35j26k8J76p1J69j02k18K02Q5k44o1Q6r2K27
$$ -327 38 -428 -27 84 -95 -50 -176 59 -67 -95 81 10 179 77 -141 61 146 -98 -159 -73 -165 62
5238F2l33M08l40K65j40K57p7k9j25J22J51k49L0n4j02M46l97J90n9j52R9K40
$$ 62 -271 137 -203 62 -78 179 102 73 -52 70 221 -28 2 -52 -154 292 -105 85 26 -126 -27 213
5260B13j03k14Q8K13k36j03K26k46J31K01k96J35k69L80k50K31q5k31N79m84J74
$$ 213 110 -104 -16 197 -39 -142 84 -162 -31 170 -126 9 -260 120 -130 101 16 -215 364 -120 54
5281E4m10N95l35L8q5J03q4o2J14l8L20m79M45j61j22J96m00M19j49Q0R4j43l4
$$ 54 -356 239 -96 -58 -143 -40 -124 -186 -72 -110 210 -269 176 15 -107 89 -311 108 -41 39 133 -10 -44
5304d4R4K11j84K29o65O87k97n4o9o5L72k9k0NR3j72j41J45j1k33P5L8j0J3o5
$$ -44 50 261 77 306 -359 328 31 -23 -92 -157 215 186 166 171 264 92 -49 96 85 -148 -73 -35 -45 -32 -97
5329i7K85m13Q5J81K38j20m43l01N77J33K4Q7n26M8K83k1k99M27L54m96m26K53
$$ -97 188 -225 -140 41 279 159 -284 -585 -8 125 149 236 -290 -242 41 20 -279 148 502 6 -420 -167
5351a67L0O30m47r2J93n11N78n08L12K5K26j61j62R1j65K72k04J92l37K04k11
$$ -167 -137 493 46 -46 147 -364 214 -294 18 43 269 108 -54 37 -128 144 -60 132 -205 -1 -212
5372b12J17J34m01O54l33K29j01j68J14Q6k70N2J49j58K71j37n8J28k07K09k42
$$ -212 -95 39 -362 292 -41 188 87 -81 33 119 -151 -99 50 -108 163 26 -32 96 -111 98 -144
5393a44L36j57J09k75k8K21j47K76l36K83l9J50o2n8r2J93k18j28L32k57j57R9
$$ -144 192 35 144 -131 -159 62 -85 191 -145 138 99 249 187 129 37 230 12 -116 216 -41 -198 -99
5415i9j9O7k06K21J9J19k90L41l21K80J62m86L19j72M1k34L54P6l76K05K43j24
$$ -99 -118 -51 -257 -36 -17 102 -188 153 -168 112 274 -212 107 -65 -24 -258 96 172 -204 1 244 120
5437A20l09K39nr4j73N2P4r4Q5j94L18k58P2Qj9K83k88J11J26r8K5o4K56k54K40
$$ 120 -189 50 45 -49 -222 -170 -96 -190 -105 -299 19 -239 -167 -159 -178 105 -183 -72 54 -44 -19 -83 173 -81 159
5462A59k02J9n8J28J64k82M60m96K30j48K2K13j04Q9k19K73j85lo0J03k16K2L49
$$ 159 -43 -24 -82 46 210 -72 388 -108 122 -26 -4 209 105 194 -25 248 63 60 0 103 -113 -91 258
5485B58l89K26J63j58m17L34j0j81K30l31L97k98K83j30R8p8j13J88k39J51p5
$$ 258 -131 95 258 100 -317 17 7 -174 56 -275 122 -176 107 -23 75 -3 -116 72 -167 -16 -91
5506i1K59l69K99l14P2l00O04n04L43l35L66L78j95k87J10k74J58J08m10N21j80
$$ -91 168 -201 98 -216 -144 -444 160 -344 -1 -336 30 408 213 -74 36 -238 -80 28 -382 139 -41
5527d1L77m96M87o72L43j53K40q7P0J03j57O4j64L83l42j84K77k21L24l66M59
$$ -41 336 -160 327 -345 -2 -155 85 -2 68 171 14 78 -86 297 -45 -229 48 -173 151 -215 244
5548B44j69M6j44K9L46r3j97k8K05l88L41j9j09L6j51M12l97L48l19O4P2j47K11
$$ 244 75 121 -23 6 352 259 62 34 239 -149 192 173 64 100 -51 361 -36 312 -7 57 129 -18 193
5571A93j70j0j61J81p0J49j87j62N88o28L31k24J54k29J8K43j04K52m60N07m98
$$ 193 23 13 -148 33 -37 112 -75 -237 351 -277 54 -170 -16 -245 -227 16 -88 164 -296 211 -287
5592b87K95m5m9J25m19L47J0M8j3R0J75m43K46k49j7L5L69m78L25o5L0J2p4L43
$$ -287 8 -37 -86 39 -380 -33 -23 25 12 102 277 -166 80 -169 -186 -151 218 -260 65 0 30 42 -32 311
5616C11n20O67n45J04j64P3K27l92L36K2k15K01oj95jJ97j8L5R7J5j43m6l5j71
$$ 311 -209 458 -87 17 -147 -74 153 -239 97 119 -96 105 99 -96 -97 100 82 117 214 229 86 40 5 -166
5640a66K01K5j44K15n8j95M0M03j58k30j97L84l06K48j16l80N16l40K14j09Q2
$$ -166 35 60 -84 131 73 -122 -82 321 163 -67 -264 120 -186 62 -54 -434 82 -258 -44 -153 -71
5661g1N1R8k55P2J71j28m3K64K3m12K75n8j5L7k04K97k15N3K28l05L23k53K67
$$ -71 -20 78 -177 -105 66 -62 -105 159 182 -230 45 -13 -28 9 -195 102 -113 -60 168 -137 186 -67 200
5684B00k99K00J40j92J54j0j22j08j81K90J44k42j07N5J16J02j54J44l0J88j33
$$ 200 -99 101 241 49 203 193 71 -37 -218 72 216 -26 -133 -78 38 140 -14 130 100 288 155
5705A55p4r6j21J99j06K74l02j07J94qqj00L89m84N22l26l5J20J9Ol18M66m26
$$ 155 81 -15 -136 63 -43 231 -71 -178 16 8 0 -100 289 -195 327 1 -34 86 105 111 -207 259 -167
5728a67K93k59N1O7j55K84k96K07j37J14r7j89L11m31K95jM27m09R1P3M7j32K4
$$ -167 126 -133 -82 -15 -170 114 -182 25 -112 2 -95 -284 27 -404 -109 -110 317 -92 -1 72 119 -13 11
5751A1L0j81O3J40j45J97k24N3j20J28r0J13r7L40j99OK23l36j7J33M32n51K36
$$ 11 41 -140 -77 63 -82 115 -109 -56 -176 -48 -138 -25 -122 218 19 25 248 -88 -105 28 460 -91 145
5774A45j4k12L57m13M18q8k02K48j62J75l81J97j74L46j88j89J50j63L50j80K06
$$ 145 131 -81 276 -137 281 193 -9 239 77 252 -129 68 -106 240 52 -137 13 -150 200 20 226
5795B26j82N3j43M7J89l91L31j52J33j9q6n9j98L07k39J92l62N81l65K57j86M7
$$ 226 44 97 -46 1 190 -201 130 -22 111 92 6 -53 -251 56 -183 9 -353 228 -137 120 -66 -19
5817a9K60k57N5l18J51l40N85n79K85K30K55J92q87M00j01k11N77k48k24l93O65
$$ -19 241 -16 39 -279 -128 -468 117 -462 -177 53 308 500 -387 13 -88 -299 278 30 -194 -587 78
5838G8J03o33N9M27j43K0M85p82K25l32M32J50k19J54N77m69n02Q13n43N49m49
$$ 78 181 -452 -393 34 -109 -89 396 -386 -161 -493 -61 89 -130 24 601 132 -370 443 -100 449 0
5859@j05J9m59K82L60J44l53M95o44N50Lj067Q86p55O43n99Q39K30j169J170r6
$$ 0 -105 -86 -545 -263 97 241 -112 383 -261 289 292 -775 111 -644 -1 -600 239 469 -700 470 374
5880C74p31P14l45M9l01M23m24Q98p81L22K0m02N65m83J72o85Q26r19N63L34q60
$$ 374 -357 357 12 61 -240 183 -241 657 -124 198 218 -184 381 -102 70 -615 211 -708 -145 189 -671
5901f71M62J89N8j83J29K1J06j91m8j41L16p1j93M93m70K33R2k31O2J68j11j91
$$ -671 -209 -20 38 -145 -16 5 111 -80 -128 -269 47 -24 -217 276 -194 39 131 -100 -38 130 19 -172
5923a72J93j02K29L0j76K52m88N66k41L22n14K43N7n50N70k47J11P6k00J9K10
$$ -172 21 -81 148 178 2 254 -234 332 91 413 -101 142 199 -351 219 -28 83 159 -41 -22 188
5944A88r1q3K13l51O1k0QJ19M5M5O2m22l43J171n37L12k81j91K58m79L45k57J11
$$ 188 97 14 227 -124 -63 -83 -75 44 89 134 196 -226 -569 602 65 377 96 -95 163 -316 29 -228 -117
5967a17J8J61q0k30L12j34j44R0J44k45J01J30j88K66k33mK19j24J45j48J37k15
$$ -117 -99 62 -18 -248 64 -70 -214 -124 20 -225 -124 6 -182 84 -149 -153 66 -58 87 -61 76 -139
5989a39M84k76J29j55J75q4k31L63m23J50p1p1K11l1J2k5K44k27m3Q1J19k79o1
$$ -139 345 69 198 43 218 134 -97 266 -157 -7 -78 -149 62 31 43 18 262 35 -8 73 192 -87 -148
6012a48J77j76L18k55L85m82K85l25R1j56J38L03k00J30K7q8J69k76K57m02J91
$$ -148 29 -147 171 -84 301 -181 104 -221 -130 -286 -148 155 -45 85 112 24 193 -83 174 -228 -37
6033c7j0K81j02j69j06K64j25k81L48k36J20n9o6J01N5O7K66j35k55JK9j15J87
$$ -37 -47 234 132 -37 -143 121 -4 -285 63 -173 -53 -112 -178 -77 -22 45 311 176 -79 -78 -49 -164 23
6056B3j00J76o2j76R4M2k55L75Q6n19P40o35M49m13K91j1J10l10J09M2N4J05k75
$$ 23 -77 99 37 -139 -45 -3 -258 117 203 -316 424 -211 238 -175 116 105 215 -95 14 56 110 215 -60
6079f0M52l12k66M33l31K49j56L35k53j07L57m67J91l02O6l4J30L1j99K71k74
$$ -60 392 80 -186 247 -84 165 9 344 91 -16 341 -126 65 -237 -171 -205 -75 -44 -243 28 -246
6100b46K64o3J50l24K16l7J7J64j08J5j15r5l1J10K81j38m39K29l9K7N4J01J07
$$ -246 18 -45 105 -219 -3 -40 -23 141 33 48 -67 -162 -193 -83 198 60 -379 -150 -189 -162 -108 -7 100
6123A00J02j64O0m67M17j35Q9p8q9J54r3L67j51q9n6nKm5O5j37L04k03K45l64
$$ 100 202 38 98 -369 48 -87 2 -76 -165 -11 -104 263 112 23 -33 -38 -36 -81 -16 -153 151 -52 193 -171
6147a71j6J28J21P2k02J88l24M14k62L6K88j24J23k46O5R5l6k84J48K50k84K56
$$ -171 -187 -59 62 134 -68 120 -204 210 -52 -16 272 148 271 25 90 185 149 -135 13 263 -21 235
6169B35j45N1k71J66m9N2L1m12L95j25J32l58L54k8j60J16m4L86l44O7j06J19
$$ 235 90 141 -130 36 -13 39 70 -342 53 -72 60 -298 56 28 -132 -16 -60 326 -18 49 -57 62
6191F2k24K11oj14K63l19J80j06L8n3j56M15l11J30O9Q0j81K8K50k77J51k17K48
$$ 62 -162 49 43 -71 192 -127 53 -53 -15 -68 -224 191 -120 10 79 159 -22 6 256 -21 130 -87 161
6214A61k98Q9k5L42l7k12J7K4j15k02K02R6j11kp4K53m6J69k71J50o1q8K97k21
$$ 161 -137 -48 -73 269 232 20 37 61 -54 -256 -54 42 -69 -71 -145 108 62 231 -40 110 49 -39 258 37
6238C7J56m3k7q5p4J20n0k4l3j5q1j14J50r0K82j13K73n90L20k70K98R2q8L27
$$ 37 193 150 123 38 -36 84 34 10 -23 -38 -119 -233 -83 -173 109 -4 269 -321 -1 -271 27 119 31 358
6262C58n10K59m23K48o2K33J0k67o6N3M84m55j7j1M9J80NN2k62M59n05L02k28
$$ 358 -152 107 -316 -68 -130 103 113 -154 -220 -167 317 -138 -155 -166 -117 63 68 120 -142 317 -188 114 -114
6285a14J36j27L5Qr4K91k74L14k31J35l3k71L37k40K89k25k04K54l8K35m50J89
$$ -114 22 -105 -70 -62 -156 135 -139 175 -56 79 46 -225 112 -128 161 -64 -268 -14 -52 183 -267 -78
6307g8q3L34k18J04k01K60K5k09K92l90L01q3J03j33j15J52j62O9P5K6J06k62
$$ -78 -161 173 -45 59 -142 118 143 -66 226 -164 137 54 157 24 -91 61 -101 -32 43 69 175 -87
6329h7o4m1K93l28M60l08L03j37k21K9J19J64l48J71K22j91J06k28K37j22r5o9
$$ -87 -151 -192 101 -227 233 -75 228 91 -130 -101 18 182 -166 5 227 36 142 -86 151 29 -66 -135
6351a35J75k30O6J14j42L59k19JJ19q5k26L33m2l54M32k80J43L0O5j08M5n7L5
$$ -135 40 -190 -124 -10 -152 207 -12 -11 108 23 -203 130 88 -266 166 -114 29 59 124 16 61 4 39
6374C9O7k14M44r9j65k27K75j42l28M59k58L23p4j52o2J88o8Q4p4j08J36j16r6
$$ 39 106 -108 336 237 72 -155 120 -22 -350 109 -149 174 100 -52 -114 74 6 90 16 -92 44 -72 -168
6397a68L11k40K69k82P1J75n9l12RO2J33M7j01p9J50O5O2j50l8k08L28k25K16
$$ -168 143 -97 172 -110 -39 136 77 -235 -226 -164 -31 16 -85 -164 -14 51 113 -37 -75 -283 45 -180 36
6420C6J73m85J70K24L8k20J50k61L96j83j26n3J24l3p1J56m8L9o7J19J19r6J54
$$ 36 209 -276 -106 118 156 -64 86 -175 221 38 -88 -141 -17 -50 -121 35 -13 26 -41 78 197 101 255
6443B55k14J30k40k8K49r1J82r7n4J44p3l67J13J10K4p6J9L10l20lk3J50j53P2
$$ 255 41 171 -69 -97 152 61 243 146 92 236 163 -204 -91 19 43 -33 -14 296 -24 -27 -50 100 -53 19
6467A9M8k15M14k76o3O7Q5l0k68L81j49m4j21r5L54r5K70k76k3j60n6J60L8j08
$$ 19 67 -148 266 -10 -73 -6 79 49 -219 162 13 -31 -152 -247 107 12 282 6 -17 -177 -233 -73 -35 -143
6491a43j4J71k31J95r6J63j78O4q5J39K38l97J75k68M40l75J73M7k27M29l35K19
$$ -143 -157 14 -217 -22 -118 45 -133 -69 -154 -15 223 -174 1 -267 173 -202 -29 18 -209 220 -115 104
6513A04j12L2Jk8Q6k0O4Q6j7j80M5n2J73k7j89R4r6K72m47K93Q1o6J64k36M0P
$$ 104 -8 24 25 -3 83 63 127 213 196 16 61 9 182 155 -34 60 -36 236 -211 82 163 97 261 25 65 72
6539G2j8k1l43K27r1L31n17L56j25q9L71k69L50l19J48m13L02O0o3K35m82L14
$$ 72 54 33 -310 -83 -174 157 -360 -4 -129 -218 153 -116 234 -85 63 -350 -48 12 -51 184 -298 16
6561A6j03K09k66Q1p3j03N04m09J75m8L00k18j97Q9M1q8k3K35k98K80n43L56R1
$$ 16 -87 122 -144 -63 -136 -239 265 -144 31 -17 283 65 -132 -43 -2 -90 -113 122 -176 104 -439 -83 8
6584Hk51M24k74q1J12J41m6k0m2L7J93k54q1J33N7K2j30K93l03K72j60J25k43
$$ 8 -243 181 -93 -174 -62 79 33 13 -29 8 201 -53 -134 -1 56 78 -52 241 -62 210 50 175 -68
6607f8J17L6M8K28m02k2Q7n8k37L56j14J28j57J47m0j81J81j50j85K88k9N9M4
$$ -68 49 85 133 361 -41 -63 24 -34 -271 85 -29 99 -58 89 49 -132 49 -101 -286 2 -27 32 76
6630G6ql25J26k00K52K1L6J58k54J98j25J46p9j25K3m3Q9m2P2j9Q4q6K98l16Q8
$$ 76 68 -257 -131 -331 -79 -58 -22 136 -118 80 -45 101 22 -103 -80 -123 -34 -76 -4 -23 61 -25 273 -43 45
6655D5o4j22K33N0j38l9j57Q3n7K81j48N9n8O6K33j83J80l40K91k12K97l71J23
$$ 45 -19 -141 92 142 4 -35 -192 -109 -166 115 -33 26 -32 34 267 84 264 -76 215 3 300 -71 52
6678E2o4k21K16j41R0j25L05Q0k29J16j78M21j47q9k00K12Nj89J92j27J78k27
$$ 52 -12 -233 -17 -158 -68 -193 112 192 -37 79 -99 322 175 86 -114 98 103 -86 106 -21 157 -70
6700g0O4j37K15k0k86M49n50K30j39K56k84J83J36o2M6k7R4j19L0l1k05Q1j81
$$ -70 -6 -143 72 52 -234 215 -335 -105 -244 12 -272 -89 47 -15 31 4 98 -21 9 -22 -227 -146 -327
6723c27J25rL23N6k05j25M35p4l44L26l85L90l88K32k1j62J79k87M12l35L65j67
$$ -327 -202 -211 112 168 -37 -162 273 199 -145 181 -204 186 -202 30 9 -153 26 -261 151 -184 181 14
6745A4j57K75j50K56k56K97k43Q4J46m58J82o4K2J38m5j68K19j62M2R5k58L84
$$ 14 -143 132 -18 238 -18 279 36 120 266 -192 -10 -74 -52 86 41 -127 92 -70 -28 67 -191 193
6767A93m14K14kJ05%J4k13J16O9k43J28J1J50j27k44Qj15L54k50J79Q9q6r7K65
$$ 193 -221 -7 -9 96 96 110 -103 13 82 -161 -33 -22 128 1 -243 -235 -350 4 -246 -67 22 -64 -161 104
6791A04j52J63p3j62q7J28J70j2j90k5j02L16j58RK79k22J81j28k34O0M62l08
$$ 104 -48 115 42 -120 -207 -79 91 79 -111 -136 -238 78 -80 -71 208 -14 167 39 -195 -135 327 19
6813A9J73j18p6K69l40K38l0J04k10N8K4k24M34m79L98l33J98Nj27K10k45J13
$$ 19 192 74 -2 267 -73 165 135 239 29 87 111 -113 321 -158 240 -93 105 110 -17 193 -52 61
6835F1n7l9J1K02K8j95j45J02J20l90M69l2j90N2r7K7k07N08k34O7k87M10j79
$$ 61 4 -35 -24 178 206 11 -134 -32 88 -302 167 135 -55 -3 -100 -73 -280 228 -6 61 -226 184 5
6858Ek91K46P7q6j89J67p2K17k49l5M10j41J16m22K12m8RL09l39J65j94M79m48
$$ 5 -286 -40 37 -49 -238 -71 -143 74 -175 -210 200 59 175 -247 -35 -83 -74 235 -104 61 -133 346 -102
6881a02M4j00K65n0j73J46j83M01m31K56J6p3L8k3Q1j61M4O2k1n9J34k76K87j10
$$ -102 -58 -158 107 57 -116 30 -153 248 -183 73 89 16 54 31 112 -49 -5 57 36 -23 111 -165 122 12
6905A2j88Q6J30j19N0O5L37r9k92j63M67l53l4K19J77k10k51K97j47J06J1j28
$$ 12 -176 -90 40 -79 -29 36 373 274 -18 -181 286 -67 -101 118 295 85 -166 131 -16 90 101 -27
6927b7K02k60j20o0K97k26M24l6l20K41k34L66l21l1K70J49n29O6L56l48K29k79
$$ -27 175 -85 -205 -265 32 -194 230 194 -126 115 -119 247 -74 -105 165 314 -215 -149 207 -141 88 -191
6949a91j91O31j06l31k83k36J186m00J8J32j91J41K9l03L78J47m10K14J58j22
$$ -191 -382 249 143 -188 -471 -707 479 79 97 229 38 179 208 -95 283 430 20 234 392 270
6969B70m53O67l51k93o3Q09q11J83k5L18j137N74l66J860m66p08j29j96j71P49
$$ 270 -183 484 133 -160 -223 586 -225 -42 -67 251 -886 -312 -678 1182 716 8 -121 -317 -488 261
6989B61k41k24k51O35K69m64l6j63O4l11L96P0j04j51O00n18p3L13N59n10o57
$$ 261 20 -204 -455 180 449 -15 -51 -214 -150 -461 -65 5 -99 -250 350 -168 -241 72 631 121 -536
7010e36O31k25J35P87q10k22K27r4K68l57L63k97J39m28J36LK88l09J85n2J51
$$ -536 95 -130 5 792 -18 -240 -13 -107 161 -196 167 -130 9 -419 -283 -280 8 -301 -116 -168 -17
7031a7J9k23L93j30r0j51J99K9M12k17j38j39J10r4K70j83M0o3O9j51kj6r5L34
$$ -17 2 -221 172 42 -48 -199 0 29 441 224 86 -53 57 -37 233 50 90 27 96 -55 -57 -73 -168 166
7055A66n41K84J58n9j94L4RL50q7k11J1k46Q21o19j1l1J57J82j29J17l04rJ81
$$ 166 -375 -91 67 8 -186 -152 -143 207 120 -91 -80 -326 495 -124 -135 -166 -9 173 44 161 -143 -152 29
7078B9j46O4J03j78K31j80j0R4q2O5R3l26P8J99J00l63J76l6r3L13j5l9jPk22
$$ 29 -117 -53 50 -128 103 -77 -87 7 -75 -10 83 -243 -165 34 134 -229 -53 -89 -182 131 116 77 76 83 -139
7103a39j79K64p5L08j9q4O1J84k51m3J57j82Q3j92K30P5l51K36j5j79J5L99l21
$$ -139 -318 -54 -129 179 160 76 137 321 70 27 184 2 85 -107 123 198 -153 83 68 -111 -96 303 -18
7126a8J06m12P06l73Oj82Q5J40m09L18o4J31q7K94l17j88L03O3k38J54J23n9j93
$$ -18 88 -324 382 9 15 -167 -82 58 -351 -33 -97 34 -53 241 -76 -264 39 102 -136 18 141 82 -111
7149a11L38m99L29Qj11k84M17j29M8J29n2l18J81Q7j04J22jJ7l17K02L71m85O61
$$ -111 227 -272 57 65 -46 -330 87 -42 6 135 83 -235 -54 33 -71 51 50 67 -250 -48 323 -162 499
7172D99l17K26l53r54L91N34m49J14O57l96K29o83k93R94p0K72m65L16j40q14
$$ 499 182 408 55 -899 -508 26 -423 -309 348 -48 181 -502 -795 199 129 401 -64 252 112 -702
7192g02O27L01p60K87J01J25j92M03J02o56K63L09m44n10J028m35K66k27L05N0
$$ -702 -75 226 -534 -247 -146 -21 -213 190 292 -364 -101 208 -236 -746 282 -153 113 -114 191 241
7212B41l67k97L99o0N1P5j65k90j70Q93K1k02n78L52L18j13k08p7j95O67n58M10
$$ 241 -126 -423 -24 -84 -33 42 -123 -413 -583 310 331 129 -449 -97 221 108 -100 -177 -372 295 -263 147
7234A47l89K96j5K51r80L73M93m55M16q6j2j33O99m19o7k91j75L72o4K04j53K5
$$ 147 -242 54 39 290 -690 -317 176 -279 137 51 39 -94 605 186 119 -172 -347 25 -39 165 12 37
7256C7m0p8K77l01L37m55K42K5K5R2l11M39l29K19j63o8J33k62L17p6J88l09L59
$$ 37 -3 -81 196 -105 232 -223 19 44 69 161 -150 289 -40 179 16 -52 81 -181 136 60 248 -61 298
7279B98l83J98j7l01J13L0K01l14L20j23J36j43n3lk34K57j17J68k14J67j50J37
$$ 298 -85 113 96 -205 -92 -62 139 -175 145 22 158 15 -38 -41 -275 -18 -135 33 -181 -14 -164 -27
7301b7J3K50k10lq8q0P0J95o4j41k1J38j5pr4O7k6K8J2j63L73l53L57k61J16j11
$$ -27 -14 236 26 23 -65 -145 -75 120 56 -85 -106 32 17 10 -84 -17 -43 -15 -3 -166 207 -146 211 -50 66 -45
7327d5M3q2j36L26l28M72j27l40J52K8J79k96K33pP7k14J32J32k28K6J20j44Q0
$$ -45 -2 -84 -220 106 -222 250 123 -217 -65 -37 142 -154 79 72 149 -65 67 199 -29 -3 117 -27 53
7350E3K16k27M7r2j61J33J11k00J61jQ3p2K58l17O7k33J12K20j39n9n5L0L4L5
$$ 53 269 42 89 -3 -164 -31 80 -120 41 40 123 51 309 -8 59 -174 -62 158 19 -40 -95 -65 -31 4
7374DJ5k50J91R9q6l3L09m38pmMK37l49N93k94K21l69J54j29K0M14j87j59P8K9
$$ 4 19 -231 -40 59 -27 -60 249 -189 -196 -200 -196 41 -308 285 -9 212 -157 -3 -132 -112 302 115 -44 34 63
7399F3k93L62l29K92p8J23Lj23K52l87mN0J86p1R7j02j5K72k07q2j43Q2o5pQ9
$$ 63 -230 132 -197 95 17 140 143 20 272 -115 -119 -69 117 46 143 41 26 298 91 9 -134 -52 -117 -124 -35
7424c5J73l0j06K43o7j06M2n4N7k74M27k20k41L25n4J57l13K65l66L09k5Pj16
$$ -35 138 108 2 245 178 72 114 60 117 -157 270 50 -191 134 80 237 -76 189 -177 132 107 114 -2
7447bL05p6k86L63l41j06J62JJ5l26M18k42R1j46L65k51mQ1k2R8k2p8j03j6J43
$$ -2 303 227 -59 304 -37 -143 19 20 35 -291 127 -115 -24 -170 195 -56 -60 21 -1 97 75 -3 -106 -122 21
7472B1j11o0J10J15j96K50m4k35J65K49l63J27J25j80J16k41K25K8k77K45k25
$$ 21 -90 -150 -40 75 -121 129 85 -150 15 264 -99 28 153 -27 89 -152 73 101 -176 69 -156
7493a56L42j30j38R7l4J87k05Q3J8Nk7kl49M34m73M06K12m00J42o0l4L29k01n3
$$ -156 186 56 -82 15 -19 168 -37 46 64 69 42 40 -309 125 -348 58 270 -130 12 -48 -82 247 46 -7
7517gk7k24J40L11l8L02l87l5j91K30J90m21o0M22l15O6M28r0k04O64r67J96k90
$$ -7 -34 -258 -118 193 155 457 70 35 -156 74 264 -157 -217 205 -110 -44 384 294 90 754 -213 -17 -307
7540c07L32l08M16j74qN0k69N15m19J14N74q01L63j98L84n71L8K91l6k5J48J45
$$ -307 25 -283 133 -41 -49 1 -268 247 -172 -58 516 -285 78 -120 264 -307 -269 22 -14 -39 109 254
7562B54j37k7j88J57l46K03l7O5J81k19J34n9k9M9k35L18p7Q3L1j32J6R5j75K54
$$ 254 117 90 -98 59 -287 -84 -121 -56 125 -94 40 -19 -48 1 -234 84 7 90 121 -11 5 100 -75 179
7586A79n3m3j3q2N8rl4qk99N45l72L22k76R1k93R6L62j35j7R4j71k0N2m9l08N34
$$ 179 126 83 70 -12 46 37 3 -5 -304 241 -131 191 -85 6 -287 -191 171 36 19 113 -58 -78 -26 -75 -383 151
7612A51j66J40J01k42o3O0KN7J05k99N3J35Lr5j81K81k20L98k62j92K66l55P44
$$ 151 -15 125 226 -16 -79 -19 -17 40 145 -154 -101 34 37 -58 -239 42 -178 220 -42 -234 32 -323 421
7635D21m73J78k66J08J67n33M62q0K95n8K6j088R24J67q37J265m31R8J52l85l76
$$ 421 -52 126 -140 -32 135 -398 64 -16 279 221 247 -841 83 250 -587 678 247 345 497 112 -264
7656b64K31j0O97k38n95j23M08l43M98n16L37k24N39l62j46K35j14n1J05J61o86
$$ -264 -33 -43 654 416 -179 -302 106 -237 261 -255 82 -142 397 35 -111 124 10 -41 64 225 -461
7677d61N97j13r5J26k47j39L72J52o1J95j56mj98K4m9K0K8p8J79k32L58n7j0j78
$$ -461 136 23 -72 54 -193 -332 40 192 131 326 170 166 -32 -8 -57 -37 -9 -87 92 -140 218 161 151 -27
7701b7j19J78l19L92j62r8m3M38k51j50N8O1N5p0Jk4K28j28PQ1O3J7j09l2j1k2
$$ -27 -146 32 -287 105 -57 -155 -198 240 -11 -161 -103 -42 13 -57 -56 -80 148 20 27 108 171 188 79 47 36 14
7727A4J06k74K68mM6k63J89j43p8Q5j71L03j28J62k47J97m9o6Q6q3J02l48L09
$$ 14 120 -154 114 110 156 -107 82 -61 -139 -54 -225 78 -50 112 -135 62 13 -53 33 -50 52 -296 13
7750A3r6K12p7j86K84l58J88r3L16k46J10j24o1J60j07J8R0J62r8J3j11k56L10
$$ 13 -83 129 52 -134 150 -208 -20 -113 203 -43 67 -57 -118 42 -65 -47 43 205 107 120 9 -247 63
7773F3J30j81q3K02j38o3N8l60O15m48M96m47O7J26J18r8j52R3M2%j85J22j80
$$ 63 193 12 -71 131 -7 -70 -12 -372 243 -205 291 -156 -89 37 155 57 -95 -2 40 40 -145 -23 -203
7796b03J52J35LM4j56K2J16k10J41r9l1J6K06m59M57J97l8k13J3k10K62j18m1
$$ -203 -51 84 87 131 -25 -3 113 -97 44 -55 -86 -70 136 -323 134 331 293 80 93 -117 145 27 -14
7819a4J86j98j4L12k08J24l10kj27O1J04M9Oj76K62p2n6J09j36n2P3J05l14M36
$$ -14 172 -26 -40 272 64 188 -122 -124 -251 -190 -86 -37 -31 -207 55 -17 -73 36 -100 -152 -79 26 -288 148
7843A48j45K47l77J50%q9K78k36j55K04Q0j97K1P3j18M70n37J47J18j82J75nR
$$ 148 3 250 -127 23 23 -66 212 -24 -179 25 105 -92 -71 2 -116 354 -183 -36 82 -100 75 70 79
7866G9Kq4j17L40m07K15Q3r1J29P5j44j7O8j23J31k1RM0j88Jj91N2L7L24j30j52
$$ 79 81 -3 -120 220 -187 28 111 20 149 224 80 63 131 8 139 118 127 167 -21 -20 -211 -159 -122 202 72 -80
7892h0K01l74N67j37j80j03oO2j44J79QO6m6K3ok59L43l62L62o9k9k57J69K19
$$ -80 121 -253 314 177 -3 -106 -112 -50 -194 -15 -7 59 13 36 30 -229 114 -248 114 45 16 -241 -72 147
7916A47pj75k66K05p1L63k84M7Q5l2o2j10k6K97l49K75j52K65k0LjN5j84K11k40
$$ 147 140 -35 -301 -96 -167 196 -88 -41 44 12 -50 -160 -186 111 -238 37 -115 150 130 133 132 187 3 214 -26
7941b6p0J64j53K42k86J0O9L41J26n92J44k09L89j38k6m1j3J73r0J22k47l3N5
$$ -26 -96 68 -85 157 -129 -119 -50 291 417 -175 -31 -240 149 11 -15 -56 -69 104 14 136 -111 -144 -89
7964h9Q0lP7J1r3J93L0l4l08L4M6k80M42k86K57k22RK58O1j71P4qL16l96m26L20
$$ -89 -9 -12 65 76 -17 176 206 172 -136 -102 -56 -336 106 -180 77 -145 -136 122 183 12 86 78 394 -2 -428 -108
7990a08R1N91o87J15R7k40M44m32K39m17L69k20J62j46p4K82M7K69o67j65L21
$$ -108 -17 574 -113 2 99 -141 303 -129 110 -307 62 -158 4 -142 -216 66 113 382 -285 -450 -129
8011a29L24J76k97q3J19K16k20J95k50n4J15n75M67L91L4o07J48j00n5P9j01j0
$$ -129 195 371 74 -9 110 326 106 301 51 -3 112 -463 4 395 429 -178 -30 -130 -185 -106 -207 -217
8033b17l24R11n04J09o6l25L57M32m62l50J22O21j008Q36J57o47Q42k37N96r19
$$ -217 -541 370 -134 -25 -91 -416 -59 373 -89 -439 -317 304 -704 132 289 -358 484 247 843 -76
8053g6R4P02j317P54r90R76J80j202O64J43M05l83l3J54l49l68Q54J25l07l7j25
$$ -76 18 720 -597 157 -833 143 323 -879 -215 -72 333 -50 -83 71 -278 -646 208 333 26 -11 -136
8074a36R1L78o28M85k70k63j98L59M71k32L22l27L39%m47L36l69p0J16J73l11
$$ -136 -45 333 -295 190 -80 -343 -541 -182 289 57 379 52 391 391 -56 280 -89 -159 -43 130 -181
8095a81L87k32j76K84n4K39l26nJ01n6j31j5J34k28L73l62L35k41J81l9Ol1K59
$$ -181 206 -26 -202 82 28 267 -59 -64 37 -19 -150 -165 -31 -259 114 -248 87 -154 27 -12 -6 -37 222
8118B22l52J09R8lp90J207r12M41l77J08N64p21M41J083j509J87r2K93J61m74
$$ 222 -130 -21 77 74 -716 491 -421 20 -357 -249 315 -406 35 1118 -391 -204 -296 -3 158 -316
8138c16N00J096j791J075k19J99p84O34L08j080Q05q05O50p25N43m00Q51j86m54
$$ -316 184 1280 -511 564 345 544 -240 394 702 -378 427 -378 272 -453 90 -310 541 355 -99
8157i9j72M57l18n3k49j3O41K04m20L06l91N69n17M56k52p9r8Q9M42j091Q85m43
$$ -99 -271 186 -132 -185 -434 -447 194 398 -22 284 -107 462 -55 401 149 70 -28 61 503 -588 297 -146
8179a46m69J181n77q27M94J74J49J24r5k69L98K10
$$ -146 -615 566 -11 -838 -344 -170 -21 103 8 -261 137 347
8191C47
$$ Imaginary data points
##PAGE= N=2
##DATA TABLE= (X++(I..I)), XYDATA
0@%%%%%%%%qJ6j6K4l2M0n2O7q7J04j28J60j92K29k75L27l85M53n32O19p15Q25
$$ 0 0 0 0 0 0 0 0 0 -8 8 -8 16 -16 24 -28 39 -48 56 -72 88 -104 125 -150 177 -208 245 -287 332 -383 442
30D42r49J088j242J410j599J807k035K289k569K876l210L573l969M402m877N399
$$ 442 -507 581 -661 749 -850 957 -1078 1211 -1358 1518 -1692 1881 -2088 2314 -2563 2836
46B836n969O590p267Q006q816R709j0693J1783j2997J4348j5863J7579j9542K1809
$$ 2836 -3133 3457 -3810 4196 -4620 5089 -5604 6179 -6818 7530 -8333 9246 -10296 11513
60A1513k4463K7622l1447L6193m2269N0362o1766P9268j11000K66034o82056P16754
$$ 11513 -12950 14672 -16775 19418 -22851 27511 -34255 45013 -65987 200047 -482009 234745
72B34745Q2617p97771J019710q21687N4183P61038r07444L10863L02400o07667
$$ 234745 317362 -480409 539301 -282386 -228203 532835 -374609 -63746 238654 -369013
82c69013O12083l52276j93776N97546m15560k0894K55983k63979K25093j8631
$$ -369013 243070 -109206 -302982 294564 -120996 -141890 114093 -149886 75207 56576
92E6576l13973L98025n2073k98599L62706k83911J02521K53161n69654L96448
$$ 56576 -257397 140628 88555 -210044 152662 -131249 -28728 224433 -345221 51227
102E1227J40446n34518N38888l01582j46761O68344q10079L03132M33793p77469
$$ 51227 191673 -342845 196043 -105539 -252300 416044 -394035 -90903 342890 -434579
112d34579O56539k27757l48673Q03451o66865J9917N67349o51467L90227K2392
$$ -434579 221960 -5797 -354470 448981 -217884 -197967 369382 -282085 108142 130534
122A30534m50596O39625l37472j78324M26597l23611J25636Q7105k82179K74466
$$ 130534 -320062 319563 -17909 -196233 230364 -93247 32389 119494 -162685 111781
132A11781J2847k67611K41719n6077p8940J92712k54246J05137J92146l18925
$$ 111781 124628 -142983 98736 42659 -36281 156431 -97815 7322 199468 -119457
142a19457J61235O3555k32169L19913k47556r2858M29862m60889J68211J57762
$$ -119457 41778 105333 -126836 193077 -54479 -147337 282525 -178364 -10153 147609
152A47609m00002M57204k30593k19884N09995m04557N6986K70476m44930L96870
$$ 147609 -252393 204811 -25782 -245666 264329 -140228 -83242 187234 -257696 139174
162A39174o1946l36118M75904k66368l1519K43245l17706K13761N9086k79570
$$ 139174 77228 -258890 217014 -49354 -80873 162372 -155334 58427 117513 -162057
172a62057K38505l1841j41281J98359j75543K8918J63957k33373Q9849Q8554j63097
$$ -162057 76448 44607 -96674 101685 -73858 -44940 119017 -114356 -24507 64047 -99050
183i9050J37708l5633j32691K57500j79516m4212K36245k65170J71713K9436k39074
$$ -99050 38658 3025 -129666 127834 -51682 -95894 140351 -124819 46894 76330 -162744
194a62744L16247j48724j13678K77034k61303J05182J32295l19157L00115p6666
$$ -162744 153503 4779 -108899 168135 -93168 12014 144309 -174848 125267 48601
204D8601j81874K93065k40640O3533J44299k63505J82620K0528j82261K03439
$$ 48601 -133273 159792 -80848 -17315 126984 -136521 46099 66627 -115634 87805
214H7805j09977m5905J81182k00313P6484Q6405j59869J20039j4725r5976J43493
$$ 87805 -22172 -68077 113105 -87208 -10724 75681 -84188 35851 21126 -74850 68643
225F8643p4867o7335J65943j44886L1236J01724j81922J53329j8415j31749J85505
$$ 68643 -6224 -73559 92384 -52502 -21266 80458 -101464 51865 33450 -98299 87206
236H7206j09163l7655J63449j92091R4352P7909k08352K07766q3733q3970J94029
$$ 87206 -21957 -59612 103837 -88254 6098 84007 -124345 83421 -312 -84282 109747
247A09747j83985O1224R4424j78477J37666q469j24465J76941j16357j7616J37138
$$ 109747 -74238 -13014 81410 -97067 40599 32130 -92335 84606 -31751 -49367 87771
258H7771j67240R5559K8966j21610J24094m1623o2318J19619q8304r059J08528
$$ 87771 -79469 16090 45056 -76554 47540 5917 -56401 63218 -25086 -34145 74383
269G4383j36868P5235L3926j16106J23150n0507n4100J19025r3619l100J01083
$$ 74383 -62485 12750 46676 -69430 53720 3213 -50887 68138 -25481 -28581 72502
280G2502j35134Q4800K4578j27140J53807q2807l5461J20030j26074N4479N2775
$$ 72502 -62632 22168 46746 -80394 73413 -9394 -44855 75175 -50899 3580 56355
291E6355j26228J09431j4528r1304J38329j05277J1337R0731j37807R4622L416
$$ 56355 -69873 39558 25030 -66274 72055 -33222 -21885 68846 -68961 25661 29077
302B9077q3686R9971n1492l2356R7957r4247K1311O6712j08780Q5420j5927n9437
$$ 29077 -54609 45362 -6130 -38486 59471 -34776 -13465 53247 -55533 29887 13960 -45477
314d5477R4614o1671j4484P1525p2171K0206M8967r5573Q0613j0914p0152J02707
$$ -45477 49137 -12534 -27018 44507 -27664 -7458 41509 -54064 26549 15635 -54517 48190
326D8190p3165J082O3708q6660M7284K7074q5215Q3358k5200n1941J02705r2766
$$ 48190 -24975 -23893 39815 -46845 439 27513 -57702 25656 456 -51485 51220 -41546
338d1546K9756N1073r3173P7725j3091m9196P7344m6390j3837P1774q0456M0032
$$ -41546 -11790 39283 -53890 23835 10744 -38452 38892 -7498 -21335 50439 -30017 10015
350A0015K9140p6832P6888l2570k4583N9115n0984L958M1904n6896K5197K4291
$$ 10015 39155 -37677 39211 6641 -17942 41173 -9811 -5853 36051 -20845 4352 28643
362B8643o4912O6477l0020l1080O8954n8368J2262L3371n4457L9084J1543o2970
$$ 28643 -36269 30208 188 -30892 38062 -20306 -8044 25327 -29130 9954 21497 -41473
374d1473P4523l1965k8846P0692p6424M4254J7228o8308O4521j7803l2747N4130
$$ -41473 33050 1085 -27761 42931 -33493 10761 27989 -40319 24202 6399 -26348 27782
386B7782m7491M732M9030p6884M6463O967m6318N4869m1813J271M0822m3254K975
$$ 27782 -19709 -14977 34053 -42831 3632 10599 -35719 19150 -22663 -21392 19430 -23824 -20849
399b0849L3784l9160K4505M499m2610O4020l3391j8619M5100l4293J5423J5777
$$ -20849 12935 -26225 -1720 2779 -39831 24189 -9202 -27821 17279 -17014 -1591 14186
411A4186m5926M4597R555n6834O3674l3568M46M5402p4504N6226R349m9106M5349
$$ 14186 -31740 12857 22412 -34422 29252 -4316 -3870 41532 -32972 23254 32603 -16503 28846
424B8846k1874o527M5211o0572J8654L9613o1435M1855k2763j0932M5894n1434
$$ 28846 6972 445 45656 -14916 3738 43351 -18084 23771 1008 -9924 35970 -15464
436a5464L460K8541k0710j876R663k3989L5093p148l7459M6923j3385q735J5519
$$ -15464 -12004 16537 -4173 -6049 3614 -20375 14718 7570 -29889 17034 3649 -5086 10433
449A0433k3309K1233K0670n3521L0117J6105l8942M2841n0565J7049L9997p2223
$$ 10433 -12876 8357 29027 -24494 5623 21728 -17214 25627 -24938 -7889 32108 -40115
461d0115L5522K038k5549L7123m3591r10N5631o1197J9573J6544l2580N3888m5432
$$ -40115 -4593 -2555 -28104 9019 -34572 -35482 20149 -41048 -21475 -4931 -37511 16377 -29055
474b9055K97M7714l1246L817Q286n392J9522k775l1675L7765J947k4553J4677
$$ -29055 -28758 18956 -12290 -8473 -187 -5579 13943 11168 -20507 17258 19205 -5348 9329
487I329q040Q150Q967k9291M412L7512m1503J3556L284k0563N2024n5483Q270
$$ 9329 1289 9439 18406 -10885 -6473 31039 -10464 3092 6376 -14187 37837 -17646 -9376
500i376M1769m2802K6165j2111j6131N5092m4967j1333M9349m6365L3364j5649
$$ -9376 32393 -10409 15756 3645 -12486 42606 -2361 -13694 35655 -10710 22654 7005
512G005l0585O5612m6850l913K3229j9734J9918j1831k1649L2686o95k7371J7406
$$ 7005 -23580 42032 -4818 -8731 14498 -5236 14682 2851 -18798 13888 13193 -14178 3228
525C228m302P347r14j7142O880J9386j7794j5916K8409k3667J9810j3622k5428
$$ 3228 -1074 6273 5359 -11783 -4903 14483 -3311 -19227 9182 -14485 5325 -8297 -33725
538c3725N2560l6380l404K0156k5884L1982j1661l1943N4532k5468p474L0800
$$ -33725 18835 -17545 -20949 -793 -26677 5305 -6356 -38299 16233 -9235 -16709 14091
550A4091m4708N4164j7185l2056N2618l1113J1837N859k7296L1660m121k8078
$$ 14091 -30617 23547 6362 -25694 26924 -4189 7648 13507 -13789 17871 13750 -14328
562a4328K3844p879k285P211k3858J9945m75q619n910J1522J461r699J3529k0936
$$ -14328 9516 1637 -648 6563 -17295 2650 2175 -6444 -12354 -832 629 -9070 4459 -16477
576a6477K8497n167k2626L2419j6131M648J1911k7788K6632M311l5115L8794k5602
$$ -16477 12020 6853 -15773 16646 515 5163 17074 -10714 15918 20229 -14886 23908 -1694
589a694K507K4653n1485M4246j2502k1632L1646l1731J6147R855l1069K3997L97
$$ -1694 813 25466 -26019 18227 5725 -15907 15739 -15992 155 10010 -21059 2938 3335
602C335j8400K5509k2969J1246J1328k3004J9138q530N239k133r76J506j286P453
$$ 3335 -15065 10444 -12525 -1279 10049 -12955 6183 -2347 2892 759 -217 1289 3 7456
616G456j6005J4412l830p809J2600j1859J756J3120k1491J3686N745k5058L5610
$$ 7456 -8549 5863 2033 -5776 6824 -5035 -3279 9841 -11650 2036 7781 -17277 18333
629A8333k8388N620K1965l8313L5008j4445j1373K7322k5254P277J2472k5427
$$ 18333 -10055 -4435 17530 -20783 14225 -220 -11593 15729 -9525 -2248 10224 -15203
641a5203K2433n128j7151K9265k6260J3462L051j7870K2892j4658M062J450o86
$$ -15203 7230 2102 -15049 14216 -12044 1418 4469 -13401 9491 -5167 -1105 345 -341
654c41K753j091l47j086O317n697p94K978J729n738P810j2471J0786L114k1797
$$ -341 2412 1321 974 -112 6205 508 -286 2692 4421 -1317 6493 -5978 4808 7922 -13875
669a3875K6682j9944Q427P183k5738K8323j0470j0098J7248j4731O602J0981k7601
$$ -13875 12807 -7137 1290 8473 -17265 11058 588 -9510 7738 -6993 -391 10590 -17011
682a7011K4488k648j5480K2580k5457J9882M7j7916J7111p373L076q94n780N830
$$ -17011 7477 4829 -10651 11929 -13528 6354 6401 -11515 5596 -1777 1299 405 -5375 455
696D55N014j1346L733K032J278%q463Q762k628N252j2591P583O622j2744J2400
$$ 455 5469 -5877 -2144 -112 1166 1166 -7297 1465 -1163 4089 -8502 -919 5703 -7041 5359
711E359j5916J4025L310j8296J3543q43l943Q401j4017O059J6540k6863J7033
$$ 5359 -10557 3468 6778 -11518 2025 1182 -2761 5640 -8377 -2318 14222 -12641 4392
724D392l943m441J7990k7406J7354M317j0971P086o082M618O586j2243J236J1445
$$ 4392 449 -3992 13998 -13408 3946 8263 -2708 4378 -1704 2914 9500 -2743 -1507 9938
738I938j0271O383q996N576O568j1403M054l422J0026r618n49J950m9N759j4556
$$ 9938 -333 6050 -2946 2630 9198 -2205 1849 -1573 8453 -1165 -1714 236 187 5946 -8610
753h610P712L820m655j053m05r99J0408j2164k196J6068j6263J3341j0727l59
$$ -8610 -898 2922 -1733 -2786 -3191 -4190 6218 -5946 -8142 7926 -8337 5004 -5723 -6082
767f082J6867j9064P410J224j541M815o531l321J3856r542j857O171q052J3755
$$ -6082 10785 -8279 -869 355 -1186 3629 -2902 -6223 7633 -1909 -3766 2405 -5647 8108
781H108j4241K588N783m632L007p749Q180j828P71m645K792M720m526j52J086
$$ 8108 -6133 -3545 2238 -2394 613 -7136 1044 -784 -13 -4658 -1866 2854 -1672 -1824 -738
796g38L614k338K162o601J1989n428l478Q495j0569J3924j0197j206R253p659
$$ -738 2876 538 2700 -3901 8088 2660 -818 7677 -2892 11032 835 -371 8882 1223
810A223K615p98l162N134r64r640J2293r559L436J512j0056J3588j0850L121j85
$$ 1223 3838 3040 -122 5012 4048 -5592 6701 -2858 578 2090 -7966 5622 -5228 -2107 -2292
825b292j410L051l625J203L24K522l837M047k677L832k623Q50K031k858O114r224
$$ -2292 -3702 -651 -4276 -3073 -2749 -227 -4064 -17 -2694 1138 -1485 -635 1396 -1462 4652 -4572
841d572R273n262l70M918q727Q364n830j95K928l053r91L599n934M725Q74q393
$$ -4572 4701 -561 -931 3987 -4740 3624 -2206 -2401 527 -2526 -3517 82 -5852 -1127 -253 -8646
857h646J3017j0953O634M59n501J0810q718M430J100j72Q06K76j451L448j045
$$ -8646 4371 -6582 52 511 -4990 5820 -2898 1532 2632 2460 3266 3542 2091 5539 4494
872D494l367N581n720O067p619M147K02l752M132q658R011m749j109K297k810
$$ 4494 1127 6708 988 7055 -564 3583 3785 33 4165 -4493 4518 -231 -1340 957 -1853
887a853L949l076k171L487J314m818N458o899P791j504q760J2340r973P135l883
$$ -1853 2096 -980 -3151 336 1650 -3168 2290 -4609 3182 1678 -7082 5258 -4715 2420 -1463
902a463l764Q779n400K5K88K58J592k32n984Q907k907q25J023n412J1056r782
$$ -1463 -5227 3552 -1848 -1823 -1535 -1277 315 83 -5901 3006 99 -726 297 -5115 5941 -3841
918c841K762o89N66L747r186O185r36P83k227k071M021J521n102K621J542l100
$$ -3841 -1079 -1768 -1202 2545 -6641 -456 -1392 -609 -2836 -4907 -886 635 -4467 -1846 -304 -3404
934c404Q117j2555J0720J87n491Q652r509J0383k715n195N025M8j251L18m244
$$ -3404 4713 -7842 2878 3065 -2426 6226 -3283 7100 4385 -810 4215 4263 3012 3330 -914
949i14M679K058r530P328o091M923j627q367J1213p675N039n696K628M975m821
$$ -914 3765 5823 -3707 3621 -2470 2453 826 -7541 3672 -4003 1036 -4660 -2032 2943 -1878
964a878R51n5K424J431k328k295R080q009L766k232k760J1540j5166P991k167
$$ -1878 -927 -982 1442 2873 545 -1750 7330 -679 3087 855 -1905 9635 -5531 2460 293
979B93j221M627r708N842N00m043K046p24j371O659r488M097M151p629R427j0878
$$ 293 -928 3699 -6009 -167 333 -3710 -1664 -2388 -3759 2900 -6588 -2491 1660 -5969 3458 -7420
995g420R446n14n251O100o159P386m602j012L109Q1r38J75l127M501m78n125O942
$$ -7420 2026 1512 -3739 2361 -3798 3588 -1014 -2026 1083 1164 226 401 -2726 1775 1297 -3828 3114
1012C114q391R461m636l176J0349j1640Q766m668q06O677o543J217L220m175L886
$$ 3114 -5277 4184 -452 -3628 6721 -4919 3847 -821 -1627 5050 -1493 -276 2944 -1231 2655
1027B655j598n130J0596j0550N556j98n441J0452j1504P283j713j529M404n499
$$ 2655 1057 -4073 6523 -4027 1529 1331 -4110 6342 -5162 2121 408 -1121 3283 -2216
1041b216M217j25j957J736j57j663M959p535O066j746l994Q432j1823J0069n138
$$ -2216 2001 1876 -81 1655 1498 -165 4794 -2741 3325 1579 -2415 6017 -5806 4263 -875
1056h75k316P166r824P842l216k474M866l549j73M994p684O276m59n634J0678
$$ -875 -3191 3975 -5849 1993 -1223 -3697 1169 -2380 -2553 2441 -5243 1033 574 -5060 5618
1071E618j1815Q776j706m510Q198q819O607k188k066L047j772J30J410l636L445
$$ 5618 -6197 2579 873 -3637 4561 -4258 2349 161 -1905 1142 -630 -500 910 -2726 719
1086G19M70m993O964p744P744l743l088Q491r452Q927o279M02O181o586L510l70
$$ 719 1189 -3804 3160 -4584 3160 -583 -3671 4820 -4632 4295 -1984 -1582 4599 -1987 1523 1153
1102A153k046M541k858l775R115r557P014k558m830J1191j2305Q259k546j375
$$ 1153 -893 3648 790 -2985 6130 -3427 3587 1029 -3801 7390 -4915 3344 798 -577
1116e77M122o547L584R41j874J381l42o11M790q499L716J783m748P212r974Q516
$$ -577 3545 -3002 582 1523 -351 1030 688 77 4867 -3632 84 1867 -2881 4331 -5643 2873
1132B873l025k267L620n353P409m373j909L326j681P42N29m774O770j044n904
$$ 2873 -152 -2419 1201 -4152 3257 -1116 -3025 301 -1380 -638 -109 -4883 1887 843 -5061
1147e061P852q526R254m709l849R465q574N931l565l39N109l735j310L489k614
$$ -5061 2791 -5735 3519 -1190 -5039 4426 -4148 1783 -1782 -2121 2988 -747 -2057 1432 -1182
1162a182K450o49m476Q843p462L427j144j622O920r639O278k067Q11J450m740
$$ -1182 1268 619 -3857 4986 -2476 951 -193 -1815 5105 -4534 1744 -323 488 1938 -2802
1177b802M299R9j739J73P28p35M371p920N871Pl619O596r971R399k977k917M354
$$ -2802 1497 1596 -143 30 758 23 4394 -3526 2345 2352 -1267 5329 -4642 4757 1780 -1137 3217
1194C217m560M431k097k704L340L89l704L773m766M294K54o601P824o515N291
$$ 3217 -1343 3088 991 -1713 1627 2016 -1688 2085 -2681 1613 1867 -4734 3090 -3425 1866
1209A866l272j920N553m853K953k810J348J376j467p75K315j685J940j603k667
$$ 1866 -1406 -3326 2227 -2626 327 -2483 -1135 241 -1226 -2001 314 -1371 569 -1034 -3701
1224c701P495p629N230k146j255N617p944N907j921p86J918k730J611J471k787
$$ -3701 3794 -3835 1395 -751 -2006 3611 -4333 1574 -347 -1133 785 -1945 -334 1137 -1650
1239a650J183J257l836O533p013M381O69m159N712n641M832j920o98K175j370
$$ -1650 -467 790 -3046 3487 -3526 855 1524 -2635 3077 -2564 2268 348 -350 1825 455
1254D55J241q75J23QJ570l132M011l845K828n94l014N852p096N626l034p34L166
$$ 455 1696 821 944 952 2522 -610 3401 -444 2384 1790 -1224 4628 -2468 3158 124 -610 2556
1271B556m489L118j344o19P60J47j876L487m309K338J415m992O425o589M834p30
$$ 2556 -1933 1185 -159 -778 -18 129 -1747 1740 -2569 -231 1184 -3808 2617 -3972 862 132
1287A32k880M459l970K844j468k15P06O47k197K018q85K14J231m230N872m742
$$ 132 -2748 1711 -2259 585 -883 -1098 -392 255 -1942 76 -809 -595 636 -3594 2278 -2464
1303b464L146k041j164M892n527L757k064J071J239k486N93J893j221l46J459
$$ -2464 682 -1359 -2523 2369 -3158 599 -1465 -394 845 -1641 -1048 845 -376 -722 737
1318G37k524N847o513L019J387l156N221o707N119n09j507J233j458J603N51k139
$$ 737 -1787 4060 -2453 566 1953 -1203 4018 -2689 2430 1921 414 1647 189 1792 2343 204
1334B04j93K855l513K959m125K801J573n396M570l602M178k958j565L277k210
$$ 204 11 2866 -647 2312 -1813 988 2561 -2835 1735 -1867 2311 -647 -2212 1065 -1145
1349a145J786k349P83J641O1l354L381j860J990o84l644O890n780L057j788o81
$$ -1145 641 -1708 -925 716 777 -2577 804 -1056 934 250 -3394 3496 -2284 773 -1015 -1696
1365a696M703n581K143J26J25K12j329p06M165l159j076K595k369N007o133K944
$$ -1696 3007 -2574 -431 -305 -180 32 -1297 -2003 2162 -997 -2073 522 -1847 3160 -2973 -29
1381b9J283k059K544m759N488j317q88p45O04J451n39j655J288J621l298L071
$$ -29 1254 -805 1739 -3020 2468 1151 263 -482 122 1573 1034 -621 667 2288 -1010 2061
1397B061l653M464j161m419N294l898M152l510p16L980k549m00k4l63J552n0l589
$$ 2061 -1592 2872 1711 -2708 2586 -1312 2840 -670 -1386 2594 45 -355 -379 -742 810 760 -2829
1414b829M900l381J590n15l392P454n750K068j438j59L675m411K002L99J86j144
$$ -2829 2071 -1310 280 -235 -3627 3827 -1923 145 -1293 -1452 2223 -2188 -186 213 399 -745
1430g45k1j096L697l713L73K258k243M175o285M298j155r96L030m400M778k042
$$ -745 -766 -1862 1835 -1878 -1505 753 -1490 2685 -3600 698 -457 -1453 1577 -2823 1955 -87
1446h7j184J160J4J208l74k772J632J686l756N209m941M156N57m910N573m536
$$ -87 -1271 -111 -97 1111 737 -2035 -403 1283 -2473 2736 -2205 1951 2508 -2402 3171 -1365
1462a365L567j493r80J321L65j761J144k22l43J436l291M790m157J875l43k154
$$ -1365 2202 709 -271 1050 1415 -346 798 576 233 1669 -1622 3168 -989 886 543 -1611
1478a611M629n231L862j799k4J817l335K309j01r40M48m5j192L934m871K495O76
$$ -1611 3018 -2213 1649 -150 -174 1643 -1692 617 516 -424 24 -21 -1213 2721 -2150 345 1021
1495A021l185N174o260M668p53k470L526l474K611m58j382Q98O74k131K620k927
$$ 1021 -2164 3010 -3250 1418 665 -1805 1721 -1753 858 400 -982 -84 590 -1541 1079 -1848
1511a848J431J436m033M933m301L280j056j824L966m161L116j541k2J020j077
$$ -1848 -417 1019 -3014 1919 -2382 898 -158 -1982 1984 -2177 939 -602 -624 396 -681
1526f81o1J402j838J474L74k833M711n201L646q67k592N052n548M419j382j024
$$ -681 -742 660 -1178 296 670 -2163 2548 -2653 993 126 -2466 2586 -2962 1457 75 -949
1542i49K070k189J035P57j304N40J201l868N553m621K953j52k736M228m488L613
$$ -949 1121 -1068 -33 724 -580 -40 1161 -2707 2846 -1775 1178 1026 -1710 2518 -1970 1643
1558A643j647k84J935k510J360l68j19N96L51k313L327k841J861q1k829N509n589
$$ 1643 -4 -288 1647 -863 497 129 10 606 957 -1356 1971 -870 991 910 -1919 3590 -1999
1575a999L063j193j508L961m380J924J87q21Q99j89r15K180k811J463J575l504
$$ -1999 1064 -129 -1637 2324 -2056 -132 55 -766 133 -56 -971 1209 -1602 -139 1436 -2068
1591b068M120n050L676k38k540L617k452J543j656o68J366J1j01J247j593J443
$$ -2068 2052 -2998 678 440 -2100 1517 -935 608 -1048 -1716 -350 -339 -440 807 -786 657
1607F57J3k900M020m874L908j540j059M829m912K514j368O82J494j665L44J053
$$ 657 670 -2230 1790 -3084 824 -716 -1775 3054 -1858 656 -712 -30 1464 -201 143 1196
1623A196j075K37O42k448N155l923J092N18k847M487n070L147k73j260J928k793
$$ 1196 121 358 1000 -1448 3707 -216 876 1394 -1453 3034 -2036 1111 838 -422 1506 -1287
1639a287J875m35r41J49P68p77J731k772J986P86k949L101m636M133r96j679K426
$$ -1287 588 153 -788 -639 129 -648 1083 -1689 297 1083 -1866 1235 -3401 732 -264 -1943 483
1656D83k519K553j254q82J393j19o51J502j861J471J72k783M299l788K558j088
$$ 483 -2036 517 -737 -1619 -226 -345 -996 506 -1355 116 288 -2495 1804 -1984 574 -514
1672e14j356M179m211K116p02l93J562m59j167J542j260K41J364k592L807l542
$$ -514 -1870 2309 -1902 214 -488 -881 681 222 -945 597 -663 -422 942 -1650 2157 -1385
1688a385K570l7k183L803l957L036j185n00J575j339P70K7p12M53Q02k425L067
$$ -1385 1185 1148 -1035 2768 -1189 1847 662 162 1737 398 1168 1195 483 936 1738 -687 2380
1705B380l009J547O5k345M394m820L257j281r34J833k417J775k00p88O4N41j374
$$ 2380 -629 918 983 -1362 3032 -1788 1469 188 -746 1087 -1330 445 245 -543 -479 62 -1312
1722a312K582k169M52J343k981L604l940L108o51j301K066k479K422j124m52N24
$$ -1312 1270 -899 -447 896 -2085 1519 -2421 687 36 -1265 801 -1678 744 -380 -832 -308
1738c08N90j263J234j344P06J049k997L592l110K467o14j859L537l244K318j329
$$ -308 282 -981 253 -1091 -385 664 -2333 1259 -1851 616 2 -1857 1680 -1564 754 -575
1754e75O8J038m77n95J331m79k08O91k167L818l309J275L13j641L277m037K472
$$ -575 -507 531 54 -541 790 311 103 794 -1373 2445 -864 411 724 -917 2360 -1677 795
1771G95k75l92O49j410J171q8l03q34J620j858K503k921P93J689k782K753l460
$$ 795 520 128 777 -633 538 450 147 -687 933 -925 1578 -1343 -550 1139 -1643 1110 -2350
1788b350L237q64j254J689j128J158q61k19k59J306j964J387r07J316J209k908
$$ -2350 887 23 -1231 458 -670 488 -373 -592 -851 455 -1509 -122 -1029 287 1496 -1412
1804a412L281l320K451j170j069L038k021O98n15M83j63J23j354R02J07k34R64
$$ -1412 1869 -1451 1000 -170 -1239 1799 -222 476 -39 444 281 404 -950 -48 59 -175 789
1821G89k101L263l393J252J021j703K567l023J942J98l03K32n67Q35K97r74k57
$$ 789 -1312 1951 -1442 -190 831 -872 1695 -1328 614 812 509 741 174 1009 1306 332 75
1838G5K025k802K673l059J204Q98k671K622m229M016q60j662J456q07P64o88M02
$$ 75 2100 -702 1971 -1088 116 1014 -1657 965 -3264 752 -108 -1770 -314 -1121 -357 -1045 -643
1855f43P6J355k769K365j165N91P54k571L563k458J641j203r9J678j494J8n45
$$ -643 -567 788 -1981 384 -781 -190 564 -2007 1556 -902 739 -464 -563 1115 -379 -361 -906
1872i06J182l13k57j133J880p43n92J624k203L904l456J532K35r61J856k732J986
$$ -906 276 -37 -294 -1427 453 -290 -882 742 -1461 2443 -1013 519 754 -207 1649 -1083 903
1889I03l05J15n85J64p61J287j506m7J623k482K580k532K081K39k623K787k241
$$ 903 598 713 128 292 -469 818 -688 -735 888 -1594 986 -1546 535 774 -1849 938 -1303
1906a303K043j096m74J036J18Kk43j8k90J181k238K674k146P61K39k066L219k923
$$ -1303 740 -356 -830 206 324 326 83 65 -225 956 -1282 1392 -754 7 246 -1820 1399 -1524
1924a524J962r43J9R10j169P15o78O61j05N40j310K413j911N79J365k649L265
$$ -1524 438 -505 -486 424 -745 -30 -708 -47 -152 388 -922 1491 -420 159 1524 -1125 2140
1941B140k717K050o94r06J452j480J334p06Q1p92J275j649J622j038J31J130k685
$$ 2140 -577 1473 779 -127 1325 -155 1179 473 554 -238 1037 -612 1010 -28 103 1233 -1452
1958a452L090k642J927p12j180K044k043J484p95J91J04kn40R78j045p8J050k255
$$ -1452 1638 -1004 923 211 -969 1075 -968 516 -279 -88 16 14 -526 452 -593 -671 379 -1876
1976a876L146k764J533L85j898K799k954K188j023r6Q30o92J36M97l92o79J791
$$ -1876 1270 -1494 39 424 -1474 1325 -1629 559 -464 -560 270 -422 -286 211 -181 -860 931
1993I31k435K482k078J093J99j796K598k628J927p54j11J190j274O31o5J88k06
$$ 931 -1504 978 -1100 -7 192 -1604 994 -1634 293 -461 -572 618 -656 -25 -90 98 -108
2010a08Q88j648K226j376J73J065k064L108l233K174q48k64J173j598J026m02
$$ -108 780 -868 1358 -18 155 1220 -844 2264 -969 1205 357 93 1266 -332 694 292
2026B92j65l59P79j015J429j434j2J268k295K797k854J875m9j473K178k225J966
$$ 292 127 -232 547 -468 961 -473 -485 783 -1512 1285 -1569 306 257 -1216 962 -1263 703
2043G03j178K64J05N92o73Q22n57K79Q76k287K523k219J682j69j505K165k347
$$ 703 -475 -211 -106 486 -187 635 78 357 1233 -1054 1469 -750 932 763 -742 1423 -924
2060i24J707j200R0N43n15n3J00J49m73Q76j834K742k248J081O75k113K890k890
$$ -924 783 -417 -327 216 -299 -352 -252 -103 -576 300 -1534 1208 -1040 41 716 -1397 1493 -1397
2078a397J714j89l94R66j233J023j83k0m88Q56j336J568j559M21O81j668K335
$$ -1397 317 128 -266 700 -533 490 307 287 -201 655 -681 887 -672 -251 430 -1238 1097
2095A097k920K043m76r49J370j231J263j042K40M26K15q89J091r44L74R01j885
$$ 1097 -1823 220 -256 -1205 165 -1066 197 -845 -605 -179 36 -853 238 -706 -332 569 -1316
2112a316K725k536J636k35j052K344k280J597q57K56J14j02l16N22l95l00R44
$$ -1316 1409 -1127 509 274 -778 1566 -714 883 26 282 396 294 -22 500 105 -195 749
2129G49j877K692k359J015M57j526K052k348J763p16j93N14l50K44P0K04p60R46
$$ 749 -1128 1564 -795 220 677 -849 1203 -1145 618 -98 -291 223 -127 117 187 391 -369 577
2147E77j393J990j488O18L56j596K630k708J888p11n3Q35j241P03n28R5j97N73
$$ 577 -816 1174 -314 304 660 -936 1694 -1014 874 163 110 945 -296 407 -121 -26 -223 350
2165C50j345J722j486K40J147k267K834k751J701k43p02J386j700J596n39Mo1
$$ 350 -995 727 -759 -519 628 -1639 1195 -1556 145 -98 -800 586 -1114 482 -57 -53 -114
2182a14P32p98R39q52K43J012k028K363k348J682k69j114J580j942J890j130j93
$$ -114 618 -180 759 -93 150 1162 -866 1497 -851 831 562 -552 1028 -914 976 -154 -347
2199c47K54K41p08O34m07j2Q54k222K540k091J000L56j295K257k185J526q35K54
$$ -347 -93 148 -560 74 -333 -345 509 -1713 827 -1264 -264 92 -1203 1054 -1131 395 -440 -186
2217a86N98p42M35J72J92n14Q32j338J909j797L72N30j236J886k191J522l95n53
$$ -186 412 -330 105 277 469 -45 787 -551 1358 -439 -67 463 -773 1113 -1078 444 49 -504
2235e04P98r84J048o50Q9m00J030q70J234r73K97J132j856K238k093J688l17r76
$$ -504 294 -690 358 -292 -203 -603 427 -443 791 -182 115 1247 -609 1629 -464 1224 907 -69
2253f9J302j277Q68o89M74m12K03q29P51l42j51Q41j842K167j619Q23o5r05J750
$$ -69 1233 -44 824 135 609 197 400 -429 322 -20 -171 670 -1172 995 -624 199 134 -771 979
$$ [...]
8191A72
##END NTUPLES=NMR FID
##END=
