##TITLE=1H_29-2022
 CDCl3
 8 sc, 
 2.06.2022
##JCAMPDX= 6.0         $$ Bruker NMR JCAMP-DX V2.0
##DATA TYPE= NMR FID
##DATA CLASS= NTUPLES
##ORIGIN= UXNMR, Bruker Analytische Messtechnik GmbH
##OWNER= root
$$ XWIN-NMR		Version 3.5
$$ Thu Jun  2 13:48:59 2022 Russian Standard Time (UT+4h)  she@DPX200
##.OBSERVE FREQUENCY= 200.13135
##.OBSERVE NUCLEUS= ^1H
##.DELAY= (6, 6)
##.ACQUISITION MODE= SIMULTANEOUS
##.ACQUISITION SCHEME= undefined
##.AVERAGES= 8
##.DIGITISER RES= 18
##SPECTROMETER/DATA SYSTEM= spect
##.PULSE SEQUENCE= zg30
##.SOLVENT NAME= DMSO
##.SHIFT REFERENCE= (INTERNAL, DMSO, 0, 15.7039)
##AUDIT TRAIL= $$ (NUMBER, WHEN, WHO, WHERE, WHAT)
$$ ##TITLE= Audit trail, XWIN-NMR		Version 3.5
$$ ##JCAMPDX= 5.01
$$ ##ORIGIN= Bruker BioSpin GmbH
$$ ##OWNER= she
$$ F:/spectra/data/she/nmr/H-F/1/audita.txt
$$ ##AUDIT TRAIL=  $$ (NUMBER, WHEN, WHO, WHERE, WHAT)
(   1,<2022-06-02 13:47:39.46 +0400>,<she>,<DPX200>,
      <created by zg, POWCHK disabled, PULCHK disabled
       configuration hash MD5:
       00 E9 B6 7A A2 85 ED C7 34 08 36 98 17 FE 4E 26
       data hash MD5: 16K
       D5 7D 9A 44 DF B3 CF 02 7C 5F D4 8E 2B B0 66 D3>)
$$ ##END=
$$ 
$$ hash MD5
$$ 7B 2D 40 F2 FC 70 4C 14 88 00 8C 7A 4C 3E 40 6F
##$RELAX= 
##$RELAX= 
##$RELAX= 
##$RELAX= 
##$RELAX= 
##$RELAX= 
$$ Bruker specific parameters
$$ --------------------------
##$DU= <F:/spectra>
##$EXPNO= 1
##$NAME= <H-F>
##$PROCNO= 1
##$TYPE= <nmr>
##$USER= <she>
##$AMP= (0..31)
100 100 100 100 100 100 100 100 100 100 100 100 100 100 100 100 100 100 
100 100 100 100 100 100 100 100 100 100 100 100 100 100 
##$AQSEQ= 0
##$AQ_mod= 1
##$AUNM= <au_zg>
##$AUTOPOS= <>
##$BF1= 200.13
##$BF2= 200.13
##$BF3= 200.13
##$BF4= 200.13
##$BF5= 200.13
##$BF6= 200.13
##$BF7= 200.13
##$BF8= 200.13
##$BYTORDA= 1
##$CFDGTYP= 0
##$CFRGTYP= 5
##$CHEMSTR= <none>
##$CNST= (0..31)
1 1 145 1 1 1 1 1 1 1 1 1 1 1 1 1 1 1 1 1 1 1 1 1 1 1 1 1 1 1 1 1 
##$CPDPRG= <>
##$CPDPRG1= <>
##$CPDPRG2= <>
##$CPDPRG3= <>
##$CPDPRG4= <mlev>
##$CPDPRG5= <mlev>
##$CPDPRG6= <mlev>
##$CPDPRG7= <mlev>
##$CPDPRG8= <mlev>
##$CPDPRGB= <>
##$CPDPRGT= <>
##$D= (0..31)
0 1.2 0 0 0 0 0 0 0 0.06 0 0.03 0 0 0 0 0.0002 0 0 0 0 0 0 0 0 0 0 0 0 
0 0 0 
##$DATE= 1654163258
##$DBL= (0..7)
120 120 120 120 120 120 120 120 
##$DBP= (0..7)
150 150 150 150 150 150 150 150 
##$DBP07= 0
##$DBPNAM0= <>
##$DBPNAM1= <>
##$DBPNAM2= <>
##$DBPNAM3= <>
##$DBPNAM4= <>
##$DBPNAM5= <>
##$DBPNAM6= <>
##$DBPNAM7= <>
##$DBPOAL= (0..7)
0.5 0.5 0.5 0.5 0.5 0.5 0.5 0.5 
##$DBPOFFS= (0..7)
0 0 0 0 0 0 0 0 
##$DE= 6
##$DECBNUC= <off>
##$DECIM= 32
##$DECNUC= <off>
##$DECSTAT= 4
##$DIGMOD= 1
##$DIGTYP= 9
##$DL= (0..7)
0 120 120 120 120 120 120 120 
##$DP= (0..7)
150 150 150 150 150 150 150 150 
##$DP07= 0
##$DPNAME0= <>
##$DPNAME1= <>
##$DPNAME2= <>
##$DPNAME3= <>
##$DPNAME4= <>
##$DPNAME5= <>
##$DPNAME6= <>
##$DPNAME7= <>
##$DPOAL= (0..7)
0.5 0.5 0.5 0.5 0.5 0.5 0.5 0.5 
##$DPOFFS= (0..7)
0 0 0 0 0 0 0 0 
##$DQDMODE= 0
##$DR= 18
##$DS= 0
##$DSLIST= <SSSSSSSSSSSSSSS>
$$ [...]
##$SUBNAM2= <"">
##$SUBNAM3= <"">
##$SUBNAM4= <"">
##$SUBNAM5= <"">
##$SUBNAM6= <"">
##$SUBNAM7= <"">
##$SUBNAM8= <"">
##$SUBNAM9= <"">
##$SW= 18.05172834244
##$SWIBOX= (0..15)
0 0 2 0 0 0 0 0 0 0 0 0 0 0 0 0 
##$SW_h= 3612.71676300578
##$TD= 16384
##$TD0= 1
##$TE= 0
##$TE2= 300
##$TE3= 300
##$TEG= 300
##$TL= (0..7)
0 120 120 120 120 120 120 120 
##$TP= (0..7)
150 150 150 150 150 150 150 150 
##$TP07= 0
##$TPNAME0= <>
##$TPNAME1= <>
##$TPNAME2= <>
##$TPNAME3= <>
##$TPNAME4= <>
##$TPNAME5= <>
##$TPNAME6= <>
##$TPNAME7= <>
##$TPOAL= (0..7)
0.5 0.5 0.5 0.5 0.5 0.5 0.5 0.5 
##$TPOFFS= (0..7)
0 0 0 0 0 0 0 0 
##$TUNHIN= 0
##$TUNHOUT= 0
##$TUNXOUT= 0
##$USERA1= <user>
##$USERA2= <user>
##$USERA3= <user>
##$USERA4= <user>
##$USERA5= <user>
##$V9= 5
##$VALIST= <valist>
##$VCLIST= <CCCCCCCCCCCCCCC>
##$VD= 0
##$VDLIST= <DDDDDDDDDDDDDDD>
##$VPLIST= <PPPPPPPPPPPPPPP>
##$VTLIST= <TTTTTTTTTTTTTTT>
##$WBST= 1024
##$WBSW= 4
##$XGAIN= (0..3)
0 0 0 0 
##$XL= 0
##$YL= 0
##$YMAX_a= 138092
##$YMIN_a= -179801
##$ZGOPTNS= <>
##$ZL1= 120
##$ZL2= 120
##$ZL3= 120
##$ZL4= 120
##$ABSF1= 10
##$ABSF2= 0
##$ABSG= 5
##$ABSL= 3
##$ALPHA= 0
##$AQORDER= 0
##$ASSFAC= 0
##$ASSFACI= 0
##$ASSFACX= 0
##$ASSWID= 0
##$AUNMP= <proc_1d>
##$AZFE= 0.1
##$AZFW= 0.1
##$BCFW= 1
##$BC_mod= 2
##$BYTORDP= 1
##$COROFFS= 0
##$CY= 11.3945322036743
##$DATMOD= 1
##$DC= 2
##$DFILT= <>
##$DTYPP= 0
##$F1P= 2.36226072786647
##$F2P= -0.459571619588291
##$FCOR= 0.5
##$FTSIZE= 0
##$FT_mod= 4
##$GAMMA= 1
##$GB= 0.15
##$INTBC= 1
##$INTSCL= 1
##$ISEN= 128
##$LB= 0.24
##$LEV0= 0
##$LPBIN= 0
##$MAXI= 10000
##$MC2= 0
##$MEAN= 0
##$ME_mod= 0
##$MI= 1.114404
##$NCOEF= 0
##$NC_proc= 0
##$NLEV= 6
##$NOISF1= 3.799351
##$NOISF2= 2.8
##$NSP= 1
##$NTH_PI= 0
##$NZP= 0
##$OFFSET= 15.70392
##$PC= 1
##$PHC0= -18041.88
##$PHC1= 15.40074
##$PH_mod= 1
##$PKNL= yes
##$PPARMOD= 0
##$PSCAL= 0
##$PSIGN= 0
##$REVERSE= no
##$SF= 200.130013532006
##$SI= 16384
##$SIGF1= 3
##$SIGF2= 2
##$SINO= 400
##$SIOLD= 16384
##$SREGLST= <1H.CDCl3>
##$SSB= 0
##$STSI= 0
##$STSR= 0
##$SW_p= 3612.71676300578
##$SYMM= 0
##$S_DEV= 0
##$TDeff= 0
##$TDoff= 0
##$TI= <>
##$TILT= no
##$TM1= 0
##$TM2= 0
##$TOPLEV= 0
##$USERP1= <user>
##$USERP2= <user>
##$USERP3= <user>
##$USERP4= <user>
##$USERP5= <user>
##$WDW= 1
##$XDIM= 8192
##$YMAX_p= 0
##$YMIN_p= 0
$$ End of Bruker specific parameters
$$ ---------------------------------
##NTUPLES= NMR FID
##VAR_NAME=  TIME,          FID/REAL,        FID/IMAG
##SYMBOL=    X,             R,               I
##VAR_TYPE=  INDEPENDENT,   DEPENDENT,       DEPENDENT
##VAR_FORM=  AFFN,          ASDF,            ASDF
##VAR_DIM=   8192,          8192,            8192
##UNITS=     SECONDS,       ARBITRARY UNITS, ARBITRARY UNITS
##FACTOR=    0.0002768,     1,               1
##FIRST=     0,             0,               0
##LAST=      2.2672688,     0,               0
##MIN=       0,             -179801,         0
##MAX=       2.2672688,     138092,          0
$$ Real data points
##PAGE= N=1
##DATA TABLE= (X++(R..R)), XYDATA
$$ [...]
1767F24j152J285j296j482J730m19L94J777k149R2N21j029J829K49k07M1j440
1784f32O69M38k75J733j569q39Q54j322J095J152j807O11n69j075J874o10O6L43
1802A37j571P96J0K52J386j028o6J52j365K074L71j041J317j506o93J834p62M54
1820G51L19j523K20l97K19J369j192L23m68j411J705k49L6J032j873j50J194r05
1838a000J604L53j376M97q25O85J189n72Q13j058q96J071o75R05Q92k177N69k56
1856b57j047J974l47p78N83j483K25R26j01J199j158o02Q64j019J574N71j512
1873c88J304j243m00J861o80L74N36k039M96L59k23J088o56o83P7j232J406J26
1891H3l43Q68j809J11J375j367J603L24j867J112n27J2J621q13J55j52j137J228
$$ plain form
1767 624 -528 757 -539 -2021 -291 -710 -316 1461 -688 -596 -75 -1104 725 974 767 808 -632
1784 -632 37 475 200 1933 364 -475 379 -943 152 1304 -503 108 -461 -1536 338 -272 -206 137
1802 137 -1434 -638 -628 -376 1010 -18 -84 68 -1297 777 1148 107 1424 -82 -775 1059 297 751
1820 751 1070 -453 -233 -630 -411 958 -234 89 -379 -1790 -85 -334 -298 734 -1139 -1289 -95 -1000
1838 -1000 604 957 -419 78 -747 -62 1127 555 1368 310 -586 485 -190 715 1607 -570 -1 -257
1856 -257 -1304 670 323 -455 128 -1355 -1130 -204 -305 894 -264 -866 -2 -1021 553 1124 -388
1873 -388 916 -327 -727 1134 454 828 1364 -675 -179 180 -43 1045 389 -294 -217 -1449 -43 83
1891 83 -260 608 -1201 -1090 285 -1082 521 845 -1022 90 -437 -425 1196 383 538 386 -751 477
1909D77j94K90Q74j909L11K26j023J860l92j261R30j245Q3J408p91O55l76j017
1927a094R35l29P41P28j346O60l39p80J940p04k38Q51j846O70Q46r54J286o73
1945C54j057O16o71J012K50r11P37j210j99J459p09O84M80j986Q78J53k21J593
1963A252r06l71J92r22R22L51k30P48j475mO65q31J522k73j388Q36r76J33J541
1982G86q79J7L10j530J260Q3j00Q96j030J9M5o63J617l06n10P29j594M98J261
2001I09j289J039j22j596R85k71K94P07j053L90l07o47J571m44o1O23j812R67
2019a17O16q96J621r71r45J153r09N88P51r62K98o95j61J098o86O23J15j626J220
2038A15o38j52J863j267k48O26j382J097P44q88R89j215l7O02l50J109l21r53
$$ plain form
1909 477 283 573 1447 -462 -151 75 -948 912 520 -741 189 -1056 -973 435 -356 299 -77 -1094
1927 -1094 -159 -488 253 981 -365 295 -44 -824 1116 412 174 1025 -821 -151 695 -259 1027 354
1945 354 -703 -87 -758 254 504 -407 330 -880 -1079 380 -329 355 835 -1151 -273 -120 -341 1252
1963 1252 346 -25 167 -755 167 518 288 1036 -439 -443 222 -609 913 640 -748 88 -888 -755 786
1982 786 -93 -76 234 -1296 -36 47 -53 843 -187 -168 -123 -786 831 525 15 744 -850 -352 909
2001 909 -380 659 537 -1059 -74 -345 -51 656 -397 -7 -314 -961 610 166 105 728 -1084 -117
2019 -117 499 -397 1224 253 -692 461 -448 140 891 -71 227 -468 -629 469 -217 406 521 -1105 115
2038 115 -523 -675 1188 -79 -327 299 -1083 14 758 -130 859 -356 -393 209 -141 968 647 -306
2056c06N15r33J42J494j123O18j68j601J353j18k35J195j298j29M64o48J233l5
2074D20l71M58j181N08P53p83J183n67j091J260q54M24R42j359L56m5q20J109
2092C42k39j01K69j339R00k9n13J543j004l98P16j132R95J088j213O32n04m62
2110d49J028l52L40L80j191N02l44q9J000j079L57J7j295J157K20p74J318j269
2128e23l33Q73p28P85L23p99M14n05K79R22p41R09o65q62J231m80L1J062j446
2147b53k9O87r40R51q7o15N80j232N37L73l57P88o55o77R69r16Q30Q82j271P63
2167C28l40o54J416m04j00N01j169M66K03j95J003j114l1K67j004J057L6p76J036
2186E26j104n44J329o44M16N20j316O17p5l62J217m87j6K74j170J192o6k82J076
$$ plain form
2056 -306 209 -724 -582 912 -211 407 239 -1362 -9 -127 -362 833 -465 -594 -130 -778 455 420
2074 420 49 507 -674 -166 587 -196 987 420 -671 589 -265 159 1101 -258 98 53 -767 342
2092 342 103 2 271 -1068 -168 -197 -710 833 -171 -569 147 -985 10 1098 -115 517 13 -449
2110 -449 579 227 567 947 -244 258 -86 -175 825 -254 103 120 -1175 -18 202 -572 746 -523
2128 -523 -856 17 -711 74 397 -402 12 -493 -214 708 -33 876 211 -651 580 100 131 1193 -253
2147 -253 -282 405 -535 416 329 -286 294 -938 -401 -28 -385 403 -252 -929 40 -876 -46 836 -435 328
2167 328 -12 -666 750 346 246 747 -422 44 247 52 1055 -59 -90 177 -827 230 266 -510 526
2186 526 -578 -1122 207 -437 -21 499 -817 -200 -275 -637 580 93 77 351 -819 373 307 25 1101
2205A101j345o3Q59r91J017L04j343P49p85J04Q96q24N51k03q12Q34m38K99O02
2224E12j079L49K75r85J520l18n43O31p37J07Q57m87N10k15p00Q22j028O68N79
2243G38j095O17o73m42J487q82K00N79j394L78M84n09R68n85k78M43q23Q21M96
2262E30o82P12r08j45J110r02Q66K40j478Q12q6n46J188o59P1J51r86O48J54k35
2282a45P19j142K74K63q11J317p4j124J179r10m5J116r38M89L20q50M87j09pN86
2302E95q55L84q1n56J220o18l19P42j343O27O23r39P66j07r71P79l60L17M47o21
2322b70M01m01l43J053n07J37N63j385R93m4m81J115o04l74M99q27O15M75p93
2341a78O50o60j86M49m46O32J27j055Q21o68p2J207j023K54M75r81O46K65n54
$$ plain form
2205 1101 -244 -307 552 -439 578 882 -461 288 -497 -393 503 -321 230 27 -785 49 -389 -90 512
2224 512 -567 -218 57 -928 592 274 -269 362 -375 -268 589 102 612 397 -303 519 -509 159 738
2243 738 -357 260 -413 -855 632 -250 -50 529 -865 -487 -3 -512 456 -129 -407 36 -787 34 530
2262 530 -152 560 -348 -493 617 -285 581 821 -657 155 69 -477 711 52 123 274 -712 -64 90 -145
2282 -145 574 -568 -294 -31 -842 475 401 -723 456 -454 -499 617 -321 168 488 -362 125 16 9 595
2302 595 -260 124 43 -513 707 89 -230 512 -831 -204 419 -520 246 139 -832 -53 -413 -96 351 -270
2322 -270 131 -270 -613 440 -67 70 633 -752 241 197 -284 831 227 -147 352 -475 140 615 -178
2341 -178 472 -188 -374 75 -371 261 388 -667 154 -514 -586 621 -402 -148 327 -654 -8 257 -297
2360b97R45p42j95N66l97O94j76n35Q49j145K30Q77j037P64j08r81Q90k44j59
2379b01P01q86K93K8o42J015m89M4M99r53M79J93n09J038k83q44R49o00L07P29
2399H68j086N14k7o67O04l03J22M94j032L74r2k16J040p69j63N71j058N65M74
2418B13m72N89l95m37P80k63L35J34o73N68m17L8P85r59L63L43j102Q01J58p13
2438c24R97r40j28M30n02M55k5l19M94o19J52N75o58R66n82o23R76o06K29R09
2458H57j093K46K60o98R19p2k19K57q57L79J18m03P96m26n75P86r49N62L64p79
2478e27O90l83n21R67k18J15L89r38L80Q7l83R22m48j79M32q47P26O9o56Q86o66
2499a03m21Q08o21L56N01r21M10m64K4Q12p41M59Op91R25l04j26O45o68n1O55
$$ plain form
2360 -297 648 -94 -289 277 -120 574 398 -137 712 -433 -203 674 -363 401 293 -688 202 -42 -201
2379 -201 500 -386 -93 -65 -707 308 -181 -137 362 -591 -112 81 -428 610 327 -517 432 -168 139 868
2399 868 -218 296 269 -398 206 -97 25 519 -513 -139 -231 -447 593 -176 -339 232 -826 -261 213
2418 213 -259 330 -65 -502 278 15 350 484 -189 379 -38 0 785 -174 189 532 -570 231 389 -324
2438 -324 673 -267 -395 35 -467 -12 -37 -356 138 -481 -329 246 -412 554 -28 -651 325 -281 -52 857
2458 857 -236 10 270 -428 491 419 200 457 -400 -21 97 -306 490 64 -511 275 -674 -112 252 -527
2478 -527 163 -220 -741 226 8 123 512 -426 -46 41 -342 580 132 -47 385 -462 264 333 -323 563 -103
2499 -103 -524 284 -337 19 520 -401 9 -455 -431 381 -360 99 105 -686 239 -65 -191 454 -214 -265 390
2520C90o53N91ko71P04n59p1O97m62M19m20m79P09o40L61P87j080N96j51p56Q78
2541A88j69l66P95p72L9M46m52P61l57m31O59o71N30K80p83P56m87m77Q91n54
2561a74L00L85q34M01q1m67P76k75j85K95o06M29K92k93M26o21j36O28p88O92
2581A64K56p76M53k77q3R14p26K35n6m20N21k66K43K95o27J20K49p62Q05m1o14
2602c93Q54p61o8N98n20N20q6o54N42j53J07K19n92M84j17m63P36k21p2M91q78
2623d27M05M02p24O31j04k65L14m37J24M61m65L78l11l73P61p63M82L18r72O97
2643A32k28m49Q88n46r1O79p92K18L61k93M63m73L8K93n66O14J55p73N99l35j88
2664b94Q43o82L23Q9q00N34L2j66M84m64j89K76m33O27k25j90M37n07R9O31o44
$$ plain form
2520 390 -263 328 326 -345 359 -200 -271 426 -36 383 -37 -516 193 -447 -86 701 -379 217 66 -690 188
2541 188 19 -347 448 -324 -285 161 -291 470 113 -318 341 -330 200 480 -303 453 -34 -511 380 -174
2561 -174 126 511 -323 78 -3 -470 306 31 -154 141 -465 -36 256 -37 389 -232 -368 260 -528 164
2581 164 420 -356 97 -180 -263 651 -75 160 104 -316 205 -61 182 477 -150 -30 219 -543 262 221 -393
2602 -393 461 -300 -368 230 -290 230 144 -510 32 -121 -14 205 -387 97 -20 -483 253 32 -40 451 -427
2623 -427 -22 380 -344 287 183 -82 232 -205 -81 380 -85 293 -18 -391 370 -393 89 407 -565 132
2643 132 -96 -545 343 -203 -294 385 -407 -189 172 -121 342 -131 -93 200 -366 248 403 -370 229 -106 -294
2664 -294 549 -133 190 279 -521 13 45 -121 363 -101 -290 -14 -447 180 -45 -235 202 -305 -206 425 -219
2685b19M47j3o70P60l02n9N80m84J70j15m51O38k88L8N00r89L64P3m50Q48n06
2706a28k41M84l16p1N63n40K33m9k24N49l46K53Q6o20N80j06k61O99o06J07K76
2727C22q13N74J88l90M82l17l21M87n70L52J93n73N58n66oQ15p25K89L1n32P70
2748B48l05j01O78p25J53K46m76P09k24l10M53o02J19K50l92O93m57l64P26o68
2768c49O0N27o65M11P6m44N10l53K34L21m85J67J05l35O01l90k50O30p10N66J05
2789C32o71N92l86j57O32l54O9J33m91K05J22j67M70n80J75K29p53N73J96m50
2809b81O60n76J13L62m44M06P0m48M70m59p6O66n05K09J08n15M76l67K9N16q84
2830d70L17K13m50O09j13n01N34m82K55J82k63M87l42k30N02l81K05M93q07N26
$$ plain form
2685 -219 228 215 -455 305 3 -56 524 40 210 95 -356 282 -6 32 532 -457 -93 -20 -470 378 -128
2706 -128 -369 115 -201 -272 291 -249 -16 -65 -289 260 -86 167 253 -367 213 107 -154 545 -61 46 322
2727 322 -491 83 271 -119 363 46 -275 212 -358 -6 187 -386 172 -394 -400 415 -310 -21 10 -522 248
2748 248 -57 -158 520 -205 -52 194 -282 427 203 -107 346 -256 -137 113 -279 414 -43 -407 319 -349
2768 -349 -289 238 -427 -16 60 -384 126 -227 7 328 -157 10 115 -220 381 -9 -259 371 -339 227 332
2789 332 -339 253 -133 -290 342 -12 57 190 -301 -96 26 -141 329 -251 -76 153 -600 -27 169 -281
2809 -281 379 -197 -84 278 -166 240 310 -138 332 -127 -203 463 -42 167 275 -240 236 -131 -102 414 -470
2830 -470 -153 60 -390 219 106 -395 139 -343 -88 94 -169 318 -24 -254 248 -133 72 565 -242 284
2850B84j09n43Q74m68k22M95m75Q1K01m21O51n10o2K66n17M61J16m52M32j99l00
2871d17N99l97J82M13o64L01k7p8M99m24J81n9k39K31j0j51N51p33j3M93o45M13
2893FJ09m90M81k98j60O30m98M21n9n30M92j73J3L35n68L54O7l97N54r5l81N85
2915C98m68l2M72o07M93Ml70L04m47K80K64o47M27On06O80l69J47L10p78L68K45
2937A74m76M92r4l30M13l62J93j8j40M46k38l09O04m34J03K96n78N63l30k97N52
2958B30m01J07L68p58M16Q7k76M35l54j2L24m98N61l7p09Q98m71j0K89m95N04
2979A98m9l10K79j92m1M18m81J70J45m44N54l53RL35o08J75L22m51L12J19m89
3000c82N37l21oN64n36L50k53m2N27n32j4M12n00L85O9m09N10m18n8M22o52M01
$$ plain form
2850 284 175 -368 506 38 -184 311 -164 -83 118 -303 348 -162 -224 42 -475 -14 102 -350 82 -117 -417
2871 -417 182 -215 -33 380 -284 17 -10 -88 411 -13 168 109 -130 101 91 -60 491 -242 -255 238 -407 6
2893 6 115 -375 106 -192 -352 278 -220 201 142 -388 104 -69 -56 279 -289 65 132 -265 289 194 -187 398
2915 398 -70 -102 370 -237 256 260 -110 194 -253 27 291 -356 71 77 -429 251 -118 29 339 -439 -71 174
2937 174 -302 190 96 -234 179 -183 10 -8 -148 298 60 -249 355 -79 24 320 -258 305 -25 -322 230
2958 230 -171 -64 304 -454 -38 49 -227 208 -146 -158 166 -332 229 192 -517 381 -90 -100 189 -306 198
2979 198 149 -161 118 -74 -115 303 -178 -8 137 -307 247 -106 -97 238 -370 -195 127 -324 -12 107 -382
3000 -382 155 -166 -172 392 -144 206 -47 -89 438 -94 -108 304 -196 189 258 -151 359 -59 -117 305 -347 54
3022E4J79k92J40k14j75N98n98K60K00m71L81k55k22P22l65n4L57p10N09N7k29
3043a28M75n01p3M19l71K28J07k33M78o94J42O13n56K61j33l30L83l24n5O04m49
3064a37m7J77k81M16j42j15K63l48p8N32m13L77j03k87M42l02J73J35n39L82J03
3085B08m68L81k18J0K83n77L01J15l02N32n59J1N09n04K36J93m28N15l36j89N13
3106B26k17J57J67l76K03j08j85M09l57jM26o60L10J14l67L58k70j05M30o07L46
3127a07K11m15L66k37J67J89l56K23r8k03M80k40n7N09o68K34K45n28M59r4l00
3148b20N21m37J00J78l71N03k70m23O33m11p1M09o97N78j72l16N89o0k88M79n38
3169b84L13N7r6L57l27k5L12m27J90J50n04N48l09j39L51l74J76K59n41L85j76
$$ plain form
3022 54 233 -59 81 -133 -308 290 -308 -48 152 -319 62 -193 -415 307 -58 -112 245 -465 44 101 -128
3043 -128 347 -154 -227 192 -179 49 156 -77 401 -293 -151 462 -94 167 34 -296 87 -237 -292 312 -137
3064 -137 -184 -7 -288 128 -14 -129 134 -214 -292 240 -173 204 101 -186 256 -46 127 262 -277 105 208
3085 208 -260 121 -97 -87 196 -381 -80 35 -267 265 -294 -283 226 -278 -42 151 -277 238 -98 -287 226
3106 226 9 166 333 -43 160 52 -133 276 -81 -82 344 -316 -6 108 -259 99 -171 -276 154 -453 -107
3127 -107 104 -311 55 -182 -15 174 -182 41 -57 -260 220 -20 -77 432 -236 -2 243 -285 174 80 -220
3148 -220 301 -136 -36 142 -229 274 4 -419 214 -197 -268 141 -556 22 -150 -466 123 63 -225 254 -284
3169 -284 29 86 -10 347 20 -5 307 -120 70 220 -284 264 -45 -184 167 -207 -31 228 -313 72 -104
3190a04j30M82l58K08L5m36M51l1k43L50m18l2M21m64L56J60m23L83k08j68M43
3211B74l32J78N2k54L36l74m8M17p14M28Q7n63O84l11j43N70m65J94o7j32M36
3232B53Mm13M92m36K70J19m03K13j2k19M82m33j16M87n06K54Q0l61M25j15k28
3253a63L08m41K84J46m34L95k94J37J87l52K26J53m44N93j08l45O01o15L24n9
3273I9l73L80k07j6L83m32o6M23m56L26r9j79N12n53O9K61m10L22kk36L31j40
3295f3p3N41n70J52N6m40N25k25m8L43m65L03K29l17L24k74j06L95m83J58J22
3316H4m70L81o6p4K52k52J04J62l99N71j99l59N12k21p1K88m13J76K39n65P28
3337D08m36nK69k03R4p8k26M19m17q9M87l37P3K39o20M44k5l27L66Rn9M6k63K83
$$ plain form
3190 -104 -234 248 -110 98 133 -303 148 117 -126 224 -194 -226 195 -269 87 247 -176 207 -1 -169 274
3211 274 -58 120 172 -82 254 -120 -168 249 -465 -37 50 -513 171 -140 -283 287 -178 16 -51 -183 253
3232 253 257 -156 336 -100 170 289 -114 99 87 -132 350 -83 -199 288 -218 36 116 -245 180 65 -163
3253 -163 145 -296 -12 134 -300 95 -199 -62 125 -227 -1 152 -292 301 193 -152 449 -166 158 99
3273 99 -274 106 -101 -117 266 -166 -232 191 -265 61 -38 -217 295 -258 -189 72 -338 -16 -18 -254 77 -63
3295 -63 -136 405 -165 -13 43 -397 128 -97 -145 198 -267 36 265 -52 272 -2 -108 287 -196 -38 84
3316 84 -386 -5 -71 -145 107 -145 -41 121 -278 293 94 -265 247 26 -45 243 -170 6 245 -320 408
3337 408 -28 -33 236 33 127 49 -177 242 -175 -264 223 -114 -41 198 -422 22 -3 -330 36 45 -14 32 -231 52
3361E2Q6j91M21o01J03N52n71J57L48n47L72k09k10O19o01J35K24l98K45j43N5
3382a02K42n50K97J09k39M59j49k17L60l98m2M66m66K56O2j34K26p1j21L11m23
3403a24K14J37n69N18l02R2J96k10Q5K47n36M17k53L6J40l20K90J3j64J63j6k9
3425B5K09m89L89j09r5L05l00rM67m99R8K09l20L10j71k79L44k52JK70l28L86
3447A62j88r4L25l94O6M63l85J88m1j86J81j7j96L40l35J96J08l65M90l39j08
3468a29L03k88J49k5m00M85j4k64K09k35L38J00l47J23M1k92J94j51K00K21m15
3489a97J28L18l21M45l27j52K77k76J73J39m72M25q4k63L36k80m2K19k27L98k00
3510A7k60M80l99P7L30m95K30J92l86L13j12j20J95k40L23O3n19O11k80n5M16
$$ plain form
3361 52 138 -53 368 -233 -130 422 -149 8 356 -191 181 -28 -238 381 -220 -85 139 -259 -14 -157 -102
3382 -102 140 -410 -113 -4 -243 216 67 -150 210 -188 -230 236 -230 26 88 -46 180 109 -12 299 -124
3403 -124 90 227 -342 176 -126 -34 162 -48 37 284 -252 165 -88 -52 88 -232 58 71 -93 70 54 25
3425 25 234 -255 134 25 -70 235 -65 -74 393 -106 -8 201 -119 191 20 -259 85 -167 -166 104 -224 162
3447 162 -26 -120 205 -189 -123 340 -45 143 102 -84 97 80 -116 224 -111 85 193 -172 318 -21 -129
3468 -129 174 -114 35 10 -390 95 81 -183 26 -209 129 229 -118 5 46 -246 -52 -203 -3 218 -197
3489 -197 -69 249 -72 373 46 -106 171 -105 68 207 -265 160 76 -187 149 -131 -173 46 -181 217 17
3510 17 -243 237 -162 -85 245 -250 -20 172 -214 99 -13 -133 62 -178 145 208 -311 300 20 -35 381
3531C81l42L7m6k28M61l36n4K56k38j79L14j94K74k63l2K08k25K20J23j95O1n2
3553d9j47L97k65k6K78l84K87J78n68N76l31l4K34k38K24q8k55L99k87J9K45n85
3575d20L65J25l22M91l32k25M20k12J71R9l31J91k45L0K70l34K61J27k79K90r0
3596E0j5J81l80J18K14k08K08j64k59L06l39K33L49m62J81N1l11L61j46j96L74
3617A46l07K16J92l95L50j88j34L56l75J47L09l90K32k38J0J14k17J28J30m56
3637c70M41K5m34L85j47P0K63n46K80rp1L73k44j37J98l27K79k0j67M12l72Q9
3659b9K74k83J25O5l64K67m6j45K71l76J41J64j42K27k03k17N27m79J82J64k85
3680a62K99j41j21K47j52o1L43l62M7K59j26K0j73P9J67m14K73K7k24K00K4j51
$$ plain form
3531 381 39 76 30 -198 263 -73 -127 129 -109 -288 26 -168 106 -157 -189 19 -206 14 137 -58 3 -49
3553 -49 -196 201 -64 -90 188 -196 91 269 -299 277 -54 -88 146 -92 132 44 -211 188 -99 -80 165 -420
3575 -420 -55 70 -252 239 -93 -318 102 -110 61 160 -171 20 -225 -195 75 -259 2 129 -150 140 50
3596 50 35 216 -164 -46 168 -40 168 4 -255 51 -288 -55 294 -168 13 64 -247 114 -32 -228 146
3617 146 -161 55 247 -148 202 14 -120 236 -139 8 317 -73 159 -79 -69 45 -172 -44 86 -370
3637 -370 71 96 -338 47 -100 -30 233 -313 -33 -42 -113 260 16 -121 77 -250 29 9 -158 254 -118 -29
3659 -29 245 -38 87 152 -212 55 9 -136 135 -241 -100 64 -78 149 -54 -271 256 -223 -41 123 -162
3680 -162 137 -4 -125 122 -30 -91 252 -110 -63 196 70 90 -83 -4 163 -251 22 49 -175 25 49 -102
3702a02L85l88R4Q3k96J84Q2k49M75n51K40R8j15J05kk14M89l43p1L21l62K73
3724A36p4j12J07J6j25K00k84K38r0l54M11k05K38M8l37K50J12m19K08m0j69L89
3746A44k01MK56l29J85o8j2J66k29J37J18l44L89l09q5M21l41k3L85m01K26J45
3768B34l29J35k06pL24k40J59j28k31M22m8j83L21m32K16J57m21L09N1j25K71
3789B49m33K35P0j85K22j40j55L76l59N7J82j85J28j11m7L23l84L7L12l29Q7J58
3811A08l60L55j19k9Q5j87K06k1j84K91r8n5K94m68J12K33l88L11m1o3J00j43
3833f1J17q6r2MJ31j84L39j88PJ41m65K66Lj52K57q3J4K83k37l0L09k22J15k61
3857g5k03M37k24J43j30j33L32j6l15J79j91J48K74n63M11j2o5K27m64L09L3l10
$$ plain form
3702 -102 283 -105 -11 72 -224 -40 42 -207 268 -283 -43 55 -60 45 43 -171 318 -25 -96 225 -137 136
3724 136 62 -50 57 73 -52 148 -136 102 12 -342 69 -136 102 150 -187 63 175 -244 -36 -76 -245 144
3746 144 -57 -53 203 -126 59 -9 -21 145 -84 53 171 -173 216 -93 -178 243 -98 -121 264 -137 89 234
3768 234 -95 40 -166 -173 151 -89 70 -58 -289 133 85 -98 223 -209 7 164 -257 52 103 -22 249
3789 249 -184 51 121 -64 158 18 -137 239 -120 -63 119 -66 62 -49 -96 227 -157 -120 192 -137 -50 108
3811 108 -252 103 -16 -45 40 -147 59 38 -146 145 47 -8 286 -182 -70 163 -225 86 45 -18 82 -61
3833 -61 56 -30 -122 -118 13 -171 168 -20 -13 128 -337 -71 -68 -220 37 -46 -32 251 14 -16 293 71 186 -75
3857 -75 -278 159 -65 78 -52 -185 147 131 -184 -5 -196 -48 226 -337 74 62 -3 224 -240 69 102 -208
3879b08K61K7j28J17k52L7M83l49J01J27m02K44nj50O7j06O6J41l56K80Pj49K66
3902A19l90K43K12m31L89j82j37M09k23j1J80j18J3R7k02J07L9j37J77j93R7M
3924F2o3J53k10KJ47k25J04M8k31K86k85m2K51n3O1J37l00K80j07j86J40k19L87
3947A37J28k85K50j89r1L15k38L2q0p6QK39j5N9k58l6J72l11J53J16j64J28q5
3970i1m3K06j66J29J64k49K17k01nQ5LQ6o3r6M4m5PL6k00L62n2k34J29j03p9J43
3996a6j6j27K25j19J03O2j96J28Q2k70L31l53L60J6k20K19j58k10J90o4P0K43
4018B80n45L10j50j7L25j76j80K41k65K92k33Rjj64J54K62k59K94j58j58K05k17
4040a51K26l2j67J83m9J11M4k86J7K32k45J52K32l22N8m1o9J79j34j04K59k72
$$ plain form
3879 -208 53 80 -48 69 -183 -146 337 -12 89 216 -186 58 53 -97 -30 -136 -70 71 -285 -5 2 -147 119
3902 119 -271 -28 184 -247 142 -40 -177 232 9 -2 178 60 73 170 -32 75 114 -23 154 -39 58 62
3924 62 -1 152 -58 -56 91 -134 -30 18 -213 73 -212 -254 -3 -56 5 142 -158 122 15 -171 -31 -250 137
3947 137 265 -20 230 41 -50 265 27 59 -21 -97 -89 150 135 194 -64 -100 72 -239 -86 30 -134 -6 -91
3970 -91 -134 72 -94 35 199 -50 167 -34 -39 46 49 135 72 -24 20 -25 -18 18 -182 180 128 -106 23 -80 -159 -16
3996 -16 -32 -159 66 -53 50 112 -84 44 126 -144 187 -166 194 210 -10 209 51 -159 31 -33 37 280
4018 280 -265 45 -105 -122 203 27 -153 88 -177 115 -118 -109 -110 -274 -120 142 -117 177 19 -139 66 -151
4040 -151 75 43 -124 59 10 121 165 -121 -104 128 -117 35 267 -55 3 -38 -107 72 -62 -166 93 -179
4062a79K10r6M3R2j18J60L4m27K68N5l14L95j71mK81j28L8q4j62L61l02J55j7
4085I0o3k2J48l96M26j79R7J63k74P0J2k33L09j02k20L30l95K22q2K7J44r1j28
4108a47J46o4J66ll18K21R3k23L81l51M9J71j88R7Q8k80K79q3j12J60l94K92p9
4131i9k00L79r2j2J28j85J91p4j52K00j2o0K18l24J74J36k14n5J40j11O5k9m1
4154b9R3k50M08j81k93L22j36M1J26k31J65Q9k41K99k33o0K95m48M40M8l65L06
4176A65k03N5K54k72O4N0j15J65j30p3J70k40J07K00m05J76J36j90K77j95nJ29
4198A20k35J23J15k88L55k34OM4PJ15P1j77N1O6k03K72l82J45Q2k15J57m4j13
4221a62L31k21KR9l58M53k97JL91m69J3M43m47J21l4M4K19l56K24J39j95J1K2
$$ plain form
4062 -179 31 -65 -22 70 -48 112 146 -281 -13 42 -272 123 -48 -52 229 101 139 55 -107 254 -48 107 90
4085 90 27 5 153 -243 183 4 101 264 -10 60 72 -161 148 46 -174 156 -239 -17 -99 -72 72 -19 -147
4108 -147 -1 -65 101 98 -220 1 94 -129 252 -99 -50 121 -67 30 118 -162 117 34 -78 82 -312 -20 -99
4131 -99 -299 80 -12 -24 104 -81 110 36 -116 84 72 12 230 -94 80 216 2 -53 87 -24 41 12 -29
4154 -29 64 -186 222 41 -252 70 -66 -25 101 -130 35 124 -117 182 -51 -111 184 -264 176 224 -141 165
4176 165 -38 17 271 -1 63 113 -2 163 33 -40 130 -110 -3 197 -208 -32 104 -86 191 -4 -9 120
4198 120 -115 8 123 -165 190 -44 -38 6 13 128 199 22 73 139 -64 208 -174 -29 53 -162 -5 -49 -162
4221 -162 169 -52 -50 49 -309 144 -153 -152 239 -230 -217 226 -221 -100 -134 -90 129 -227 -3 136 -59 -48 -26
4244b6n3K0k1J01L4m5K6N7k17K81l01R6J12j1q4J65l17L28p2j95K03j56M6Mp2
4269i7J73o6j21K86l13R6R3l42M00n6j2L10l76j1J33j70N9lj9K67k85o1P4j96
4293b37O1J12J47O8j56r6K52j55L2M9k64J65K53l58L19k71N6J10j36K70k61rJ11
4316F2q0M2j65j44K20J09j85K11n0o2L04m01P5J48j38K02j62m3K17k50J68J63
4338B41l95K24k5J04l6j64J59p4j29K37k60J34j4Rn8O2j18K34j35j88K24K7j93
4361a34K28m04K64K61k80J73j97J06J29j56K24j12j50K71k40O5J03k73J36J52
4381A66k58Q3j06Q6J07n3j15J03j80L15k06M3J4J5oK42k59J13o5R1j0q7j77L35
4405A91k19j04K60k41L17j30o9K29j67R3q2k30K03k38L0L20l85K46R8j66N6j65
$$ plain form
4244 -26 -79 -59 -80 21 55 10 36 93 -124 157 -144 -48 64 53 -31 134 -183 145 73 -122 81 -75 -29 -25 -97
4269 -97 76 10 -111 175 -138 -42 51 -291 109 53 41 351 -25 -36 97 -73 -14 -17 -36 231 -54 -115 -41 -237
4293 -237 -176 -64 83 151 -5 -101 151 -4 28 77 -187 -22 231 -127 192 -79 -23 87 -49 221 -40 -49 62
4316 62 -18 24 -141 -285 -65 44 -141 70 20 -42 262 -139 -64 84 -54 148 -14 -57 160 -90 78 241
4338 241 -154 70 45 149 113 -51 108 34 -95 142 -118 16 2 11 -47 15 -103 131 -4 -192 32 59 -134
4361 -134 94 -310 -46 215 -65 108 -89 17 146 -10 214 102 -48 223 -17 48 151 -122 14 166
4381 166 -92 -9 -115 -29 78 25 -90 13 -167 148 -58 -15 -1 14 8 250 -9 104 39 130 120 33 -144 191
4405 191 -28 -132 128 -113 204 74 5 234 67 160 78 -152 51 -187 -157 163 -222 24 122 -44 12 -153
4427a53lJ01j35O0L21j75NQ2k98K29o9J43J0k86J92o5j48L07j81J16j1k26J7Q5
4451h2q4J89m1j10K44k33J7o2K6L60j60l23L26k57K05J06l24K56J33k26L30l78
4473h8J32l8j03K68j06k72M50k23l7R3j20n0J78j77K78k87P9R0j63J36j7k00K01
4496B4K4J1K15j64m7P0j65K13Lk78M12m23J44q9j44K24M0j82L86l00jJ84l36J65
4520a4j28M3L07j97K18l9k91J23N2j60J91p0j87K57k81J54J13j81J95n6j63L70
4542B56k60J09q7j38K44j62p3K28k86K32J42l23J16P9j65J55j26K6J97j92J27
4563I9m8j53K48r1k3L0j50J02R4k70J93Kj64J75j12J3M6L9rj6k8O6p1J1M0k9J38
4590A32j78J11Q0K4j03J79l98K87q1q4K56k91O1p1k52M08j40j72K67j79N6K51
$$ plain form
4427 -153 -156 -55 -190 -130 191 16 21 103 -195 34 -35 108 118 -168 24 -41 -189 118 -63 53 42 -184 -167 -82
4451 -82 -166 23 -18 -128 116 -117 -100 -162 -136 224 64 -259 67 -190 15 121 -203 53 186 -40 290 -88
4473 -88 44 6 -97 171 65 -207 243 20 -17 76 -44 -94 84 -93 185 -102 -23 67 -96 40 23 -177 24
4496 24 48 59 274 110 63 133 -32 181 184 -94 318 -105 39 -50 -194 30 70 -112 274 -26 -27 157 -179 -14
4520 -14 -142 -99 208 11 229 190 -101 22 74 -86 105 35 -152 105 -176 -22 91 -90 105 49 -114 256
4542 256 -4 105 18 -120 124 -38 -111 117 -169 63 205 -118 -2 77 -88 67 -59 -33 164 -28 99
4563 99 51 -102 146 55 32 62 -88 14 108 -162 31 33 -131 44 -68 -55 -9 30 21 5 -23 43 -28 -17 23 -6 132
4590 132 -46 65 145 169 66 245 -153 134 53 -31 225 -66 -5 -76 -328 80 -60 -232 35 -144 -88 163
4612A63k66J4K53m30L17q6j46K37k35J49p4J07O4j84NL62l20KK1q0J89J05m25
4635b58L39j17k7Q6j57J50j35J15J20j34J64j14j64K16k9k26K82j08j00J89k16
4656a24J15J83k39J87j17n3K01k12N0J74k11P7M7j89J24M1P3r2j13P2P5r6M0m
4680IK5M8k41K94j42j36K73j25j37J85k04K77q4o9J66j17p6J10j45P6L3r5J62
4703H7K6k06J52k8j84K04o3K10q1p7lj11p2J38j52K40j81R4O1o3M7Qo4P1K0k36
4729a63K77l8j32K35j95O8n3o6K06l8k11J21j30K2K08k28J26r8P4N3r6K70j76
4752C6j25K73j16k40K64p0j08k9J18L3j9q1L09k91M6M7j12J32j74M1J27j08p2
4775a19J59p7K05j16j39O4J30k03P5j38K65J0q8J19k37K23j06k7J02P6k77K39
$$ plain form
4612 163 -103 -89 164 -266 51 -35 -181 56 -179 -30 -104 3 67 -117 -112 250 -70 -68 -47 -127 62 167 -258
4635 -258 81 -36 -63 23 -134 16 -119 -4 116 -18 146 32 -132 84 55 -171 111 3 -97 92 -124
4656 -124 -9 174 -65 122 5 -48 153 -59 -9 165 -46 31 78 -111 13 54 127 35 -78 -6 69 -27 13 9
4680 9 34 82 -159 135 -7 -143 130 5 -132 53 -151 126 42 -27 139 22 -54 56 -89 -13 20 -75 87
4703 87 113 -93 59 31 -153 51 -12 198 117 40 37 -74 -146 -8 -160 80 -101 -7 54 -9 38 46 -18 53 73 -163
4729 -163 114 76 -56 179 -16 52 -1 -67 139 101 -110 11 -119 -97 111 -117 9 -89 -15 38 -58 212 36
4752 36 -89 184 68 -172 92 22 -86 -115 3 36 17 -64 245 -46 0 47 -65 67 -107 -66 61 -47 -119
4775 -119 40 -37 168 52 -87 -23 107 -96 -21 -159 106 116 28 147 -90 133 27 0 102 178 -99 140
4797A40j69l6J5O0Q6j63o2J88O3l43J76J3J2N1n6OJj53K50r1l8K53r9L5m6m20
4823c27M69j22r3J90o8mp2N0M9J6j93K94j50OL0l51M42k07r5K72j21j75J76p3
4847e7J18m9k72K92m7M6Mo0N2O7j25K86l17M1Q6j73J27O3k52K19l9q8K00k40K49
4872A31j17o7RL7r6J99m09K23MjL19k17j20L55k66J02%L8j1P3l1r6j49K6K00k43
4898a07J62mj99J46j08Q9m6l1J72J15l38J28rk09K92j93P7L8j21K32o7o5L27m46
4922a65K23q8j63J80J00k28J31M0n2N2MJ44l8j53J83j99oK28j82q9O0KJ2j22J27
4947AJ48m61L49O5j81J06L3k29L48l12J05J29ml9K4k2j05J1r6L13l04Q7j16O6
4971h4P8p7M2J61k25K10k43Q5K72k33j9J53j95J26M8j47N0j63K03m4P9k0j25J00
$$ plain form
4797 140 -29 -65 -50 10 96 -67 -129 59 122 -221 -45 -32 -20 31 -25 -19 -18 -171 79 -12 -50 203 104 139 93 -327
4823 -327 142 20 -73 117 49 45 -27 23 72 88 -105 189 39 45 75 -276 166 -41 -136 136 15 -160 16 -57
4847 -57 61 12 -260 32 -15 31 35 -25 27 94 -31 255 -62 -21 65 -108 19 82 -170 49 10 -78 122 -118 131
4872 131 14 -53 -44 -7 -103 96 -313 -90 -86 -87 232 15 -105 250 -16 86 86 124 113 186 155 59 -90 -64 136 -107
4898 -107 55 51 -148 -2 -110 -21 -67 -98 74 189 -149 -21 -30 -239 53 -140 -63 -25 -146 86 19 -46 281 -165
4922 -165 58 -30 -193 -13 87 -141 -10 30 -22 30 34 178 140 -13 170 -29 -35 193 11 -78 -18 -16 -4 -126 1
4947 1 149 -312 37 102 -79 27 60 -169 179 -133 -28 101 97 58 82 60 -45 -34 -130 183 -121 -34 -150 -84
4971 -84 -6 -83 -41 120 -105 105 -138 -53 219 -14 -33 120 -75 51 99 -48 2 -161 42 -2 77 57 -68 32
4995C2J37j86J8q4k9p5J39j96K00l3j09K98k05J34R6k58O4Q8q5J0J48k0n1j5K1
5020C9K3j15J25k6J9R6k80Q5l8p8K53j86O7J6Nk04K05M5m3p2K8R5p5j5J64j78
5046d5m0K77l37k0J79q5J67k00J69j03N8J62l42J04R1r7P6j1q8K0k9r0L52j73
5070eK0O8N5j58q5K8O4j34M2K02k7l0J07k46K71k15N7N3k54O7J30j5J49j06j09
5095g1J82j05m4N1oR1j17p5J21j77K34P1j35p9L3K13n8k28K1J95k48L51k81J11
5119E0p0J2P2pJ8j41J37j36J55q3L5M1j90o5K06j29K34l51J82J15k6q9P9j76J72
5144D5J6m5J4j16M1M8N5J98l94J11P0q0K9k9J2m2J10j38J89j11P0o5q3J77k4k37
5170a79K15j5j76K14k16J89j0J40ok00mJ02r3K87k53r4K04l1k61J41j31J64K41
$$ plain form
4995 32 169 -17 1 -83 -112 -187 -48 -244 -44 -77 -186 112 -93 41 137 -121 -57 31 -54 -44 104 84 33 18 39
5020 39 62 -53 72 46 65 161 -119 -34 -72 -150 103 -83 -16 0 5 -199 6 51 8 -64 -36 59 -16 -31 133 -45
5046 -45 -85 192 -145 -165 14 -71 96 -104 65 -38 20 182 -160 -56 35 -62 14 3 -85 -65 -94 -184 168 -5
5070 -5 15 83 138 -20 -105 -77 -13 -147 -105 97 70 40 147 -99 172 -43 14 67 -187 -120 10 -5 144 38 -71
5095 -71 111 6 -38 13 7 98 -19 -94 27 -150 84 155 20 -59 -26 187 129 -99 -78 117 -131 220 -61 50
5119 50 -20 -8 64 57 75 -66 71 -65 90 7 42 83 -107 -172 34 -95 139 -212 -30 85 59 -30 49 -127 45
5144 45 61 16 30 -86 -45 3 58 256 -138 -27 43 -37 -8 -37 -25 -67 43 -95 94 -17 53 -12 -95 82 58 -179
5170 -179 36 21 -155 59 -157 32 22 162 156 -44 -48 54 -39 248 -5 -99 105 74 -187 -46 -177 -13 228
5193B28l90J50J30m01L32k91K11K46l47L00j58k17L31j62J12n8j81K78j98M4J27
5214H6n3O2p7k5k9Lp2O8Q9J5P9j95N7J62k98J62j73R6J20J6n8m0r9J12j7M3R1
5241A25j66l5M5m9N7j0PJ23r9L6K8j45J35N5k42L64J0m21K48r1M2j03L4K18r9
5266F7k5j12K40k80J37O1n7j04J92J9l32J81%j5J27k3m5qK5L4j52NjM9nJ17l04
5293b09P8J55M0p2n2p4L0N4K8K00l41J76m4r4J98l9K4J09k03QJ70k16J19N4qp3
5319A8j14P7Rj52L56j64j09J17j48J11m1j31J53R4l42M60j49m1n3n3J48m6R7j00
5343cL5n8J60k28J21J8k53J17O3J6Q3j20j3J89k57J97rl6jn5p5J49r9J27Qk89
5369b13L18P5j63Q0k10J34R5j49J80k19Q7Jk4J18O7k29L5J24j80j18R2J56q8L5
$$ plain form
5193 228 -162 -12 118 -283 49 -242 -31 215 -132 168 10 -207 124 -38 74 16 -165 113 -85 -41 86
5214 86 33 95 18 -7 -36 -33 -105 -37 52 67 146 -49 8 170 -128 34 -139 -43 77 93 35 -5 -104 8 -9 34 125
5241 125 -41 -76 -31 -80 -23 -33 -26 97 -2 34 62 -83 52 107 -135 229 239 -182 66 -25 17 -86 -52 166 67
5266 67 42 -70 170 -110 27 88 31 -73 119 138 -194 -13 -13 -28 99 76 31 23 48 82 -70 -65 -66 -17 -22 95 -209
5293 -209 -131 24 64 -8 -60 -134 -104 -50 -22 178 -163 13 -31 -125 73 34 58 167 -36 -28 142 -74 45 99 91 18
5319 18 -96 -19 -10 -162 194 30 -79 38 -110 1 -40 -171 -18 76 -266 194 45 4 -49 -102 46 0 97 -3
5343 -3 32 -26 134 -94 27 45 -208 -91 -28 -12 71 -49 -62 127 -130 67 58 22 21 -34 -109 40 -59 68 76 -213
5369 -213 105 180 17 97 -113 21 116 -33 147 -72 15 16 -8 110 177 -52 -17 107 -73 -191 -99 57 -31 4
5393Do6n1MR4n1J59q9k8O0K13k85J3Q9k4mk51L39j65J2J85j54j00J71j61J19j58
5419a25J30Q3K0j46J42j57J36L2k57J95q9Q8L8j85N9p3M5K09j14j69K39j51J53
5442A03j2q3J03l29K25P6q0j54K33O4l8j11j18K23k22J24Pr2J3OO3L7m6J51j80
5467c7O1o5Q9j49J01J19m3o3KR2r0j13J99j42J1J67p3k00J10k5K9j74O1J76N6
5492I9k26J95L2L3j31p3J16l0jNl0J27m6k10Q0n1R9j7R1j1P9j92J74j31j19R2
5518d6j13K26j23K1jM0j4J71p8j13J27j91J72j42Q2nQ7m9n1J76qj32n9Q2p7Q7
5544F9R5k49J41j26L5NK26k51Q6k8N8j8k4L8j8nNr5j43L58k68Q1J50p6L4p1j37
5571a28K83P6k65m2N1J51j26q2O7k0J18m3k15K30j18J61L4j75P3q0J03k4Pj30
$$ plain form
5393 4 -62 -113 -109 -15 -66 93 4 -24 36 249 -36 -23 66 42 38 -213 126 -39 -27 158 4 -96 75 -86 33 -125
5419 -125 5 88 108 -38 104 -53 83 115 -142 53 -36 52 90 -95 -36 -109 -64 145 31 -138 101 -50 103
5442 103 91 8 111 -218 7 83 3 -151 82 146 108 -3 -121 102 -120 4 11 -81 -68 -62 1 38 -8 143 -37
5467 -37 24 -41 48 -101 0 119 76 13 15 107 17 -96 103 -39 -28 139 66 -134 -24 -49 -20 -194 -133 43 99
5492 99 -127 68 100 133 2 -71 45 15 14 19 -11 116 70 -140 -60 -111 -12 -29 62 51 130 -62 112 -19 -138 -46
5518 -46 -159 67 -56 -35 -36 4 -10 161 83 -30 97 -94 78 -64 18 13 100 51 0 176 168 36 -23 59 -18 69
5544 69 164 -85 56 -70 -35 -30 196 -55 31 3 61 43 19 57 39 34 39 -56 -199 159 -109 -28 122 46 80 9 -128
5571 -128 155 231 -34 -76 -25 126 0 -82 -15 -35 83 40 -175 55 -63 98 132 -43 30 -50 53 29 36 -94
5595i4L53l48J17m8m2J83P6k88NK8J62j78j04J49P5nk6m1J59j31L2K0K3j03j2
5620c8j14J54j21mJ87K5j66J06M7j26J20j14J7N1k6m5p8Q2J2J02r0P6k22J41m9
5645g3l8P8%M8J1j6N7j83N4l8NJ1R6J0j32O9J08j2k38N7K0J80Q0j17p0P6ll3J05
5674A12pk11O4J0M5Mj6J6j24P9Q8p0J37n9p0M4k3K1R4j76L8N7q6Q5Q3N9j9k11
5702c6J16n6k52J60k6j85L56k63J45K70j70P6k29J5J6p2J2J14jJ47l1j50R5j42
5726i1J41M9j77J73k20p2L06r9J91k03j01J94j00n1J02K1p5n9Q9J1J7j67J15j6
5750b2m5nO3K29k50JMj3OJ46k19J16O6j05J55j64Q5j26N5J02j90J26N9j41o4K83
5776A52k52J85o9n6o0O5R4j04Q3K1Q5k55J62p0N0O3j93J23J05j18o9K77k64M5
$$ plain form
5595 -94 259 -89 28 -20 -62 121 197 -91 -86 -58 104 -74 -178 -29 46 41 15 -26 133 2 34 54 77 -26 -38
5620 -38 -152 2 -119 -123 64 89 -77 29 76 -50 70 -44 -27 24 -2 -47 -125 -43 -31 71 -19 57 -165 -24 -73
5645 -73 -111 -33 -33 15 26 10 67 -116 -62 -100 -95 -84 12 22 -110 -41 67 55 -183 -126 -106 74 154 37 -33 43 40 7 112
5674 112 105 -106 -42 -32 13 17 1 17 -107 -28 60 -10 127 68 -2 42 19 40 134 -42 -4 53 -33 52 135 194 175 -36
5702 -36 80 24 -228 -68 -94 -279 77 -186 -41 229 59 135 -94 -79 -63 -135 -123 -9 -10 137 106 -44 51 -91
5726 -91 50 99 -78 95 -125 -197 109 10 201 -2 -103 91 -9 -60 42 63 -12 -71 18 29 46 -121 -6 -22
5750 -22 -67 -72 -9 220 -30 -29 -25 -38 -32 114 -105 11 77 -28 127 -37 48 -78 -23 79 -111 15 74 -67 -131 152
5776 152 -100 85 16 -40 -100 -35 59 -45 38 59 144 -111 51 -19 31 94 -99 24 129 11 -58 219 -45 0
5800@o0K66j05j12K9N7q0o1N4o7R8k8L7K1k69K00M9k8R7j16l6O3k73M58j60r1
5826e7R2j70J85J9N4k74K14J7N3j55R8l9o5J4N3j86K78j52kJ75j83J40j02n7K50
5851B00k01J05j6j69O9J34m2j52k8R2J45N2j44r3r1J54P7k3j20J87n9j19n5P8
5875a9q6O4J19j62J56Q9l36L10j50P6k13Q7j72K78Q3j57K3J30k62J15J4j05J38
5898B0j21N2O0N3j12l5Q0n4j47J55j10L29j36j77L00j67p2K26p4K24l99J10J72
5921A77j09o2j3Q1j04Q9j05J50n0k6K4j43K38m7q6K4o4r5K53j61J13p1p4rPnP
5948f1J50N8l1j04JJ35j14m5O6r2K70j68j7o2j07J26l8q4J16p4Q2L7j4j85rL2
5974a32K42q6L8n3j30J99j18q1L03m67L45j8M4M0j57j0K50l26J90Q8j05J2r2o3
$$ plain form
5800 0 -60 206 101 -11 18 75 -5 -66 -12 -79 19 -9 28 49 -220 -20 29 1 98 -18 -54 9 -264 194 34 -57
5826 -57 35 -135 50 69 123 -151 63 80 133 -22 76 37 -28 -14 39 -147 131 -21 -23 152 -31 109 7 -50 200
5851 200 -1 104 88 -81 -12 122 80 -72 -100 -8 137 189 45 -48 -139 15 92 69 -51 136 77 -42 -97 -19
5875 -19 -105 -41 78 -84 72 161 -175 135 -15 61 -152 -65 -237 41 124 -33 -10 120 -142 -27 -13 -118 20
5898 20 -101 -49 11 64 -48 -83 -3 -57 -204 -49 -159 170 34 -143 157 -10 -82 144 70 294 -105 5 177
5921 177 68 6 -7 74 -30 59 -46 104 54 28 52 -91 147 100 14 38 -26 -121 132 -29 84 13 -61 -70 -63 -68 -61
5948 -61 89 147 116 12 13 148 34 -11 55 -37 233 65 48 -14 -121 5 -33 -117 -1 -75 7 44 30 -155 -164 -132
5974 -132 110 24 62 9 -121 78 -40 -121 182 -285 60 42 86 126 -31 -41 209 -117 73 161 56 68 -24 -87
5998h7K20O4j00q2q6J01r5r9J80M4j16R1j71K7K21j41R2J18p0qq0M0L6j08p1P1
6024iLJ14j34L3K16k79J06j31M4Q4k21K48q8R9K3k40J21p1K8J14Q1j04L3J71j76
6049F5Qoj78K49j33m2L5j00J2M0J97k06J07j38J34p5n2PO7J72l31J24J25j83O2
6074d0O7l3O8k7J83m04J28m7J66j49J62nj57K31l1j43l3j13M10p2l70K76k0L8
6098H5j11kK02k70j7J26K8o5J16k75J33k3J01J7K8m2K8k39K45o7lQ2j43J37q2
6123a1o3J41j01OR3M8j15J43j96R4k0p0J07l1J0N7k35J04J48p2N6n5r1J5j6J42
6149H8m7kp7K0N0j12J53k9J7k05J29J41j90N6p5j1Q8Q8j92J61j18J73j17p4J22
6174C7Pj55J81r2q3J61k9J79j62J23k11O9L1p8k9ML6Q1o7p8O0J4l9Q4j13L1J51
$$ plain form
5998 -87 133 197 97 15 -71 30 -65 -164 16 60 -56 35 -136 -109 112 -29 63 181 111 103 23 63 99 -9 -80 -9
6024 -9 -6 108 -26 7 223 -56 50 -81 -37 47 -174 74 -14 85 108 -132 -11 -82 -54 60 141 37 70 241 65
6049 65 73 67 -111 138 5 -37 -2 -102 -90 -50 147 -59 48 -90 44 -31 -83 -76 -9 163 -168 -44 81 -102 -40
6074 -40 27 -6 62 35 218 -186 -58 -105 61 -88 74 69 -88 143 112 -31 -64 -177 233 161 -209 67 47 85
6098 85 -26 -28 174 -96 -113 13 41 -24 92 -183 -50 -73 28 45 73 31 59 -180 65 -2 -5 77 -66 71 -11
6123 -11 -74 67 -34 -28 65 113 -2 141 -55 39 19 -51 56 25 35 92 -143 -39 109 37 93 38 -53 -38 -54 88
6149 88 41 39 -38 -18 32 -80 73 44 61 -144 -15 126 -64 -8 -83 -94 -6 82 -110 51 -67 106 -11 -85 37
6174 37 44 -111 70 -22 -105 56 27 206 44 167 -44 25 56 -22 -51 -47 -11 70 3 -75 -15 -1 -40 44 -69 -38 113
6201A13j48k0r6J17P5j18K9K98l37J22q7n1J18R8l9j45MK0J57k39M9J12j2M6Q8
6226A54k03K10j69J17l0j32Jq7K13j70J7J83j17j86J95l8l9J96p6j74J05R0Q4
6249A44k16j50J81o1K46p6j8O6j45n7j4J02J30q7R3j31M3j28Q1p6J45r9J38k29
6273a18J02O7j36L7P2j83K07Oq0J09l6j70L2J39j33%J09j49J30n6MN3O2Pj96J17
6299dK41k10k50L31p7K8M6j83J86m1K5j2m4k6Lm9J33p4n1J90k06K7l7M6J22j78
6325f4P2M7K8M4j16r7J05l1K22o9k21J09j2O9j47J22j60J57k36n3K80j20K13o1
6349H1n6M4%j27J27j55J03j76J17J51J5k31N6k1j4N9j05R2J03l2J94p1k38R4p2
6374f2J46k25J41r5J04K3j9kM4j27KJ03j12k6J03J8%J62k67R3N9j00Q6j09rJ46
$$ plain form
6201 113 -35 -55 -151 -34 41 -77 -48 250 -87 35 -52 -103 15 113 74 -71 -67 -47 110 -129 -80 32 20 66 154
6226 154 -49 161 -8 109 79 -53 -52 -139 74 -96 -79 104 -13 -199 -4 -42 -81 115 39 -135 -30 60 144
6249 144 -72 -222 -41 -102 144 68 50 116 -29 -86 -100 2 132 45 138 7 50 -78 3 -73 72 -27 111 -118
6273 -118 -16 51 -85 -48 24 -159 48 54 -26 83 47 -123 -91 48 -85 -85 24 -125 5 -51 -47 6 68 75 -121 -4
6299 -4 237 27 -223 108 31 59 105 -78 108 67 92 80 36 10 13 -36 97 23 -28 162 -44 -17 -54 -8 114 -64
6325 -64 8 55 83 127 11 -86 19 -12 210 141 -80 29 17 86 -61 61 -99 58 -178 -231 49 -71 142 81
6349 81 25 69 69 -58 69 -86 17 -159 -42 109 124 -107 -51 -72 -86 -27 -132 -40 63 31 225 154 -84 10 -62
6374 -62 84 -141 0 -95 9 32 13 11 55 -72 -70 33 -79 -105 -2 16 16 178 -89 4 63 -37 49 -60 -69 77
6400G7o3Q6j10l8K81j76k80J46J12M1k6r9J02J09k81J35l7j43J20L8M2K7n9L8
6424D2J1j84N2J65j81K46q9J17k58J81mk36N5J6P7Q5j23K6Q7K6j3q0j22K20j42
6449b6P2j26J27p0L8p0L1J15j73K68k64O1l1RJ2J68j48N3q2j50J83J31n0o4m8
6474c4p1R9q5K23j14j4l0J71j40j93M15M6k39J00j60Nm7R0qO7j32J44k5k26K40
6499H2j32K7l9lk6N3N5pK5j13P5L6q0P6j12J53l8pO1o3j60L36k39N4J1j4mR3j03
6528cq5j0R2P2k26K38j49m3J84r6k3l8P0J49j65j0R7k4m9J09j17n9P9j23%J02
6554b8j1L7l7j80L37p5J5O6j30M5j13k7K19j18n8k2J83j63j18K26J01j14j72K45
6578A08j75N4O9j23%M8Q8j51m6P3J22J3p7k3J0J59l53K81o9J05r1m4P3j89J80
$$ plain form
6400 77 14 100 -10 -48 233 57 -223 -77 35 76 50 -49 53 162 -119 16 -21 -164 -44 -6 36 63 4 42
6424 42 53 -131 -79 86 -95 151 62 179 -79 102 98 -138 -83 -67 10 95 -28 -2 85 111 98 18 -104 116 -26
6449 -26 46 -80 47 -23 15 -55 -24 91 -82 186 -78 -17 -48 -39 -27 141 -7 46 -36 -186 -3 128 78 14 -34
6474 -34 -105 -6 -91 132 18 4 -26 145 5 -188 227 273 34 134 -26 -21 -68 22 14 81 -51 93 68 -158 82
6499 82 -50 -23 -62 -65 -91 -38 17 10 35 -78 -3 33 -47 29 -83 70 32 25 86 23 -137 199 -40 14 25 11 7 100 -3
6528 -3 -88 -98 -6 66 -160 78 -71 -114 70 -26 -49 -87 -17 132 -33 -43 54 30 -19 90 -27 -86 -7 -130 -130 -28
6554 -28 -39 -2 -39 -219 118 43 58 124 -6 39 -74 -101 118 0 -58 -80 103 -60 -178 48 149 35 -137 108
6578 108 -67 -13 56 -67 -67 -19 69 -82 -128 -55 67 80 3 -20 -10 149 -204 77 8 113 22 -22 51 -138 42
6603D2J10p3J29Rl11M9j1j7J36j78J0m3K4K08j91R2J34j15J39p8j06j5%j36K37
6628D5j73p5K20o8J26r8K05Kl04J57J37k69L9R0O0r9j2M1K4j4k8N1k96J41k6J1
6654a13J72K7o5k6j66K12p4q5j0J51l0J1l7N6J4L8j6o5R2r6j19J59j24RJ92j70
6680f3J13N8k40J03jj00J12r9mJ0J53K3J37k36J4O6n7K7j00J54L9j14L6N9k45
6705a55J36O6j75O0%J34q7k8O9J47k49J3J35n8J9q9J99r6oJ92k70R0J26k90L30
6730B13l26J46m4n8J84J8k68J23P1j20J38p6p2J19j20J69n8p5M6k7K4J61j85J49
6754A32j59j48J73P2q3M6m8j3Q4j29Q8k4n2R6rm9L3l9O2j89J5J47M2l1j36jJ17
6781crJ41l7q1m7J31j66J09m9j78J5K57j37kRK6lj4rJ00l4k2K4o2J17j74J90q9
$$ plain form
6603 42 152 79 208 217 -94 -45 -56 -73 63 -115 -105 -148 -124 84 -107 -15 119 4 143 65 -41 -56 -56 -192 45
6628 45 -128 -203 17 -51 75 -23 182 184 -120 37 174 -95 -56 34 94 -5 -17 24 48 34 6 57 -239 -98 -124 -113
6654 -113 59 86 21 -5 -171 41 -33 -118 -128 23 -7 4 -33 23 37 75 59 -6 86 -10 -129 30 -94 -85 107 -63
6680 -63 50 108 -132 -29 -30 -130 -18 -117 -121 -111 42 65 202 -34 -20 46 -11 16 -84 70 109 -5 31 90 -155
6705 -155 -19 47 -128 -68 -68 66 -21 -49 20 167 -82 -69 66 8 27 -62 137 41 35 227 -43 47 173 -117 213
6730 213 -113 33 -11 -69 115 133 -135 -12 59 -61 77 1 -71 48 -72 97 39 -36 10 -17 7 168 -17 132
6754 132 -27 -175 -2 70 -13 33 -15 -28 56 -73 15 -9 -61 35 26 -23 10 -29 33 -156 -141 6 48 17 -119 -120 -3
6781 -3 -12 129 92 11 -36 95 -71 38 -11 -189 -174 83 -54 -56 -47 -21 -24 -38 -47 53 19 -3 21 -41 76 -98 92 3
6809Cp6J65k02J53M8j6nn0J54k18K07j49P5o9n8O8Kr3j61L11K2L6l7j55K8o1O3
6836a5l4l8J65k15K50k43Q2N0M2J1k79K31n4J6m0R6j17K8p2J15n9O1ON3l3J72
6862A79j44n6j04J73j2l5N1P2j48J41j45J26j20m9J25q8J10j2n3j48J15k0J7j24
6886a49J45p0J89j02j6Q8o6j38J08m3O5J55k80K13j67J27r5P3k0P1o8m2o0J11
6910B9K9k5l2p8q8J55j63J31l6p5J1L66k18J7o2M8O2k72K77j17j8Q6Q1j13l5j23
6936a63L71k78J34j85J32o3Q7j71K72j92p6J52m8l2N1o5J18R4k71K05l1L6J2j28
6960c9j3K7jN3j24lM8n8J14J3l7O7l18J16P6m1J20k8l8J46j88L26k69j26K37j29
6986f9MP4n2J25k10K50k63J94l8r0J53j08q5P6N4L4P2j08o6l3P6r3M0J8K9j47
$$ plain form
6809 3 -73 92 -110 43 91 75 70 20 174 -44 163 14 89 20 -38 30 32 -61 -222 89 111 147 110 -45 -17 -78 -15
6836 -15 -49 -87 78 -137 113 -130 -48 2 44 55 -224 7 -47 -31 -71 25 -92 -64 -136 -21 -80 -19 -13 40 7 179
6862 179 35 -21 -125 48 36 1 52 124 -24 117 -28 98 -22 -71 54 -34 76 64 11 -137 -22 -42 -25 -149
6886 -149 -4 -74 115 13 -3 85 19 -119 -11 -54 11 166 -114 99 -68 59 -36 37 17 88 20 -22 -82 29
6910 29 58 33 1 -77 -165 -10 -173 -42 -78 -153 -142 224 6 23 -39 9 71 -201 76 -41 -59 27 108 -5 -40 -163
6936 -163 208 -70 64 -121 11 -52 35 -136 136 -56 -132 20 -28 -60 -9 -74 44 138 -133 72 41 77 89 -39
6960 -39 -52 -25 -26 27 -97 -100 -52 -110 4 17 -20 47 -271 -155 -79 -120 0 -28 -66 80 -108 218 -51 -177 60 -69
6986 -69 -65 9 -43 82 -128 122 -141 53 15 -75 78 -30 -115 -39 15 49 121 13 -53 -86 -10 -103 -63 -45 -16 -163
7012a63N6J88J12j10j09k6K75j52j44Q8R2j74J09Oj39Q8J27k52J11P2l9j5l7n1
7036h7J68j09J09r9r0L49l02K52o0k15K9J78J0k57O3n2J27p6J2J9j14K73o7k00
7060a39K50k5r6L3o1M9r2Q2K1k4M2Q1j8j63J4K3L5m4P5o9r2J0N6Q0K39j57k28
7087a18P3k13L20k6QQ2k27R1N2j34J54J01j16P4j10l5lk0n3J32r8l0R4L2ro4o2
7114a05K18m5j74J39Q6o3r8P2l2J6k4j58K89j57J22p4k9R6j57m8J31oJ23j46K5
7139Aj01o2Q3P7KN2j25P3J7j44P8j28Q8oJ01P5q5p3nJ39j07Q2N0J48j79j26J54
7166G9j29K06p5j14O9l1p8j20K59k16J64q4K74j68L1q7j4KJ04r0K21j81l3O0n1
7191bl5M4NM3L1j46J1R7n5Qk55K44k5Kk8Q0j0n7j9K2J47j97K87j50m3L0q0O0M
$$ plain form
7012 -163 -107 81 193 83 -26 -52 223 71 -73 15 107 -67 42 48 -91 -3 124 -128 -17 55 16 1 -36 -87
7036 -87 81 -28 81 -18 -108 241 -61 191 131 -84 -55 123 133 -124 -61 -113 14 -62 -50 -31 -145 128 61 -139
7060 -139 111 86 -10 23 -38 11 -81 1 22 -2 40 121 103 -60 -46 -23 12 -32 43 -26 -118 -108 -52 28 267 110 -118
7087 -118 -45 -258 62 36 44 126 -101 -10 42 -92 62 163 47 121 11 -24 -27 -47 -100 32 -66 -96 -2 30 21 -43 -105
7114 -105 113 68 -106 33 119 56 -42 30 -2 14 -10 -168 121 -36 86 12 -17 79 -78 -126 5 -1 122 -24 1
7139 1 -100 -162 -79 -2 0 52 -73 0 17 -127 -49 -177 -89 -95 6 81 -4 -77 -82 57 -50 32 82 230 51 -75 79
7166 79 -50 156 81 -33 36 5 -73 -193 66 -150 14 -70 204 36 67 -20 -34 -32 72 -18 203 22 -11 49 -2
7191 -2 -37 7 12 55 86 -60 -49 48 -7 1 -254 -10 -35 -33 -61 19 9 -48 -67 -45 102 -95 192 42 -1 29 -51 9 13
7220A3l3n7N1R7r2P6O3m8j17Q5k03K33n1n0Q4q0Q0r3o6o2K25K5k20J8nJ39L7j39
7248i0J74j18Q4K2k7q1LR2k1M2L1j06M5L8q7o0J49j48N0J01j46J47j64qJ34j27
7274g1k5O9PJ5L0q0J88k6l20L44q5j05Q4O1N3j80j4J07N1j25O2j63J02jk32J60
7300i4J04k16J91L9p7P3j91J23J32o2kj76L0J68q1mMpp4L04j27k7k61J39J26r4
7326f0J25n2l8mm6K06p3j62K09j67m3J14ll0J10l35J98kj5R2O6j17m3J57r7l0
7352d0J88j45m1J11j21l6J51m1p0NP6j90J93k19J64M6j6l8r8J73j2p0Q8J9k2K
7378E7p2M2N0j87J26J80j51l7r0O6j18J9J05Jo7N7n2L2k3m1J41J85l34K22M2r6
7404E7k8n2O4j63Q5N3K71k99k0P7j3p6Q7j37P4j2J30o7j51K5j6Q6o2J70p7r8P
$$ plain form
7220 13 -20 -77 -26 71 -21 55 118 70 -47 38 -165 68 17 -33 51 -29 51 -42 -108 -170 55 80 -140 -122 -127 12 49 -90
7248 -90 84 -34 50 72 45 -36 -33 59 38 80 111 5 50 88 1 -59 90 -58 -8 93 -53 94 -70 -78 56 -71
7274 -71 -96 -27 -20 -5 25 -55 133 107 -213 131 46 -59 25 86 139 -41 -55 52 103 -22 40 -123 -21 -22 -254 -94
7300 -94 10 -206 -15 24 -53 20 -171 -48 84 22 20 -156 -126 42 -39 -43 -39 -46 -120 184 57 30 -231 -92 34 -60
7326 -60 65 13 -25 -29 -75 131 58 -104 105 -62 -105 9 6 -24 86 -249 -51 -53 -68 24 90 -27 -70 87 -10 -40
7352 -40 148 3 -38 73 -48 -84 67 26 -44 -39 37 -153 40 -179 -15 31 15 -23 -121 52 40 -30 58 77 55 57
7378 57 -15 27 77 -110 16 196 45 8 -82 -16 -134 -115 -10 -9 -76 -19 -71 -39 -62 -103 38 223 -111 111 153 57
7404 57 29 -23 41 -122 -37 16 287 -12 -32 45 32 -44 43 -94 -20 -32 98 31 -120 -95 -111 -25 -87 83 6 -92 -85
7431h5L8q1Q9O6l0qM4j43J6J14m5l7K3J5K67j66N9mk50K44l61J90K12j42j13J27
7457C9Mm2p0n8K42j51L8nk3L5rM8K23l77J74k89J46J02Qr6L8R8j9j7p7K22j84
7484@l3J22k43J17N1j04J40j28K65j93m7K09j09M9j4r9n0J76j72K1R9q5N6K3j09
7509e8l6Q7r6J52j41J12Or1J92j35J42Rj22l2N3k32K86j41k0J18j17m8R3O9Jk7
7535B4O0j84J68k09K48k60L09j74m3K00j33Q4k4r6j62K09L4j02j01L7Q9O9j24
7558h1K9J8M5o0m3R3N4j04M2r6j5J24K3n5k18K98q8Q0l5J00l4N1j34n4R5n9P3
7585D9M9j65J48K0p8o5J18l3Pj46L5J80k88J50l7J89p9r7J62kj16RL8o0O9q1Q2
7612E8M4r6j1N0o3J19k04J15M4j34K74k59L5P5j77J62k25K49J44n9q5n5l9J23
$$ plain form
7431 -85 -47 -128 -39 27 -3 -11 33 -110 -94 20 -25 -62 -39 -24 243 77 136 132 -118 126 -235 -45 167 25 -88 39
7457 39 43 1 -69 -127 115 -36 2 -3 -26 9 0 48 271 -106 68 -221 -75 27 35 -61 -23 75 56 39 -38 184 0
7484 0 -33 89 -154 -37 14 -90 50 -78 187 -6 -53 156 47 96 82 -17 -67 109 -63 -42 57 -28 28 51 -58
7509 -58 -94 -7 -103 49 -92 20 26 -65 127 -8 134 143 21 -11 42 -190 96 -45 -65 53 -64 -112 -19 50 51 24
7535 24 84 -100 68 -141 107 -153 156 -18 -61 139 6 90 66 -30 -192 17 51 -51 -152 -115 -26 43 -81
7558 -81 -52 -34 11 -49 -92 1 55 -49 -7 -103 -118 6 29 -26 -244 54 -34 46 11 111 77 128 -6 -60 35 -24 49
7585 49 98 -67 81 101 23 -42 76 43 50 -96 -61 119 -169 -19 -56 133 54 -43 119 117 1 10 48 -12 57 -24 58
7612 58 102 6 -5 45 -18 101 -103 12 56 -78 196 -63 -28 47 -130 32 -193 56 200 141 56 1 -38 85
7636H5J41l08K88p5j20r8J04J82k20j71K40m0j06P9J8PL0j15k8N4J0J47n3lj2
7661C6m3J45q8m4J41j60l6P0kQ8J07j60J6j09L3k5J6k4Q7j06J47l0m3O5j39J34
7687G6j73Q5l6Q8j01N9l9rO0Nj10J27j83O0o8J43m9l0O5j06J43J95j75Q4Ql6n6
7714B7L7L4j03J06k43J61j79J32J8K3J39j33j70J53mO3jj30J27L2j36J17%j90
7738a20J67Om3q3o2K19j21j08K50j57j17K45m4K9j09J85N9k96J80j71J67m4l2
7761@p2Q9j31K38j62r6J79p3M0q8l9J26m0J32L2j37pJ19n6m5Q1j00L2m2m4J75
7787A11k26J32L7j13j5J21j26J47ll2Q1m6j31j09N9P1k6M6k1L6N9q4m7K5j02J44
7813a2j6J5M2K2p4O5k5m3Kp4J39q5q6K58o6j19K64l00N5J24k77K84j00l0P3j24
$$ plain form
7636 85 226 -82 206 131 11 -87 17 199 -21 -192 48 8 -98 -19 -1 6 36 -79 -107 -53 -43 104 51 48 36
7661 36 -7 138 50 6 147 -13 -49 21 19 107 214 54 70 -39 -6 -31 -15 -39 48 -58 89 59 16 81 -58 76
7687 76 -97 -12 -48 40 -61 -2 -41 -50 10 15 -95 32 -151 -91 -159 -16 -65 -95 -30 -136 7 202 27 111 119 83 27
7714 27 64 98 -5 101 -142 19 -160 -28 -10 13 152 19 -151 2 -2 61 60 -70 57 89 -47 70 70 -120
7738 -120 47 53 10 -73 -135 84 -37 -145 105 -52 -169 76 32 61 -48 137 196 -100 80 -91 76 32 0
7761 0 -72 17 -114 124 -38 -134 45 -28 12 -76 -115 11 -29 103 135 -2 -9 110 54 9 90 -10 22 -20 -64 111
7787 111 -115 17 54 -59 -74 47 -79 68 65 33 114 68 -63 -172 -113 -42 -68 -22 -43 -7 52 -32 -79 -54 -156 -12
7813 -12 -28 -13 29 51 -23 42 17 -26 -24 -98 41 -44 -130 128 62 -57 207 -93 -38 86 -191 93 -7 -37 36 -88
7839h8N9Q7q2%J01l05K78J4p4K98l81p3J63N7q3J37j65O1j02J69O3k03J57j97
7863a09K46j59K8j28RJ22R6k63J00M1N5j05J11pn2J74j35n7K5n8k5O7J79n3n0
7888E2k3N1p5m5p2J47K1l7j4j1KJ01l49L91m3r8o1J04m4r1MJ50O6j86J82k29J59
7915E2p0No9J88k02P8J14p8J01j46M9L2k2n5Jk4J48p3j7L8n8J03k9l02K78J9j60
7942i9O1q4J11N2l2Rq8J9l5m%J07m0R6n4J9m3POJ02j24K3l2n2J99j98J11O1k64
7971a66L53j47P8k0k8j96J74m2Q0j21K4j02J69K03k45%j47K78k41M6N1R4K5j40
7995b0J30k6j64J74o7j26K34m5q4J27l24L38j06j09qj61J93J15o6J09p8k93L11
8018E4J66k63J51j20M5n0j95J60o8P0J21k9k02J76l9l6O8m5J41k49M7O2N4m9J45
$$ plain form
7839 -88 -29 58 -24 -24 77 -228 50 64 -10 288 -93 -166 -3 54 -29 108 -57 4 -98 71 134 -69 88 -109
7863 -109 137 -22 6 -122 -113 9 105 -158 -58 -17 38 -67 44 37 -15 159 24 -33 -8 -66 -91 -24 155 102 52
7888 52 29 80 5 -40 -112 35 56 19 5 -6 -4 97 -252 139 96 -2 -63 41 -3 -94 -90 60 126 -60 122 -107 52
7915 52 -18 -13 -82 106 -96 -18 96 18 119 -27 22 54 32 -23 -22 -46 102 29 12 50 -8 95 66 -236 42 61 -99
7942 -99 -38 -122 -11 41 9 18 -70 -51 -86 -90 -90 17 -23 73 19 38 -5 2 8 110 -14 9 -23 -75 124 -74 37 98 -166
7971 -166 187 40 118 98 70 -126 48 6 86 -35 -11 -113 56 259 14 14 -133 145 -96 -50 1 95 120 -20
7995 -20 110 84 -80 94 27 -99 135 90 6 133 -191 147 41 -68 -76 -237 -44 71 5 114 36 -257 54
8018 54 220 -43 108 -12 33 -17 -212 -52 -120 -50 71 42 -160 16 -23 -59 9 -36 105 -144 -97 -35 19 -30 115
8043A15k26J58J28j77O3j32J11q3o0R2N2N8j78J20r3J76j64joj9P2L3M0l7j70
8068a28L2m7K7k0J56l4J38k18K7J28j8lmj6k4j95O8Q7j42L54j89k05J76R9m1J54
8094A62j86L8j9P9J0l7k0Nj10K09r2j64P6j1J9rl2J57J00j31n0m2ql1m1Q0Q2j16
8122h2J42j79J26jQ6k46K15j54J08k9j58J97P7k18K03k55J96J09j96J53k09J3
8144a02j18L19j41Jl7J1l9K09K8k36J5O5JK21j64L5L9j48j25J63j52J36J05j53
8168f7Q5j9m2K31k65jk1J04J1j28M0J8j7K58j30k0O2M9n7q7q8J02O0
$$ plain form
8043 115 -111 47 175 -2 61 -71 40 -43 -103 -11 41 99 -79 41 -52 124 -40 -41 -47 -66 6 39 79 42 -128
8068 -128 -96 -143 -116 -136 20 -14 124 -94 -67 61 43 40 36 20 -4 -199 -131 -44 -186 168 -21 -226 -50 49 8 162
8094 162 -24 14 -5 74 84 47 27 32 -78 131 39 -125 -49 -60 -41 -50 -82 75 175 44 -6 -48 -56 -87 -128 -48 34 -82
8122 -82 60 -119 7 6 92 -154 61 -93 15 -14 -172 25 102 -116 87 -168 28 137 -59 94 -115 -102
8144 -102 -220 99 -42 -41 -78 -67 -106 103 131 -105 -90 -25 -24 197 33 68 107 -41 -166 -3 -155 -19 86 -67
8168 -67 18 -1 -43 188 -77 -78 -99 5 16 -112 -72 -54 -71 187 57 37 99 148 91 4 -84 18 78
8191G8
$$ Imaginary data points
##PAGE= N=2
##DATA TABLE= (X++(I..I)), XYDATA
0@%%%%%%%%%%%%%%Qj6J6j6J6k4L2l8M6n3O1p2Q5r3J04j20J40j63J83k07K36k65
36a40K97l32L70m12M59n09N65o27O91p63Q42r28J023j124J236j364J505j659J834
55I64k032K257k519K823l180L611m147M825n711O930q714J1566j6809K9397j10860
70i1599q8202K98405q9004j02696J92721k2457k18159P0525J35776p6953O38J29097
82A38092j15596j11933J09499j0543n2027J02824j3173j02464R804N3066k6760
93a9211l5871Q1520M322j43541O6483J22135j16154p470J38523q2243j18111J28461
105A8843P6821j40015L6663J39588j50527n7462J81298p7979j02692J39132k8226
116C5444j07541J00215L5888j12861J0855O6011q6970j4385J40456m3055r5819
$$ plain form
0 0 0 0 0 0 0 0 0 0 0 0 0 0 0 0 8 -8 8 -8 8 -16 16 -22 24 -29 32 -40 45 -48 56 -64 76 -87 96 -111 125 -140
36 -140 157 -175 195 -217 242 -267 298 -329 362 -401 441 -487 536 -588 648 -716 789 -870 964
55 964 -1068 1189 -1330 1493 -1687 1924 -2223 2602 -3109 3821 -4893 6673 -10136 19261 -91599
70 -91599 -179801 118604 29600 -73096 119625 97168 -120991 -50466 85310 8357 8995 138092
82 138092 22496 -89437 20062 9519 -42508 60316 47143 -55321 -45517 7549 -19211
93 -19211 -55082 26438 30760 -112781 -46298 75837 -40317 -47787 90736 8493 -109618 18843
105 18843 95664 -44351 -7688 131900 -18627 -76089 105209 27230 -75462 63670 35444
116 35444 -72097 28118 64006 -48855 -38000 28011 -58959 -73344 67112 24057 -71762
127g1762Q7732j6055r0344Q2813O9461n0877l0302L3132L613n4450M7539P8386
139H8886q0346l9320O1362l3416k2900P7369J2247q2690j7404L8818m9059P467
151c8986J14728n4284q2492P2726m0950o3421J16625L2452q4624J7782L3916n9531
163c6059k455R4820j5048p2288M9069Q85n4732O2682L0203n0994m688o832j5354
176b0791J1453K2334J9095l1417k2066J3899k5359P006M4333j6046k2103J1020
188h642P514j2909J747M0593k4803m4836N8233O550m1409N5128J160o5617J6569
201a0722K4157j4405J0706K3214k0146l9640J9042J0831k3076L4210Q62m9273
213c4240K1811J0976j6026K9862O59k7290p967L219K1784R342P344Q376l5242
$$ plain form
127 -71762 15970 -85 -90429 -7616 61845 10968 -19334 13798 17411 -37039 10500 88886
139 88886 8540 -30780 30582 -2834 -25734 51635 63882 -18808 -36212 2606 -46453 -38986
151 -38986 75742 21458 -61034 11692 -29258 -92679 23946 56398 -28226 -10444 23472 -36059
163 -36059 -38514 56306 41258 -31030 18039 18924 -35808 26874 57077 6083 1395 -5437 -20791
176 -20791 -9338 12996 32091 674 -21392 -7493 -32852 -25846 18487 2441 -19662 -8642
188 -8642 -1128 -14037 -12290 28303 3500 -41336 16897 23447 -17962 37166 38326 -27291 -10722
201 -10722 13435 -970 9736 32950 12804 -26836 -7794 3037 -20039 14171 15033 -34240
213 -34240 -12429 -1453 -17479 12383 13042 -14248 -22215 -18996 2788 12130 19474 27850 -7392
226g392j6393J9266O916J7710N464j1464j1633k5672J6435K3414j8473J2477l686
239F969l6538J8110J6554n626J1058j1394j9821k916J2998K1441k09M962p513
252H075l5574J5691K0303j0207K6627k193l4141P652L617N23J3139m963p534j3821
266a2806P43K0219l598L603k497k9382N497J0867L504K4070r710j7871p05j1502
280a9568J4832J7518l534M649j5530j0272J5578RP173K661j8372k542j840J1229
294A991J6836j4032j398q497k5070K2236J6942o264J1639j2878j9153L881O668
307g099J4683J159m694J49j8287R859J9777j2367P197m002k4950J3854J2119J384
321H782Q315j3042j1842r187J626K4464o78l906M475k4904k432J8234L22P894
$$ plain form
226 -7392 -23785 -4519 2397 20107 25571 14107 2474 -23198 -6763 16651 -1822 10655 6969
239 6969 -29569 -11459 5095 -531 10527 -867 -20688 -23604 -10606 10835 10626 15588 8075
252 8075 -27499 -11808 8495 -1712 24915 22722 -11419 -3767 -150 373 13512 8549 1015 -12806
266 -12806 -12063 8156 4558 8161 5664 -23718 -18221 -7354 -3850 20220 10510 -7361 -8066 -19568
280 -19568 -4736 12782 9248 13897 -1633 -11905 3673 3682 10855 13516 -4856 -7398 -9238 1991
294 1991 18827 4795 3397 -5100 -30170 -7934 9008 2744 14383 1505 -17648 -13767 -7099
307 -7099 7584 8743 4049 4198 -14089 -4230 15547 3180 10377 6375 -18575 -4721 7398 8782
321 8782 17097 4055 -7787 -16974 -15348 9116 8438 4532 9007 -15897 -18329 -95 227 8121
335H121m251j0213J910n314J6701J1163j8874K359n771j2231K2255R899l949k627
349I178j5624n098K99J0448J8221j3347n203J955k1384J3870J8403j3513K981
362A186k816j1734Q075R197R412p333j3929N048q244N260K7322q536j0077q45
376A986j5440N438J1536O091M765j7633m177M025p494J7578N688j8664P48l899
390i452m52J5263M526l41j4428j0450R753k182J4301J8226k2585p979L495j2123
404a4428J3743J5864m639o929j0384J210J905K698J6608j1222j6200P974n342
417i142N993J6658o948n919j0125n656J3115K475Q928N164k0990j124M658m265
431g178J3966L329q430l442l858P669Q39o77Q138j7661m680J7766o796M877R524
$$ plain form
335 8121 3870 -6343 -4433 -9747 6954 18117 -757 1602 -4169 -16400 5855 15754 11805 9178
349 9178 -6446 -11544 -11245 -797 17424 4077 -1126 829 -20555 -6685 11718 -1795 1186
362 1186 -1630 -13364 -5289 3908 13320 5987 -7942 -2894 -11138 -5878 21444 12908 2831 1986
376 1986 -13454 -8016 3520 9611 14376 -3257 -7434 -3409 -10903 6675 12363 -6301 -5553 -9452
390 -9452 -9904 5359 9885 9544 -4884 -15334 -5581 -7763 6538 24764 2179 -5800 -2305 -14428
404 -14428 -685 15179 10540 3611 -6773 -5563 -3658 -960 15648 4426 -11774 -3800 -9142
417 -9142 -3149 13509 6561 642 -9483 -15139 -2024 451 9379 14543 -6447 -7571 -2913 -7178
431 -7178 6788 10117 1687 -1755 -5613 2056 2895 2218 10356 -7305 -11985 5781 -1015 3862 13386
446A3386j8067n554M304K725Q043O23N63r105j0206J3494K212j653R636j3596
460c195p226Q403P95J1132K31j1920j216j0570N099K0125j932p04n164j7348J317
475a2173Q796J0775O187r090m229j1273l862K1932L4l776O677k0537n410J7815
489A866J519N188N17j2400p652k508J4054R508l685L296j3074j1871J1963K495
503g84P462P179j5038j417q86m177J4467K25o548J186q193K513P992j213J568
518D336o796l683J538q33J2315j306j1733Q761p495n410J8593m156p266N431o186
533c890J648O908J382n06r004r52J657J449J3656l621j0373J812j2540L084J8259
548H969m069R40l284j5589L535N692N421Q859p801q200l686N67J1891L754K707
$$ plain form
446 13386 -4681 -10235 -5931 -3206 4837 5460 6023 -3082 -13288 206 2418 765 10401 -3195
460 -3195 -10421 -2018 -1223 9909 10140 -1780 -2996 -13566 -8467 11658 9726 9022 3858 -13490 -12173
475 -12173 -3377 7398 13585 4495 266 -11007 -14869 7063 7097 3321 9998 -10539 -15949 1866
489 1866 3385 8573 9090 -3310 -10962 -13470 584 10092 6407 9703 -3371 -15242 -3279 -784
503 -784 6678 13857 -1181 -2598 -3484 -7661 6806 7031 483 1669 -6524 -4011 3981 2768 4336
518 4336 -2460 -6143 -4605 -5438 6877 5571 -6162 2599 -4896 -10306 8287 4131 -3135 2296 -3890
533 -3890 -2242 4666 6048 5542 -3462 -4414 -2757 -1308 12348 8727 -1646 166 -12374 -9290 8969
548 8969 4900 5840 2556 -13033 -9498 -3806 1615 10474 2673 -5527 -9213 -8646 3245 6999 9706
563I706l910j8265M638Q948m72J6043l989j7982R83m703L795J6374j021n585p111
578b551p466K045M430J0817n94j1872K767n813j994J7881l150n802M189j1831
592h944K428J2140j497L113k600p877J57J394P653M16m372K245q627L18J0051
607E998o931K218N22j2222Q537L913m685P592o753q586N616J654N705L076k808
622B846l696p983O390O832j891Q880p335j2946J0315j251N10J3115r674r527J812
637c603k360O188O184K46n519j1384J716L188K601J2517n774r368K087p732O939
652d074J2994n401J131l918r549Q013M696K110L285q189m647q69L709Q140k635
667D796j15m567j2424R398N276m730J0191o779j2362P530O03J386O706l504m036
$$ plain form
563 9706 5796 -12469 -7831 1117 645 16688 12699 -5283 -4300 -9003 -5208 11166 10145 4560 -2551
578 -2551 -10017 -7972 -3542 7275 6681 -5191 -2424 -8237 -10231 7650 4500 -1302 2887 -8944
592 -8944 -6516 5624 4127 7240 4640 -3237 -3080 -1686 5967 6383 2011 4256 -4371 -4053 5998
607 5998 -933 1285 1807 -10415 -1878 2035 -2650 4942 -1811 -10397 -4781 -3127 2578 5654 2846
622 2846 -850 -8833 -2443 4389 2498 11378 4043 -8903 1412 161 671 13786 4112 -5415 -3603
637 -3603 -5963 225 6409 6655 1136 -10248 -8532 -5344 -2743 9774 4000 -5368 -3281 -11013 -4074
652 -4074 8920 3519 4650 732 -8817 -804 3892 6002 9287 1098 -3549 -4418 -709 7431 4796
667 4796 4681 114 -12310 -2912 2364 -2366 7825 1046 -11316 -3786 -3183 -1797 4909 1405 -2631
682b631l325L441O099j818M595l667j0489Q261J806o10R189q102o473K748l930
697d906P145M693n425k94o279k189O918J319K457l372n611J475k487P555O885
712G884r187J493j616q739J2293N778n282L084o108n590M027M654M652l583k557
727A203j706p571P773O599o646L755m880q436Q570K032R40L319q047j900L75Q72
743c748Q839o91l141j124o314M119M362J539L923q554l132M539m361Q097M662
758I015j0882N87j412l410Q627K374j919l686n400K106J88N358O859r535j612
773b742R75o319R545N457n872J402n226k829O500J386L869k427p236J368j618
788c767L724O955m510r53l973m776P579J066R17L740j0067j099M377k559O958
$$ plain form
682 -2631 -5956 -2515 3584 1766 6361 2694 -7795 466 2272 1662 10851 2749 -3724 -976 -4906
697 -4906 2239 6932 1507 1213 -5066 -7255 -337 982 3439 67 -5544 -4069 -6556 999 7884
712 7884 -1303 190 -1426 -10165 2128 7906 2624 5708 -400 -5990 -1963 2691 7343 3760 1203
727 1203 -503 -8074 -301 6298 -348 3407 -1473 -9909 -1339 693 1633 4952 -3095 -4995 -4620 -3748
743 -3748 5091 4400 1259 135 -6179 -2060 2302 3841 7764 -790 -3922 617 -3744 4353 9015
758 9015 -1867 -1280 -2692 -6102 2525 4899 2980 -706 -6106 -4000 -3812 1546 8405 -1130 -2742
773 -2742 -1767 -8086 1459 6916 1044 2446 -2780 -5609 891 2277 6146 3719 -3517 -2149 -3767
788 -3767 -43 6912 2402 1449 -2524 -7300 279 1345 2262 6002 -4065 -5164 -787 -3346 3612
803C612J373o714k90k044K685M409o27J953o799l324O771k397M489M479j0417
818b841o1J513k729P804P93l563j123n014L105L318M42L831o356l810L384j958
834c265O310K931o704M74l901j233Q968r54K91j39q217J838K982J428M632m035
850A406k746j472k447P683R67k194K535q334n16P195j901M046M98q202O17M4K363
867d58N382k677o52m124l698O880K49J205K913q886k19L044j527P144n67n856
883a847Q89l578K602O117j751J210m285m548M247L57M198K194o984J07k040j190
899d302Q969j903k107J073p606K085N377p45L129l394m268Q48q62N991J845l795
915C35J613n804r66P971k037K212J205q431J780K000j40N272l077k649o77k826
$$ plain form
803 3612 4985 -1729 -2019 -4063 -1378 3031 2404 4357 -2442 -5766 1005 -1392 3097 7576 -2841
818 -2841 -2902 -1389 -4118 3686 4479 916 -207 -5221 -2116 1202 1644 5475 -881 -4691 -1307 -3265
834 -3265 3045 5976 -728 -254 -4155 -5388 3580 2626 2917 2778 -5439 -3601 -619 809 5441 1406
850 1406 -1340 -2812 -5259 2424 3391 1197 3732 -4602 -5118 2077 176 4222 4720 -3482 -2865 -2821 -458
867 -458 4924 2247 1595 -2529 -6227 653 902 2107 5020 -3866 -4085 -1041 -2568 4576 4009 -1847
883 -1847 -958 -4536 -1934 4183 2432 3642 -643 -5191 -944 -587 3611 5805 -1179 -1072 -3112 -4302
899 -4302 4667 2764 657 1730 -5876 -3791 1586 841 3970 576 -3692 -2844 -3706 2285 4130 335
915 335 1948 -3856 -4822 3149 1112 3324 4529 -3902 -2122 -122 -262 5010 1933 -716 -1393 -4219
931d219N332J359j761J776o160l95M253j524M716j302o007L003k052J296O737
946E052l940j361j62l685M250K292O61M22n883O43N87o4P280l154m821K085n317
963e115K607P188l151K54k510m867K980J681L678J510n689k82k430M31P567p74
979C078r47j78p388L119L980n88N308m211n287J922j778L863M109l002j033m102
995c135r36L880QL845j574o504L286j703j3P621l745k601J663m067L077L553r07
1012A748Q64l973j48J830q35M741j810m153K619l320J591N342m417N28q42m562
1028d797N093J087j113K273n133j175K213L93M230j575k107j9m335M892L711l178
1044D60L568l855n441N887j46J410L781n473k185k70O7M810j28J86k232n898L534
$$ plain form
931 -4219 1113 2472 711 2487 -3673 -4068 185 -1339 3377 2075 -3932 -929 -2981 -1685 5052
946 5052 1112 -249 -411 -4096 154 2446 3107 3529 -2354 -1711 -1124 -1188 6092 2938 -1883 202 -5115
963 -5115 -2508 4680 1529 1783 -727 -5594 -2614 -933 2745 4255 -1434 -1716 -4146 -3715 3852 3078
979 3078 2131 1953 -5435 -2316 1664 1076 6384 2173 -3114 -1192 -2970 893 5002 2000 967 -3135
995 -3135 -4071 -191 -183 3662 2088 -4416 -1130 -2833 -2846 4775 1030 -1571 92 -3975 -898 2655 1748
1012 1748 2612 -1361 -1509 321 -514 4227 2417 -1736 883 -2437 -846 4496 79 607 -235 -4797
1028 -4797 296 1383 270 2543 -2590 -3765 -1552 -1159 3071 1496 -611 -630 -4965 -73 3638 460
1044 460 4028 173 -5268 619 473 1883 5664 191 -1994 -2264 -2197 2613 2485 2671 439 -5459 -1925
1061a925J517J46N498n113l898K255k965M704M359m199N99k952k395M849J173
1076A653J792p52m458Q96j506K294N173m368J04l31n448N381K061k885L315l971
1092a050k745L377k96K183K04k618J67k658K730L365k973K100k079m032N596o41
1108F30n1L861n634j039K652j752L977L18k920j94k881K257K313n64K354m652
1124a325k481L714k071L343L233o391P35l88k359N835R30j942j05l549Q62J758
1140b01J355K996l607j549M92k861N228J998l961K278l736k587N454p00R65R28
1156B492m837J17O18J224L030k121l25j658k681N021J92n57K976n720p84M032
1172A019k277L701J031m802P77q27M71L528q73K29k625k315L088p42K139K204
$$ plain form
1061 -1925 -408 -262 5236 123 -3775 -1520 -4485 219 4578 379 978 -1974 -4369 480 1653
1076 1653 3445 2693 -1765 -869 -2375 -81 5092 724 828 497 -4951 430 2491 -394 2921 -1050
1092 -1050 -3795 -418 -714 1469 1673 -945 -778 -3436 -706 2659 -314 1786 -293 -4325 1271 630
1108 630 579 4440 -1194 -2233 419 -1333 2644 2962 42 -152 -3033 -776 1537 973 3327 -1325
1124 -1325 -3806 -92 -2163 1180 4413 -1978 -1243 -1631 -3990 1845 2775 833 728 -2821 -1959 -201
1140 -201 1154 4150 543 -1006 -514 -3375 1853 3851 -110 2168 -1568 -4155 1299 599 1564 2492
1156 2492 -2345 -2228 -1610 -386 2644 523 198 -1460 -4141 880 1072 515 3491 -2229 -3013 1019
1172 1019 -1258 2443 3474 -1328 -551 -1378 -907 2621 1748 1977 -648 -2963 125 -617 1522 3726
1188C726n832O89L96k212N730k63l204J439l422L85L628p1J248k109k269J275
1204h66r75L599J605l936J701k487j867O014j477m33J775n387R31K351n93K472
1220B427j591k175K05j604L452P25j627J686l984l58M099j928K254J024n552K085
1236h62M23n17M295j827j646k15j895K849J086j28Q93m410L86J891j669M418q32
1253B240m487K086k320N86M452j604m92p92l065K307J067J479J091l635L11o92
1269a468o95N144j017j407J101m506J173L668j402K124j234l887J458l52J999
1284F99J705k235J13k486m89L813j229J333L70m861J913J264j232M054j569k341
1300a178J106j868J977K006j122M59k558j87K243j292K764m24l926K172j435j52
$$ plain form
1188 3726 -2106 -1417 -1021 -3233 2497 2234 -970 469 -2953 -2568 1060 989 2237 128 -2141 -866
1204 -866 -1841 1758 3363 -573 1128 -1359 -3226 2788 1311 878 2653 -2734 -1803 548 -45 2427
1220 2427 836 -1339 -1134 -2738 714 1439 -188 1498 -2486 -2844 1255 -673 1581 2605 -2947 -862
1236 -862 -439 -956 3339 1512 -134 -349 -2244 605 1691 1563 2456 -1954 -1568 323 -1346 3072 2240
1253 2240 -2247 -161 -2481 -1895 2557 953 461 -331 -3396 -1089 -22 1457 2548 -1087 -776 -1468
1269 -1468 -2163 2981 1964 557 1658 -2848 -1675 1993 591 2715 1481 -2406 -948 -1300 699
1284 699 2404 169 282 -2204 -2693 1120 -109 1224 1594 -3267 -1354 -90 -1322 2732 1163 -1178
1300 -1178 -72 -1940 37 2043 921 1380 -1178 -1365 878 -414 2350 1926 -2000 172 -1263 -1415
1316a415M339k776p57N07k888K670J423p43J032k642n12J147l08L291r89k242
1332h63J291k994J574L913k390R30p66l597K778P55K62J758l037n87l38k27L343
1349A805r54n95L38l881K035K100j429K998k063l071K261j219J818K581k475k32
1365A7r34r77L072j14O21k88l537J585K24q0L507k585j617J159k555K624J979
1382B101k154R00j959j235K272k23J961n39k629R69j266Q85L552k300K47j67l430
1399c015L126J138r81J985k612j323J480l64K189Q3j944J93k004J173K304j572
1415a44J875j645k913K918n22M60K217k964n22P98j326K708L29r15K80k633J341
1432f58J170n45K594k348j668J884j926K055K082k991O95q77j529K974J7k94Q8
$$ plain form
1316 -1415 2924 148 -609 -102 -2990 -320 1103 360 1392 -1250 -1762 -615 -923 2368 1379 -863
1332 -863 428 -2566 -992 2921 531 1461 695 -2902 -124 631 893 2651 -386 -973 -1311 -1538 1805
1349 1805 851 256 594 -3287 -1252 848 -581 2417 354 -2717 -456 -1675 143 2724 249 17
1365 17 -917 -1894 1178 1064 1685 1397 -2140 -555 -331 -411 3096 511 -1106 53 -2502 122 2101
1382 2101 -53 847 -1112 -2347 -75 -298 1663 1124 -1505 -536 -1802 -917 2635 335 582 415 -3015
1399 -3015 111 1249 268 2253 -359 -1682 -202 -566 1623 1706 -238 -45 -2049 -876 1428 -144
1415 -144 1731 86 -2827 91 -431 29 2246 -718 -1240 -442 -1768 940 1269 354 634 -1999 -658
1432 -658 512 -33 2561 213 -1455 429 -1497 558 2640 -351 344 -533 -2062 912 929 635 723
1449G23k557P97M30L85K584k401p44M48k426L360J207k148J692k489j297K922
1465D86m54J423O50l138L40l39O02K764j563K78j247k377K873j20K24K078l673
1482a193n08J375j260K594O98k267M39j662N52J921m99J461j657j837J980j136
1498i99J325K263l104N97j65j806L252O3j444J207k132L8J325l53J433j457j125
1515a082P93j508K274Q63k213J299j470j356L545r59J16R81k845N77J191k22J934
1532A918j194q06p5j435K532L19q62J260k715o92K520j199J666L16l254R50l91
1549a142j71K633o70o71l92j889J797N53P92J122k788O9N81j521L579j28k137
1566c83J250k104l7K576n16M14o53j808Q01l38J393R27k081N41j116r74L248q05
$$ plain form
1449 723 -1834 -1037 -607 -222 2362 -39 -783 -335 -2761 599 1806 -342 1350 -1139 -2436 486
1465 486 32 1455 2105 -1033 -693 -1032 -430 2334 771 1049 -198 -2575 298 178 402 2480 -1193
1482 -1193 -1701 -326 -1586 1008 1706 -561 -122 -1784 -1232 689 190 1651 -6 -1843 137 -999
1498 -999 326 2589 -515 82 -83 -1889 1363 1426 -18 1189 -943 -905 420 67 1500 43 -1082
1515 -1082 -289 -1797 477 1340 -873 426 -1044 -2400 1145 186 302 1283 -1562 -985 206 -16 1918
1532 1918 724 -82 -157 -1592 940 1259 397 1657 -1058 -1750 770 -429 1237 1553 -1701 -751 -1142
1549 -1142 -1313 1320 650 -21 -413 -2302 -505 48 840 1962 -826 -757 -176 -1697 1882 1754 -383
1566 -383 867 -1237 -1274 1302 786 1200 547 -1261 -460 -798 595 1522 -559 -18 -1134 -2108 1140 335
1584C35m99J098k747M78J723o61J445n23j493P25q74J515R05j190O00j623m63
1601a249K269j005J113L28l194J410L03q56K803j268j515N72j137J241P58k36
1617C37M28j976L8J333r82K404l83k410J392j064K8K641j326M2N3k069J487L51
1635C24J58J002j786k78K33p84K355n33j042R67k406Q63J932j436J406n15k517
1652b057J734R8J83J526j530k50n31k10K161q21M26L47k939J555Q45q93K186j208
1670F22j805J363j063P92J589j246K3j151m91J661m58J011j50k300J260o50J01
1687h92K685j676n66Q99k141J550J318r75R44j091j090R19j20J468j54j319P02
1704D61j789P85J896j550Q82l07k422J982J17n71J720j495o95O76o26J480K5n50
$$ plain form
1584 335 -164 934 -1813 -1335 388 -273 1172 649 -844 -119 -993 522 1427 237 837 -786 -1249
1601 -1249 1020 15 1128 1456 -1738 -328 -25 -881 1922 654 -861 -289 -1426 -185 573 337
1617 337 765 -1211 -1173 160 -822 1582 1199 -1211 181 -883 -855 1786 460 502 555 -1514 -27 324
1635 324 482 1484 -302 -580 -347 -1131 1224 691 -351 616 -1790 -927 1005 -431 975 460 -2057
1652 -2057 -323 -225 -42 1484 -46 -296 -827 -1037 1124 303 729 1076 -1863 -308 537 -356 1830 622
1670 622 -1183 180 -883 -91 1498 252 275 -876 -1367 294 -164 847 697 -1603 -343 -993 -892
1687 -892 1793 117 -449 450 -1691 -141 1177 202 1146 55 -1035 -116 -236 1232 1078 -241 461
1704 461 -1328 -543 1353 -197 685 378 -2044 -62 55 -516 1204 -291 -986 -310 -936 544 569 19
1722A9K88j591J011J109j207J952r73j823J948r34M09J839k135j1Q2j084J771
1739F70j74k45L2j671P97K30k81J753j461p64J167j724J751J446j699M45m96r97
1757a221J770Q9J58M79j728M46k15L57J577j458%K8j955J864O40j254J679j966
1775g10j009J405p18J279K99j289K59p32M65J436o25Q46o34j472J891l84oJ889
1793B190k215j92P33j263J613M10j293M65j311K17Q82o90J110j003r65J013p72
1810a071Q37J178k020J032k35j216K201r6m07Q28j662M10O97R9J009j050n15K83
1828C02j217J317Q18j485J108j449r70J918p89L98O37j973L43M04j16J520p16
1845E0l74J44r26J510N8o4J230j877j26J093j143J594M86k051P76q88j8J423q59
$$ plain form
1722 19 307 -1284 -273 836 -371 1581 608 -1215 733 -201 208 2047 -88 -99 -17 -1101 670
1739 670 496 251 283 -1388 -591 -361 -642 1111 -350 -1114 53 -1671 80 1526 -173 272 -224 -1221
1757 -1221 549 638 796 1275 -453 -7 -222 135 1712 254 254 282 -1673 191 831 -423 1256 -710
1775 -710 -1719 -314 -1032 247 546 -743 -484 -1216 -751 685 60 906 272 -1200 691 307 301 2190
1793 2190 -25 -217 516 -747 866 1276 -17 448 -863 -646 236 -454 656 -347 -1312 -299 -1071
1810 -1071 -234 944 -1076 -44 -279 -1495 706 610 203 1031 -631 -221 476 575 1584 534 19 302
1828 302 -915 402 1220 -265 843 -606 -1576 342 -447 -49 588 -1385 -1042 -638 -754 766 50
1845 50 -324 -180 -1106 404 462 398 1628 -249 -375 718 -425 1169 1655 -396 380 -508 -526 897 38
1864C8L26n70j200J127l05K73J261j936L57L50j258K123J49r77J138j533m4J602
1882I21p45Q58l38j024P50o72Q17R51j549M06p43j129K246p42j74Q65k027M04
1900i25P95q37J590l55j012O60r02R81N36o18R56j165k55J318r70J070K99j811
1918f45P38ln96J724p73o37K55j138Q72J68j24Q39j372J31M56j008J830k35j261
1937g79J181j082J6J814j098L47J58j460Q74K55P3R02j311n7j40q23K076o72l64
1956i0N92j647K61J288q46R63k71j494J097l30M55J049j119N12o31p74J761n11
1974B65L53N20k035O75L08o93J744q14q92Q69j268P38Q45p30N82q95m68Q81m90
1993e05J196l1j450J125p57m05J874p59k30O26j594R06O48o88P70r96k74O63o33
$$ plain form
1864 38 364 -206 -1406 -279 -584 -311 950 -986 -629 -279 -1537 586 735 -242 896 -637 -681 921
1882 921 176 1034 696 -328 422 -250 567 1518 -31 375 -368 -1497 749 7 -167 698 -1329 -925
1900 -925 -130 -967 623 268 -744 -84 -986 -5 531 -87 869 -296 -551 767 -203 867 1166 -645
1918 -645 93 90 -506 1218 445 -192 63 -1075 -203 -35 -159 680 -692 -561 -105 -1113 717 482 -779
1937 -779 402 -680 -664 1150 52 399 557 -903 -29 226 299 1201 -110 -167 -307 -1130 946 274 -90
1956 -90 502 -1145 -884 404 -442 521 250 -1244 -147 -477 -22 1027 -92 420 -211 -985 776 265
1974 265 618 1138 -897 -222 86 -607 1137 323 -569 300 -968 -230 615 -115 467 -428 -896 -15 -505
1993 -505 691 660 -790 335 -422 -827 1047 288 58 684 -910 -4 644 -44 726 -270 -544 119 -514
2012e14R89K9j150J059j132L2J523j170P78m9j514J444l18j90J185j088k32M53
2030A35p42J300l15k87N18j562N63O54n75J233o27j411J323r93M42J236j285K78
2048a15o7q82J275j88K80M64j483Q51k24k10J625j040l70O99j346P22P79r83Q80
2067F67q54o90J016m06M47J92r44M62n60QJ320r68L76L86j583J352J76o26J340
2086A111j114m75J086r30P58M65r23L34q84L25Q71r20P86n37r73J159n18r5J567
2105A093j670J76L45j031J468j32k24L83r84M49O16l83Q97n68o88P88q80O07R46
2124A208j367N98k85j133J155k88k16P48j184J84K82k87R87q25PL92j026J184
2142A34L48p46J234j022l87J026p64N92N67j067K44k69k25J026n90L28l72j012
$$ plain form
2012 -514 475 504 -646 413 -719 -687 836 -334 444 395 -1119 325 7 -183 1002 -86 -318 135
2030 135 -607 693 378 91 609 -953 -390 264 -311 922 295 -1116 207 -786 -344 892 -393 -115
2048 -115 -182 -1064 211 23 303 767 -716 135 -89 -299 1326 286 -84 615 -731 -9 770 -213 667
2067 667 -187 -877 139 -267 180 372 -572 -110 -670 -662 658 -310 66 452 -1131 221 397 -229 1111
2086 1111 -3 -478 608 -322 436 901 -22 312 -572 -247 624 -296 490 -47 -1020 139 -379 -474 1093
2105 1093 -577 -401 -56 -1087 381 249 25 408 -576 -127 489 106 1003 435 -253 535 -345 262 1208
2124 1208 -159 439 154 -979 176 -112 -328 420 -764 -580 -298 -585 402 -423 -416 -24 -1050 134
2142 134 482 -264 970 -52 -439 587 -177 415 982 -85 159 -110 -335 691 101 429 57 -955
2160i55J203j82l96J275j482j20P36j046J248L11j248Q59o59j73J062l05N70k95
2178D03r77R81m71L58Q46j290L44p4r46J393o4q39Q92j202M6N57m89R28k63o89
2198e56M41p64R12L66r45J078o52p77J617q70M15O57j239K67N21p46J167m03n84
2217i5M03r15O21L15m42P05j053l18J145j251R53O58j391O48k87m65J328m57j41
2236c9L57r81R50k15RQ71j231K62K37n11J010j29r34R82r92j80J180q06L97J6
2256B53r42P13l22K5P87p30J84k70n92J319l01k23P14j287M39O34q72J135j44
2275E20q67N73n75L78N84n57M06l70p08J134p24M49L48j272O62j66o34J312m63
2294C0m58O19r74O53M89n00O22o79k88P55p38J001j7p95P64n70j49J072q24K18
$$ plain form
2160 -955 248 66 -330 945 -537 -657 79 -967 281 592 -656 203 -456 -629 433 128 698 403
2178 403 -574 407 -64 294 1140 -150 194 120 -826 567 503 -336 556 -646 -600 -43 -532 396 133 -556
2198 -556 -115 -879 33 399 -546 532 -120 -897 720 -150 265 922 -317 -50 471 -275 892 489 -95
2217 -95 308 -607 14 329 -113 592 -461 -779 366 -885 68 726 -665 -17 -304 -769 559 102 -39
2236 -39 318 -663 287 72 81 952 -279 -17 220 -291 719 590 -344 638 -354 -534 646 -160 237 253
2256 253 -689 24 -298 -273 514 -216 -32 -302 -894 425 124 -99 615 -672 -233 401 -471 664 520
2275 520 -347 226 -349 29 613 56 462 92 -616 518 -206 243 591 -681 -19 -185 -819 493 30
2294 30 -428 191 -783 -130 359 -141 481 -198 -486 269 -469 532 515 -280 484 -86 -235 837 13 231
2314B31K11j201P41L17m51P95p95n5L09q38J127k96m26N40r82M10Q46r36R38j03
2334C82j088R95m22LR39q18p9J85n62Q72j65j39N31j300O04M32q95J190n20o66
2354e21P12p81L69N60p24M90l11n43R18k81J27N88j107P05k41k12J064o52l08
2373a48P09j163P95K89o65P20n88l27O34m85M41J45o85N69p18L3Q38j027P61n7
2393G1j087J065j28l10J096p60j07M40o35P21M5l39L83o17J38M34o56Q29k29q99
2413e45J017o47j31R76r61K01j2o59Q35rk65L64o75K66L73n55R44o07k64P74r60
2434e40O63O35r81N69k53o41J009m20J29L47p89L09k50k0O77o21M6J82p64Q04
2454I1L7n21Q39o43k81P75p85O83K62o98L64k88N7P28o72L42R9j027Q50j28l85
$$ plain form
2314 231 442 -759 -18 299 -152 643 -152 -207 102 -736 391 95 -331 209 -773 -363 483 -453 485 382
2334 382 -706 289 -133 -130 809 -9 -88 97 -465 407 242 103 634 -666 -62 370 -525 665 145 -521
2354 -521 191 -590 -221 339 -385 105 -206 -749 169 -112 15 603 -504 201 -40 -252 812 160 -148
2373 -148 561 -602 193 482 -183 537 -51 -378 256 -229 212 357 -328 241 -477 -444 394 -633 128 71
2393 71 -1016 49 -79 -389 707 -53 -160 280 -355 366 411 72 455 -162 -24 410 -246 583 354 -545
2413 -545 472 -175 -306 670 -291 -90 -102 -761 74 65 -200 164 -511 -245 128 -427 517 -90 -354 420 -540
2434 -540 123 758 -223 346 93 -548 461 41 170 517 -272 37 -213 -233 444 -177 -131 51 -713 91
2454 91 128 -393 446 -197 -478 297 -488 195 457 -241 123 -165 -108 620 -52 290 389 -638 212 84 -301
2475c01R42r39K02L38r78J044j50n39O31p29K42M00n04N72k07m86O74n76K60O59
2495E55q67N52J22r04J028j91m04N31o38R1N09o28N88l96k80N03q80N21N34p20
2515c74O87m61m27Q08m78K74L66q96L26K57n20Q29k66j36J60o08O53P7l26P34
2535F79q70j33O96p69P35K61p76M15n01j39P76p26L66K06q58O30k65n8Q62q03
2555b72J19K27p35J004j39m97P84o05j19N06m67M00J25p69N37k92J09L74l46K71
2575B15j72n20O95k13k54Q23r23J11M67o54O84k42l52L30k69J80K30l18N52m84
2595a14j10M97m58J96M31q16O40k03m70R47m89k73O02q47L55L45l87O62o03n4
2615a49L39p22O96O8n98O03n17j10Q54p31K85L53p97O16p6k24P11o42J62R0o38
$$ plain form
2475 -301 641 -298 -96 242 -736 308 158 -381 250 -479 -237 163 -341 231 24 -462 212 -364 -104 555
2495 555 -312 240 362 -542 486 295 -109 422 -216 -125 384 -244 344 -52 -332 171 -709 -188 346 -374
2515 -374 313 -148 -575 233 -245 29 395 -501 -175 82 -438 391 125 -11 149 -459 194 271 -55 679
2535 679 -191 -324 372 -397 338 599 -177 238 -263 -402 374 -352 14 220 -638 -8 -273 -331 531 -272
2555 -272 -153 74 -661 343 204 -293 491 -114 -233 273 -194 206 331 -438 99 -193 -84 290 -56 215
2575 215 43 -477 218 5 -249 574 -349 -238 229 -425 259 17 -335 -5 -274 -94 136 -182 370 -114
2595 -114 -224 273 -185 11 442 -374 266 63 -407 540 51 -222 380 -467 -112 233 -154 508 -95 -149
2615 -149 190 -532 164 232 -366 237 -280 -390 464 -267 18 371 -426 190 114 -110 601 -41 121 211 -427
2636d27P32j43m40O02p33L63L32n49N84q1q17O03j30M8M03p21M06j25l94O14k29
2657a02J20L49p02L99j1n50R69l31m47N80m63J09O33o51L36j86k75L00k68L57
2677A66k8n55M49j04m44R75o77L9M27o74J11M25m88P85m41o9L60n98L51K23k86
2698e3M46m87k14P80p22L62K57p61O76k62k50N42m63p6J39k84M56k4k41K58m76
2719c97M77K8m18O58k08n02P57o60L26N57p74L93o1n38O84l06j06N66q20K91j49
2740b02j50P09m70j63N18q39M61L05n90N18k92k25O86k76N0K39n10M03l31j38
2760b97R51p44M00N2r06Q29R1n85O90n88k59N43l92K11K27n65L43m44J38M32n09
2781c82M81N3o81O54m51K6Q27n66j2L05o03O57n2l52L65l18k7K75m76N46k00l11
$$ plain form
2636 -427 305 162 -278 324 -409 -46 286 -263 321 240 -577 26 -104 -56 347 -374 32 -93 -487 127 -102
2657 -102 18 367 -335 64 53 -497 472 141 -306 274 -189 -80 553 -98 238 52 -223 77 -191 166
2677 166 138 -417 32 -72 -516 459 -218 -179 248 -426 -315 110 -378 407 -34 -103 257 -341 10 233 -53
2698 -53 393 -94 -308 472 -250 112 369 -392 284 22 -228 314 -149 -225 -86 -370 86 62 -179 79 -397
2719 -397 80 108 -310 348 140 -362 395 -265 61 618 -156 237 176 -362 322 16 -90 476 -344 -53 -202
2740 -202 -352 357 -113 -276 242 -597 -136 169 -421 97 -195 -420 266 -10 40 279 -231 172 -159 -297
2760 -297 654 -90 310 362 -544 285 376 -209 481 -107 -366 177 -215 -4 223 -342 1 -443 -305 127 -382
2781 -382 99 152 -529 125 -326 -300 527 -39 -51 254 -349 308 256 -96 269 -49 -76 199 -277 269 69 -242
2803b42N25o23K08M65o50L04P2p00P37j26l48M91l76J53K42l10N65m22o4M98o22
2824b23K79K08k72L07j66m24N71m64J83M97q75L85j18m04P69j67j55J26m18M43
2844H2j41k62Q50p13k1M68n67M22J75o13M22o5j55M79l06J47j36k40L72m54J69
2865h7M55n78K41pn12N78k7m17N56n34OM24n62O89J1n45M44l09K20K17n52N44
2887B55r3m82P25m81l3N78o66J17K06o61P59j09j61J87m60K45K10l96P35o86k77
2908d88Q16r36N20M12p43O06r4l33N36l96J72J96m50K64N9k17M29m83J3K89n50
2929c78N51m1k69L13l63r2O59m92J18K88o94M24Lk08N93p03K79J36l14L10j33
2950a3j07N65p94L02K96m69M69m0m08M38l69P8K46l08K07l3l30L81l29J1N53o89
$$ plain form
2803 -242 283 -340 -132 333 -317 -13 59 -641 96 -30 -378 113 -263 -110 132 -178 387 -35 -99 399 -223
2824 -223 56 264 -8 299 133 -291 280 -184 -1 496 -379 6 -112 -516 253 86 -69 57 -361 82
2844 82 -59 -321 529 -184 -205 263 -304 118 293 -320 102 37 -118 361 55 202 66 -174 198 -256 -87
2865 -87 368 -210 31 24 -488 90 63 -354 202 -332 -326 98 -464 225 236 -309 135 -174 46 263 -289 255
2887 255 162 -320 405 -76 -109 469 -197 -80 126 -535 224 115 -46 141 -319 -74 136 -260 475 -211 -488
2908 -488 328 -608 -88 324 -419 187 93 -240 296 -100 72 268 -182 82 141 -76 353 -130 -117 172 -378
2929 -378 173 132 -137 176 -187 -279 380 -112 6 294 -400 24 27 -181 412 -291 -12 124 -190 120 -13
2950 -13 -120 445 -349 -47 249 -220 249 209 -199 239 -130 -52 194 -114 93 60 -270 111 -218 -207 346 -343
2972c43L63J5m04N53j14l70N62p26L72L55m62L63K5k84L68m18J11K40m34O06m00
2993b2k69N03l37R1M39p21M69n6m23N95k15k90K00k05L92%l72M86l84j0M69n30
3015a90L12J74p02N64k16l7M89l16q6J92m42M98k47oL05m34o1M01n13N80j64n79
3037d78P75o26J21M21m75J87N1k02M30m42L78K47n69L22o4j96N36l25j96M53m70
3058a22J37O8l46L95k01j65M06n23M35O4m09K82j76k18N36l05N0K75n39N00p5
3079F9k34N02m64R8L70m05L49J7m88M97k99mK79l46K62l7l56M18k23j96O04p39
3101c26J48L77l98L23j76p8J62k86J69K88m79N23j96j81M39n88L65M14n66L48
3121B82K1m22K87j65j50L01n25J80K59l06L71j26l75N32n81L56K64n62N59l13
$$ plain form
2972 -343 20 35 -369 184 70 -300 262 -464 -92 263 -199 164 189 -95 273 -145 -34 206 -228 378 -22
2993 -22 -291 212 -125 -34 405 -316 153 97 -326 269 54 -236 -36 -241 151 151 -221 265 -119 -129 340 -190
3015 -190 122 296 -406 158 -58 -95 394 78 -8 184 -258 240 -7 -13 292 -142 -203 198 -315 265 101 -478
3037 -478 297 -329 -208 213 -262 -75 -24 -226 204 -238 140 387 -182 140 76 -120 416 91 -105 348 -122
3058 -122 15 83 -263 132 -69 -234 172 -351 84 148 -261 21 -155 -373 163 -142 -92 183 -356 144 69
3079 69 -165 337 -127 -29 341 -64 285 302 -186 311 12 8 287 -59 203 166 -190 228 5 -191 413 -326
3101 -326 -178 199 -199 124 -52 -130 32 -254 -85 203 -276 247 51 -130 309 -279 86 500 -66 282
3121 282 303 -119 168 3 -147 154 -371 -191 68 -238 133 7 -368 164 -417 -61 203 -359 200 -113
3141a13k15O26l98J76K30n30M68r7q4K45l62K06Q0n62N09p7l46O47m78N0K95n78
3163c08N11q3m46O33m66r7L41l19J80K50m80L97k47L3L60l39K18J24n87N57k44
3184a2j30N95n22Q1J87l60K76j16l29N45n53L30J58l53J28J48m93N57l00K3O02
3205D62o82M18O4n58O68n15J91L58m26j0L12n04M46l01n0L11k99K30J69n67M97
3226B14k36k25L66k61K16J71n35K22j02k3M26n00K75J55l85M35r6k79M48l26J8
3247b2L37l17P6K00m55Q1k18L11J49k78L30j84n47M43q5o9N13l52O6R2m71O06
3269B06o0m30O82m34MJ91m14N00j10k29N18m60O2J49l01K60n9n08O49l55n1K66
3291G6k59J98J4k30M70l71o8L72m86L04J28l45L63k66j0N19l55k3J68l21K50n8
$$ plain form
3141 -113 -328 298 -100 76 306 -224 244 147 63 308 -54 152 232 -330 179 102 -244 403 -75 -25 270 -308
3163 -308 203 120 -326 307 -159 -256 85 -234 -54 196 -284 113 -134 -101 259 -80 138 262 -325 232 -12
3184 -12 -142 453 -69 12 199 -161 115 -1 -330 215 -338 -8 150 -203 -75 73 -420 137 -163 -140 462
3205 462 -220 198 262 -296 372 -143 48 406 -20 -30 282 -222 224 -77 -127 184 -115 115 284 -283 214
3226 214 -22 -247 119 -142 74 245 -290 -68 -170 -193 233 -267 8 163 -222 213 117 -162 286 -40 -22
3247 -22 315 -2 74 274 -181 -100 -318 -7 142 -136 194 10 -537 -94 -179 -248 265 -87 -21 71 -400 206
3269 206 146 -284 398 -36 -32 159 -255 245 135 -94 424 -36 26 175 -126 134 75 -433 216 -139 -190 76
3291 76 -183 15 29 -201 269 -102 -170 202 -284 20 148 -197 166 -100 -110 409 54 31 199 -122 128 70
3313G0j15K59k58J80O7l22K43o0l15M32l25J34K42n28L81j4k95M63l40m1L25l18
3335a35K35K0l25M12j67j07M27m67K37O6k50K20j50k57M96m31J37K47n44N27k3
3356A68m27N37m62J03K89n28K22K49m43N99k57k78M15n36N12k5j94M08k91j60
3376i9L56l45J54J39l73K32j49j2L36l86K19K6m76M69j08k31M90l52j51M36l59
3397a84K15Ok57M80m63J11L83m86L48o2l74N28r7k44L06l59K58j21l01M47o0l42
3419b68L88k23QJ69m54O00l99M9K96m04L2M67n30M54M7l50K93j50J32L9l62K13
3441D7J06l31N19l67R6P3m49M14l24n4M64j15ml5m06L46N1j96K44j06k15L13j4
3464E7K1O8m39M73j92j01M55m45J96K70n58K18K14k81L27k46k59L61l96K27J17
$$ plain form
3313 70 -45 214 -44 136 203 -119 124 64 -251 181 -144 -10 232 -296 85 71 -224 239 -101 -142 183 -135
3335 -135 100 120 -205 207 40 -67 360 -107 130 196 -54 166 16 -241 255 -176 -39 208 -336 191 168
3356 168 -259 278 -184 -81 208 -320 -98 151 -292 307 50 -228 187 -349 163 138 -56 352 61 -99
3376 -99 257 -88 66 205 -168 64 -85 -97 239 -147 72 98 -378 91 -17 -248 242 -110 -261 175 -184
3397 -184 31 37 -220 260 -203 -92 291 -195 153 91 -283 245 148 -96 210 -149 109 -12 -313 134 74 -268
3419 -268 120 -103 -95 74 -380 220 -179 -130 166 -238 -206 261 -269 185 232 -118 175 25 157 196 -166 47
3441 47 153 -178 341 -26 70 143 -306 108 -216 -270 194 79 75 40 -366 -20 31 -165 79 -27 -242 71 57
3464 57 78 146 -293 180 -12 -113 342 -103 93 363 -195 23 237 -44 283 37 -222 139 -257 -30 87
3485H7k92J91J1MO1l31L05N5l79M36j80q0M02l77J01P2k43K94j66p0K76l67K74
3508H4J6l91N09j96k73M96j91o7R4k34J76qk94L35o2o8J13j22J96M7m58O27l64
3531c5j30M42n78N04ol42M57k12k23M16o00M27J39n29M45j71j12K90l67m9M21
3552A87m07M28k70j49M23l66r7K58l17L70R0l37M68l71J4K63k80K72j49k25L88
3573A93l34J67L24o03K54o7k18L91k1j84L18m10L87m9l28K09K1k91M57j16j65
3594f5K46m99K63Q0j52L87k52L9J35l41L66l3k02K44k38r3R0j33M00j26k84L18
3616A50k32q1K66k00Q3J21l86M11k60k0M20l04j51K37j77K92l15K5M63l68l9L26
3638B61l95K53N7l21K32k07j28M39l05j06K90n25O02l01k0K41k39K37q1j58L44
$$ plain form
3485 87 -205 -14 -3 1 62 -269 36 91 -288 148 -32 -112 290 -87 14 86 -157 137 -29 -99 177 -190 84
3508 84 100 -291 218 22 -251 245 54 -13 81 -153 23 15 -279 56 -6 -74 39 -83 113 160 -298 329 -35
3531 -35 -165 277 -301 203 197 -145 312 100 -123 293 -307 120 259 -270 175 4 -108 182 -185 -234 187
3552 187 -220 208 -62 -211 212 -154 -251 7 -310 60 150 -187 281 -90 -76 187 -93 179 30 -195 193
3573 193 -141 26 350 -253 1 -66 -284 107 86 -98 220 -190 197 148 -180 29 50 -241 216 100 -65
3594 -65 181 -318 -55 25 -127 260 8 47 182 -159 207 174 -28 216 -22 -115 -25 -158 242 116 -168 150
3616 150 -82 -163 103 -97 -14 107 -279 132 -128 -148 272 -32 -183 54 -123 169 -146 -121 342 -26 -65 261
3638 261 -134 119 176 -145 87 -120 -248 191 -114 -220 70 -455 147 -154 -174 67 -172 65 -16 -174 170
3659A70j94n1L43m46K34J67k97J69N4l22K81q7OJ58l78K41m7k37L77j51r7J82
3681G5k24K41nk42K26p0o7J41k36J00K72k03K60l70J12L97m23J24l5k40L24j36
3703B1j98L16l18K09R4k19Q4n4j32K81k76K77p0Jl2P4l37M91k15m9K55m50K99
3726E2J39m83M19K3j66K4p1J82j01k58L31Q9k05J86k62K10k4j99J43L1k85L35
3748A10k66N3K30k82J18O2qJ94k97M1J82l00K74j0k95M05j49j55L68l92J02m4
3770e9j07L80j27j3R4m72K39J69m75O09k07j56L27k93K4J77l55L77r6j19M01l85
3792f7J15k1k15L24j26j97J83J26j63J84k47J23j2l23M29j35l0Q5k64K87O1k93
3814a76J63m0J9J72l22J74n9J5N4O4k50M51j84j55K83k70J93k13qK28j56J34o4
$$ plain form
3659 170 -24 -75 268 -178 56 223 -74 95 149 -173 108 21 27 185 -193 48 1 -236 141 -10 -107 75
3681 75 -149 92 87 -155 71 1 -66 75 -161 -61 211 8 268 -102 10 407 -16 108 73 -167 157 21
3703 21 -177 139 -179 30 124 -95 -11 -65 -197 84 -192 85 15 16 -16 58 -279 212 -3 -52 203 -247 52
3726 52 191 -292 127 150 -16 8 -63 119 18 -240 91 180 -25 161 -101 109 85 -114 29 60 -225 110
3748 110 -156 -103 127 -155 -37 25 17 211 -86 -45 137 -163 111 101 -194 211 62 -93 275 -117 -15 -59
3770 -59 -166 214 87 74 168 -304 -65 104 -371 238 31 -125 202 -91 -67 110 -245 132 36 -83 318 -67
3792 -67 48 27 -188 136 10 -187 -4 122 -41 143 -104 19 7 -316 113 -22 -52 33 -231 56 117 -176
3814 -176 -13 -53 -34 138 -184 -10 -69 -54 0 64 -186 265 81 -74 209 -61 132 -81 -89 139 -17 117 53
3837E3q1J78j41p0L45l69pK29l21K75j16k09N15n08P4L82k62J23Oj03J71j22k66
3860b24L62k15J43Q8k75L70j98j70K81j86P7J9j61J04P2l73L82j46k8L08m75L11
3882F6J28l43L47n0k47J23r7L5K50k98K91l9k60L35k28O2O8k78K37j65KL57m07
3905a11P9J25j01M3P6n0J60k83k3K27j77J16k6k21K39j90P7J87l42K66J75m66
3927b20K09j05m6L08k76J95J16l85M13j93j90L82k64NK86k47P2j88o9K73j88J46
3949C4J8k61J98K2j59L86m46K67J15k78K65m0j14J07j80QJ14j73J34k8k53J02
3971a62k7p8L51j58o1J38j50K22r5j71K53j01Q2J30m60L42O7k36M22k25O9ol51
3994b05L27j61j19K37n8lJ3k87L23n8j8K15l00o6K30j71J86O1l73L90k21J52j8
$$ plain form
3837 53 -28 150 9 -61 284 -85 -92 137 -184 91 -25 -234 281 -227 -153 229 -33 90 96 -7 164 42 -224
3860 -224 138 -77 66 154 -121 249 51 -119 162 -24 53 72 -89 15 87 -286 96 -50 -78 230 -245 66
3882 66 194 -149 198 148 -99 24 -73 -38 212 -86 205 166 -94 241 13 75 143 -135 102 -63 -61 296 -111
3905 -111 -32 93 -8 35 111 61 221 -62 -85 142 -35 81 55 -166 73 -117 -40 147 -195 71 246 -220
3927 -220 -11 -116 -162 146 -130 65 181 -204 209 16 -174 208 -56 -51 235 -12 60 -128 -197 76 -112 34
3949 34 52 -209 -11 11 -148 238 -208 59 174 -104 161 121 7 114 -66 -58 56 -117 17 -11 -264 -162
3971 -162 -189 -267 84 -74 -135 3 -147 75 -20 -191 62 -39 43 173 -287 55 122 -114 308 83 152 146 -205
3994 -205 122 -39 -158 79 21 18 31 -256 67 9 -9 206 -94 -160 70 -101 85 146 -227 163 -58 94 76
4017G6k53J99R6k12K67j01k25M17j84o3K54l62J07R9k89K16j47J2J6j5Q3l9l86
4040d34N69j58nJ95k32K28n9j92K9J3p2L52k67J37j3j64M5J11k45K52j02j15K41
4063A14l93N16k52r1K04j53M4J16k03R8L6j24J62p0j42L48m23K71J16k07K13l95
4085b15L33K6j89J22M8k80L37j24j74K88l42R7L60k04K0k13L7K45m90L92N0k87
4107a63J45l6j3K53l82K37J05k89K20k1j62K50p3k15K94k03J09Jl18K77j44j5
4129a43K62k90K49K1k30K13j44jK23l57J30K29l27J76j9j3MJN5K5j96L03j21K1
4153G1R4j69K89j87k87K92R5k35J42j57J03J17m33K45k4p7K80l8k91K75j57oK17
4176A59l12L18k26J65N3lj93P4k24K21J09l09K12K6Q1Q5l01J19j18k10K48j6K9
$$ plain form
4017 76 -177 22 118 -94 173 72 -153 264 80 17 271 -91 16 115 -174 42 -105 -93 -77 -92 -9 -48 -434
4040 -434 135 -23 -28 167 -65 163 104 -88 -59 -46 -118 234 -33 104 91 -73 -28 83 -162 90 -12 -127 114
4063 114 -279 237 -15 -106 98 -55 -11 105 -98 0 36 -88 74 4 -138 210 -213 58 174 -33 180 -215
4085 -215 118 144 -45 77 125 -155 182 58 -116 172 -170 -73 287 83 103 -110 -73 172 -318 74 124 -163
4107 -163 -18 -54 -67 186 -196 41 146 -143 77 56 -106 144 71 -144 150 -53 56 57 -261 16 -128 -143
4129 -143 119 -171 78 99 -131 82 -62 -63 160 -197 -67 162 -165 11 -8 -21 -17 -16 39 64 -132 171 50 71
4153 71 165 -4 285 98 -189 103 198 -37 105 -52 51 168 -265 -20 -44 -121 159 121 -170 105 -52 -58 159
4176 159 -153 165 -61 104 157 154 -39 35 -189 32 141 -168 44 70 151 236 -65 54 -64 -274 -26 -42 -13
4199a3N1k90M11j21j89K70k56J58J71l34J79j3L7K14j69l11M99l30j63L68k69
4220a00K15m3j07Q3q8j49K47l29K77j24L0J71j82%K38k37Q8J11j02J98k95L1K04
4243A37k58J50L5q7R9j6j40L58l55pJ79k62J91o2o9J46j41o7L23l27J25J9j5K74
4267B30k30lQ8j51J02j09r9J93l9r4K29j33J78j45j34L93m71L7L57k39k7J04j65
4290a28K84k68n6J93k53L27k06Q5Rr5k4L21j54j53L42n81N50l40k00M70j91J09
4312D1P7j84J12k4o1K46l39L02j90j32K91L6l39K53j38k4J50l24K53L5l96M38
4334H3m9j82L54k51R7r8j48L12j33n3J64k00K20j93j0L57m21j42N40k85Q8O3j21
4357hK15j30j90L09k45j24K71j64l2L9j0J31j0j93L44l39K43J12k76J36j91L2
$$ plain form
4199 -13 38 -252 159 38 -151 119 -137 21 192 -142 37 24 61 275 106 -205 294 -36 -199 169 -100
4220 -100 115 72 -35 48 -40 -189 58 -271 6 -118 -88 83 -99 -99 139 -98 -10 101 -1 197 -98 -67 137
4243 137 -121 29 64 -23 76 60 -80 278 -77 -84 95 -167 24 -38 -107 39 -102 -169 154 -173 -48 -29 -44 230
4267 230 0 -3 85 -66 36 -73 -172 21 -18 -112 117 -16 162 17 -117 276 -195 -158 199 -40 -67 37 -128
4290 -128 156 -112 -168 25 -228 99 -107 -22 -13 -108 -132 189 35 -118 224 -357 193 -147 -347 123 -68 41
4312 41 118 -66 46 22 -39 207 -132 170 -20 -152 139 175 -164 89 -49 -73 77 -247 6 41 -355 83
4334 83 34 -148 206 -45 52 -46 -194 118 -15 -68 96 -104 116 -77 -87 270 -151 -293 247 -38 50 113 -8
4357 -8 207 77 -113 196 -49 -173 98 -66 -98 -59 -69 62 52 -141 203 -136 107 219 -57 79 -112 -80
4379h0J70j53J32j6j90K39J35k89N1%K4l3k39K89j89J19J30k27R2N0j66K47j84
4402h8j07M54k73j17L03k16K22m2k46K21M4k19J85m1p4J70k23N1j26q6L79l80
4424b09L27n1k77J62N4j42J26o3j44M45k85L4Q1r6J54k43J71K4j74J38k14j8L65
4447A65p8K9J9k18P9J21k00J62j18m8Q1j45KJ41r9L32j93r5L16k76N8J45l37R8
4471e9L4j82L21j84O9J14k91J64J8j36K85j61j35J62n2J59k23r5K6Q9j52K84j34
4494g9M8J78l30K62j10M5K19n08L01n1r7J56l6j31L27k22l1K19k82J49j3n6R4
4517E2j06j55L76l55K66P6k40J79j05R1N7j98L0J18p6N8j12r6K88m61M41K6j03
4540E1J45k05J4J38l14J79J35k08O4o1K7J80k22J4K60k16Q0Jk61Q5o3K7J13k03
$$ plain form
4379 -80 90 -63 69 53 -137 102 237 -52 -1 -1 23 -10 -249 40 -149 -30 100 -127 -35 15 -151 96 -88
4402 -88 -195 259 -14 -131 172 -44 178 136 -110 111 155 -64 121 80 6 176 -47 4 -122 -208 171 -209
4424 -209 118 67 -210 -48 6 -136 -10 -73 -217 228 -57 -23 58 -38 116 -127 44 68 -106 32 -182 -200 165
4447 165 87 116 135 -83 -4 117 -83 79 -39 -87 -6 -151 -149 -8 -107 225 32 -63 253 -23 35 180 -157 -59
4471 -59 -25 -207 114 -70 -1 113 -178 -14 4 -132 153 -8 -143 19 -33 126 -97 -192 -166 -77 -229 55 -79
4494 -79 -31 147 -183 79 -31 14 233 -275 26 -25 -122 34 -2 -133 194 -28 -59 160 -122 27 14 -42 52
4517 52 -54 -209 167 -188 78 154 -86 93 -12 79 136 -62 -32 86 10 68 -44 -140 148 -313 128 154 51
4540 51 196 -9 5 143 -171 8 143 -65 -1 -62 -35 145 -77 -63 197 -19 61 62 -199 -114 -177 -150 -37 -240
4564b40K43P0k88L43j29L0J77k81J40nj68P2J49j56K6O0k0J60k59O2L9j06J21
4587D0j63J40J29l98K65J9j00Q6j25J55m7j48J94j4l0j6j4j1J30o6l0J31k7j2
4611H8n1j47J47j64J46o7J8J25j75p3K43j84R4L5r0J39j68k3L63l04L9Q7k09K99
4635A68p8o8N5o9N5O7q6K5Kj49K50l11J62R4k52J95j4j16L31l98J92M1j64L3R9
4660F4q4J07J2j76L21l35Q8J34k70K58r4j06L70m18J11J22j75K55j13j16Q5j33
4682i3J42j3o6L9j30R3J10j32M8R4k68K15k9j56L90k25j73L59k73J77pl12M45
4705B35r1q1n3n1K8o2p8L69m24J61P2j49o7K57j89J81j9j19K94l70J70P9j70J90
4729A13P7k48J41k81J99J93k30J45k5j1j36P5j65K63k44J27R0j70J10N5k96L08
$$ plain form
4564 -240 3 73 -215 128 -1 29 206 -75 65 60 -108 -36 113 -43 -17 43 23 183 -76 -14 25 -81 40
4587 40 -123 17 146 -252 13 32 -68 18 -107 48 1 -147 47 33 3 -13 -27 -38 92 26 -4 127 100 88
4611 88 37 -110 37 -127 19 -48 -30 95 -80 -153 90 -94 0 35 -55 84 -84 -107 256 -48 -9 78 -131 168
4635 168 90 22 77 8 63 130 44 69 71 -78 172 -139 23 117 -135 60 46 -70 261 -137 55 96 -68 -35 64
4660 64 -20 87 99 -77 244 -91 -3 131 -139 119 25 -81 289 -129 -18 104 -71 184 71 -45 40 -93
4682 -93 49 36 -30 9 -121 -28 82 -50 -2 92 -176 39 10 -146 244 19 -154 205 -68 109 102 -210 235
4705 235 144 63 10 -41 -13 -75 -153 216 -208 -47 25 -124 -191 66 -123 58 39 -80 214 -156 14 93 -77 113
4729 113 190 -58 83 -198 1 194 -36 109 84 73 -63 12 -153 110 -134 -7 83 -87 23 78 -218 90
4751I0l03K87J78k29M1N4k97J15J19j37K08k21K97n4j97J51QM0q0j69J63l1j39
4774a06L78k32j67K14j56q4K24j88O6l5k3K83l67L83j22j33N6l7J30J02l93K87
4796H0Q2j72N0k0j36K13R5m74L64l19L36m6j81J24JlK4j86L79l1l06J50r0m3K26
4821A17k80J14J18k28K28Oj98J58l7l8J98j86P6k54J11K73j48q4L3j45J12J92
4843A38m30K97o6o4J19j34P7J13j04J05KqJ21l23K58j9k77K93j19J04q3p6K72
4866A96q7j50R0J69k25j39P0J43j02j38J87p3m3J89r2m7J46j44J38P6k36m0N9
4889e3J6J84q9k3k4L5J43j86n2J45j10J45j58m4K6j9J62q8j32J76j05r6K49j54
4913e2k7R4P8j51J16j71N2J66r7M5k20J60J05k00L74j16k93K05j55L8L27k38m4
$$ plain form
4751 90 -213 74 252 23 64 118 -179 -64 55 -82 126 -95 202 148 -49 102 110 150 70 -99 64 33 -106
4774 -106 272 40 -127 87 -69 -153 71 -117 -51 -86 -109 174 -193 190 68 -65 -9 -46 84 186 -207 80
4796 80 162 -10 40 20 -116 97 192 -282 82 -237 99 53 -128 -4 -3 -6 18 -168 211 180 -126 24 -66 -109 117
4821 117 -163 -49 69 -159 69 75 -123 35 -2 -40 158 -28 48 -206 -95 178 30 -54 -21 -166 -54 138
4843 138 -292 5 -61 -125 -6 -140 -63 50 -54 51 53 45 166 -157 101 82 -195 98 -21 83 0 -76 196
4866 196 109 -41 49 218 -7 -146 -76 67 -35 -173 14 -59 -102 87 -5 -52 94 -50 88 164 -72 -112 -53
4889 -53 -37 147 58 35 11 46 189 3 -49 96 -14 131 -27 -71 -45 -64 98 10 -122 54 -51 -147 102 -52
4913 -52 -79 15 93 -58 58 -113 -61 105 8 53 -167 -7 98 -102 272 156 -137 68 -87 -49 278 40 -4
4936dJ82k56Q9p9K23k53k2J69J43l05J82%j05J32n3p6J77j67L7j07J35l8j1r2
4960i9L02j41Q0j16j09J41K1j84K32j28q1K22n9m7n1j33K35k89J99PP1J22j11
4983H4k1j3m2J27j48m2J55j32q2J78j62K09o0j6Oj38J45Pj61J37L8k53J65q0k5
5008a24J12K6j35J24q6O0O4j42J99k93J66L9l3K69j83n3O9j14j18L26k73J82o7
5031A5j66J37J00j38J73k87J57N7j53P8j9q7J37pn0J58j76J80j61m1J89m8m3J
5055Fj70J26R6r2j7K8lP6k32K63L3k13K39j25j87L00k16J60m6q8J53j91k6K46
5079A20j78O8L3k09L71p1j17J12j56j22K12j30m5K32j44J79k19r1J99L2j38n8
5101a20k4K0J8l3K97k94J23P8qO0j86q3J19j34J48J3j70R6J07L0M9j56M6J00J2
$$ plain form
4936 -4 178 -78 11 -68 155 -98 -120 49 192 -113 69 69 -36 96 43 -33 144 -23 14 -93 42 4 -7 -99
4960 -99 203 62 142 26 -83 58 79 -105 127 -1 -82 140 81 34 -17 -150 85 -204 -5 2 73 195 84
4983 84 63 50 8 135 -13 -55 100 -32 -114 64 -98 111 51 35 41 -97 48 55 -106 31 69 -184 -19 -99 -124
5008 -124 -12 14 -121 3 -83 -23 41 -101 98 -195 -29 10 -23 246 63 10 79 -35 -153 173 -100 82 15
5031 15 -151 -14 86 -52 121 -166 -9 48 -105 -27 -46 -133 4 -3 -53 105 -71 109 -52 -93 96 48 5 6
5055 6 -164 -38 58 -34 -51 -23 -26 50 -182 81 114 -99 140 15 -172 128 -88 72 26 -62 91 -100 -126 120
5079 120 -58 10 43 -166 205 134 17 129 -27 -149 63 -67 -112 120 -24 155 -64 -155 44 76 -62 -120
5101 -120 -144 -124 -106 -139 158 -136 -13 65 57 117 -69 -152 -33 -167 -19 -6 -176 -80 27 57 106 -50 -4 96 108
5126A08j92K58j54J46k14m8J41o4K4j3O2P0j72oO2n2J40o8k4L0o5J95k73J29L4
5151E4J01k65J81J7j48K33k47o9Q0J5N2M8j41K08j71Q2n0l6j5m7n0K23Rk57L86
5176A93k08L7r5j41K55N9p4O3n7qK10k37OJ0r8J05M9okj66J35j17p9L92k84L5
5202b3%j48K16k6j77L24k57M9M6O1r4J2M5J60j25j70J89j03M1Q4k6P0j13N9J96
5227B90k68L7N7j85R0j14J02K06l58J83k50M0J93j63K50j54P1o5J30j29o1J67
5249F9j47J07o4nJ45l29K58K8j87J92q7K2K20j22J6L7l00J54j48J14J26l36J61
5272g6N8k5J57j10K4N4j82N6L6JjO8k18K58j83J52J7k48Q2J36o0R5m8j3Mk44L53
5299A43j27k04K43m1J06j41m2J14m1k2K0j07M0J34j5j4J77j56K7j17j16K63j03
$$ plain form
5126 108 -84 174 20 166 -48 -96 45 -19 5 -8 54 124 -48 -54 8 -44 96 28 4 34 -31 164 -109 20 54
5151 54 155 -110 71 88 -60 173 -74 -143 -63 -48 4 52 -89 119 -52 30 -20 -56 -71 -118 -168 55 64 -193 193
5176 193 -15 22 -73 -214 41 100 26 89 32 24 234 -3 3 13 -85 20 69 63 61 -105 30 -87 -166 226 -58 -23
5202 -23 -23 -171 45 19 -158 166 -91 -42 4 65 -29 -17 28 188 63 -107 82 -21 20 104 78 148 35 94 290
5227 290 22 59 116 -69 21 -93 9 215 -143 40 -210 -170 23 -140 110 -44 27 -38 92 -37 -98 69
5249 69 -78 29 -35 -40 105 -224 34 62 -125 67 -20 2 222 100 116 153 -147 7 -141 -27 99 -237 -76
5272 -76 -18 -43 114 4 28 82 -100 -44 -8 -7 -8 60 -158 100 -83 69 86 -162 -80 56 -4 91 43 30 34 -210 143
5299 143 16 -188 55 14 120 -21 -63 51 10 -12 8 -99 -59 75 60 46 223 67 94 -23 -139 124 21
5322B1K5J75k09pj0J4j20n7Q5O9k21K00Qn8K21p6o9Q1j0r9%RJ19p9j53N3n7K25
5350H0p9p1K36k80J19K7j04JL9N3JR2j95Q3J03n3L1j66j3O7l4m4J13J2J45k05
5376d2J81q7l10L90k22k4J55r5J29K7j53P5j04J55m8j70K82p9O7k2p2j43J35%
5400B5m6p2J62l3p6J08R4k75j6L79k89J73m7j32J2jJ05m7J2N3K9k05J25j62J20
5425dj3J05mj7k17J66q2k2Q4j09J26r8J31RJ1k7Q7k96K98n5j44J02P9k43P0J10
5451D7k4k4j26J53L8j30J93j20L2p0J10j62P8k74K27J8M5M1J4J49j55l0P0j51
5475e1Q9Q6n5r8K23j67K0R2k43K59l26K05n8K2Q1j41m4K26k08O9j29j5K39k3j02
5500d9J41nr0N4j43J18j2j0j8K6N6Q0j30m2o3r2J49j63N2L51k07L9O4j09J24q1
$$ plain form
5322 21 46 221 12 5 -5 9 -111 -168 -83 -14 -235 -35 -27 -85 136 60 -9 72 62 -37 -37 -28 91 12 -141 -88 -145 80
5350 80 1 -70 166 -114 5 32 -72 -71 -32 21 22 114 -81 2 105 52 83 -83 -96 -29 -63 -107 6 18 163 -42
5376 -42 139 52 -258 132 -90 -114 41 -54 75 102 -51 24 -80 75 27 -143 139 60 127 105 33 -110 25 25
5400 25 -21 -93 69 36 -40 68 162 -113 -129 250 -39 134 87 -45 -33 -34 71 24 36 89 118 -87 38 -124 -4
5425 -4 -17 88 84 67 -150 16 -66 -88 -4 -113 13 -85 46 55 66 39 126 -170 128 73 -71 31 110 -133 -63 47
5451 47 23 -1 -127 26 64 -66 127 7 39 -31 79 -83 -5 -279 -52 -34 11 52 66 215 60 30 100 -51
5475 -51 38 124 69 -29 194 27 47 139 -104 155 -171 34 -24 -2 79 -62 -106 120 -88 -19 -148 -163 76 53 -49
5500 -49 92 87 -3 51 -92 26 14 4 -14 12 68 148 18 -24 -87 -179 -30 -193 -141 210 3 42 106 -3 121 40
5526D0k04M04j09m7j4J9j9k7r2J68p1M8o4J41j02k5j1j11J79r8n7j73L47o6j48
5551i2K23j4k07K11j45M9J29k34J29p8k40L95j11Mpj60J68n2M9J35k96K25J6j12
5575a5L6j4k3J22Q3K5k44Q7LJ2jJ2j34J63n2j45J08Pj29j8m3J12K31k98J37J46
5601A68j28J12k26J77rK8l9o3j89K29r2J06j97K14n9R5j88oO0O1j2K5j45J59j6
$$ plain form
5526 40 -164 240 131 84 70 89 70 43 -49 119 48 96 32 173 71 46 35 -76 103 5 -52 -225 122 56 -92
5551 -92 131 117 -90 121 -24 25 154 -80 49 -29 -269 126 15 19 12 -148 20 -32 17 152 -144 81 97 -15
5575 -15 21 7 -16 106 189 214 -30 57 60 72 71 83 -51 112 60 -85 23 30 -99 -117 -160 -48 183 -115 22 168
5601 168 40 152 -74 103 94 122 83 20 -169 60 -32 74 -123 91 32 127 -61 -67 -7 54 42 67 -78 81 65
$$ [...]
8191a5
##END NTUPLES=NMR FID
##END=
