##TITLE=1H_28-2025
 200.13MHz, CDCl3,
 8 sc
 
 13.2.2025
##JCAMPDX= 6.0         $$ Bruker NMR JCAMP-DX V2.0
##DATA TYPE= NMR FID
##DATA CLASS= NTUPLES
##ORIGIN= UXNMR, Bruker Analytische Messtechnik GmbH
##OWNER= pz
$$ XWIN-NMR		Version 3.5
$$ Thu Feb 13 14:13:59 2025 Russian Standard Time (UT+4h)  she@DPX200
##.OBSERVE FREQUENCY= 200.1313
##.OBSERVE NUCLEUS= ^1H
##.DELAY= (6, 6)
##.ACQUISITION MODE= SIMULTANEOUS
##.ACQUISITION SCHEME= undefined
##.AVERAGES= 8
##.DIGITISER RES= 18
##SPECTROMETER/DATA SYSTEM= spect
##.PULSE SEQUENCE= zg30
##.SOLVENT NAME= CDCl3
##.SHIFT REFERENCE= (INTERNAL, CDCl3, 0, 14.3821)
##AUDIT TRAIL= $$ (NUMBER, WHEN, WHO, WHERE, WHAT)
$$ ##TITLE= Audit trail, XWIN-NMR		Version 3.5
$$ ##JCAMPDX= 5.01
$$ ##ORIGIN= Bruker BioSpin GmbH
$$ ##OWNER= she
$$ F:/spectra/data/she/nmr/H-C/1/audita.txt
$$ ##AUDIT TRAIL=  $$ (NUMBER, WHEN, WHO, WHERE, WHAT)
(   1,<2025-02-13 14:11:26.32 +0400>,<she>,<DPX200>,
      <created by zg, POWCHK disabled, PULCHK disabled
       configuration hash MD5:
       00 E9 B6 7A A2 85 ED C7 34 08 36 98 17 FE 4E 26
       data hash MD5: 16K
       0E A0 66 9D 18 25 DA A5 EF 63 07 D2 F8 FE 41 A8>)
$$ ##END=
$$ 
$$ hash MD5
$$ EB AE 5B 37 85 82 85 9C 98 24 13 6E 01 C6 9A 7B
##$RELAX= 
##$RELAX= 
##$RELAX= 
##$RELAX= 
##$RELAX= 
##$RELAX= 
$$ Bruker specific parameters
$$ --------------------------
##$DU= <F:/spectra>
##$EXPNO= 1
##$NAME= <H-C>
##$PROCNO= 1
##$TYPE= <nmr>
##$USER= <she>
##$AMP= (0..31)
100 100 100 100 100 100 100 100 100 100 100 100 100 100 100 100 100 100 
100 100 100 100 100 100 100 100 100 100 100 100 100 100 
##$AQSEQ= 0
##$AQ_mod= 1
##$AUNM= <au_zg>
##$AUTOPOS= <>
##$BF1= 200.13
##$BF2= 200.13
##$BF3= 200.13
##$BF4= 200.13
##$BF5= 200.13
##$BF6= 200.13
##$BF7= 200.13
##$BF8= 200.13
##$BYTORDA= 1
##$CFDGTYP= 0
##$CFRGTYP= 5
##$CHEMSTR= <none>
##$CNST= (0..31)
1 1 145 1 1 1 1 1 1 1 1 1 1 1 1 1 1 1 1 1 1 1 1 1 1 1 1 1 1 1 1 1 
##$CPDPRG= <>
##$CPDPRG1= <>
##$CPDPRG2= <>
##$CPDPRG3= <>
##$CPDPRG4= <mlev>
##$CPDPRG5= <mlev>
##$CPDPRG6= <mlev>
##$CPDPRG7= <mlev>
##$CPDPRG8= <mlev>
##$CPDPRGB= <>
##$CPDPRGT= <>
##$D= (0..31)
0 0.7 0 0 0 0 0 0 0 0 0 0.03 0 0 0 0 0 0 0 0 0 0 0 0 0 0 0 0 0 0 0 0 
##$DATE= 1739441485
##$DBL= (0..7)
120 120 120 120 120 120 120 120 
##$DBP= (0..7)
150 150 150 150 150 150 150 150 
##$DBP07= 0
##$DBPNAM0= <>
##$DBPNAM1= <>
##$DBPNAM2= <>
##$DBPNAM3= <>
##$DBPNAM4= <>
##$DBPNAM5= <>
##$DBPNAM6= <>
##$DBPNAM7= <>
##$DBPOAL= (0..7)
0.5 0.5 0.5 0.5 0.5 0.5 0.5 0.5 
##$DBPOFFS= (0..7)
0 0 0 0 0 0 0 0 
##$DE= 6
##$DECBNUC= <off>
##$DECIM= 32
##$DECNUC= <off>
##$DECSTAT= 4
##$DIGMOD= 1
##$DIGTYP= 9
##$DL= (0..7)
0 120 120 120 120 120 120 120 
##$DP= (0..7)
150 150 150 150 150 150 150 150 
##$DP07= 0
##$DPNAME0= <>
##$DPNAME1= <>
##$DPNAME2= <>
##$DPNAME3= <>
##$DPNAME4= <>
##$DPNAME5= <>
##$DPNAME6= <>
##$DPNAME7= <>
##$DPOAL= (0..7)
0.5 0.5 0.5 0.5 0.5 0.5 0.5 0.5 
##$DPOFFS= (0..7)
0 0 0 0 0 0 0 0 
##$DQDMODE= 0
##$DR= 18
##$DS= 0
##$DSLIST= <SSSSSSSSSSSSSSS>
$$ [...]
##$SUBNAM0= <"">
##$SUBNAM1= <"">
##$SUBNAM2= <"">
##$SUBNAM3= <"">
##$SUBNAM4= <"">
##$SUBNAM5= <"">
##$SUBNAM6= <"">
##$SUBNAM7= <"">
##$SUBNAM8= <"">
##$SUBNAM9= <"">
##$SW= 18.0517328524113
##$SWIBOX= (0..15)
0 0 2 0 0 0 0 0 0 0 0 0 0 0 0 0 
##$SW_h= 3612.71676300578
##$TD= 16384
##$TD0= 1
##$TE= 0
##$TE2= 300
##$TE3= 300
##$TEG= 300
##$TL= (0..7)
0 120 120 120 120 120 120 120 
##$TP= (0..7)
150 150 150 150 150 150 150 150 
##$TP07= 0
##$TPNAME0= <>
##$TPNAME1= <>
##$TPNAME2= <>
##$TPNAME3= <>
##$TPNAME4= <>
##$TPNAME5= <>
##$TPNAME6= <>
##$TPNAME7= <>
##$TPOAL= (0..7)
0.5 0.5 0.5 0.5 0.5 0.5 0.5 0.5 
##$TPOFFS= (0..7)
0 0 0 0 0 0 0 0 
##$TUNHIN= 0
##$TUNHOUT= 0
##$TUNXOUT= 0
##$USERA1= <user>
##$USERA2= <user>
##$USERA3= <user>
##$USERA4= <user>
##$USERA5= <user>
##$V9= 5
##$VALIST= <valist>
##$VCLIST= <CCCCCCCCCCCCCCC>
##$VD= 0
##$VDLIST= <DDDDDDDDDDDDDDD>
##$VPLIST= <PPPPPPPPPPPPPPP>
##$VTLIST= <TTTTTTTTTTTTTTT>
##$WBST= 1024
##$WBSW= 4
##$XGAIN= (0..3)
0 0 0 0 
##$XL= 0
##$YL= 0
##$YMAX_a= 305869
##$YMIN_a= -327264
##$ZGOPTNS= <>
##$ZL1= 120
##$ZL2= 120
##$ZL3= 120
##$ZL4= 120
##$ABSF1= 10
##$ABSF2= 0
##$ABSG= 5
##$ABSL= 3
##$ALPHA= 0
##$AQORDER= 0
##$ASSFAC= 0
##$ASSFACI= 0
##$ASSFACX= 0
##$ASSWID= 0
##$AUNMP= <proc_1d>
##$AZFE= 0.1
##$AZFW= 0.1
##$BCFW= 1
##$BC_mod= 2
##$BYTORDP= 1
##$COROFFS= 0
##$CY= -3
##$DATMOD= 1
##$DC= 2
##$DFILT= <>
##$DTYPP= 0
##$F1P= 0
##$F2P= 0
##$FCOR= 0.5
##$FTSIZE= 0
##$FT_mod= 4
##$GAMMA= 1
##$GB= 0.15
##$INTBC= 1
##$INTSCL= 1
##$ISEN= 128
##$LB= 0.25
##$LEV0= 0
##$LPBIN= 0
##$MAXI= 10000
##$MC2= 0
##$MEAN= 0
##$ME_mod= 0
##$MI= 1.114404
##$NCOEF= 0
##$NC_proc= 0
##$NLEV= 6
##$NOISF1= 3.799351
##$NOISF2= 2.8
##$NSP= 1
##$NTH_PI= 0
##$NZP= 0
##$OFFSET= 14.38212
##$PC= 1
##$PHC0= -468.8324
##$PHC1= 14.59221
##$PH_mod= 1
##$PKNL= yes
##$PPARMOD= 0
##$PSCAL= 0
##$PSIGN= 0
##$REVERSE= no
##$SF= 200.129724274929
##$SI= 16384
##$SIGF1= 3
##$SIGF2= 2
##$SINO= 400
##$SIOLD= 16384
##$SREGLST= <1H.CDCl3>
##$SSB= 0
##$STSI= 0
##$STSR= 0
##$SW_p= 3205.1282051282
##$SYMM= 0
##$S_DEV= 0
##$TDeff= 0
##$TDoff= 0
##$TI= <>
##$TILT= no
##$TM1= 0
##$TM2= 0
##$TOPLEV= 0
##$USERP1= <user>
##$USERP2= <user>
##$USERP3= <user>
##$USERP4= <user>
##$USERP5= <user>
##$WDW= 1
##$XDIM= 8192
##$YMAX_p= 0
##$YMIN_p= 0
$$ End of Bruker specific parameters
$$ ---------------------------------
##NTUPLES= NMR FID
##VAR_NAME=  TIME,          FID/REAL,        FID/IMAG
##SYMBOL=    X,             R,               I
##VAR_TYPE=  INDEPENDENT,   DEPENDENT,       DEPENDENT
##VAR_FORM=  AFFN,          ASDF,            ASDF
##VAR_DIM=   8192,          8192,            8192
##UNITS=     SECONDS,       ARBITRARY UNITS, ARBITRARY UNITS
##FACTOR=    0.0002768,     1,               1
##FIRST=     0,             0,               0
##LAST=      2.2672688,     0,               0
##MIN=       0,             -327264,         0
##MAX=       2.2672688,     305869,          0
$$ Real data points
##PAGE= N=1
##DATA TABLE= (X++(R..R)), XYDATA
0@%%%%%%%%%%%%%%%nJ3j6J6j6J6j6K0k8L2l6M3m7N2o0O8p9Q8r7J11j25J39j54
$$ 0 0 0 0 0 0 0 0 0 0 0 0 0 0 0 0 -5 8 -8 8 -8 8 -8 12 -16 16 -20 23 -24 28 -32 36 -43 45 -52 59 -66 73 -81
38h1J70j90K10k30K54k79L08l42L76m12M54n00N50o06O70p41Q22r16J022j149
$$ -81 89 -101 109 -121 133 -146 162 -180 196 -216 238 -262 288 -318 352 -389 433 -483 539 -610
58f10J303j488J717k007K396k936L716m934P046j1325K2886j04570k38458N01860
$$ -610 693 -795 922 -1085 1311 -1625 2091 -2843 4203 -7122 15764 -88806 -327264 174596
72A74596R1847m72516J69914L02912l40514p7165L62782r8247l18440J80656K14921
$$ 174596 266443 -206073 -36159 266753 -73761 -150926 211856 113609 -204831 -24175 190746
83A90746k29687m1080K05718j49535p8519K29032m4024k02533N9805J62564o0275
$$ 190746 -38941 -80021 125697 -23838 -102357 126675 82651 -119882 -60077 102487 42212
94D2212j49321J25989P8776k03350O1853K30294j88648k13639K55906J41545l12278
$$ 42212 -107109 18880 97656 -105694 -43841 186453 -2195 -215834 40072 181617 -130661
105a30661l8374K90564j22781k02045K70646P7145l36143R9163L27329k32086
$$ -130661 -169035 121529 -1252 -203297 67349 144494 -191649 -92486 234843 2757
115B757j65364K78442n4450j87418K01360L4569k42092P1998K17958j45217j40946
$$ 2757 -162607 115835 61385 -126033 75327 109896 -132196 -60198 157760 12543 -128403
126a28403K07774q761k01163J71301R4507k49084J5311K10622o5300j35974P5008
$$ -128403 79371 70610 -130553 40748 135255 -113829 -98518 112104 46804 -89170 -14162
137a4162Q2344p1780k3359Q8135k3209j06527N3705J00017r0718q2615Q7278L0403
$$ -14162 68182 -3598 -26957 61178 37969 -68558 -14853 85164 -5554 -88169 -891 29512
149B9512o2457J8992M5962n6696k3216J22013k0810j44954J04247P1483j52907
$$ 29512 -32945 -13953 32009 -24687 -47903 74110 53300 -91654 12593 84076 -68831
160f8831N7087J05720j53082k1072J77043m2737j57423R3523J05259j43299j4270
$$ -68831 -11744 93976 -59106 -80178 96865 54128 -103295 -9772 95487 -47812 -62082
171f2082J45045j01775r5646J64451Q992j48824O9430Q3183q8770R748P0885o2086
$$ -62082 82963 -18812 -114458 49993 58985 -89839 -20409 62774 -25996 -16248 54637 -7449
183g449l5159P0180J2600p1937k371O6615l0682l4369O5039j3920n2556M5339
$$ -7449 -42608 27572 40172 -31765 -34136 32479 1797 -32572 32467 18547 -34009 11330
195A1330L1333l0673l7113K0090N0443n0956l0891P6847l0221o1458Q2386J8643
$$ 11330 42663 11990 -25123 -5033 45410 -5546 -36437 40410 10189 -51269 31117 49760
207D9760r3222K2548P3132n3920m4554O6570k221p6810M9719O1237r3988j1084
$$ 49760 -43462 -20914 52218 -1702 -46256 20314 18093 -58717 -8998 52239 -41749 -52833
219e2833J11662n4952o5496R8673r967q4603O0998M0081p0844r190O5681r142
$$ -52833 58829 3877 -61619 37054 27087 -57516 3482 43563 -27281 -36471 29210 20068
231B0068n9167M5487L8486p1455J4522O1912n4556k2103N0609j1070l0396J3842
$$ 20068 -39099 6388 44874 -26581 -12059 49853 -4703 -26806 23803 12733 -17663 -3821
243c821J7996j1870j9039K3736J7114m0663N014M2801l4528k3213M3578n867l4147
$$ -3821 14175 2305 -16734 7002 24116 -16547 -11533 31268 -3260 -26473 17105 11238 -22909
256b2909J6851K3621j9580k2944L7907J0167n7724K9984M4611o7041J488O0940
$$ -22909 -6058 17563 -2017 -24961 12946 23113 -34611 -4627 39984 -27057 -25569 35371
268C5371m2150k4293M9419k703l9988J9107L7918l4139k6338N2252l715n3468
$$ 35371 -6779 -31072 18347 15644 -24344 -5237 32681 -1458 -27796 24456 20741 -32727
280c2727M0191K2787n9096J6349M3330l8898j4764L4158k678k1987P153K1154
$$ -32727 7464 30251 -28845 -12496 30834 -8064 -22828 11330 8652 -13335 -6182 14972
292A4972j6813k0384L7874J276m2823K7167K0979l3744O957J8207j2831r271Q403
$$ 14972 -1841 -22225 15649 16925 -25898 1269 22248 -11496 -4539 13668 837 -8434 -31
305c1J6440j8874j9012L6262k893l6292K9841J1099l6882J5195K4849k4169j1833
$$ -31 16409 -2465 -21477 14785 11892 -24400 5441 16540 -20342 -5147 19702 -4467 -16300
318a6300K2771Q887k5079n4L0552k2947k1143M4240j0133m2738L7096J3269l8235
$$ -16300 6471 15358 -9721 -9775 20777 -2170 -23313 20927 10794 -31944 5152 18421 -19814
331a9814J2441K1122j7408r777J9507J0344k9128K331L5740k6469j7528L8452
$$ -19814 -7373 13749 -3659 -13436 6071 16415 -12713 -10382 25358 -1111 -18639 19813
343A9813j2719k4152K8255L018k2229N707J2680m025j5779N816J5974k2377n241
$$ 19813 7094 -17058 11197 14215 -8014 -2307 10373 6348 -9431 -3615 12359 -10018 -15259
356a5259K8418j6854j6048K8253j722j8489J1116R131o271j0965R499J2509k5961
$$ -15259 13159 -3695 -19743 8510 6788 -11701 -585 8546 2275 -8690 809 13318 -12643
369a2643K204K9540k7353j0090L6052j3976k0162K3160L626j7426J241J5780o095
$$ -12643 -10439 19101 -8252 -18342 17710 3734 -16428 6732 10358 -7068 -5827 9953 3858
382C858j9829K0286J4267l2379R639K7750k6809l489K5399j7082j2413J5919K2
$$ 3858 -15971 4315 18582 -13797 -4158 23592 -3217 -6706 18693 1611 -10802 5117 5139
395E139j2566n390J2189L405j7367J1859J2478k2196Q907J9579j8715n103J2394
$$ 5139 -7427 -12817 -628 2777 -14590 -2731 9747 -12449 -3542 16037 -2678 -7781 4613
408D613k00m139m978R040Q87j5763J8257R849l0149R062K3076k2298n498J6086
$$ 4613 4413 274 -4704 4336 5223 -10540 7717 17566 -12583 -3521 19555 -2743 -8241 7845
422G845r382q587J1886Q625j4406q247K5471n98k4109J8198L514k6385J7032J0171
$$ 7845 -1537 -10124 1762 10387 -4019 -12266 13205 12607 -11502 6696 10210 -16175 857 11028
436A1028k7624K484J4088m250l600N59N873j848k840J5427o692j7452J7452O627
$$ 11028 -16596 -14112 -24 -4274 -7874 -7315 -1442 -3290 -6130 9297 2605 -14847 2605 9232
450I232j2479L435L43J514M555k253O934n938j2161J9839K811k5624Q889R241
$$ 9232 -3247 188 531 2045 6600 4347 11281 5343 -6818 13021 15832 -9792 -903 8338
464H338j3465O977P231j1468k400J2678O321j4597n909J5241j1139p758J8840
$$ 8338 -5127 1850 9081 -2387 -4787 7891 14212 -385 -6294 8947 -2192 -9950 8890
477H890j7427j6462K8202o28j8947J0823L041m915O498K287n125p037N475J2026
$$ 8890 -8537 -24999 3203 2575 -16372 -5549 -2508 -7423 -925 1362 -3763 -10800 -5325 6701
491F701r324n007Q339k345O772N899j3432M397O203p756Q465m314j4581J3314
$$ 6701 -2623 -7630 709 -1636 5136 11035 -2397 2000 8203 447 8912 4598 -9983 3331
505C331M956r430O174k274m002J1794J806r431n604N857N048j2858M12P975j7767
$$ 3331 8287 -1143 5031 2757 -1245 10549 12355 2924 -2680 3177 8225 -4633 -4221 3754 -14013
520a4013O115K1522k1043p194K1733p154n345J0593r462n649J0656K207p108k777
$$ -14013 -7898 13624 -7419 -14613 7120 -34 -5379 5214 -4248 -9897 759 2966 -4142 -6919
534f919O942J262l668R961n167j3628J7189L286j8851Q546J399r531J3441o31
$$ -6919 23 1285 -2383 7578 2411 -11217 5972 9258 -9593 -1047 352 -9179 4262 3631
548C631j0219R175J157j580N918m897n965L080M192k783j0136M770O771j0962
$$ 3631 -6588 2587 3744 2164 8082 3185 -2780 300 4492 1709 -8427 -3657 3114 -7848
562g848Q166P514j8173R103J5039j7648K012J0232j3645M037J1669j0992m575
$$ -7848 318 7832 -10341 -1238 13801 -3847 -1835 8397 -5248 -1211 10458 -534 -5109
575e109R629L376p178j09P309q964m590J5543j1055j2559J6965l669r911J4911
$$ -5109 4520 7896 718 609 7918 -1046 -5636 9907 -1148 -13707 3258 -411 -10322 4589
589D589m977q626J5128j956q504N983j095m267J633J510l794m921P360K794r566
$$ 4589 -388 -9014 6114 4158 -4346 1637 542 -3725 -2092 -582 -4376 -9297 -1937 857 -8709
604h709Q367L754j2195J1524M774j6460J0575O740j4232Q491O593j1152M786P099
$$ -8709 -342 3412 -8783 2741 7515 -8945 1630 8370 -5862 2629 9222 -1930 2856 9955
618I955n222k842L782J524q689J134P909j2819p18J4529j3567k432J7394j1297
$$ 9955 4733 1891 5673 7197 -1492 -358 7551 -5268 -5986 8543 -5024 -7456 9938 -1359
632a359n140J5270q050o009R830m374n760L874J144l388j810N626j572n723R366
$$ -1359 -6499 8771 721 -5288 4542 168 -5592 -1718 -574 -3962 -5772 -146 -1718 -7441 1925
647A925j406j1174J2552J163j2914J1701P42j0284J1535J834r394P644J829m939
$$ 1925 519 -10655 1897 3060 -9854 1847 2589 -7695 3840 5674 -3720 3924 5753 814
661H14L167J137m485k825N082J983j1072M253Q321j1975M431J1067j5441J660
$$ 814 3981 5118 633 -2192 2890 4873 -6199 -1946 6375 -5600 -1169 9898 -5543 -3883
675c883J3656j1437j345Q656q157p5P298l743m677K000M954k513m667O775m058
$$ -3883 9773 -1664 -3009 5647 -2510 -2585 4713 970 -3707 -1707 3247 734 -3933 2842 -1216
690a216n844J2062l886j0504J0603l45n761J0033m724n904J0426j309m955L515
$$ -1216 -7060 5002 1116 -9388 1215 870 -4891 5142 418 -5486 4940 3631 -1324 2191
704B191k067j736K338K056k962o032O742M387j0126N033M274j1435Q613O521j4279
$$ 2191 124 -1612 726 2782 -180 -6212 530 4917 -5209 -176 4098 -7337 1276 7797 -6482
719f482L676P964p867L258L918o524K87N143J685n634k917O957k901l396P576
$$ -6482 -2806 5158 -2709 549 4467 -2057 -1770 3373 5058 -576 -3493 3464 563 -2833 4743
734D743o551n077J1880l663o196P613m860j192Q931n995l100M910j661J787J6
$$ 4743 -1808 -6885 4995 1332 -4864 2749 -2111 -3303 5628 -367 -3467 1443 -218 1569 1585
749A585k519J31p09M285j89p864N585K089o986P679n76j0636R902L286r341M834
$$ 1585 -934 -803 -1512 2773 2584 -5280 305 2394 -4592 3087 2511 -8125 1777 5063 -4278 556
765E56J446m521M518J841l682j735J267M528l961k726N587n297j118R200q460
$$ 556 2002 -2519 1999 3840 158 -1577 -310 4218 257 -2469 3118 -2179 -3297 5903 -2557
780b557l980R639m707j272N007n538P83N228k867M64p11n12L447j842K06N28m147
$$ -2557 -6537 3102 -1605 -2877 2130 -3408 -2625 2603 -264 200 -511 -1023 2424 582 788 1316 -2831
797b831N283O55o502N231n47n274Q168k334p164P896r11l812M726j714k408K503
$$ -2831 2452 3107 -3395 1836 1289 -3985 4183 1849 -5315 2581 1670 -2142 2584 870 -1538 965
813I65R40K6l526Q32M357n798R6N872q209P80P908p647l83N841m991J430L004
$$ 965 1905 1931 -1595 -763 3594 -2204 -2108 3764 -4445 -3665 4243 -3404 -3787 2054 -2937 -1507 1497
830A497l462J395N16M76J503l190J999J883m078M177J26n003N081l84m759N319
$$ 1497 -1965 -570 -54 422 1925 -1265 734 2617 -1461 2716 2842 -2161 2920 2536 -2223 3096
846C096k867l223O316l852k104M842l086j40K710k181P47n52KK017m751J896L626
$$ 3096 229 -2994 3322 -530 -2634 2208 -878 -1018 1692 -489 258 -294 -292 1725 -3026 -1130 2496
863B496o904L002M480p991L813M262p276K707L162l751J638N98j119J651j392
$$ 2496 -4408 -1406 3074 -4917 -1104 3158 -4118 -1411 1751 -2000 -362 236 -883 768 -624
878f24K602J16l452M988j63m613N404k073l984N885k966l026M073l232k75L578
$$ -624 1978 2094 -1358 3630 3467 -1146 4258 2185 -1799 4086 1120 -1906 2167 -1065 -1340 2238
894B238m341Q43J913k116J865r41k056K844j837J272J623n565L926K758n836M129
$$ 2238 -2103 -1260 653 -1463 402 -539 -2595 249 -1588 -316 1307 -4258 -332 2426 -3410 719
910G19Q11o378N853R69n732L011N93j292K075m05J37k20l90M587k954l081N955
$$ 719 1530 -4848 1005 1974 -3758 -747 -154 -1446 629 224 361 141 -249 4338 1384 -1697 4258
927D258l038k030N805n368k243O435l706j167K433l220J277J949k604P42j453
$$ 4258 1220 -810 4995 -373 -2616 3819 113 -1054 1379 -1841 -564 1385 -1219 -477 -1930
942a930J16L438k889L12J920l339M378M66n603M554L39m149M765j885m821N493
$$ -1930 -1814 1624 -1265 -953 967 -2372 2006 2472 -3131 1423 1762 -2387 2378 493 -4328 1165
958A165m69k333K275j694K48J454l42Q63k468N90M544m885j05M628o059J247N759
$$ 1165 696 -1637 638 -1056 -808 646 304 1167 -1301 -711 3833 -1052 -1157 3471 -2588 -1341 4418
975D418o510q9M121l842J098J567l487J231Q60N13M65k921K802J418k655L907
$$ 4418 -2092 -2181 1940 -1902 -804 763 -2724 -1493 -633 -120 345 -2576 226 1644 -1011 2896
991B896j202m145N889o98m139M348k248k385N326k924k083L263k075J60J682j812
$$ 2896 1694 -2451 3438 2740 -1399 2949 701 -1684 3642 718 -1365 1898 -177 -17 1665 -147
1007a47m7p50J241J607m236J561L003n260L500K066o932L855L157n998K369J442
$$ -147 -194 -944 297 1904 -2332 -771 2232 -3028 472 2538 -4394 -539 2618 -3380 -1011 431
1023D31l994K560J139k046K34K70J889q57j440L966k358j553O180l584k760O070
$$ 431 -3563 -1003 136 -1910 -1676 -1406 483 -374 -1814 2152 -206 -1759 4421 837 -1923 4147
1039D147l009j811M638l683j164M228k801m91J346j406N29n98K55P29l025K375
$$ 4147 1138 -673 3965 282 -882 3346 545 54 1400 -6 523 -75 180 909 -2116 259
1055B59J754m577L253R68n057M849K5n382M552L76m715M503n03l142K344R2m51
$$ 259 2013 -2564 689 1657 -3400 1449 1474 -3908 644 1020 -3695 808 305 -2837 -493 -401 -852
1072h52n73Q3K007k435L19M465m669K58N492n435PN673n501R9M391l914P4K532
$$ -852 -1425 -1342 665 -1770 -1451 3014 -1655 -1397 4095 -1340 -1333 4340 -1161 -1062 3329 -585 -511 2021
1090B021j834l11K73J82L41k208K359J64l177L655o14l442M663q63l649M937j719
$$ 2021 187 -124 149 331 672 -1536 823 987 -2190 1465 851 -2591 2072 1209 -2440 2497 778
1107G78l146M692k029k389L318j253p87P23k38j9j473J544K028m191J941K892
$$ 778 -2368 2324 295 -2094 1224 -29 -816 -93 -331 -350 -1823 -279 1749 -2442 -501 2391
1123B391n473L129L390o410K670L556n083J461K607l429P85J118n86p06o22J901
$$ 2391 -3082 47 3437 -2973 -303 3253 -1830 -369 2238 -1191 -406 712 126 -580 -1202 699
1139F99r47j913L615j829k038N251k702k385N006k532j694M050k733j120L116
$$ 699 -248 -2161 1454 -375 -2413 2838 136 -2249 2757 225 -1469 2581 -152 -1272 1844
1154A844j552l17P29j057M49n98N44M77k668K580J227m312L451O41m583M647Q78
$$ 1844 292 -25 704 -353 96 -502 42 519 -2149 431 1658 -2654 797 1438 -3145 1502 2380
1171B380n219L764J109l886K353Q11k330M75P07M6j399j71K938k893l91M342m021
$$ 2380 -2839 925 2034 -1852 501 1312 -1018 -543 164 210 -1189 -1360 1578 -1315 -1706 2636 -1385
1188a385r28N317l578j222M486l449j61L408k753Q6J002r79P12o03oL99j874J976
$$ -1385 -2313 3004 -574 -1796 2690 -759 -920 2488 -265 -179 823 -156 556 -47 -53 346 -1528 448
1206D48K56l111K658L48l335M448q73l496M492n90k879L470j198j557K202p31
$$ 448 704 -2407 251 599 -2736 1712 839 -2657 1835 1245 -1634 1836 638 -919 1283 552
1222E52p54J08n4J029k010M17K587l922J236L516m512O85L717m043P34K812k979
$$ 552 -202 -94 -148 881 -1129 -712 1875 -2047 -811 2705 -1807 -1122 2595 -1448 -714 2098 -881
1239h81O03J609j415K08j93Q2K47j417J650k97k540L286q74k407L267q69k035
$$ -881 -278 1331 -84 124 -69 13 260 -1157 493 196 -2344 942 68 -2339 928 59 -1976
1256a976L597j508j472L302j553q77K195j911O48L35p76O91j514R50R06k420J291
$$ -1976 1621 113 -1359 1943 390 -487 1708 -203 445 780 4 695 -819 131 1037 -1383 -92
1273i2J567l680K146J936m279K423J689l353J740J183k058R63K39k23k14o15J322
$$ -92 1475 -2205 -59 1877 -2402 21 1710 -1643 97 1280 -778 185 424 201 -13 -628 694
1290F94o29j673K728j486j458L209j686j507L233j771p86K798k100lK066j799
$$ 694 65 -1608 1120 -366 -1824 1385 -301 -1808 1425 -346 -1132 1666 -434 -437 1629 -170
1306a70K98K96q24J043o43J11N96j654J264O37k897K256N05l077K844O4k962K795
$$ -170 128 424 -400 643 0 111 707 -947 317 954 -1943 313 818 -2259 585 649 -2313 482
1324D82Q8j694J291m9n74Q28k89P63j173p72K227j455n71K509k458k55L180k573
$$ 482 570 -1124 167 118 -456 372 83 846 -327 -1099 1128 -327 -898 1611 -847 -1102 2078 -495
1342d95n78K628k274O50J100k115J129N36n20J051j050K87O47j562J086K39k618
$$ -495 -1073 1555 -719 -69 1031 -1084 45 581 61 1112 62 349 996 -566 520 759 -1859
1359a859K211j63k350K735r17j697L265j007j336J671p00j75P92n94J89Nm60J854
$$ -1859 352 189 -2161 574 -343 -2040 1225 218 -1118 553 -147 -322 470 -124 65 70 -390 1464
1377A464j797j14J831j900L32J894k898M95K016k272P70O92k135J653N55p65M18
$$ 1464 -333 -447 1384 -516 -184 1710 -1188 -693 1323 -949 -179 513 -1622 31 586 -179 239
1394B39k22M65P90j381P00k5k107K439n43k331K553r66j071K181j568l35K005
$$ 239 17 482 1272 -109 591 566 -1541 898 355 -1976 577 -389 -1460 721 -847 -1182 823
1411H23r00j89Q94j449Q02J43j92J167j573O94J576j959O31J007k830J627P90
$$ 823 -77 -266 628 -821 -19 124 -68 1099 -474 220 1796 -163 468 1475 -1355 272 1062
1428A062k987J698P15j893J789P3j060Q80j98L04M6j060J020k00j192J682q12
$$ 1062 -1925 -227 488 -1405 384 457 -603 277 79 383 429 -631 389 189 -1003 679 -133
1445a33j449K729j319j289K066j453R0J603j264n03J153j102J029J94m68Q72o94
$$ -133 -1582 1147 -172 -1461 605 -848 -758 845 -419 -922 231 -871 158 352 -116 756 62
1462F2R30Q49k594J297P22k305J252J42k708K600L98k027J900j33r47J308m92
$$ 62 992 1841 -753 544 1266 -1039 213 355 -2353 247 645 -1382 518 385 -562 746 254
1479B54p9j61o81J170m16q99J919j386n07K420k194O8J762k170J69J411k118N85
$$ 254 175 14 -667 503 87 -812 1107 -279 -786 1634 -560 -492 1270 -900 -731 680 -1438 -853
1497h53J303j250Q24Lo2O97n14L34K44j146J024L6j814J686k42j920K449k86j805
$$ -853 450 -800 24 27 -35 662 148 482 726 -420 604 640 -1174 512 270 -1650 799 513 -1292
1516a292K289o64q09R92o22l20P33p64N91k65k64J288j287K04J641k027N83J586
$$ -1292 997 333 -476 516 -106 -426 307 -457 134 -131 -395 893 -394 -190 1451 -576 7 1593
1534A593k866J030P91j717O80R75j308R65K99n34L06PJ56l0j099J534n07j595
$$ 1593 -1273 -243 548 -1169 -489 486 -822 143 442 -92 214 221 377 347 -752 782 275 -1320
1552a320K089q02j208K297r98q52K233j654n18J447j266p3P92p23M11J25j18O29
$$ -1320 769 -33 -1241 1056 58 -794 1439 -215 -733 714 -552 -625 167 -556 -145 -20 -138 491
1570D91j085R08O45j887J135P48k236J641L65k037J773J94j354J247k92o33N96
$$ 491 -594 314 959 -928 207 955 -1281 360 725 -1312 461 655 -699 548 256 -377 219
1587B19n17P9K46m81N86o57j33J846j353l7J702j489m15J705j944n0J739j915
$$ 219 -298 -219 27 -454 132 -525 -658 1188 -165 -202 1500 11 -404 1301 -643 -693 1046 -869
1605h69K50R61p81K99J60PK45n96R10K44j597R58M70j811J698K34j760J860n88
$$ -869 -619 342 -439 -140 20 27 272 -324 586 830 -767 191 661 -1150 548 782 -978 882 294
1624B94r75J201j28r88R71l89m52O58o95P83p03k5J158j044K19J418j876J20J732
$$ 294 -681 520 392 -596 375 -14 -466 192 -503 280 -423 -448 710 -334 -115 1303 -573 -453 1279
1643A279k005M07J145j721N91J095j368N93j08kK03k66K70k11q53J520j07j803
$$ 1279 -726 -319 826 -895 -304 791 -577 16 -92 -94 109 -157 113 -98 -951 569 462 -1341
1661a341K028m83j257K558j300r11J686p99o54R39m63n93Q36l27N2m23RJ006j190
$$ -1341 687 204 -1053 1505 205 -706 980 181 -473 466 3 -590 246 -81 -29 -452 -443 563 -627
1680f27M66P70j451Q56R18j893R61N47j337R73N26j364P55N4j90K04k01K35L9
$$ -627 -161 609 -842 14 932 -961 0 547 -790 183 709 -655 100 154 -36 168 -33 202 241
1699B41o62J050p28m76J514r45p39J650j175m41J769j215l21J207r34P9O12n83
$$ 241 -421 629 -99 -575 939 -6 -745 905 -270 -711 1058 -157 -478 729 -205 -126 486 -97
1717i7l3J57J67L41j159M38N62j252J076K92j626J037N59j640J722j92j214J138
$$ -97 -130 27 194 535 -624 -186 376 -876 200 492 -1134 -97 462 -1178 544 352 -862 276
1735B76J0n75O80m40J01K4m32J167j104l82J227q84k88J330j204p2J699j729L75
$$ 276 286 -289 391 -49 52 76 -356 811 -293 -675 552 -332 -620 710 -494 -566 1133 -596 -221
1754b21J137r38M5N20q16K01K23l46K65o20R81J60j204Q46K84j438J508o30j050
$$ -221 916 -22 23 543 -273 -72 151 -195 70 -550 431 591 -613 233 517 -921 587 -43 -1093
1773a093J689l95r21J243k69l75O94l64O5k05j13L51n76j62P29j120N08R55j370
$$ -1093 596 201 -720 523 254 -121 573 209 274 69 -44 307 -269 -431 298 -822 -314 641 -729
1792g29L69J231j379L80P60j476P03N23p47M49K91m96N48n56L80P0j035Q93q9
$$ -729 -360 871 -508 -128 632 -844 -141 382 -365 84 375 -121 427 -129 251 321 -714 179 90
1811I0j133J315k51q14J373o04o55J574m17p24Q13k98j87K02n50K31j47K4O03
$$ 90 -1043 272 21 -793 580 -24 -679 895 478 -246 567 269 82 284 -266 -35 -182 -158 445
1830D45j128M84P88j427J028N09j442O22Q70j660O01L82p15O07K84l82N00k77
$$ 445 -683 -199 589 -838 190 699 -743 -121 749 -911 -310 72 -643 -36 248 -134 366 89
1848H9K36Q2p28R12q00k23R93r98l35J493p26m08J234r32n7P79q30K53N39r20
$$ 89 325 407 -321 591 -209 -432 561 -437 -772 721 -5 -413 821 -111 -168 611 -219 34 573 -347
1868c47O41l02O1K73o15O06J47r95P33J47j210J124k06r73J005K67j186R45J41
$$ -347 294 -8 53 326 -289 317 464 -531 202 349 -861 263 57 -916 89 356 -830 115 256
1887B56m81Q64o65N65l13n13L91Om97O86p54j40J401r85K40O34j276M24N04q12
$$ 256 -225 639 -26 539 226 -287 104 110 -387 299 -455 -595 806 -179 61 695 -581 -157 347 -465
1907d65L1L69k63O21r6j55N29p68O52J98j034P31k07j036Q66k01n75R94k20n76
$$ -465 -434 -65 -328 293 197 42 571 -197 455 653 -381 350 143 -893 -27 -228 -803 191 -29 -605
1927f05R94k65l47O12m14RL51m54N65o38J31O98q48K20J106j404L52O48j423P27
$$ -605 389 124 -223 389 -25 -16 335 -119 446 -192 -61 637 -211 9 1115 -289 63 711 -712 15
1947A5J35p01M22K19n36N31j88J26M53m67M77j71p23R59n26o88O86j41n82J106
$$ 15 150 -551 -129 90 -446 85 -103 23 476 9 486 315 -408 551 25 -663 23 -118 -700 406
1967D06o71j21Q01n13p1L93o41J86M82l73N71k30q3L74m88J76Q46j377N15J61
$$ 406 -265 -386 415 -98 -169 224 -417 -231 251 -122 449 219 136 510 22 198 1044 -333 182 343
1987C43j122P82K65j072P23P9m13N81j53mJ74l23N14l52m79O47Q7j017J276n87
$$ 343 -779 3 268 -804 -81 -2 -415 166 13 9 183 -140 374 22 -457 190 277 -740 536 -51
2007e1n84J152m72m59Q16q18k27N59l83K27L02l14L15j84J57M00o19M78K93o72
$$ -51 -635 517 45 -414 402 -416 -643 -84 -467 -240 62 -252 63 -121 36 436 -183 295 588 -84
2027h4J22L16j065R07J88j109J222k76o05O60j92k9K99n51j3K50k92O80p82J95
$$ -84 38 354 -711 196 384 -725 497 221 -384 276 84 55 354 -197 -210 40 -252 428 -354 -159
2047a59Q64o96j96J031j071p6Q44j247J73P00m80J4R3j35M46N6l22K72l76O03
$$ -159 705 9 -187 844 -227 -303 541 -706 -533 167 -313 -299 -206 -341 105 161 -161 111 -265 338
2067C38kq85O70L59q31O12j85m93J042o03k02O47o89Q4N74p74N56n06lN10j60
$$ 338 336 -549 121 480 -351 261 76 -417 625 22 -180 467 -222 -138 436 -338 218 -288 -291 219 59
2088E9l08J118j017N95K05q42K86M82q47J09L35o70O77k03j66j8k17J79j41J47
$$ 59 -249 869 -148 447 652 -190 96 578 -269 -160 175 -495 182 -21 -187 -205 -422 -243 -384 -237
2108b37M09k21l34N89j18q75J069r9l31J114p20q02Q27o40J70L29m86K6K94j35
$$ -237 172 -49 -383 206 88 -787 282 183 -148 966 246 -556 271 -369 -199 130 -356 -330 -36 -171
2128a71M3N5r8P07q99P29K55q49N63K40r11P91k3j001O00j54l30M61j43n55O37
$$ -171 -128 -73 -171 536 -363 366 621 -228 335 575 -336 455 432 -569 31 -123 -453 8 -135 -690 -53
2149e3k29K15MJ95N64p33j4N40j70p80J149q30nN44n88J12J16m88M30J00l95K91
$$ -53 -282 -67 -63 132 696 -37 -51 489 319 -461 688 -142 -147 397 -191 -79 37 -451 -21 79 -316 -25
2171b5m5N3K48m52M90J08p17Q99l55m51L88l7p35R60l65q02R70m91o2M73l84K70
$$ -25 -70 -17 231 -221 269 377 -340 559 204 -247 141 104 -631 329 -36 -838 132 -359 -421 52 -332 -62
2193f2k53K93L25l78j15M84o97J44P84p17R1O67q50L97J56p72N44k28M6N9r4L1
$$ -62 -315 -22 303 -75 -190 294 -403 -259 525 -192 -101 566 -284 113 269 -503 41 -187 -141 -82 -176 -145
2215a45M12p81P91j88k76P14m9j037J028m05l08L74l64J35K79o09L20J50k85J14
$$ -145 267 -514 277 89 -187 527 478 -559 469 64 -244 130 -234 -99 180 -429 -109 41 -244 -130
2235a30J16m52O64k63J73J71l44k6O41p94N06K68r82N24P1k44K89l04k19N98n33
$$ -130 -14 -466 198 -65 108 279 -65 -91 550 -244 262 530 -452 72 143 -101 188 -116 -335 263 -270
2256b70q1M87k56K88n9m08M59q0n41Q45o01m2O48n61l0Q33p21l30Q40n28J91K6
$$ -270 -351 136 -120 168 109 -299 160 80 -461 384 -217 -259 389 -172 -202 631 -90 -420 420 -108 83 109
2278A09J6q6l04K09L29p22N50M99j037O15J95o72M23K77p31L40q4p8M21l61Q1
$$ 109 125 39 -265 -56 273 -449 101 600 -437 178 373 -299 124 401 -330 10 -74 -152 269 -92 -11
2299a1k98L80K22k47n38Q01m59j77M26l86j83O74k36j83N42m53J21m2l06M50L41
$$ -11 -309 71 293 46 -492 309 -150 -327 99 -287 -470 204 -32 -215 327 -126 -5 -47 -353 97 438
2320D38m57L37n42J74O00n99K06K26r07P32j15o72R70l77k29M72k33j71N07k58
$$ 438 -19 318 -224 -50 550 -49 157 383 -524 208 93 -579 391 14 -215 257 24 -147 360 102
2340A02j27L45n57J48j53k95P02l28l7O21p55kN62m04L98qm08L95jl67J05Q2j02
$$ 102 -25 320 -237 -89 -242 -537 165 -163 -200 421 -334 -336 226 -178 220 212 -196 199 198 -169 -64 18 -84
2363h4K81k72Or0J95J15M2n07M53j23o42Q14m24q1J124r33J14K32l17J57M1n17
$$ -84 197 -75 -69 -159 36 151 193 -314 139 16 -626 188 -236 -317 807 -126 -12 220 -97 60 101 -416
2385d16O26k19o5M07o73K37M79m17J93L7k89N79j04o34N78j93m03N02J06l95L83
$$ -416 210 -9 -74 333 -340 -103 376 -41 152 189 -100 479 375 -259 319 126 -277 225 331 -64 319
2406C19q7k18M46n45N23m60l14Q23m12m01O89m59J9K32n63K28M28k92P6K16n83
$$ 319 232 14 460 -85 438 -22 -336 487 75 -326 363 -96 -77 155 -408 -180 248 -44 32 248 -335
2427c35J54Oj84O25m45Q5L59m90K39J20m22M73J42r38O82J27n99P57n25M8O02
$$ -335 -181 -175 -359 266 -179 -94 265 -225 14 134 -288 185 327 -611 71 198 -401 356 -169 -121 481
2448D81k04N3l05mK34j53J27l9m09K1M48k79J54K29n36j06M59l85L38N0j48p2
$$ 481 277 330 25 21 255 102 229 190 -219 -198 250 -29 125 354 -182 -288 171 -214 124 174 26 -46
2470d6o9m4L56k41p7M00n43M18J14n84O01j97l97K98r3l15P89m75j36M39j86K48
$$ -46 -115 -159 197 -44 -121 279 -264 154 268 -316 285 88 -309 -11 -104 -419 370 -105 -241 198 12 260
2492B60Q3o50N08k50N5P9k04J06M95n56j42O63q55M34R8m88P31k40k83K64P5j67
$$ 260 343 -307 201 -49 6 85 -119 -13 482 -74 -216 447 -408 26 124 -364 367 127 -156 108 183 16
2514A6K04k09L3N2l21M68j70j73L05j87n95P77k01m39O98n97L59K40n79M2K14
$$ 16 220 11 44 96 -225 243 73 -100 205 18 -577 200 -1 -440 258 -339 20 260 -319 -277 -63
2535f3k28K87P8j65M01n93L60K68n39O4N4k48M15l05J46N01n28q2J89k3l4J54
$$ -63 -291 -4 74 -91 310 -283 77 345 -194 -130 -76 -324 91 -214 -68 433 -95 -177 12 -11 -45 109
2557A09k38K11N1j90L63m34j30L59j88j93P02o00o8N54n31L28j89r0K46k7j29
$$ 109 -129 82 133 -57 306 -128 -258 101 -87 -280 422 -178 -246 308 -223 105 -84 -174 72 45 -84
2578h4N5J58j33J87j46J44p1k92K47k2j40L28j60n66N62P2n09O23k43k69K47m12
$$ -84 -29 129 -4 183 37 181 110 -182 65 43 -97 231 71 -495 67 139 -370 253 10 -259 -12 -424
2600d24N87k71k13K22p0P6K66k44j38M25q0j32L18n66K97O9q5J57m06N7M07k90
$$ -424 163 -108 -321 -99 -169 -93 173 -71 -209 216 136 4 322 -244 53 122 37 194 -212 -155 252 -38
2622c8p7J12M0q0L15j12j18J23l04L20L5j09k2j40p9J6J37j17L21M5m26M6k10
$$ -38 -115 -3 37 -43 272 160 42 165 -139 181 216 107 85 -55 -134 -118 19 -98 223 268 -158 -112 -322
2645c22N19j06l56J95l08M48M8k84K22n5o6L06Q9l90J08j24k77L43p9J65j54n6
$$ -322 197 91 -265 -70 -378 70 118 -166 56 1 -65 241 330 -60 48 -76 -353 -10 -89 76 -78 -134
2667a34M01m45j79O05l21pK94j07K4L15p11K94J55l23J72j78LO8r7k0k6L8K9L68
$$ -134 267 -178 -357 248 -73 -80 214 107 131 446 -265 29 184 -139 33 -145 -142 -74 -171 -191 -217 -179 -150 218
2691B18l84J59R7k68M33k46j02K58L2l65N46j99j75K79k11J77q6l49Q8L29k72
$$ 218 -166 -7 90 -178 255 9 -93 165 197 -168 378 179 4 283 72 249 163 -186 -98 231 -41
2712d1K59k42r7J85l08L21q3R9l09M07n92K76J17l44L76j11Q0j98P2Q5P9j74J9
$$ -41 218 -24 -121 64 -244 77 -6 93 -216 191 -401 -125 -8 -352 24 -87 -7 -205 -133 -48 31 -143 -124
2735a24J25j98L71n5l50L20k7j31L41l12OL73k64l32K79j6L7J10m05K57q7K21
$$ -124 1 -197 174 119 -231 89 62 -69 272 -40 -34 339 75 -257 22 6 43 153 -252 5 -82 139
2757A39J9l63K75K35j98L8L9k44L13k08j35K09k81j76L07K3j78J29k05K62Qj90
$$ 139 158 -205 70 305 107 145 184 -60 253 45 -90 119 -162 -338 -31 -8 -186 -57 -262 0 8 -182
2779a82J28K4j09K72j57k38N56l79P2J73n6j17k30J45K1M6j52J88k25K52L05o56
$$ -182 -54 -30 -139 133 -24 -262 294 -85 -13 160 104 -13 -243 -98 -77 -31 -183 5 -220 32 337 -319
2801c19K53M45o04K18J72j99K85k11j9Q9j42N7Q9k69j43J98L04N7l70K6M69o93
$$ -319 -66 379 -225 -7 165 -34 251 40 21 110 -32 25 114 -155 -298 -100 204 261 -109 -83 386 -307
2823c07J14M17n69M39K25l46j74M48j64K81k30l7P7k74P9M1j29K17Q0m65L19M7
$$ -307 -193 224 -345 94 319 -27 -201 247 83 364 134 97 174 -100 -21 20 -109 108 188 -277 42 89
2845H9l43M62k25j20L77r2l13K43j09r6J98k13L34j95k89K39R2QJ95m63j5N79
$$ 89 -254 208 -17 -137 240 148 -165 78 -31 -127 71 -142 192 -3 -292 -53 39 47 242 -221 -236 343
2867C43m60K66J00n21L56J03l11K87K94m43M69k21j26n6r2O0J74J6k81Q0j59L11
$$ 343 -117 149 249 -272 84 187 -124 163 457 14 483 262 136 80 -12 48 222 238 -43 37 -122 189
2889A89l13j23K34q2M8q2K12n6j50J03K82j90j65M2J93l13K8M9K49Ln89M72P4
$$ 189 -124 -247 -13 -95 -47 -129 83 27 -123 -20 262 72 -93 -51 142 -171 -143 -94 155 158 -431 41 115
2912A15m16O27Ll61J87n73L71J84j09k73M19l59L49O6k96J71l4k02K05k78L94
$$ 115 -301 326 329 -32 155 -418 -47 137 28 -245 174 -185 164 230 -66 105 71 -131 74 -204 190
2933A90j43l46M00k62M0n7K33o2n22N86k2l8n2j20L60l44J53j31m5L41k37j06
$$ 190 47 -299 101 -161 -121 -178 55 -7 -529 57 35 -3 -55 -175 185 -159 -6 -137 -182 159 -78 -184
2955a84J84J61l70J24n7J68m8l50J94L32j95J40J35k31n7j4J7J75l80J17K34l56
$$ -184 0 161 -209 -85 -142 26 -22 -372 -178 154 -41 99 234 3 -54 -68 -51 124 -256 -139 95 -261
2977b61M26O3m28K19n0n9M7R6m20M02M5L8J43k19O5J04m14N20j18k94J60j63k92
$$ -261 165 228 -200 19 -31 -90 -43 53 -367 35 80 118 261 42 107 211 -203 317 199 -95 65 -98 -390
3000c90O12r9n62P36k89j75J36N4M4O2L5k69L09k98J22l24J65K07l40Q8L60n50
$$ -390 222 123 -439 297 8 -167 -31 23 67 129 164 -105 204 -94 28 -296 -131 76 -264 -176 184 -366
3022c66M38R7p07N01k3L2K7P3j77K35k76K79j41J90j42J09j22j4p0n7J71l17j28
$$ -366 72 169 -538 -37 -60 -28 -1 72 -105 130 -146 133 -8 182 40 149 27 13 -57 -114 57 -260 -388
3045c88L72j3R9P5l38L50k39R6M2N5j42K97l86J35j3o6K75j69n26O41m95J60K24
$$ -388 -16 -29 70 145 -193 157 -82 14 56 111 -31 266 -120 15 2 -64 211 42 -484 157 -338 -178 46
3068D6l3j13J61j98k14O35o05O10n11K00R6m11L99n9j99j03L22JK06l57N1L95
$$ 46 13 -100 61 -137 -351 284 -321 289 -222 -22 74 -337 62 3 -196 -299 23 24 230 -127 -76 319
3090C19l31M2m0K43l86N71o22P3O5pK89j29j03Q8k85P8K39K3m52L49j90R7n8l5
$$ 319 -12 30 -10 233 -153 418 -204 -131 -66 -73 216 87 -16 72 -213 -135 104 127 -325 24 -166 -69 -127 -162
3114a62%k0L88j11J22n97K98K39j37j08nj47O31n08J42L04m63q4L89j06j4L7j90
$$ -162 -162 -182 206 95 217 -380 -82 157 20 -88 -93 -240 391 -117 25 329 -134 -218 171 65 51 88 -102
3137a02J34l07J74J42r1J17p0l9J06L6l08M94l44j79K87K28l07J52j90J15k2k55
$$ -102 32 -275 -101 41 -50 67 -3 -42 64 100 -208 286 -58 -237 50 278 -29 123 -67 48 26 -229
3159b29J07r2K78j71J79j81L6Lo6K23k25O8K6j88J77J83n2P5r0k83J70L90k90
$$ -229 -122 -214 64 -107 72 -109 -73 -70 -136 87 -138 -70 -44 -232 -55 128 76 151 61 -222 -52 338 48
3182D8J8k03K22k60K42j53L63n11K76j85N9K63j57RK58n08K01K9k1r7M7j54L05
$$ 48 66 -137 85 -175 67 -86 277 -234 42 -143 -84 179 22 31 289 -219 -18 11 -10 -107 -60 -214 91
3205I1j08k1K74k93Q7m1k49K28K7j66M13r4p6j00j41R9J78j87J34l2Q1j37r0K56
$$ 91 -17 -38 236 -57 30 -11 -260 -32 -5 -171 242 148 72 -28 -169 -70 108 -79 55 23 104 -33 -123 133
3229A33k52m0J58K39l88K98O6nl38L37k32J12P2k91L45l89L16p0j61N0J66k63
$$ 133 -119 -159 -1 238 -150 148 214 209 -129 208 -24 88 160 -131 214 -175 141 71 -90 -40 126 -137
3251a37J5L92o01O07k90l44L61J85j80K30l90Q6J74j44j14j02J45J50j10O8j92
$$ -137 -122 270 -331 276 -14 -358 3 188 8 238 -152 -66 108 -36 -150 -252 -107 43 -67 1 -191
3272a91J43j0J0K3Q6j42j3N2K00k49Q1K57m07N21l76J33j39J35N0n7k99M47l29
$$ -191 -48 -58 -48 -25 61 -81 -94 -42 158 -91 -10 247 -160 361 -15 118 -21 114 164 107 -192 255 -74
3295g4J31J15m27M62P2k40j58L01k55R7K05n19K31K47n58J02K47R4k39j47L24
$$ -74 57 172 -255 207 279 39 -119 182 -73 24 229 -290 -59 188 -370 -268 -21 73 -166 -313 11
3316A1J5k0R7n3k76K77O5j38J74k0l3O4j06l04K31j68rR1k0M46m29j14M63l32
$$ 11 26 6 103 50 -226 51 116 -22 152 132 99 163 57 -247 -16 -184 -193 -102 -122 324 -105 -219 244 -88
3340h8L1jJ26J13j48J04J29m2l20k54J93J38J78m74K30l5J55J10l03K33j15K84
$$ -88 -57 -58 68 181 33 137 266 224 -96 -350 -157 -19 159 -315 -85 -120 35 145 -158 75 -40 244
3362B44m57K55r3l4K40k10Q4j55P2L04j69k85K98q8j63J11k01o7L60K22m99L24
$$ 244 -213 42 -51 -85 155 -55 29 -126 -54 250 81 -204 94 6 -157 -46 -247 -314 46 268 -231 93
3384I3k21M6M3k4J7K90k25J17k63M03M8k59r2O9l18R9j18K95J50j95k24N20n59
$$ 93 -128 -82 -39 -63 -46 244 19 136 -127 276 324 65 -27 42 -276 -177 -295 0 150 -45 -269 251 -308
3407c08K58J65j44j7Q8j37K58r8j90J83J60l93M24j58Q4K41n65K63k02j63L92
$$ -308 -50 115 -29 -46 42 -95 163 65 -125 58 218 -175 249 91 175 416 -149 114 -88 -251 141
3428A41k83K09n4J02j95J27q2j05m0K06PK8m9J91r1k24J16k16J44K06j05JP9j03
$$ 141 -142 67 13 115 -80 47 -35 -140 -180 26 33 61 12 203 112 -112 4 -212 -68 138 33 34 113 10
3452A0k99M90j87j73L02q8K0j44J79M1o0j67J45N8j04J8l04KM40p5r4J26l42J20
$$ 10 -289 201 14 -159 143 55 75 -69 110 151 91 -76 69 127 23 41 -263 -261 179 104 10 136 -206 -86
3476h6J07k28N28k28N3J50m62J3J02J95j1k89L42l66J59k77K52o5J73r7k97K43
$$ -86 21 -207 321 93 146 296 -166 -153 -51 144 133 -156 186 -180 -21 -298 -46 -111 62 -35 -332 -89
3498h9J44Q6k10J40j50J13j35r9K62o4j03N2j73P0J40J2J08k61J94j69R2j25M03
$$ -89 55 141 -69 71 -79 34 -101 -200 62 -2 -105 -53 -226 -156 -16 -4 104 -157 37 -132 -40 -165 238
3521B38j00k01l2K53p1j72J08Lr0P5k0l4j19K54k34K47k49Q1K26j93n0N6J56o4
$$ 238 138 -63 -95 158 87 -85 23 26 -64 11 -9 -43 -162 92 -142 105 -144 -63 163 -30 -80 -24 132 68
3545F8J21j58k13K70%L0j84Q8K04J09l57J12N5m71L81k23L9J3K28k42O4r2L60
$$ 68 189 31 -182 88 88 118 -66 22 226 335 -22 90 145 -326 55 -168 -129 -116 112 -130 -66 -158 202
3568B02j64L6j12k93l4L98m80N67j42J3j81J73n8m9p0P9J35J00j62j05K41J0k67
$$ 202 38 74 -38 -331 -365 33 -447 120 -22 -9 -190 -17 -75 -124 -194 -115 20 120 -42 -147 94 104 -163
3591a63j4J01M8j99K71j50q1J65j80K77M0j82K09N6j44k29j53K29J83j55m8L49
$$ -163 -177 -76 -28 -227 44 -106 -187 -22 -202 75 115 -67 142 198 54 -175 -328 -99 84 -71 -119 230
3613B30k30J00J76m18K59j40l07P03j54k52J35j64n3o3M45j19j61j29L11j46K0
$$ 230 0 100 276 -142 117 -23 -330 373 219 -33 102 -62 -115 -178 267 148 -13 -142 169 23 43
3634D3K08j46k90N7K66k09l14K08J30L0L2m0j35p1M01Q3l98K09k40j6K22L03k31
$$ 43 251 105 -185 -128 138 -71 -385 -177 -47 -17 15 -25 -160 -231 170 253 -145 64 -176 -192 30 333 102
3657A02p0K27l78K39K1l67k06O16m9m1l11J78k35J17M1j16J34J20j9j1k1j5P4
$$ 102 32 259 -119 120 141 -226 -432 184 135 94 -217 -39 -274 -157 -116 -232 -98 22 3 -8 -29 -44 30
3680C0O4j61R7k17K18k9q1J94q6j71O0J95j54N1j26j6L26l48M10r5j85r5J13p9
$$ 30 94 -67 30 -187 31 2 -79 115 29 -142 -82 113 -41 10 -116 -132 194 -154 256 161 -24 -119 -6 -85
3704h5m1L10j17n6j60Q9K5q4R3P8M1j31K08j16q3J75kl48J68R6k77J18K12M1j71
$$ -85 -126 184 67 11 -149 -60 -35 -119 -26 52 93 -38 170 54 -29 146 144 -204 -36 60 -217 -99 113 154 -17
3729a7oJ52r1k3M3mJ72j28P9l54K91o1p4Q2n1K31l73J12r3J76r0j43J50p0l8j9
$$ -17 -23 129 38 15 58 54 226 98 177 -177 114 53 -21 61 10 241 -132 -20 -113 63 -27 -170 -20 -90 -128 -147
3755a47M56l85K97j5n89K49J70r4L81l14m61L55J53j98J44M1R9m2k89K94l7j15
$$ -147 309 -76 221 206 -383 -134 36 -58 323 9 -452 -97 56 -142 2 43 142 100 -189 105 68 -47
3777d7p0l0j16R0J31p3K17l10L59J0j57J98m69K59M0N2j23L8l5Pj89L08k00K71
$$ -47 -117 -147 -263 -173 -42 -115 102 -208 151 161 4 202 -267 -8 32 84 -39 -1 -36 -29 -218 90 -110 161
3801A61k00J48l61K24J07n01L21J9j33K41k18K15N3j2oN2p2j7K15l30P9j16k72
$$ 161 -39 109 -252 -28 79 -422 -101 -82 -215 26 -192 23 76 64 58 110 38 21 236 -94 -15 -131 -403
3824d03M52k56k0K65j32j44J83L27l99J46n8j74J96J6K05j68J0Q4l5M6k42M10
$$ -403 49 -207 -227 38 -94 -238 -55 272 -127 19 -39 -213 -17 -1 204 36 46 130 95 141 -101 309
3846C09m45K04l57m1N98l00J49k11L95k99J85j25N8j63l03J95J57K5R4k77J45
$$ 309 -136 68 -289 -330 268 -32 117 -94 301 2 187 62 120 -43 -346 -151 6 31 125 -152 -7
3867gL38n32L50l51J65K04n03L74j07L87l93K86j01j14l6P6J69l61j73N68k72
$$ -7 331 -201 149 -202 -37 167 -336 38 -69 318 -75 211 110 -4 -40 36 205 -156 -329 239 -33
3888c3K93k13J67j76K35q9j91k14n3L69k39L55k24P2k55K54J03J57l88L90j82
$$ -33 260 47 214 38 273 184 -7 -221 -274 95 -144 211 -13 59 -196 58 161 318 -70 320 138
3909A38j20K00k16r0K12l3j12J45j51L5O5mk0k11N7N28p35J9L59p0J24l67n8L50
$$ 138 18 218 2 -88 124 91 -21 124 -27 8 73 69 49 -162 -105 423 -312 -293 66 -4 120 -247 -305 45
3933D5l4j99OK99L8l09J55k95M00j35J89k61Q7M7m8k41K83J47m24O62m67P3p2
$$ 45 11 -188 -182 117 155 -154 1 -294 106 -29 160 -101 -14 33 -15 -256 27 174 -250 412 -55 18 -54
3956e4o9J9J75j89P2k7k74K91j6p8Q0K28j60O1j59J55k32O7O8J37j04J61j43J86
$$ -54 -123 -104 71 -118 -46 -73 -347 -56 -72 -150 -70 158 -2 59 -100 55 -177 -110 -42 95 -9 152 9 195
3980A95q3j58J33k3M6m8k84M10l49K21k41K69l97O08m09J82L9p4kJ8L49m50NO4
$$ 195 112 -46 87 64 110 62 -222 188 -161 60 -181 88 -309 299 -110 72 111 37 35 53 402 -48 -43 21
4004B1J95n57M13l52K13L1k73K34J14j1l42M11n6m3J5j15K26p1j65K57jj80k57
$$ 21 216 -341 72 -280 -67 -36 -309 -75 39 28 -314 97 41 -2 13 -102 124 53 -112 145 144 -36 -293
4027b93L83j22q9L52k87k37K52K2L8Q8N5j32J99m94j5K59K02k06L09m17J38j04
$$ -293 90 -32 -121 231 -56 -293 -41 -19 19 107 162 30 229 -265 -280 -21 181 -25 284 -133 5 -99
4049i9L03p9q6p4L5O0K6j14N4K41m14K24p0l12K44J36p5q7q3J43J50J76j98P8
$$ -99 204 125 39 -35 0 60 86 -28 26 267 -147 77 7 -305 -61 75 0 -87 -170 -27 123 299 101 179
4073A79k2j78R1n7J7j74J71q5J1j6K18k07N7k41L23r7j50L29j31J64m16K87j16
$$ 179 157 -21 70 13 30 -144 27 -58 -47 -63 155 -52 5 -236 87 -10 -160 169 38 202 -214 73 -43
4096d3l05L35K88m41K03m0K81q9l43K0R3O8L7M1K08j90j54j98J39k79M95j41p7
$$ -43 -348 -13 275 -166 37 -3 278 189 -154 -134 -41 27 64 105 313 123 -31 -229 -90 -369 126 -15 -92
4119i2P9Q6k0j36J72N9k20k51Q6L72k33j46L08j98J05j06J42q6j35K55j39L0J74
$$ -92 -13 73 53 -83 89 148 -72 -323 -237 135 -98 -244 64 -134 -29 -135 7 -79 -214 41 -98 -68 106
4142A06Q4m79K74j27K25k95L63j8r6lr5m5r5L01j49j00K09l0M4J54l8j49q2J18
$$ 106 190 -289 -15 -142 83 -212 151 133 37 34 -61 -106 -201 100 -49 -149 60 30 74 228 190 41 -41 77
4166G7m48M74J7k16nN7n9K31r9r8K05J49k92k08L87m5K6J4r3J16m8l05K54oo2
$$ 77 -371 103 120 -96 -101 -44 -103 128 29 -69 136 285 -7 -215 172 127 153 167 74 190 142 -163 91 85 23
4191B3k32M9J72k35M52o2j46R1o2J17n9j5m47L33J44M1j97N2J60j4j7l26K58j27
$$ 23 -209 -160 12 -223 229 167 21 112 50 167 108 93 -354 -21 123 164 -33 19 179 165 148 -178 80 -47
4215d7J90j13j52J4J60K8j73K83l99r0L34j04n1r9J09K04m1J19k33K9K71m05K03
$$ -47 143 30 -122 -108 52 80 -93 190 -209 -299 35 -69 -120 -219 -110 94 53 172 -61 -32 239 -166 37
4238C7o4N0J60l03N4J89j61Q8n3J45Nm66J65K44k74K15Nk42J42L51j60j28oM6
$$ 37 -27 23 183 -120 -66 123 -38 50 -3 142 147 -319 -154 90 -184 31 36 -206 -64 287 127 -1 -7 39
4262C9Kn6NN15m34l80M63Nj6R7l36K38k88l7P9J42L4j20j9j13J09j11K17m5p2
$$ 39 41 -15 -10 505 71 -309 154 159 143 240 -96 142 -146 -183 -104 38 72 -48 -67 -180 -71 -182 35 -10 -82
4287h2R1k05L36N1j40j04L8k21K33J45P7j53n0j55M19k30PO1j14J6K9O9j27q0
$$ -82 9 -196 140 191 51 -53 -15 -236 -3 142 219 66 16 -139 280 50 57 118 4 20 49 118 -9 -89
4311h9P4jK0Rj43J36k23J76P3k22N37j22j80q9J14j68j37J02l2L04j17J0r6%L36
$$ -89 -15 -16 4 13 -130 6 -217 -41 32 -190 347 225 45 -44 70 -98 -235 -133 -165 139 22 32 -64 -64 272
4336B72k69l7J27J32j84j23J02K58r4k53j61M91k90l1K06L9r5p8K31k58k0K66
$$ 272 3 -34 93 225 41 -82 20 278 184 -69 -230 261 -29 -60 146 185 90 12 243 -15 -35 231
4358B31l48n6J1J12J91n9k55K82j28j92M60k32O8j77j79K86J6j32J68k39m8K84
$$ 231 -117 -173 -162 -50 141 82 -173 109 -19 -211 249 17 85 -92 -271 15 31 -101 67 -172 -220 64
4380F4m7r7o6J66l1M2P8n4O7j38j42j23K42M07k95K9k5k77J43J53qJ18k64k8j3
$$ 64 17 -80 -146 20 -11 31 109 55 122 -16 -158 -281 -39 368 73 102 77 -200 -57 96 88 206 -58 -86 -99
4405i9K17j09J37j69q0K49j3j40p6J99l93O51j97l72OM48k92OJ89n1J25k36L7
$$ -99 118 9 146 -23 -103 146 133 -7 -83 116 -277 374 177 -195 -189 259 -33 -27 162 111 236 0 37
4428C7R7j07J21k00K41j45j87J37o5j97M08k59R7J52Q8k48O6k13K89o5k81j28
$$ 37 134 27 148 -52 189 44 -143 -6 -71 -268 140 -119 -22 130 218 -30 36 -177 112 47 -234 -362
4450c62L71j15j21k78K22N82m21k9J69n7K08k44J66J48l20L64j04j1k05q3J7j77
$$ -362 9 -106 -227 -505 -283 299 -122 -151 18 -39 169 -75 91 239 -81 283 179 168 -37 -120 -103 -280
4472b80K85j92M23k52r5J93o3n7K2l88J75J64K47qP7n3k50j1q9M09m10N3P7Jk5
$$ -280 5 -187 236 -16 -111 82 19 -38 -16 -404 -229 -65 182 174 251 198 -52 -63 -152 257 -153 -100 -23 -22 -47
4497d7J0J48J0k72j21L35n9K4N8j11K03R9k80P4J53k82P4n9j69J94Q4n07L94J2
$$ -47 -37 111 121 -151 -272 63 4 28 86 -25 178 277 -3 71 224 -58 16 -43 -212 -18 66 -441 -47 -35
4521c5J16J11k5J15n08J33l7M55m38j62M87m09K88j57l0K71L2l27J69k53P2L41
$$ -35 81 192 167 282 -226 -93 -130 325 -113 -275 212 -197 91 -66 -96 175 207 -120 49 -204 -132 209
4543B09m56L63p4N0k54K76J43r7j78R5P1kj92K32j07k27r8Q4J60Q2k54q0K02o1
$$ 209 -247 116 42 92 -162 114 257 160 -18 77 148 146 -46 186 79 -148 -246 -162 -2 80 -174 -254 -52 -113
4567a13N8n7L55m16J70J14l47K75L96n72K81J06k93Q0L0p9l0j32L5J39M41m81
$$ -113 -55 -112 243 -173 -3 111 -236 39 435 -137 144 250 -43 37 67 -12 -42 -174 -139 0 441 -40
4589d0J62j32J48k41n3J25J13j34K32l3l97J31N9r0M03k79oQ4R1p8l8j86O6J75
$$ -40 122 -10 138 -103 -156 -31 82 -52 180 147 -250 -119 -60 -150 253 -26 -32 52 143 65 27 -159 -93 82
4613H2k02L08l45j4J27P8j49L02n22M10j61J48p3k1J33n9n5j34K58p6J11l93J58
$$ 82 -120 188 -157 -171 -44 34 -115 187 -335 75 -86 62 -11 -32 101 42 -13 -147 111 35 146 -247 -89
4636h9K61j39j14J94j10J2M4j04J09j2J81j49k09J17J71l28K71k47K08J63m44
$$ -89 172 33 -81 113 3 15 59 -45 64 52 233 84 -125 -8 163 -165 106 -141 67 230 -214
4657b14J78k00L65j19N6M8k32J93j11m57O09J5l51N64k00p2q7J77k20R8M6J13
$$ -214 -36 -236 129 10 66 114 -118 75 -36 -493 116 131 -220 344 144 72 -15 162 -58 40 86 199
4679A99no1k87K77l36M42j96j35J67p9l6K82j3j1k77j77M20k64q5L99j56l00L51
$$ 199 194 133 -154 123 -213 229 33 -102 65 -14 -50 232 219 208 -69 -246 174 -90 -175 224 68 -232 119
4702A19k26kOJ76k91R0J31J1J49m45L70Q6k61K4r6K72J30n02M40m42L09k81L09
$$ 119 -107 -109 -103 73 -218 -128 3 14 163 -282 88 174 -87 -63 -159 113 243 -259 181 -261 48 -233 76
4725G6J63l52J52k16K53K2l0J02nl18L60k47K44r3k11N6N45l88j80m0M3l9k09
$$ 76 239 -113 39 -177 76 98 68 170 165 -153 207 -40 204 111 -100 -44 501 113 -67 -107 -64 -103 -312
4748c12r9M64j27J28J0J09k2o2J56l10j68N29m37J98j25J65j25J0M36k95k6J16
$$ -312 -411 53 -74 54 64 173 151 89 245 -65 -233 296 -141 57 -68 97 -28 -18 418 123 97 213
4770B13l47K29r8J4J52l73N3J0L61N7n94N15j22j6j9j63R0j2n5M9K14l11J57J38
$$ 213 -134 95 -3 11 163 -210 -157 -147 214 271 -323 192 70 54 35 -128 -38 -50 -105 -56 158 -153 4 142
4794A42p1k05K68n6Jj52M8J57Q0m32J63M3J16O3j54P9k31J94p3k75L17m3L6L07
$$ 142 71 -134 134 78 79 -73 -25 132 212 -220 -57 -14 102 165 11 90 -141 53 -20 -295 22 -21 15 322
4818C22m32J31p5K79j42k2J46j49q1M4j21J31j02MJ83j56L4K31k78J60m40M73
$$ 322 -110 21 -54 225 83 61 207 58 -23 21 -100 31 -71 -67 116 -40 -6 225 -53 107 -333 140
4840A40k0j05J43l58jR6K42K6l7j38k46K39M8r2K13N7m73R6R9P2J16k53J01J1
$$ 140 120 15 158 -200 -201 -105 137 163 126 -12 -258 -19 29 -63 150 207 -266 -170 -71 1 117 -136 -35 -24
4864b4K52l23L53m1l53J50N5p3Q8Q7J50k64k09K69k57K56j04j85J43R5j52J45
$$ -24 228 -95 258 217 -136 14 69 -4 84 171 321 57 -152 117 -140 116 12 -173 -30 65 -87 58
4886E8j11k4M14L8l98j8p5J49j9k21K93j36J00j82R0L6J09j82j74K92j11Q1J02
$$ 58 -53 -77 337 375 -23 -41 -116 33 14 -207 86 -50 50 -132 -42 -6 103 -79 -253 39 -72 9 111
4909A11j67N9R3j01J51L8j34j30m2M2M86j26m72J61q7J70J02N8l49L73k32R1o6
$$ 111 -56 3 96 -5 146 184 50 -80 -122 -80 406 280 -192 -31 -118 52 154 212 -137 236 4 95 29
4932B9m7j70K46R0j16M9l0o8J0J16l07M80k05l01K37m9K62n9k61OJ35q5K13j98
$$ 29 -18 -188 58 148 32 81 51 -17 -7 109 -198 282 77 -224 13 -36 226 167 -94 -88 47 -38 175 -23
4956b3J47k31L00j78k72J36k5K39J6L5j07L40n24L2L8Q6R5j97K72k5k41L2J30
$$ -23 124 -107 193 15 -257 -121 -146 93 109 144 37 377 -147 -115 -77 9 104 -93 179 154 -87 -55 75
4979G5j07p1r4K88j93K30k37MK96j44J24k68J90k52K43j75J55m1N4O2l68L9K75
$$ 75 -32 -103 -197 91 -102 128 -109 -105 191 47 171 -97 93 -159 84 -91 64 23 77 139 -229 -190 85
5002H5k62K13J22k38K38j12r1j9L06k56k13L34Lj25J64n6k32m7K03j01L4L9r2
$$ 85 -177 36 158 -80 158 46 -45 -64 242 -14 -227 107 110 -15 149 93 -139 -186 17 -84 -50 -11 -103
5025a03MM1k90M57k43K53r9P1j8l9jJ7l2j24l7K31J73l11M3J23J41l11K8j3P6
$$ -103 -99 -58 -348 109 -134 119 20 91 73 34 33 50 18 -106 -143 88 261 -50 -7 116 257 -54 -26 -39 37
5050C7P0K3q8j39J27l8J59r0Pk34K12j60M25m40L13m5k08J44l36J20K25k13K47
$$ 37 107 130 42 -97 30 -8 151 61 68 -166 46 -114 311 -129 184 139 -69 75 -261 -141 84 -129 118
5073A18m56K12J0L36m02J55J07M3K16j92k01N5pJ40q3l03L73J39k03NR0k61K58
$$ 118 -338 -126 -116 220 -182 -27 80 123 339 147 -54 1 -6 134 51 -252 121 260 57 62 152 -109 149
5096A49L27n76K79r4j28K29k42O6J4N0j71j76J21L64n17J8M9K63k01K43k67J38
$$ 149 476 -100 179 85 -43 186 -56 10 24 74 -97 -273 -152 212 -305 -287 -238 25 -176 67 -200 -62
5118f2L3Qj72K44K49k63k41K92M6M6J42m09J16j01L8L08m32K58k68P2J84J79l24
$$ -62 -29 -21 -193 51 300 37 -204 88 134 180 322 -87 29 -72 -34 274 -158 100 -168 -96 88 267 -57
5141e7oj66M21j71J56nm04J86n7m3M51k10j33J83k39oJ24j00O0P6l5j0j20M58
$$ -57 -63 -229 192 21 177 172 -232 -46 -103 -146 305 95 -38 145 -94 -100 24 -76 -16 60 25 15 -105 353
5165C53l98m6L7L7O6j45R3k17P2J22j34N09j83k73K99l59rJ51N4J33m7p8K12j72
$$ 353 -45 -91 -54 -17 49 -96 -3 -220 -148 -26 -160 349 166 -107 192 -167 -176 -25 29 162 115 37 249 77
5189G7rj51q3J69qM2l3J67q8o8O6m6L72l23j43J24M8k43L01j62j38J53J80j09
$$ 77 68 -83 -166 3 -5 37 4 171 83 15 81 35 407 84 -59 65 113 -130 171 9 -129 24 204 95
5213I5m2k01J58J16j37K89l55K77k96K72r7m2pO8J04j88J59l6k65M4m0K57j67
$$ 95 53 -148 10 126 -11 278 -77 200 -96 176 79 37 30 98 202 14 173 137 -128 -84 -124 133 -34
5236c4j52L87l2L1l04m01L44nJ87j00lJ93l07K18rj16K52k81J17J21J46k50K47
$$ -34 -186 201 169 200 -104 -505 -161 -166 21 -79 -82 111 -196 22 13 -103 149 -132 -15 106 252 2 249
5259B49l37L81k99j59l5J10N0K9K38J3r3j60J53j31J39Q8j00j81m8K7m6L40j58
$$ 249 -88 293 -6 -165 -200 -90 -40 -11 227 240 147 -13 140 9 148 236 136 -45 -93 -66 -112 228 70
5282G0Q2l2k33K41j93J25q9k57J03K18k87P3L41k08N0J12q7n7k2J56j21J56j25
$$ 70 152 120 -113 128 -65 60 -29 -286 -183 35 -252 -179 162 -46 4 116 29 -28 -50 106 -15 141 16
5305A6J3l3R3Jj81J40O8l1jk8l27j2L43m0J70j03j71J44l18L86j01KR0%k50J53
$$ 16 29 -4 89 90 -91 49 117 86 85 57 -270 -282 61 21 191 88 -83 61 -257 129 28 30 120 120 -130 23
5331B3j7R0j36J20k6k2j64O3j1J96j6l43j09M02j61j60J14L51n8p3k37K48oj36
$$ 23 6 96 -40 80 54 32 -132 -69 -80 116 100 -243 -352 50 -111 -271 -157 194 136 63 -174 74 68 -68
5355f8K44k33n3N3j80K55j4J15K58l39p9n6m4n6K85j06o8L14l49J99j75K51n6
$$ -68 176 -57 -110 -57 -237 18 4 119 377 38 -41 -97 -141 -197 88 -18 -86 228 -121 78 -97 154 98
5378I8k45K06k04L36j55j40j09K02J32j85K27r0Lk7O4K1j77O4L0j97L42j91j71
$$ 98 -147 59 -145 191 36 -104 -213 -11 121 -64 163 73 76 49 113 134 -43 21 51 -146 196 5 -166
5401a66L16k61L5K29k66M6J90k51L76m32J21p2J07K51n3r0j66J80j05J18k93J62
$$ -166 150 -111 -76 153 -113 -67 123 -128 248 -184 -63 -135 -28 223 170 80 -86 94 -11 107 -186 -24
5423b4Q2r7j62q4L64k30L36k13p4J78Jl8j26J14N4j64Q7Q3l93N13k84K5l5K22
$$ -24 58 -39 -201 -285 79 -151 185 -28 -102 76 77 39 -87 27 81 -83 4 87 -306 207 -77 -52 -87 135
5447A35j93K05l33L22k87K11m5j4K67Ol24k28M87l45N5j0j70J08J0L18l0m19K77
$$ 135 -58 147 -186 136 -151 60 15 1 268 274 -50 -278 209 -136 -81 -91 -261 -153 -143 175 145 -274 3
5470CK69j87o0k1j17L34j07j84J47K92k40k60K71Q0K09l49O4j63L0J06K98n27
$$ 3 272 85 25 4 -113 221 114 -70 77 369 129 -131 140 220 429 80 144 -19 11 117 415 -112
5492a12J95p4J58J11m24K27j85n2l7L6J93M2k50K36O5j3k50R9L4l6lO3n0K15Q9
$$ -112 83 9 167 278 -146 81 -104 -156 -193 -157 36 78 -172 64 129 116 -134 -35 -1 -37 -40 23 -27 188 277
5517B77j49J34j54J51l06k05k3K9L7J09j2l0K27j17K02J17k32j86K19l22j0L35
$$ 277 128 262 108 259 -47 -252 -275 -246 -209 -100 -112 -142 85 -32 170 287 55 -131 88 -234 -244 91
5539I1q0K0K76m60K42J41m47L10k03j03J87J73r8K33l24K21j88j25L11k92K10
$$ 91 11 31 307 -153 89 230 -217 93 -110 -213 -26 147 49 282 -42 179 -9 -134 177 -115 95
5560I5k08K36j12L78o70N36j68L9J45l22J26j5LN3n4q5K22j40j8j75R5l15K87
$$ 95 -113 123 11 389 -281 255 87 126 271 -51 75 60 63 116 62 -23 199 59 41 -134 -39 -354 -67
5583f7J29L4k42O2J04Nq4M6r2j75J70o6L84j78k73L60j33L5J45R7k56K5m3J9j0
$$ -67 62 96 -146 -84 20 25 -59 -13 -105 -280 -110 -176 208 30 -243 117 -16 19 164 261 5 30 -13 6 -4
5608dJ26J52k78M7p4P3M8R2k39K92j96n1Q7R2q3j85K3MO6p3k3L6jq6K00k8j13
$$ -4 122 274 -4 43 -31 42 90 182 -57 235 39 -12 75 167 84 -101 -78 -74 -8 -81 -104 -68 -69 -155 45 17 -96
5635i6L16o2Jn0j61L80k38m07K38J46J64k18J04l07J67O7j24N0j49L16k10J5K2
$$ -96 220 158 159 109 -52 328 90 -317 -79 67 231 13 117 -190 -23 44 -80 -30 -179 137 -73 -58 -36
5658c6o7K5L07j68K1O6l9k03L40K0k96J5l5J48Qk94J8J76J58k29M9J39k05j32
$$ -36 -103 -78 229 61 82 148 109 -94 246 266 -30 -15 -50 98 106 -188 -170 6 164 -65 -16 123 -82 -214
5682b14J24J47kJ0L4J56j13rk79K37j78OQ2R9J35j03j84L9o5K08qP5k29j69Q8
$$ -214 -90 57 55 65 99 255 142 133 -146 91 -87 -81 1 100 235 132 -52 -13 -78 130 122 197 -32 -201 -113
5707a13J55N3J35k04n8j6k0J84k58K12j55k3K46j18J97j44k95L59m01J69rK29
$$ -113 42 95 230 26 -32 -48 -68 116 -142 70 -85 -108 138 20 217 73 -222 137 -264 -95 -104 125
5729A25o3j29On3R5q7J22j13J53o5J56j85j7J99n6J26l46P2n4j7R1J3k18N7N33
$$ 125 62 -67 -61 -114 -19 -106 16 -97 56 -9 147 -38 -55 144 88 214 -132 -60 -114 -131 -40 -27 -245 -188 345
5754C45l96J24O0m61N02k19J01n5O0j71J57k51K31J6m11L39o7J67j16o0NN65m42
$$ 345 -51 73 133 -328 174 -45 56 1 61 -110 47 -204 27 43 -368 -29 -96 71 -45 -105 -100 465 23
5777B3MJ48l6o9j6j54M2j93K91n4J18J08k19j81K24J0M2R7k39L13k28j25j44L90
$$ 23 27 175 139 70 54 -100 -58 -251 40 -14 104 212 -7 -188 36 46 88 185 -54 259 31 -94 -238 152
5801A52p6J03j79J5k40L05l2m21K91L04l24J13O7N0l01L40k30J93L40n09J22k57
$$ 152 76 179 0 15 -225 80 48 -373 -82 222 -102 11 78 128 -173 167 -63 130 470 -39 83 -174
5823a74J96J54j57J67j31j03j37K76Pm3N7q2J44j13o3Jj31q9L04J6K16l46L7k09
$$ -174 22 176 19 186 55 -48 -185 91 98 55 112 30 174 61 -2 -1 -132 -221 83 99 315 -31 6 -203
5847b03J26L24k90K43j90k1J11j50J26k07L4l15O40j72o3j10j13N23k52K2j77
$$ -203 -77 247 -43 200 10 -11 100 -50 76 -131 -97 -412 228 56 -7 -117 -230 293 41 63 -114
5868a14J09j90K35K05k49J36k34K91M5j27q4k05m2L72j45N7j40J23j29K27n4j85
$$ -114 -5 -195 40 245 -4 132 -102 189 234 107 23 -182 -224 148 3 60 -80 43 -86 141 87 -98
5890i8N9L7J02j57O6j01J75q9K16k92L21n2k17K62l04j04J66m1K7J06Q2J94k45
$$ -98 -39 -2 100 -57 9 -92 83 -6 210 -82 239 187 -30 232 -72 -176 -10 -51 -24 82 164 358 113
5913A13m46N40l33K00j14K64j23j4J95n24L84o8j45J1J79j4j77o2L67l95K60R3
$$ 113 -333 207 -126 74 -40 224 101 87 282 -242 142 74 -71 -60 119 105 -72 -134 233 -162 98 191
5935A91j00o0m3j12P9k8o8j80N22k50M2n5O6J11N1j69J36N7N0k89J57j53J82j05
$$ 191 91 31 -12 -124 -45 -73 -141 -321 201 -49 -7 -62 4 115 166 -3 133 190 240 -49 108 -45 137 32
5959C2j96M58n95K76j06L07j1j27m2K87l73J74L0j40O5j98J10K76O1k06k07K12
$$ 32 -164 294 -301 -25 -131 176 165 38 -4 283 -90 84 114 -26 39 -159 -49 227 288 82 -125 87
5981H7j13j54J82P6k06l1K69q7o1J10Q3m9j62K89l65P7K24J96k65k85K0O8j99
$$ 87 -26 -180 2 78 -128 -159 110 23 -38 72 155 106 -56 233 -132 -55 169 365 100 -185 -165 -97 -296
6004b96K75K79k72k8J81k34K51LO1l29L22J6j07k73K52p4q3K84j58K6r1q8n7j78
$$ -296 -21 258 -14 -42 139 -95 156 159 220 -109 213 229 122 -151 101 27 -56 228 70 96 5 -83 -140 -318
6028c18J4K17Q5J97r7l4k2j30j2K97k60q1J25N0j7k47k2L69m9j65K43%r6J49k32
$$ -318 -304 -87 -2 195 98 64 42 -88 -100 197 -63 -144 -19 31 14 -233 -255 114 65 -100 143 143 47 196 -36
6053c6M9j18M11m93M68k81M0j29J17Q4k4J1q3J59k63l8J46Q7P2k2m2k96K77l8
$$ -36 13 -105 306 -187 281 0 40 -89 28 112 88 99 16 175 -88 -126 20 107 179 157 115 -181 96 58
6077E8j03J07o2Q5P7j54o9K24j19r3q1L05lj01O5j57K20o3j03K1P2k02j38K17
$$ 58 -45 62 0 85 162 8 -61 163 44 -49 -130 175 172 71 136 -21 199 136 33 54 126 -76 -214 3
6101Cj92J34J59J33n5j93K3j14K95j85j26J05J54k16q3L97j58qJ59l37o4J71o
$$ 3 -189 -55 104 237 182 -11 12 -102 193 8 -118 -13 141 -75 -158 239 81 73 232 -105 -169 2 -4
6124dK3k2J18m04K06K74m5l26L56k93j5O0m9q5L01q5k32J80j31L2L02j48p7J55
$$ -4 19 -3 115 -289 -83 191 146 -180 176 -117 -132 -72 -121 -206 95 10 -222 -42 -173 -141 161 13 -64 91
6148I1q8j80K14K36j51L7m8J7l9o8l63J90r2K93J19k28m5N9J94l62K24J09J57
$$ 91 3 -177 37 273 122 159 111 128 89 21 -342 -152 -244 49 168 -60 -105 -46 148 -214 10 119 276
6171B76k28j28M62m43j24N26j19l29Pj34J81J08k14M5j19L97k39q1J17J70k35
$$ 276 48 -80 382 -61 -185 341 222 -107 -100 -234 -53 55 -159 -114 -233 164 -75 -156 -39 131 -104
6192a04k8J84j54L27k05j8r7j57j55N45n7m4k20J00M0j3j5J2K05j89L4JK33j20
$$ -104 -132 52 -102 225 20 2 -95 -252 -407 138 81 37 -183 -83 -43 -56 -71 -59 146 -43 -9 -8 225 105
6216A05K0k46J73K25j84J14o8j97J46K2j83J83J82k17m01L32n2m7m2K04j09K32
$$ 105 125 -121 52 277 93 207 139 -58 88 110 -73 110 292 75 -326 6 -46 -93 -135 69 -40 192
6238A92r5J98l9k49p3K89N5l38Q2K96m22k63N80j29l2r6J94L8l9l73N34l04J53
$$ 192 97 295 256 7 -66 223 278 -60 22 318 -104 -367 213 84 52 -44 150 188 149 -224 310 6 159
6261A59J3j83m6R0j70J64ln3oJ05k50K70J8l08K53K42j72Q3l39K91m57K03J90
$$ 159 172 -11 -57 33 -137 27 24 -29 -35 70 -180 90 108 -200 53 295 123 206 -133 158 -299 -96 94
6284I4r5Q8k73J28K87r4j15J9k66J51J51j10K93l40J84k12L40k04j0J55l62J60
$$ 94 -1 87 -186 -58 229 135 20 39 -227 -76 75 -35 258 -82 102 -110 230 26 16 171 -191 -31
6306c1K07j50l09O32k22j42J92l81J86J89m09M22K1l07p5L20k50L6L08k54n1J14
$$ -31 176 26 -283 349 127 -15 177 -204 -18 171 -238 184 205 -102 -177 143 -107 -71 237 -17 -68 46
6328D6j08M4K82l43K80l54K24J15km5k86K86j68J93Q0J4k48M13m22j25K2J7N8
$$ 46 -62 -18 264 -79 201 -153 71 186 184 139 -147 139 -29 164 244 258 10 423 1 -124 -102 -85 -27
6351b7K51k83L4L05l04Q0n9k27L07J47k69O0j12J50K78m84L25k32pL10j14j03
$$ -27 224 -59 -25 280 -24 56 -3 -230 77 224 -45 15 -97 53 331 -153 172 -60 -67 243 129 26
6373B6N0K2r9J45J9j2j71L3J78j57m04O13m52M22k09j40j80K74j67J13r7N7J20
$$ 26 76 98 -1 144 163 151 -20 13 191 34 -370 243 -209 213 4 -136 -316 -42 -209 -96 -193 -136 -16
6396a6M0j47K68K03n73K9P6J51%m43L40j54L7L98k18j55K86p3Nk05q9M42M6J4
$$ -16 24 -123 145 348 -225 -196 -120 31 31 -412 -72 -226 -189 209 -9 -164 122 49 54 -151 -240 202 248 262
6420B62Rk19j68J64J5K7l01Q1J07K8j8P5kj58l0K35j81J53J1j59o0o3P9J00k34
$$ 262 271 52 -116 48 63 90 -211 -130 -23 5 -13 62 60 -98 -128 107 -74 79 90 -69 -129 -192 -113 -13 -247
6445b47K82Lj73K5J05j3K53k43Q7j45j54J68j37K98j54Q2RK2m7k00K64j57J87
$$ -247 35 38 -135 -110 -5 -18 235 -8 79 -66 -220 -52 -189 109 -45 37 46 68 21 -179 85 -72 115
6468A15k11o7K14m2J09J6k41m7L51j14n3J02k63K0r9J52Jp1n4L27m9l9r0j8j26
$$ 115 -96 -163 51 9 118 134 -107 -154 197 83 30 132 -131 -111 -210 -58 -57 -128 -182 145 96 57 -33 -51 -177
6493a77J73J14k1Qn0k28K17J18P1k49K08O8j67k26L2L92l99R6p1j15J77j70O8
$$ -177 -4 110 89 97 47 -181 36 154 225 -24 184 252 85 -141 -109 283 -116 -20 -91 -206 -29 -199 -131
6516a31L23l70L57l13J4P0n8L4M33j53M0q9l89L79r7j21K39m81J77P3j7J86j53
$$ -131 192 -178 179 -134 -120 -50 -108 -74 359 206 246 157 -232 147 50 -71 168 -313 -136 -63 -80 106 -47
6539d7L24k21Q6j4J4n7j83J07M2j25j79K03N4J28Qj96N5K20Qm55R6J53l09M76
$$ -47 277 56 142 128 142 85 -98 9 51 -74 -253 -50 4 132 140 -56 -1 219 227 -228 -132 21 -288 188
6563A88l08q5J06O5m5K18L4l22j0j41L6K96k88M6L25j98K86l40J72L4Jm6J20l
$$ 188 -120 -205 -99 -34 -79 139 173 -149 -159 -300 -264 32 -256 -210 115 -83 203 -137 35 69 70 24 144 141
6587A41j85J99NJ07j31j5j31J75k38J48qJ03k31J48j04R6K65m31L0L3K08k46R5
$$ 141 -44 155 160 267 136 121 -10 165 -73 75 67 170 -61 87 -17 79 344 -87 -57 -24 184 -62 33
6610C3K6J38k03K05m38L75j31lk30J55K25j64l2K66k66L7K9J30l06P3n3q7L91
$$ 33 59 197 -6 199 -239 136 5 2 -228 -73 152 -12 -44 222 -44 -7 22 152 -154 -81 -134 -221 170
6633A70n5j70J17J14j81J70k57n7K34k33M3J07J04j94K2k23J22j44K7J26j7k8
$$ 170 115 -55 62 176 -5 165 -92 -149 85 -148 -105 2 106 -88 -66 -289 -167 -311 -284 -158 -175 -203
6655b03K39j27J17K17j05o7k39L3L58m79j14O63k76o7N5l5q9K28J48l89L4n1J23
$$ -203 36 -91 26 243 138 71 -168 -135 223 -256 -370 293 17 -50 5 -30 -119 109 257 -132 -98 -149 -26
6678b6K22l7k02J26p9O5J41j83N0j86J16J06J84j83On5O1j02PJ19m07L57K70l65
$$ -26 196 159 -43 83 4 69 210 27 77 -109 7 113 297 114 120 65 126 24 31 150 -257 100 370 5
6702EJ34k80J87r7J82k30J92p4m1J7J98k99L41l77L26J17j62j1j35k69K15K03
$$ 5 139 -141 46 -51 131 -99 93 19 -22 -5 193 -106 235 -142 184 301 139 128 -7 -276 -61 142
6724A42k67P1J49k91O7M15j44j16j41P2l2n3q8M17p4j41N2j19J68j81K87m04J70
$$ 142 -125 -54 95 -196 -129 286 142 26 -115 -43 -75 -128 -216 201 127 -14 38 -81 87 -94 193 -211 -41
6747d1j67L81j82J3R4o2j51J01k26J10K98m98K53j77J61L21k26J25m9J3J5L2m3
$$ -41 -208 173 -9 4 98 36 -115 -14 -240 -130 168 -330 -77 -254 -93 228 2 127 78 91 106 138 95
6770I5j02J41P6q5l8j79K56l03L55k75l7J85j18j0Q7k9j00J77j16q1k5J83n8M5
$$ 95 -7 134 210 125 87 -92 164 -139 216 -59 -96 89 -29 -39 48 19 -81 96 -20 -101 -126 57 -1 44
6794D4k03K99k03J3J79m41L16P9O5p5q8pK8K7n6J04j03j46K21j01j96J81k36K87
$$ 44 -159 140 -63 -50 129 -312 4 83 148 73 -15 -22 6 33 -23 81 -22 -168 53 -48 -244 -63 -299 -12
6818a2k76K12j27j1K04K13l67K15L55n19Q7J93q0k17j22L82m59L12j46K60j6K50
$$ -12 -288 -76 -203 -214 -10 203 -164 51 406 -113 -26 167 87 -130 -252 130 -329 -17 -163 97 81 331
6840C31k00n1m3NJ42j10k25J23n8K8j29J3J54L25m61J86k4k9O3lR2m59K54J86
$$ 331 131 80 37 42 184 74 -151 -28 -86 -58 -187 -174 -20 305 -156 30 6 -23 40 37 129 -330 -76 110
6864A10N5q2j37J33J33j25j11K76l28Q6j54J24O0O3N1k09J30k66M84j54L7k59
$$ 110 165 83 -54 79 212 87 -24 252 -76 10 -144 -20 40 103 154 -55 75 -191 293 139 176 -83
6886h3J38J2k03K9K08R9k04J54j02j02n6Q2j17J10j3P6J82l46j54K73k3J49j27
$$ -83 55 67 -136 -107 101 200 -4 150 48 -54 -110 -28 -145 -35 -48 28 210 -136 -290 -17 -40 109 -18
6909a8P8oj70K79l84K50mJ5J83k00j11K42r4J06o1J7j99RP3j01p4O6J58j54K35
$$ -18 60 54 -116 163 -221 29 25 40 223 23 -88 154 60 166 105 122 -77 -68 5 -96 -170 -104 54 -100 135
6934A35k26K0r4Q7J01K54j25k25J75k21L6K17r5J75l18K77j16Jk18R3M3J48l5
$$ 135 -91 -71 -165 -78 23 277 152 -73 102 -119 -83 134 39 214 -104 173 57 58 -160 -67 -24 124 89
6957H9j96l9P9J77P5k66M8Jj01J46j19J37j35J32k0Q2k1K4k87L73r6j95J2P1j48
$$ 89 -107 -146 -67 110 185 -81 -33 -32 -133 13 -106 31 -104 28 8 90 69 93 -194 179 83 -112 -100 -29 -177
6982a77M21j45j35J54J38l74L83m61J59j60J46L10k20L6k36J22J73J19K4j95m4
$$ -177 244 99 -36 118 256 -118 265 -196 -37 -197 -51 259 39 75 -161 -39 134 253 277 82 38
7003C8M9jm5j40Q1On5m4M5K20j82j43K54J47l26k3L2J63J33Qj14j47J52j29r7
$$ 38 87 86 41 -99 -18 -12 -67 -111 -66 154 -28 -171 83 230 -96 -119 -87 76 209 217 103 -44 108 -21 -118
7028a18K38Q2Q1m19J16N5k35L34j01k30n7K59m7o7J77k53J92P8n15N46J18m37
$$ -118 120 202 283 -136 -20 35 -200 134 33 -197 -254 5 -42 -109 68 -185 7 85 -430 116 234 -203
7050b03M70k66Q9j12K09j55P6q4R5j06o1j09L11j26k63J52J48mK02m37L27j57
$$ -203 267 1 90 -22 187 32 108 24 119 13 -48 -157 154 28 -235 -83 65 61 263 -174 153 -4
7072dP5l72J83O9k23J78J21j20l9k5L06k62K85q3n3J05k14jR8J30k46j47K02K33
$$ -4 71 -301 -118 -49 -272 -94 27 -93 -132 -157 149 -113 172 89 36 141 -73 -74 24 154 -92 -239 -37 196
7096A96k97K90j79k95K78j0k20J37J45J3j39J74m59K97J07K44k1p2j00N4Qj9p7
$$ 196 -101 189 10 -285 -7 -17 -237 -100 45 58 -81 93 -366 -69 38 282 261 189 89 143 151 132 55
7119E5j61Q6J9R4j22j6O2j56o1M59l76j8J2M3J76k11J99l29K54K0J24l68K06p2
$$ 55 -106 -20 -1 93 -29 -45 17 -139 -200 259 -117 -135 -123 -80 96 -115 84 -245 9 29 153 -215 -9 -81
7143h1JJ62n4j1J2j13Q4J42j85J64P8J01j15nj37J27j09j06J43j5j63J43K4k98
$$ -81 -80 82 28 17 29 -84 0 142 -43 121 199 300 185 180 43 170 61 -45 98 83 -80 63 87 -211
7167b11K65k09J36NJ40p3O9K3k41L16j90pJ07k7j80j06J94Rl39N09k58n3J68O0
$$ -211 54 -155 -19 -14 126 53 122 145 -96 220 30 23 130 103 -77 -183 11 20 -319 190 -68 -121 47 107
7191A07k06n1L66k74J91j10K21o7p7M5j37K26m50K54n4k0j8O1k72J87NJ27Q0j33
$$ 107 -99 -150 216 -58 133 23 244 177 100 145 8 234 -216 38 -16 -36 -54 7 -265 -78 -73 54 134 1
7215AJ97k98J27j53l4K59l0l01K52K0J74k62j61J19O3n1o8K23O4M7j23j37j10
$$ 1 198 -100 27 -126 -160 99 69 -232 20 40 214 -48 -209 -90 -27 -78 -146 77 141 188 65 -72 -182
7238a82L41q2L6j95J97k14o7L42j69j08N3M6j77O9K0j22L14R8l29J11k17K93j77
$$ -182 159 77 113 -82 115 -99 -166 176 7 -101 -48 -2 -179 -110 -90 -212 102 200 -129 -18 -235 58 -119
7261a19J02L47l95K29m32J22J19L0m7p8R1l06N73k03Q0L10k66J7l99J92rP3Q1
$$ -119 -17 330 -65 164 -268 -146 -27 3 -44 -122 -31 -337 236 33 113 423 157 174 -225 -33 -42 31 112
7284A12l02R4N1Q0K94k23q8n9K37m08L07J06p5j23R0j0l32K35J15k73K4K49j42
$$ 112 -190 -96 -45 35 329 106 18 -41 196 -212 95 201 126 3 93 83 -249 -14 101 -172 -148 101 -41
7307d1K92m31J42M9J08R1k49J22n9k1j24P2rJ24l6J8j65l09P4M79J0l16J33k4
$$ -41 251 -180 -38 11 119 210 -39 83 24 3 -121 -49 -58 66 30 48 -117 -426 -352 127 137 -179 -46 -70
7331g0PM3j05R1K30j46O6L5k28L51k86O8J32k86j56K5L13j81l4j24L37J45j83
$$ -70 -63 -20 -125 -34 196 50 116 151 -77 274 -12 56 188 -98 -254 -229 84 -97 -131 -255 82 227 44
7354D4N3m5j29j7J09J89j67k95K36j59K08j39J12J73j12K01k49j20K7R5L3J10
$$ 44 97 52 -77 -94 15 204 37 -258 -22 -181 27 -112 0 173 61 262 13 -107 -80 15 48 158
7376A58j29R7P6j83J31j49k05R2l8R1j88J15M07l96M52j20k17J62j11l7O5k15
$$ 158 29 126 202 19 150 1 -204 -112 -150 -59 -247 -132 275 -121 331 211 -6 156 45 8 73 -142
7398a42n2K10p8L0K15j04L4K43l17n1j10J03J68M3N3j94k00j76M44j53R0O5k24
$$ -142 -194 16 -62 -32 183 79 113 356 39 -12 -122 -19 149 192 245 51 -149 -325 119 -34 56 121 -103
7421a03J51j61J40j41L8J20j54K36N2k98q1M76k15k25O8L22j44K1j91j89K44K2
$$ -103 48 -113 27 -114 -76 44 -110 126 178 -120 -201 275 60 -165 -97 225 81 102 -89 -278 -34 -12
7443a2m2rK11l36R2J05L7%q4J12n9j49K33m0K76k43l68J39J8K51k20J49k48Q8
$$ -12 -54 -63 148 -188 -96 9 46 46 -38 74 15 -134 99 59 335 92 -276 -137 -119 132 -88 61 -187 -99
7467i9m7J16Kn3K1K11O8j60k62M6P5K30k02p6K08j10j00K59l01L49k23R4J58j96
$$ -99 -146 -30 -28 -81 -60 151 219 59 -203 -157 -82 148 -54 -130 78 -32 -132 127 -174 175 -48 46 204 8
7491HK49k48Q1K1j83oR8J95k68K30q5L4k58J96k78p0L89L6l1j42M5k66J17J19
$$ 8 257 9 90 111 -72 -78 20 215 -53 177 92 126 -132 64 -214 -284 105 141 110 -32 13 -253 -136 -17
7515a7K06J54k11l10J08K38q3l23L26l1j78M19l35L17l85J05l5j60L30k95L41
$$ -17 189 343 132 -178 -70 168 85 -238 88 57 -121 298 -37 280 -105 0 -35 -195 135 -160 181
7536A81r8R5k27o1K22m1L12n63K2J67o2p3m3l1O3QN6K21k15J39m08K80M6K31o6
$$ 181 83 178 -49 -110 112 71 383 -180 -158 9 -53 -126 -169 -200 -137 -129 -73 148 -67 72 -336 -56 -10 221 155
7561A55k51m5R7J14k00K9n7n3K27L05l86L31o11N75l74J23M7k18K1L48k58m1M8
$$ 155 -96 -141 -44 70 -130 -101 -158 -211 16 321 -65 266 -345 230 -144 -21 26 -192 -171 177 -81 -122 -74
7584g4J97j17j40J1K22k1oj27J20l06K79j32R7l71L25p4J45k05Rn4J12J71J26
$$ -74 123 6 -134 -123 99 78 72 -55 65 -241 38 -94 3 -368 -43 -117 28 -177 -168 -222 -110 61 187
7607A87l36K00j17R6j30L36Kn08Q7N8L78k64m4K81j44j13L1k8J43j85K45r0n5
$$ 187 -149 51 -66 30 -100 236 238 -270 -183 -125 253 -11 -55 226 82 -31 0 -28 115 -70 175 85 30
7630C0J06j12k4J11k80K74k05K36l45L06j87j81L00o0J23j88J0qL53j20q7m2j6
$$ 30 136 24 0 111 -169 105 -100 136 -209 97 -90 -271 29 -31 92 -96 -86 -94 259 139 52 10 -6
7653fm7K79k00L81n49J74p4J3O8oo5J2O1J9k36k5L0K21k63K55j06K2j43K02j38
$$ -6 -53 226 26 407 -142 32 -42 -29 39 33 -32 -20 41 60 -176 -201 -171 50 -213 42 -64 -42 -185 17 -121
7678a21K50O7j65K2j42J62j18J21k74OL4%n1L98k01P6j3j06K49j83N2R3J49k19
$$ -121 129 196 31 53 -89 73 -45 76 -198 -192 -158 -158 -209 189 -12 64 51 -55 194 11 63 156 305 86
7702H6M1l6o1J98j50n1r3K0O2J68j56J46K19m18Q6J09m38L33M5L9j63J13j56l
$$ 86 127 91 30 228 78 27 -66 -46 16 184 28 174 393 -25 61 170 -268 65 110 149 -14 99 -57 -60
7726f0l5L03k73l8J19j59j3L36k79J49m6k64J89r1qK37l3m38N51j70j27L65l69
$$ -60 -95 208 -65 -103 16 -143 -156 180 -99 50 4 -260 -71 -162 -170 67 34 -404 147 -23 -150 215 -154
7749a54J48n8n0l4O5J27N1k79L95l03K54r1k46j01J30K76j7K3j53P6k54K14l82
$$ -154 -6 -64 -114 -148 -83 44 95 -184 211 -92 162 71 -175 -276 -146 130 113 136 -17 59 -195 19 -363
7772c63N46j75j22j86K9L33k36K58r2K86n5m33J08J3M9j0K98j77k55K18k05K56
$$ -363 183 8 -114 -300 -271 62 -174 84 -8 278 223 -210 -102 -89 -40 -50 248 71 -184 34 -171 85
7794H5k77oL15j22k40K38l3l7J9K3M43l00r8J67n03K27o0K33mk32j20K59R1k62
$$ 85 -192 -198 117 -5 -245 -7 -40 -77 -58 -35 408 108 10 177 -326 -99 -159 74 70 -162 -282 -23 68 -194
7818a94J37j17K17J02k72J8J05J65k7k11j03K53k73J66k2J14j58L4K91l45p9J79
$$ -194 -57 -174 43 145 -127 -109 -4 161 134 -77 -180 73 -200 -34 -56 58 -100 -66 225 -120 -199 -20
7840b0n7J26j78O4J04q2r5L48j89L32l34j6J70l97L38j60k82M93j39k00J9NQ4
$$ -20 -77 49 -129 -65 39 -43 -138 210 21 353 19 3 173 -224 114 -46 -328 165 26 -174 -155 -150 -66
7863f6K89l04P2J01R7j16n8K2J29j32j1l6oJ09O0k40J02j77J60J99l35j17J26
$$ -66 223 -81 -9 92 189 73 15 37 166 34 23 -13 -19 90 150 -90 12 -165 -5 194 -141 -258 -132
7886a32K11k1kj52j14N60j33j32K98k85l32K97k15M23k91QM71k76o4k33o9J2L14
$$ -132 79 58 56 -96 -210 350 217 85 383 98 -234 63 -152 271 -20 -12 459 183 119 -114 -183 -171 143
7909A43lj16j00K87l23M3k39O00l57j85L02K4j48J56k29R0K05j46n2n9l7J82l3
$$ 143 140 24 -76 211 -112 -69 -308 292 -65 -250 52 76 -72 84 -145 -55 150 4 -48 -107 -144 38 5
7932Ek68L99O6k62j5J61k3Ok18J2J10J05J84n26L07J07j98J76j68k64M31k89P8
$$ 5 -263 136 202 -60 -75 86 63 69 -149 -137 -27 78 262 -264 43 150 -48 128 -40 -304 127 -162 -84
7955h4L01k70J75p7r0R7J22k21q8M52m49rK93J10m43J68j47O9K82k36K54m61K09
$$ -84 217 -53 122 45 -45 52 174 -47 -135 317 -132 -141 152 262 -181 -13 -160 -91 191 -45 209 -252 -43
7978d3J31k12Q7P9q6j35J04M52k21l31K67j04j71R5m8L7J29r4j62K46j4J08kj05
$$ -43 88 -124 -37 42 -44 -179 -75 377 156 -175 92 -12 -183 -88 -136 -99 30 -64 -226 20 6 114 112 7
8002GJ4J31l12O2k5O4l6K38k42l1L00j15j00K5P7j64J51J87O0k96K65n64M2M27
$$ 7 21 152 -160 -98 -123 -59 -95 143 -99 -130 170 55 -45 -20 57 -107 44 231 291 -5 260 -304 -262 165
8026A65j44j36n9K02o4J36j38J13o6o8J49j95L28j47j16K56J11l04J08J37k69
$$ 165 21 -115 -174 28 -36 100 -38 75 9 -59 90 -105 223 76 -40 216 327 23 131 268 -1
8047aL0o1j06J87j5O3Q7j8m7r9Q1j60L0M6l6L4l6j2j0J0%n1K37k89J82l64K43
$$ -1 29 -32 -138 49 34 97 184 166 119 20 101 -59 -29 17 -19 15 -21 -33 -43 -33 -33 -84 153 -136 46 -318 -75
8074g5J74N0j28j96J61R7j79J55O2kJ07k39M8j16J5K41l08q9J68J7J73q7O8j06
$$ -75 99 149 21 -175 -14 83 -96 59 121 119 226 -13 35 -81 -66 175 -133 -222 -54 -37 136 49 117 11
8098A1Q2j07J00l7L7n1l95N72k61l2q8K07k6m4j00O7l7J7K35k21J54OO8k69J35
$$ 11 93 -14 86 49 86 35 -360 212 -49 -81 -169 38 12 -32 -132 -65 -102 -85 150 -71 83 89 157 -112 23
8123B3J36k35j29K55N9j16j59L36j33q5lJ20l43L15q9l4l5mL7K07n4k32L74q9
$$ 23 159 -76 -205 50 109 -7 -166 170 37 -48 -51 69 -274 41 -48 -82 -117 -121 -84 123 69 -163 211 122
8147A22M2m80j9K20j47J7K48J82n42L54J61k58N6k09K34K55j16k36K69k01kJ77
$$ 122 164 -316 -335 -115 -262 -245 3 185 -357 -3 158 -100 -44 -253 -19 236 120 -116 153 -48 -50 127
8169A27j53k26J25k3M30n61L98q3k66J34J48J35m64J65j76K26K31j43qK60m80
$$ 127 -26 -252 -127 -150 280 -281 117 34 -232 -98 50 185 -279 -114 -290 -64 167 24 16 276 -204
8190b04K55
$$ -204 51
8191E1
$$ Imaginary data points
##PAGE= N=2
##DATA TABLE= (X++(I..I)), XYDATA
0@%%%%%%%%%%Qj6J6k4L2m0M8n6P2q8J04j28J52j76K08k45K86l30L83m41N06n80
$$ 0 0 0 0 0 0 0 0 0 0 0 8 -8 8 -16 16 -24 24 -32 40 -48 56 -72 80 -96 112 -133 153 -177 206 -235 271 -309
32c09O59p46Q42r50J071j201J342j499J672j859K063k286K530k797L088l406L753
$$ -309 350 -396 446 -504 567 -634 708 -791 881 -978 1085 -1201 1329 -1468 1620 -1786 1967
49A967m134M556n019N531o101O736p449Q256r178J0244j1493J2977j4775J7005
$$ 1967 -2167 2389 -2630 2901 -3200 3536 -3913 4343 -4835 5409 -6084 6893 -7882 9123
63I123j9860K3666k9017L7146n1097Q1397k62517K00453L16575n58127J13464
$$ 9123 -10737 12929 -16088 21058 -30039 51358 -211159 -10706 305869 -252258 -138794
74a38794L32809k19287j83589L69125l03l66388J32233L01878k53577r8499K11146
$$ -138794 194015 -25272 -208861 160264 159961 -206427 -74194 227684 -25893 -124392 86754
85H6754o2935j24352J86098K5792k15475L5781K10094q6680j52398R2830R8416
$$ 86754 23819 -100533 85565 111357 -104118 -68337 141757 55077 -97321 -4491 93925
96I3925j42450k0161K22849j00558k48966K52493J81699l06585p8524K78921m4080
$$ 93925 -48525 -68686 154163 53605 -195361 57132 238831 -67754 -146278 132643 88563
107H8563k56967J68188J60222l32875P375L67717j89600k35448K75992N0058k20830
$$ 88563 -168404 -216 160006 -172869 -165494 202223 12623 -222825 53167 103225 -117605
118a17605J23759J19857k30066N708K54316j25179j86712J95436N7733j96359
$$ -117605 6154 126011 -104055 -98347 155969 30790 -155922 39514 97247 -99112
128i9112R1812J50296k09762n5169K45943n2419j90860Q7608R2380o7480l9616
$$ -99112 -7300 142996 -66766 -121935 124008 71589 -119271 -31663 60717 -6763 -46379
139d6379O8992K1435r8509M0440J21782q9812q8250Q7125M0545o8637k3432N2525
$$ -46379 22613 44048 -54461 -14021 107761 17949 -70301 16824 57369 -11268 -34700 17825
151A7825l1938m8336J06172M104j39504P6331J09416j26785j0901J30365j03609
$$ 17825 -14113 -62449 43723 47827 -91677 -15346 94070 -32715 -43616 86749 -16860
162a6860p7108J76498r745j79669Q3339J31347j18066n5385J39618l8021j34298
$$ -16860 -93968 82530 72785 -106884 -23545 107802 -10264 -65649 73969 35948 -98350
173i8350J31913N8818j81948L6849J21121r3514k1935P9976l6627m2294O3397
$$ -98350 33563 92381 -89567 -52718 68403 -25111 -47046 32930 -3697 -45991 17406
184A7406L1712p5033j4180P6031k4877n2365M9491L805n3881L0817M6130l3538
$$ 17406 49118 -25915 -40095 35936 11059 -41306 8185 11990 -41891 -11074 35056 1518
196A518l4758L1511M2578l3795m1859N8079O407p6645N5824N0248r7977R106R0726
$$ 1518 -33240 -1729 40849 7054 -34805 23274 29681 -46964 8860 59108 -38869 -29763 60963
209F0963m3907n1901N6755K0520p1457J4853P5214p8430m6494J14153k8119r1424
$$ 60963 17056 -34845 21910 42430 -29027 -14174 61040 -17390 -63884 50269 22150 -69274
221f9274Q6007K4944r1061L7598O2591o7967k9044P1170l641o5908L0253M8357
$$ -69274 16733 41677 -49384 -11786 50805 -17162 -46206 24964 21323 -44585 -14332 34025
233C4025n6642j1086P0929l0875m5387N9570M912m6387J8851J7830j4318j4491
$$ 34025 -22617 -33703 37226 6351 -39036 20534 25446 -20941 -2090 15740 1422 -13069
245a3069J0649K4011l1812j0076N0543k3240l3193M3786K932l7166J0487K5976
$$ -13069 -2420 21591 -10221 -20297 30246 7006 -26187 17599 20531 -16635 -6148 19828
257A9828j5729k7811L0017J9552n1434J1888N3931n0420k3139O6010k2394m7785
$$ 19828 4099 -23712 6305 25857 -25577 -13689 40242 -10178 -33317 32693 10299 -37486
269c7486M8425R594m8783J5184L7755k5740k9687M1718J7058n5434K1394M4704
$$ -37486 10939 20533 -28250 -13066 24689 -1051 -30738 10980 28038 -27396 -6002 38702
281C8702n6435k393N5717l4589k6859L7299L000k5508K124K1949j0518k4592L0031
$$ 38702 -17733 -20126 35591 1002 -25857 11442 14442 -11066 -8942 13007 2489 -22103 7928
294G928J1521m3473J4624L2600l1279o113K7277j0729j2655J2144J1459j2425
$$ 7928 19449 -24024 -9400 23200 -8079 -14192 13085 2356 -10299 1845 13304 879
306H79j7783K5596J1825l9724J5266K7501l8015K835L3344k3981j6208K3040Q888
$$ 879 -16904 8692 20517 -19207 -3941 23560 -14455 -11620 21724 -2257 -18465 4575 13463
319A3463k0883p168L0271q900k9856L7789O132m7538K6578K7052m0652J26K8779
$$ 13463 -7420 -14588 15683 6783 -23073 14716 20848 -26690 -112 26940 -13712 -13586 15193
332A5193j6082j6115J8749R972k4207l654L3653j3205k8838L4373L684l4441K3104
$$ 15193 -889 -17004 1745 11717 -12490 -16144 17509 4304 -24534 9839 13523 -20918 2186
345B186J4804k7747N262J7403m626j1226L160J7436j3711j4716K7109q033k6435
$$ 2186 16990 -10757 -5495 11908 7282 -3944 -784 16652 2941 -11775 15334 7301 -19134
358a9134K4489M558k4240Q557J2812o534q696P313J4296j8587o427K9297j6647
$$ -19134 5355 9913 -14327 -5770 7042 508 -8188 -875 13421 -5166 -11593 17704 1057
371A057k2781L3635k469l0254K0987J2325k1226J086J5848l686j7694J0826J8052
$$ 1057 -21724 11911 9442 -20812 175 12500 -8726 -7640 8208 4522 -13172 -2346 15706
384A5706k7682m048L3811j8854j5502L1863p743j7562K0032M754j4014m163R133
$$ 15706 -11976 -16024 17787 -1067 -16569 15294 7551 -10011 10021 14775 761 -3402 5731
397E731L953j8074J815J5424j9372j311K3249j4283j1427J7878J872p923k415
$$ 5731 9684 -8390 -6575 8849 -10523 -11834 11415 -2868 -14295 3583 5455 -2468 -4883
410d883M658L818j3152P507J5861k5118l69L1486j6879j4142K1650m821j2566
$$ -4883 -225 3593 -9559 -2052 13809 -11309 -11678 19808 2929 -11213 10437 5616 -6950
423f950R893N469j2367j0124K0222O880k5504J2308J7912k3128Q794J9483k6174
$$ -6950 2943 8412 -3955 -14079 6143 13023 -12481 -173 17739 -5389 3405 22888 -3286
436c286m011J9264p174j0515K15K309o11m439R341n39j7326J3150J3149j7409
$$ -3286 -7297 11967 4793 -5722 -5507 -3198 -3809 -8248 1093 554 -16772 -3622 9527 -7882
450g882j500O321k870L731j787J127K179r355J5350J1219k4607L848J8185j3776
$$ -7882 -9382 -3061 -5931 -2200 -3987 -2860 -681 -10036 5314 16533 -8074 -4226 13959 183
464A83j074Q866j1667l275J2100N983j0843n728J8271j21j2646J5860n917k1486
$$ 183 -891 7975 -3692 -6967 5133 11116 273 -5455 12816 12695 49 15909 9992 -11494
478a1494K2236N828k8158N925R819r407L753L173n942l258L844R381q493j1649
$$ -11494 10742 16570 -11588 -5663 4156 -5251 -1498 1675 -4267 -7525 -3681 5700 -2793 -14442
492a4442R633L02k046O914j0929J305J3524o344K963L307j3646R400R983j5023
$$ -14442 -4809 -4507 -6553 361 -10568 -9263 4261 -2083 880 4187 -9459 -59 9924 -5099
506e099J031L242n927R833M156q810q86R080P485r028l945J0291j0815m301K0248
$$ -5099 -4068 -826 -6753 3080 7236 -1574 -2460 6620 14105 5077 1132 11423 608 -3693 16555
521A6555j5973j7200K4400q51j4066J1619k946q655J1493J997r458m144N565L275
$$ 16555 582 -16618 7782 6931 -7135 4484 1538 -7117 4376 6373 -3085 -7229 -1664 1611
535A611o566M714J481j2300J3644J0689k0174L413R939j2079N741L617j4881N879
$$ 1611 -4955 -241 1240 -11060 2584 13273 -6901 -3488 6451 -5628 113 3730 -11151 -5272
549e272O742n568M874l47m467O459N547k372q325J488Q616j0089j756J0211j4838
$$ -5272 1470 -4098 776 429 -4038 2421 7968 5596 -2729 -1241 7375 -2714 -4470 5741 -9097
564i097L24J9310j4117o005J6500r352k750J3714r407q113J0497L584o804r76
$$ -9097 -8773 10537 -3580 -9585 6915 -2437 -5187 8527 -880 -8993 1504 5088 -1716 -2692
578b692Q626k589o386J3931k432j6171J3979L628j7334R711J274j3893J2293L753
$$ -2692 5934 3345 -3041 10890 8458 -7713 6266 9894 -7440 2271 3545 -10348 1945 5698
592E698j1919P026M130m704K402J765k805m897L745L449j0734J529Q076j1929
$$ 5698 -6221 805 4935 231 2633 4398 1593 -3304 441 3890 -6844 -5315 2761 -9168
606i168M134J0614j5701L603J2686j4375J285J1043j1464O14J0223m555k874O174
$$ -9168 -5034 5580 -10121 -6518 6168 -8207 -6922 4121 -7343 -6729 3494 -1061 -3935 2239
620B239L419m666r3R019p089o391J3633p735j0719J6524n405j2548J6537j482
$$ 2239 5658 992 899 9918 2829 -3562 10071 2336 -8383 8141 2736 -9812 6725 5243
634E243j0855J1050Q14p764M752K282m577k459L541L39o937N056L204j1817P168
$$ 5243 -5612 5438 6252 -1512 3240 5522 945 -1514 2027 2366 -4571 485 3689 -8128 -960
649i60P025j4742N338O878j3227N934O818j2141M701O592n717K542L936l076q08
$$ -960 6065 -8677 -3339 3539 -9688 -3754 3064 -9077 -4376 2216 -3501 -959 2977 -99 -907
664i07M406K626q717m67J0420r416l269J3012j0856m780J7110p862p653J1930
$$ -907 3499 6125 -2592 -3059 7361 -2055 -5324 7688 -3168 -7948 9162 1300 -6353 5577
678E577m307m197Q181k655n963K646M832j697n424N143J293p655Q409J325j3373
$$ 5577 1270 -2927 5254 2599 -3364 -718 4114 2417 -3007 2136 3429 -4226 4183 5508 -7865
693g865P589M860j0437O218L92r058R487K648p992M259J338k541L123J167k617
$$ -7865 -276 4584 -5853 365 757 -8301 1186 3834 -4158 101 1439 -1102 2021 3188 571
708E71m251M072N881q968r44Q681r471K365J0839j3879j250J2635p841j815O494
$$ 571 -3680 392 6273 -2695 -3639 5042 -4429 -2064 8775 -5104 -6354 6281 -1560 -3375 3119
723C119o110j067O587O14m274k165O305R26n977N373j545p610J0367M81j0882
$$ 3119 -2991 -4058 2529 3143 -1131 -3296 3009 3935 -2042 3331 1786 -5824 4543 5024 -5858
738e858O570J67n285Q499k977o761O520N48j702J259k392K81J200J580J034o342
$$ -5858 712 879 -4406 4093 1116 -5645 875 1423 -279 980 -1412 -1131 69 1649 2683 -3659
754c659K556O025p316K415M208j0649N473P777j1384J281N855n725K644L536m578
$$ -3659 -1103 4922 -2394 21 4229 -6420 -947 6830 -4554 -3273 2582 -3143 -499 3037 -1541
769a541n22K330L812k795m093N894j158m474Q440l975p841R843j099o345N697
$$ -1541 -2063 267 4079 1284 -2809 3085 1927 -2547 5893 1918 -5923 3920 2821 -3524 2173
784B173l450k522N861k504j877J346j096L007m67j827J660k286K103L624o644
$$ 2173 -1277 -3799 2062 -442 -2319 -973 -2069 938 471 -1356 304 -1982 121 3745 -2899
799b899K160L590o343N676J302q704O004K825o759L875P41m310L454J197j099
$$ -2899 -739 2851 -3492 2184 3486 -5218 786 3611 -3148 727 1468 -2842 612 1809 710
814G10j008p14N273k961k922O483m663l457R082n606m744P643l463k819M906l590
$$ 710 -298 -1012 4261 1300 -1622 4861 198 -3259 5823 217 -4527 3116 -347 -3166 1740 -1850
830a850o04K213j040J096j786j82L467l361R72L200n400L444L120n440L674J394
$$ -1850 -2454 -241 -1281 -185 -1971 -2153 1314 -2047 -1075 2125 -3275 169 3289 -2151 1523 2917
846B917n266N342j021m934N314j262l258L882j642o24J529r09J715j977o18N039
$$ 2917 -2349 2993 1972 -2962 2352 1090 -2168 1714 72 -552 977 68 1783 -194 -812 4227
862D227n333j077O593o139r52O770o507n82N951m625j72J801j788O31p73N32J145
$$ 4227 -1106 -2183 4410 -1729 -2681 4089 -2418 -3000 2951 -1674 -1846 -45 -1833 -1202 -1975 -1443 -298
879b98l773L433K737n263L698K199n225N132J370n982M709k01l409M200k937j300
$$ -298 -4071 -638 2099 -3164 534 2733 -2492 2640 4010 -1972 2737 2536 -873 3327 390 -910
895i10L696k205l4R20k629K486p48j093K463m054O66N045n974J198L987o020K648
$$ -910 2786 581 547 1467 -1162 1324 576 -517 1946 -2108 -1442 3603 -2371 -1173 2814 -3206 -558
912e58M662o892J223K678l190J595m38j487P46p53K599l28m106N715K91m632N815
$$ -558 4104 -2788 -1565 1113 -2077 -482 -920 -2407 -1661 -2414 185 -143 -4249 1466 1757 -2875 2940
929B940j509m415P076j411m554M194j771m32K959k831k70N37j314K513k112k026
$$ 2940 1431 -2984 4092 2681 -1873 2321 550 118 3077 246 -24 513 -801 1712 -400 -2426
945b426L022k349J344K972n560K663L363m632K765J264n616M278J852m757J986
$$ -2426 596 -1753 -409 2563 -2997 -334 3029 -1603 1162 2426 -3190 1088 2940 -1817 169
960A69o18j376K457o78m19m88o09M532k880k698N554l490j678O679m538l241O634
$$ 169 -449 -1825 632 -46 -465 -953 -1562 2970 90 -2608 2946 -544 -2222 4457 -81 -3322 3312
977C312k257k165L456l417j29K082j334L42k365P67K339l155J326J973m849M607
$$ 3312 1055 -1110 2346 -1071 -1200 882 -452 -110 -2475 -1708 631 -2524 -1198 775 -4074 533
993E33K119n891L715J668m390M502o06m157M443l30j920K338j717l34J006j9J106
$$ 533 2652 -3239 476 2144 -2246 2256 1650 -2507 1936 1606 -314 2024 307 -27 979 960 2066
1010B066k764m25M614l955l45M781n730P68N675n534m54L673l675N64K410l172
$$ 2066 -698 -1123 3491 -464 -809 3972 -1758 -990 4685 -849 -1303 2370 -1305 -741 1669 -1503
1026a503m38J227K63k12k422K352Q9l628N086m90n210N823J44m394N196j287l395
$$ -1503 -1941 -714 -451 -663 -3085 -733 -644 -4272 814 324 -4886 937 1081 -3313 1883 596 -2799
1043b799N317j285k548K966q61m28R92r52J089k098P16K963m256R35L510m886
$$ -2799 2518 1233 -1315 1651 790 362 1354 402 1491 -607 109 3072 -1184 -249 3261 -1625
1059a625K051L346o036K697K915n535K724K032m238J559Q64j489l1j87J401j664
$$ -1625 426 3772 -2264 433 3348 -2187 537 2569 -1669 -110 754 -735 -766 -953 448 -1216
1075a216j363L841k609k344N871l132k797O087k718k691N598k494k263M257j556
$$ -1216 -2579 1262 -1347 -3691 2180 -952 -3749 2338 -380 -3071 2527 33 -2230 2027 471
1090D71j026J305k86L35j676Q99J630l668J930K126m939L166J878n191L719J438
$$ 471 -555 750 464 799 -877 22 1652 -2016 -86 2040 -2899 267 2145 -3046 673 2111
1106B111m715M192K01l688K837L73k012J256J45o14o06K00J782k735k94M223m300
$$ 2111 -2604 1588 1789 -1899 938 1311 -701 555 700 86 -520 -320 1462 -1273 -1567 2656 -1644
1123a644n43N109n092m5N875m672q87M637l347m98K661j165q47K06J171j10k770
$$ -1644 -2187 2922 -2170 -2215 3660 -1012 -1899 2738 -609 -1107 1554 389 -458 -252 919 809 -1961
1140a961K347J69l531L912J75m875M731R6l976L873j25k905L583m69j780J920
$$ -1961 386 555 -2976 936 1111 -3764 967 1063 -2913 960 835 -2070 1513 1044 -736 1184
1156A184j073l4N50m60Q40j673M86K707m090P78L076m826J960L555n664J750L754
$$ 1184 111 77 627 167 1007 -666 -180 2527 -1563 -785 2291 -2535 -575 2980 -2684 -934 2820
1173B820m239J199K127k887P04J231k38r20o81K352j373k152L806j892l241N600
$$ 2820 -1419 -220 1907 -980 -276 955 717 -203 -884 1468 95 -2057 1749 -143 -3384 2216
1189B216j621l633M581j289k524L921j322j779K494r50J57N71r50Q93r26L06J556
$$ 2216 595 -3038 1543 254 -2270 1651 329 -1450 1044 94 251 822 -128 765 -161 145 1701
1206A701l411J744J723l765K342J456m726L027J749m388K761J119k782K114L16
$$ 1701 -1710 34 1757 -2008 334 1790 -2936 91 1840 -2548 213 1332 -1450 664 980
1221I80j508N78J09J094j222q95K780k618p70L741l004j987N228l183j404L887
$$ 980 -528 50 159 1253 31 -864 1916 -702 -1472 2269 -735 -2722 2506 -677 -2081 1806
1237A806k208o36K920j877k72Q38m70O82j239N78R82k366J766R15l382K379N24
$$ 1806 -402 -1038 1882 5 -267 571 101 783 -456 122 1104 -1262 504 1419 -1963 416 940
1254I40l472K696L25l222L177J54k631K572k83j126J560p69J87KQ6J327j845M
$$ 940 -2532 164 489 -2733 444 598 -2033 539 256 -870 690 -79 108 110 196 1523 -322 -318
1272c18K285l080M01L127l614K5L275l322O5K647k522N80J210j000K20R0N96M05
$$ -318 1967 -1113 -712 2415 -1199 -1174 2101 -1221 -1156 1491 -1031 -451 759 -241 -21 69 665 1070
1290A070k135J940K98k933K534K44l285L017l22k683L020p50j542K417j131m60
$$ 1070 -1065 875 1173 -1760 774 1018 -2267 750 428 -2255 765 15 -1527 890 -241 -701
1306g01J538j039O56P1q42J027o80k96K251k609Q70J941l316J419J462l639J451
$$ -701 837 -202 454 525 -317 710 30 -266 1985 -624 246 2187 -1129 290 1752 -1887 -436
1323d36J699k857J198P19j263J012J75j72K57q88J458k33k005K424r57j783L205
$$ -436 1263 -1594 -396 323 -940 72 247 75 332 -556 902 669 -1336 1088 131 -1652 1553
1340A553j484j924L002j250j171K704j957l87J340o89M49k95m87J325o76NJ342
$$ 1553 69 -1855 1147 -103 -1274 1430 -527 -914 426 -263 186 -109 -596 729 53 58 1400
1357A400j981Q10J918l238J435R19l003K055M47k799J700M15j118J326l66o42
$$ 1400 -581 229 2147 -1091 344 1263 -1740 315 762 -2037 -337 78 -1040 286 -80 -722
1373g22Q28o60J179l74j369J989o55j086K450j973o39L261k232o99J752j750N6
$$ -722 106 -554 625 251 -1118 871 216 -870 1580 -393 -1032 2229 -3 -702 1050 -700 -644
1390f44J391j438J71J13k2R06o93J29J373j844J639N35k826J610O84k124J447
$$ -644 747 -691 -520 -407 -429 477 -216 -87 1286 -558 1081 1616 -1210 400 1084 -1040 407
1407D07k3k013K184k95j179J117r20L4Q45r37O18m42l44K102j531k38K038j389
$$ 407 384 -1629 555 260 -919 198 -722 -688 157 -780 -162 -604 -948 1154 -377 -615 1423 34
1425C4N2K300k860r7K108k254M47O97j709Q09O79l92J77m62P89P13j428J330j77
$$ 34 86 2386 -474 -571 1537 -717 -270 427 -1282 -473 206 -186 -9 -471 318 1031 -397 933 756
1444G56k313K456kk100J839k87j389K111j026r63J368p94l42M77p43K78k8rJ582
$$ 756 -1557 899 897 -1203 636 349 -1040 1071 45 -918 450 -344 -686 -209 -952 -674 -702 -711 871
1463H71j199J57J940j944N41J373k931J204J291k315P82P88j518R91M69j023O84
$$ 871 -328 -171 1769 -175 366 1739 -1192 12 1303 -1012 -230 558 -960 31 500 -523 161
1480A61m50O35K22j220J089j65j381K162p47j457K663j002j279K169j569n98J457
$$ 161 -289 346 568 -652 437 272 -1109 1053 306 -1151 1512 510 -769 1400 -169 -767 690
1497F90j028m18N16m38L74O0k08R21j009P75J154j935R72J080k634J116R77k222
$$ 690 -338 -756 -240 -678 -304 -244 -452 469 -540 235 1389 -546 426 1506 -1128 -12 965 -1257
1515a257J388N76j761J376K99j184R11r4l55J38o43J057q58l51J660j361l85K465
$$ -1257 131 707 -1054 322 621 -563 348 254 -101 37 -606 451 -407 -758 902 -459 -844 1621
1533A621j553l78J843j895l87J689j719K0J424j411M24J41K02L81q63M69J129
$$ 1621 68 -310 1533 -362 -749 940 -779 -759 665 -746 -322 -181 21 402 -461 8 1137
1550A137k131J444K7j875J951r4j687J747J12j809K085p8j108Q88n29n67K71j83
$$ 1137 -994 450 477 -1398 553 459 -1228 519 631 -1178 907 829 -279 609 80 -487 -216 -399
1568c99M51o75J63J321j392K62J604j986P23J240k191K39J633j828L19J190j394
$$ -399 52 -623 -460 861 -531 -269 1335 -651 72 1312 -879 -640 993 -835 -516 674 -720
1585g20P46L68l45K12n77N54p3q72Q05m58r02K070n27j612K555r21q48J794r79
$$ -720 26 394 49 261 -316 238 165 -707 98 -360 -1262 808 281 -1331 1224 303 -545 1249 270
1604B70q35J236o49m98N88l07J67k33K82K96j128J066O77j866Q89R45k011J104
$$ 270 -565 671 22 -476 112 -195 -28 -261 21 317 -811 255 932 -934 -45 900 -1111 -7
1622gR75k044J182Q14j406J121p0p14N25l48J88k99o23J027m87o93J698j294m78
$$ -7 968 -1076 106 920 -486 635 565 -149 376 28 216 -83 -706 321 -166 -859 839 -455 -933
1641i33K133j174o40J855j637k31J657j146m51R44n96L4L24l92O96j106R36R0
$$ -933 1200 26 -614 1241 -396 -627 1030 -116 -567 377 -219 -185 139 -253 443 -663 273 363
1659C63j520J071O27j776J748o2j482J664J37j383Q59L44j157Q95l13n6n4k26
$$ 363 -1157 -86 541 -1235 513 451 -1031 633 770 -613 246 590 -567 328 15 -41 -95 -321
1677c21Q70p43k73J069j046k0J477j519j98J776j361k3J329j612L01P99o61O9
$$ -321 549 -194 -467 602 -444 -464 1013 -506 -704 1072 -289 -312 1017 -595 -294 505 -156 -87
1695h7K93m1Q7l42M4L32j184J574m80j181J506j01j948K181n74j013J348l01n93
$$ -87 206 165 252 -90 -46 286 -898 676 196 -985 521 420 -1528 653 79 -934 414 113 -480
1714d80O62N9k07j37l38M73o3j3N73q45L28R37j779P11J260j917N42R23j523O36
$$ -480 182 241 34 -103 -441 32 -31 -44 529 -316 12 949 -830 -119 1141 -776 -234 689 -834 -198
1734a98N98r78N82O5l25N21n24O49l65o20J409o32q45J365m91j178J580n98q11
$$ -198 400 -578 4 69 -256 265 -259 390 25 -595 814 182 -663 702 211 -967 613 15 -796
1753g96J510o28q71J303q33K30K72m81O49m43mO59q16M60P11j613N60P86j678
$$ -796 714 86 -785 518 -315 -85 187 -294 355 -88 -92 567 -249 211 922 -691 -131 655 -1023
1772a023J159L15j505R23K60q59P76l07MN91j19Q4J68q34J055m54r14J302r88
$$ -1023 136 451 -1054 -131 129 -730 46 -261 -257 334 215 299 467 -367 688 234 -680 622 -366
1791c66k87J840j279n71J424q85p0N50p70P6O30m14J73l01J30L99n00P25k6j021
$$ -366 -653 1187 -92 -663 761 -124 -194 356 -414 -338 292 -122 51 -250 -120 279 -221 504 478 -543
1811e43J007O8j499J039J0j336J471K6r33R31l96j57R65l74l41o3J55N05n61n05
$$ -543 464 532 -967 72 82 -1254 217 243 -690 241 -155 -312 653 279 -62 -125 30 535 -26 -531
1831e31J183q20o8J477j642P5J318j314K78M37o90Q9L32o82L69j20M28M50q09
$$ -531 652 -168 -236 1241 -401 -326 992 -322 -44 393 -297 -208 124 -558 -189 -309 119 569 -240
1850b40Q26q5q10P26k23r69Q71l33o98J189l47m26R69n57r1O12o54M53L5l12L14
$$ -240 586 501 -309 417 194 -775 96 -237 -935 254 -93 -519 450 -107 -198 414 -240 213 248 -64 250
1871B50o42J62P56o70K79O92j069K26J172j768P08K99j093Q57J85j047O92l1n
$$ 250 -392 -230 526 -144 135 827 -242 -16 1156 -612 96 395 -698 159 344 -703 -11 -42 -47
1890d7L51n13L90Q6m98N75m76l61J028o66p76J538q46r5R23m50k62L72n94J74
$$ -47 304 -209 181 267 -231 344 -132 -493 535 -131 -907 631 -215 -310 613 163 -99 273 -321 -147
1910a47K71p48M35j1j55Q97o73L55O33j174O20M66j460P55P6q05P15K52o18N57
$$ -147 124 -624 -189 -200 -355 542 -131 224 857 -317 303 769 -691 64 140 -665 50 302 -316 241
1930B41m85j40O05l62J87j29j3M08j38p08J130r33J88J096q33k58R57j028k30
$$ 241 -244 -384 221 -141 46 -83 -96 312 174 -534 596 -337 -149 947 114 -144 813 -215 -445
1949d45P31n46J09p0m22N64r4O6N96p24N49L15j106R86O0j237Q32j30r02J313
$$ -445 286 -260 -151 -221 -643 -79 -173 -107 489 -235 314 629 -477 509 569 -668 164 34 -868 445
1969D45m04n07O26m22K02J21p22O16j76j34J44J8j0Q19n16n4Q40r73Q4J015j227
$$ 445 41 -466 160 -262 -60 61 -661 -45 -221 -355 -211 -193 -203 616 100 46 886 -87 -3 1012 -215
1990b15j19O16j018M54M69o31Q02l99k51P71p04K82L42p31Q44m90m78Q35k22p24
$$ -215 -334 282 -736 -282 187 -444 358 -41 -292 479 -225 57 399 -332 512 22 -456 379 157 -567
2010e67Q26Pj46M04p64j29L14m95O09j91n53Q42o79K27P92p79L87P05j003Q7N62
$$ -567 259 266 120 524 -240 -369 -55 -550 59 -132 -685 157 -522 -295 497 -282 105 810 -193 -106 456
2031D56j217R53r0q36R03K07m62J74K66k44J63p77O23Mp49R19k80m15J003n45
$$ 456 -761 192 102 -734 169 376 -86 88 354 110 273 -504 119 123 -626 293 13 -402 601 56
2051E6m89J379r94j23Q06q31l80P31o00K31J70k51J49k2j19O39p97K88L69p33
$$ 56 -433 946 -48 -171 635 -196 -576 155 -445 -214 -44 -295 -146 -168 -287 352 -445 -157 212 -521
2071e21M50m4l37N66L45r11O37P2m57O18m78L9J64m85L37q5o22R42l92l74J056
$$ -521 -71 -115 -452 114 459 -452 185 257 -200 418 -60 -21 143 -342 -5 -90 -712 230 -162 -536 520
2092E20l02l28R30p92j48J029r83K78Q8k85k69L49r3J53k70M4J89m55K74J91n68
$$ 520 218 -110 820 28 -120 909 -74 204 292 7 -262 87 -6 147 -123 -79 110 -345 -71 120 -448
2113d48P33q4j123J141J81o70M96K90o13L53m15j39L89k28J34Nl74M18l59l14
$$ -448 285 201 -922 219 400 -270 226 516 -97 256 -159 -298 91 -137 -3 2 -372 46 -313 -627
2133f27J122q38J19Q04p10N11K25q93M36J97m55J91P1k88J20k89j29N47r39P35
$$ -627 495 -343 -224 580 -130 381 606 -287 149 346 -109 82 153 -135 -15 -304 -433 114 -825 -90
2153i0j29n71R66l37l08Q67k81m16O72n5m68O78m18m9L81p34L26k70j45L73n02
$$ -90 -219 -790 176 -161 -469 398 117 -299 373 318 -150 528 110 61 442 -292 34 -236 -381 -8 -510
2174e10J48N89o50M23M90q33M32N21q95N23J68o52N87m3n03K13n7j41J16l51J89
$$ -510 -362 227 -423 0 490 -343 89 610 -285 238 406 -246 341 298 -205 8 -49 -190 -74 -425 -236
2195b36J72j34K22m8k94N93m07l75J075n98l2N79m59KM26m53K16k94k18L67m13
$$ -236 -64 -198 24 -24 -318 275 -132 -507 568 -30 -62 517 58 60 486 33 249 -45 -263 104 -309
2216c09L95L16p13L70K45o34L79L64o60P94j46r92O81j9k92N10k25M7L36p57M79
$$ -309 86 402 -311 59 304 -330 49 413 -247 547 401 -591 90 71 -221 289 64 111 447 -310 169
2237A69j46n08O35n98K58N72q24j46R94o45K42P53j052M59L30o99J11J30j43J78
$$ 169 23 -485 150 -448 -190 382 -442 -588 406 -239 3 756 -296 163 493 -206 -95 35 -108 70
2257G0k66L60r5l08L21k28l28P91n0r00J071l55n95R40m57k75N48m29L5J16oM3
$$ 70 -196 164 69 -239 82 -146 -474 317 267 -633 438 83 -512 428 -29 -304 244 -185 -150 -34 -40 3
2279Ck1m9L14n15J19M13n92L70L95p60N10J83o34K90O00r88N76j45l94L75M2K16
$$ 3 -18 -67 247 -268 -149 264 -328 42 437 -323 187 370 -264 26 626 -362 214 69 -325 50 92 308
2301C08j48j42j78L88p63N55k93l41J002m76l14N77j59k74O23m35J62J55p36M11
$$ 308 160 18 -160 228 -535 20 -273 -614 388 -88 -402 175 16 -258 365 -70 92 247 -489 -78
2321g8K37j38J43k84p9N13l54N4L62m73K17K46n75L95m5m97K07L25q53J108k65
$$ -78 159 21 164 -120 -199 314 -40 14 376 -97 120 366 -209 186 141 -356 -149 176 -677 431 166
2342A66o8K81n40L67k42l39N69l15m25P56k63k62Q83q20k0P68n20N5L65o24N16
$$ 166 98 379 -161 206 -36 -375 194 -121 -546 210 -53 -315 568 -252 -272 496 -24 31 396 -228 288
2363B88o73L82L77m28j64O04l72J72Q1m42O39k99q40O41N3p04O38j9j2K15j46
$$ 288 -385 -3 374 -54 -218 386 14 186 267 -175 464 165 -675 -34 19 -685 -47 -66 -78 137 -9
2384iK23j67k00J19j42m3M93l75l16P10n59p0N65o51L78J43m02J15K44k28O6J97
$$ -9 214 47 -153 -34 -176 -219 274 -101 -417 293 -266 -336 229 -422 -44 99 -303 -188 56 -172 -106 91
2406I1k52K50k06M29m3l47K49J53o59P81l47k38L83j87m23M65k88K5N23n24M20
$$ 91 -161 89 -117 312 269 -78 171 324 -335 446 99 -139 244 57 -366 99 -189 -164 359 -165 255
2427B55j08k96M39k94l33P08o62j9P53j175P93K64n34K32M29j144Q43l28j00J9
$$ 255 147 -149 290 -4 -337 371 -291 -310 443 -732 61 325 -209 23 452 -692 151 -177 -277 -258
2447b58K07L7j5Q3L3k0m40M91o2k17O76l21o61R25m48j7L16n38J43L94o43M29
$$ -258 -51 -14 -29 54 87 67 -373 118 56 -161 515 194 -467 458 10 -7 309 -229 -86 308 -335 94
2469I4j50k24P20n36L4K77l94M49M02p78K03J31m32M00j65l55M28o5n07M82j27
$$ 94 -56 -280 440 -96 -62 215 -179 270 672 -106 97 228 -204 196 31 -324 104 39 -468 14 -113
2490a13J0K69k69O9n8j52O57l63n8J75k58j41M07m44K9P12o94k14N49n00M18Q8
$$ -113 -103 166 -103 -34 -92 -244 413 50 -8 167 -91 -232 175 -269 -240 472 -222 -436 113 -387 31 119
2512A19p3J39k42j86Q60o26j6N71p70N23N8l52K85j56l91O55j96n93N93o0m74
$$ 119 46 185 -57 -243 617 -9 -25 546 -224 299 357 5 290 134 -257 398 202 -391 202 142 -332
2533c32O44l59P3m2%K34n17K74K39l94K44J07k88L9K33k58P0J4k66L84k37n3L18
$$ -332 312 -47 26 -16 -16 218 -299 -25 214 -180 64 171 -117 -78 155 -103 -33 -19 -285 99 -138 -191 127
2556A27l25L2L60k65J48J34m08L40M4n67O78lk62K61l49j94O11n03n6K38n6l4
$$ 127 -198 -166 194 -71 77 211 -197 143 187 -380 298 295 33 294 -55 -249 362 -141 -197 41 -15 -49
2578d9L4j66O8J31j77M56m29J12L20k33o5R0k82K84J92m44L10J26m84J74N6L10
$$ -49 -15 -181 -113 18 -159 297 -132 -20 300 67 2 92 -190 94 286 -158 152 278 -206 -32 24 334
2600C34j1m61Q8J34j10K68m14j40O08k94j90M90l03l2M75n84J46L0l69N44k31
$$ 334 323 -138 -50 84 -26 242 -172 -312 296 2 -188 302 -1 -33 442 -142 4 34 -335 209 -22
2621b2M7q1L0J13n3q1K32o3n18O25N6m06N09m44k59M59j92R2K49o3k29nj53L41
$$ -22 25 -56 -26 87 34 -47 185 122 -396 229 285 -121 388 -56 -315 144 -48 44 293 230 1 -4 -157 184
2645A84j01n03N02j64R3J20l02l1K77m13K04R0j11L07j56j43J50K62k83J04j59
$$ 184 83 -420 82 -82 11 131 -171 -202 75 -338 -134 -44 -155 152 -4 -147 3 265 -18 86 -73
2666g3J11J7o8Q1j85r5N54m32j13M20K5l52N22n51j42L91k7M9lj70q4J93q3K9
$$ -73 38 55 -13 68 -117 -212 342 -90 -203 217 242 -110 412 -139 -281 110 83 132 129 -41 -125 68 -15 14
2690A4K9l93M60m61M29N5l86L26r3n7K57j30k13L77j4l47L02l59L23J5j92J56
$$ 14 43 -350 110 -351 78 133 -253 73 -20 -77 180 50 -163 214 200 -147 155 -204 119 134 -58 98
2712I8J54l83N33o88J89L23j77m08P82m58j73L59J6J43nl83J28k67K39j42j71
$$ 98 252 -131 402 -286 -97 226 49 -359 423 -35 -208 151 167 310 305 -78 50 -217 22 -120 -291
2733b91J93p4j34O10j98l87L61j97l13P77k18k22N22n46m3M65k60l17M82k91K80
$$ -291 -98 -172 -306 304 106 -281 80 -117 -430 347 129 -93 429 -117 -160 305 45 -272 210 -81 199
2754A99p7k39K67Ll19M63m11K0K91k76J62K59l09N8O8l20M80j31j76K8r3J35o1
$$ 199 122 -117 150 153 -166 297 -114 -94 197 -79 83 342 33 91 159 -161 319 188 12 40 -53 82 21
2777B1j70J71j61k57L93q7l14P57k45l98O34l16m32P65l18j6l5j94J64L08k83
$$ 21 -149 22 -139 -396 -3 -90 -404 353 108 -290 344 28 -404 361 43 27 -8 -202 -38 270 -13
2798a3K01m41L72J96n25J73j5k85J11O83o79J84J45j57k46L63j32K75l44J6J45
$$ -13 188 -253 119 315 -210 -37 -52 -337 -226 457 -222 -38 107 -50 -296 67 -65 210 -134 -118 27
2819B7q1k04L98n05M33n2l0J19l1nJ67l43q1J37k1Q8l8J18j26P3o5J44o1k45J55
$$ 27 -54 -258 140 -365 68 16 -14 105 74 69 236 -107 -188 -51 -72 16 -22 96 -30 43 -22 122 61 -184 -29
2844b9M8J17k41q0K08Q9n01L79J64l21K33O1k70J16j63M02L1k39K00j84J34j71
$$ -29 19 136 -105 -185 23 112 -389 -10 154 -167 66 127 -143 -27 -190 212 243 4 204 20 154 -17
2866a7q4j98N59n00J77L40m24j43M7M08q6J26l96L97l75J17J57o2k2j1k90M11
$$ -17 -101 -299 260 -240 -63 277 -147 -290 -243 165 79 205 -191 206 -169 -52 105 43 21 10 -280 131
2888A31J13o33L11L39k64K38k39J65j28R5j23J61j13n2O5l13J74o5R8J81k67O2
$$ 131 244 -389 -78 261 -3 235 -4 161 33 128 5 166 53 1 66 -247 -73 -138 -40 141 -126 -64
2910f4P7l35L26M76p20Q2K51p6j10M06o19K80J74l01N8l4L82j73j37J5P0j80J78
$$ -64 13 -322 4 480 -240 -158 93 17 -93 313 -306 -26 148 -153 -95 -129 253 80 -57 -42 28 -152 26
2933B6j12k30K28k12j24N07k5N7j34k05K2J06R4m0n7K01k6l36N53k14k87L91k91
$$ 26 -86 -316 -88 -300 -424 83 58 115 -19 -224 -202 -96 -2 -42 -99 102 76 -260 293 79 -208 183 -108
2956a08K9p1L55l55l6K44o3J92l89O3K73p0J2n8j90L12R8n54M29Q3l34N50o11
$$ -108 -79 -150 205 -150 -186 58 -5 187 -202 -139 134 64 76 18 -172 140 238 -316 113 196 -138 412 -199
2979a99M23j14m06J87Q1j8j00K79j61k58K99J95L6o46L81L15l40P2K8j86K83j53
$$ -199 224 110 -296 -109 -28 -46 -146 133 -28 -286 13 208 244 -402 -21 294 -46 26 54 -132 151 -2
3001bm01N70j17j69K16k51J59r0N2nJ9J73K6n7j82J58j84l1K76l05L4K22k88J62
$$ -2 -403 167 50 -119 97 -154 5 -85 -33 -38 -19 154 180 123 -59 99 -85 -116 160 -145 -111 111 -177 -15
3025a5n3M4n8n6RJ53k48L58J2j79J17j2j04J98j10k15J77o1L4J6l15J79L2p0j0
$$ -15 -68 -24 -82 -138 -129 24 -224 134 146 -33 84 72 -32 166 56 -159 18 -43 -9 7 -308 -129 -97 -167 -177
3050a77L31l71L83j8j7N6r2p0m3JQ5j45j35L22j30J09J15J43m92K10L0nm6j06
$$ -177 154 -217 166 148 131 187 95 25 -18 -17 68 -77 -212 110 -20 89 204 347 -145 65 95 90 44 -62
$$ [...]
8191B5
##END NTUPLES=NMR FID
##END=
