##TITLE=1H_27-2024
 DMSO-d6
 8 sc, 
 2.4.2024
##JCAMPDX= 6.0         $$ Bruker NMR JCAMP-DX V2.0
##DATA TYPE= NMR FID
##DATA CLASS= NTUPLES
##ORIGIN= UXNMR, Bruker Analytische Messtechnik GmbH
##OWNER= root
$$ XWIN-NMR		Version 3.5
$$ Tue Apr  2 14:53:36 2024 Russian Standard Time (UT+4h)  she@DPX200
##.OBSERVE FREQUENCY= 200.1309
##.OBSERVE NUCLEUS= ^1H
##.DELAY= (6, 6)
##.ACQUISITION MODE= SIMULTANEOUS
##.ACQUISITION SCHEME= undefined
##.AVERAGES= 8
##.DIGITISER RES= 18
##SPECTROMETER/DATA SYSTEM= spect
##.PULSE SEQUENCE= zg30
##.SOLVENT NAME= MeOD
##.SHIFT REFERENCE= (INTERNAL, MeOD, 0, 15.7039)
##AUDIT TRAIL= $$ (NUMBER, WHEN, WHO, WHERE, WHAT)
$$ ##TITLE= Audit trail, XWIN-NMR		Version 3.5
$$ ##JCAMPDX= 5.01
$$ ##ORIGIN= Bruker BioSpin GmbH
$$ ##OWNER= she
$$ F:/spectra/data/she/nmr/H-F/1/audita.txt
$$ ##AUDIT TRAIL=  $$ (NUMBER, WHEN, WHO, WHERE, WHAT)
(   1,<2024-04-02 14:52:52.34 +0400>,<she>,<DPX200>,
      <created by zg, POWCHK disabled, PULCHK disabled
       configuration hash MD5:
       00 E9 B6 7A A2 85 ED C7 34 08 36 98 17 FE 4E 26
       data hash MD5: 16K
       0A 87 7A 76 B2 80 0B 96 B1 10 8F B7 00 FC 59 A9>)
$$ ##END=
$$ 
$$ hash MD5
$$ B4 A3 68 2A 6D E4 32 3B 5D 02 3A F8 1D 82 B1 A8
##$RELAX= 
##$RELAX= 
##$RELAX= 
##$RELAX= 
##$RELAX= 
##$RELAX= 
$$ Bruker specific parameters
$$ --------------------------
##$DU= <F:/spectra>
##$EXPNO= 1
##$NAME= <H-F>
##$PROCNO= 1
##$TYPE= <nmr>
##$USER= <she>
##$AMP= (0..31)
100 100 100 100 100 100 100 100 100 100 100 100 100 100 100 100 100 100 
100 100 100 100 100 100 100 100 100 100 100 100 100 100 
##$AQSEQ= 0
##$AQ_mod= 1
##$AUNM= <au_zg>
##$AUTOPOS= <>
##$BF1= 200.13
##$BF2= 200.13
##$BF3= 200.13
##$BF4= 200.13
##$BF5= 200.13
##$BF6= 200.13
##$BF7= 200.13
##$BF8= 200.13
##$BYTORDA= 1
##$CFDGTYP= 0
##$CFRGTYP= 5
##$CHEMSTR= <none>
##$CNST= (0..31)
1 1 145 1 1 1 1 1 1 1 1 1 1 1 1 1 1 1 1 1 1 1 1 1 1 1 1 1 1 1 1 1 
##$CPDPRG= <>
##$CPDPRG1= <>
##$CPDPRG2= <>
##$CPDPRG3= <>
##$CPDPRG4= <mlev>
##$CPDPRG5= <mlev>
##$CPDPRG6= <mlev>
##$CPDPRG7= <mlev>
##$CPDPRG8= <mlev>
##$CPDPRGB= <>
##$CPDPRGT= <>
##$D= (0..31)
0 1.2 0 0 0 0 0 0 0 0.06 0 0.03 0 0 0 0 0.0002 0 0 0 0 0 0 0 0 0 0 0 0 
0 0 0 
##$DATE= 1712055171
##$DBL= (0..7)
120 120 120 120 120 120 120 120 
##$DBP= (0..7)
150 150 150 150 150 150 150 150 
##$DBP07= 0
##$DBPNAM0= <>
##$DBPNAM1= <>
##$DBPNAM2= <>
##$DBPNAM3= <>
##$DBPNAM4= <>
##$DBPNAM5= <>
##$DBPNAM6= <>
##$DBPNAM7= <>
##$DBPOAL= (0..7)
0.5 0.5 0.5 0.5 0.5 0.5 0.5 0.5 
##$DBPOFFS= (0..7)
0 0 0 0 0 0 0 0 
##$DE= 6
##$DECBNUC= <off>
##$DECIM= 32
##$DECNUC= <off>
##$DECSTAT= 4
##$DIGMOD= 1
##$DIGTYP= 9
##$DL= (0..7)
0 120 120 120 120 120 120 120 
##$DP= (0..7)
150 150 150 150 150 150 150 150 
##$DP07= 0
##$DPNAME0= <>
##$DPNAME1= <>
##$DPNAME2= <>
##$DPNAME3= <>
##$DPNAME4= <>
##$DPNAME5= <>
##$DPNAME6= <>
##$DPNAME7= <>
##$DPOAL= (0..7)
0.5 0.5 0.5 0.5 0.5 0.5 0.5 0.5 
##$DPOFFS= (0..7)
0 0 0 0 0 0 0 0 
##$DQDMODE= 0
##$DR= 18
##$DS= 0
##$DSLIST= <SSSSSSSSSSSSSSS>
$$ [...]
##$SUBNAM2= <"">
##$SUBNAM3= <"">
##$SUBNAM4= <"">
##$SUBNAM5= <"">
##$SUBNAM6= <"">
##$SUBNAM7= <"">
##$SUBNAM8= <"">
##$SUBNAM9= <"">
##$SW= 18.0517689322627
##$SWIBOX= (0..15)
0 0 2 0 0 0 0 0 0 0 0 0 0 0 0 0 
##$SW_h= 3612.71676300578
##$TD= 16384
##$TD0= 1
##$TE= 0
##$TE2= 300
##$TE3= 300
##$TEG= 300
##$TL= (0..7)
0 120 120 120 120 120 120 120 
##$TP= (0..7)
150 150 150 150 150 150 150 150 
##$TP07= 0
##$TPNAME0= <>
##$TPNAME1= <>
##$TPNAME2= <>
##$TPNAME3= <>
##$TPNAME4= <>
##$TPNAME5= <>
##$TPNAME6= <>
##$TPNAME7= <>
##$TPOAL= (0..7)
0.5 0.5 0.5 0.5 0.5 0.5 0.5 0.5 
##$TPOFFS= (0..7)
0 0 0 0 0 0 0 0 
##$TUNHIN= 0
##$TUNHOUT= 0
##$TUNXOUT= 0
##$USERA1= <user>
##$USERA2= <user>
##$USERA3= <user>
##$USERA4= <user>
##$USERA5= <user>
##$V9= 5
##$VALIST= <valist>
##$VCLIST= <CCCCCCCCCCCCCCC>
##$VD= 0
##$VDLIST= <DDDDDDDDDDDDDDD>
##$VPLIST= <PPPPPPPPPPPPPPP>
##$VTLIST= <TTTTTTTTTTTTTTT>
##$WBST= 1024
##$WBSW= 4
##$XGAIN= (0..3)
0 0 0 0 
##$XL= 0
##$YL= 0
##$YMAX_a= 22808
##$YMIN_a= -77178
##$ZGOPTNS= <>
##$ZL1= 120
##$ZL2= 120
##$ZL3= 120
##$ZL4= 120
##$ABSF1= 10
##$ABSF2= 0
##$ABSG= 5
##$ABSL= 3
##$ALPHA= 0
##$AQORDER= 0
##$ASSFAC= 0
##$ASSFACI= 0
##$ASSFACX= 0
##$ASSWID= 0
##$AUNMP= <proc_1d>
##$AZFE= 0.1
##$AZFW= 0.1
##$BCFW= 1
##$BC_mod= 2
##$BYTORDP= 1
##$COROFFS= 0
##$CY= 11.3945322036743
##$DATMOD= 1
##$DC= 2
##$DFILT= <>
##$DTYPP= 0
##$F1P= 15.7292609196834
##$F2P= 12.9074282941183
##$FCOR= 0.5
##$FTSIZE= 0
##$FT_mod= 4
##$GAMMA= 1
##$GB= 0.15
##$INTBC= 1
##$INTSCL= 1
##$ISEN= 128
##$LB= 0.24
##$LEV0= 0
##$LPBIN= 0
##$MAXI= 10000
##$MC2= 0
##$MEAN= 0
##$ME_mod= 0
##$MI= 1.114404
##$NCOEF= 0
##$NC_proc= 0
##$NLEV= 6
##$NOISF1= 3.799351
##$NOISF2= 2.8
##$NSP= 1
##$NTH_PI= 0
##$NZP= 0
##$OFFSET= 15.70392
##$PC= 1
##$PHC0= -25301.46
##$PHC1= 11.58731
##$PH_mod= 1
##$PKNL= yes
##$PPARMOD= 0
##$PSCAL= 0
##$PSIGN= 0
##$REVERSE= no
##$SF= 200.130013532006
##$SI= 16384
##$SIGF1= 3
##$SIGF2= 2
##$SINO= 400
##$SIOLD= 16384
##$SREGLST= <1H.CDCl3>
##$SSB= 0
##$STSI= 0
##$STSR= 0
##$SW_p= 3612.71676300578
##$SYMM= 0
##$S_DEV= 0
##$TDeff= 0
##$TDoff= 0
##$TI= <>
##$TILT= no
##$TM1= 0
##$TM2= 0
##$TOPLEV= 0
##$USERP1= <user>
##$USERP2= <user>
##$USERP3= <user>
##$USERP4= <user>
##$USERP5= <user>
##$WDW= 1
##$XDIM= 8192
##$YMAX_p= 0
##$YMIN_p= 0
$$ End of Bruker specific parameters
$$ ---------------------------------
##NTUPLES= NMR FID
##VAR_NAME=  TIME,          FID/REAL,        FID/IMAG
##SYMBOL=    X,             R,               I
##VAR_TYPE=  INDEPENDENT,   DEPENDENT,       DEPENDENT
##VAR_FORM=  AFFN,          ASDF,            ASDF
##VAR_DIM=   8192,          8192,            8192
##UNITS=     SECONDS,       ARBITRARY UNITS, ARBITRARY UNITS
##FACTOR=    0.0002768,     1,               1
##FIRST=     0,             0,               0
##LAST=      2.2672688,     0,               0
##MIN=       0,             -77178,          0
##MAX=       2.2672688,     22808,           0
$$ Real data points
##PAGE= N=1
##DATA TABLE= (X++(R..R)), XYDATA
$$ [...]
1796dO1r9O5J85p2k06J9O5M9J72k72mm26N67j70q8j3L3R5j9K83k75L06j86j74
1821a08J69j13J22K40j05q0j9P0k23L99k42qM2k81m4K7K47M6M8j22o4k82J36K91
1845A46J4j28k6R5p5j47Q8L9r6M71j38k1m87L76l8J28j98k7J17j02J09l56L26
1868G0l3J74m10P7J24L32l00p5Q0l88M35p8k1JJ17j59q8J0K80j90k8K85j78P7
1892A14o5o8K02j37k17O1K42k47J29J03Q0k03K6MR1q4l1R6O1o5j75j50K16K50
1916B33j54q2K17k15j09j56J67M9P8K37m63O4r7L02j10J95R0n7j81O2nO5k85N9
1940i6J54j77J7mqN2N6j2L0Q3k00L27m71J24KP8m1J39q2J79K2j80K1J41m0m4N1
1967A21k65N2l9L61k78J2J00o1k73M27j43r5q3J58Lj8Om7j9K13m0j60J82M0j09
$$ plain form
1796 -4 57 -42 23 208 136 -70 -51 14 63 235 -37 -41 -467 100 -70 -158 -171 -138 -43 -62 221 -54 252 66 -108
1821 -108 61 -52 70 310 205 125 106 176 -47 352 110 102 144 -137 -181 -154 93 139 187 65 1 -281 -145 146
1845 146 160 32 6 101 26 -121 -33 6 -90 381 243 222 -265 111 73 201 3 -24 93 -9 100 -256 70
1868 70 37 211 -199 -122 2 334 34 -41 39 -349 86 8 -13 -12 105 -54 -142 -132 148 -42 -70 215 37 114
1892 114 49 -19 183 46 -171 -110 132 -115 14 117 197 -6 20 24 115 31 0 96 157 92 -83 -233 -17 233
1916 233 79 -3 214 -1 -110 -266 -99 -50 28 265 -198 -134 -231 71 -39 156 246 189 8 70 65 130 -155 -96
1940 -96 58 -119 -102 -106 -114 -62 -6 -18 12 95 -105 222 -249 -125 -123 -45 -86 53 -29 150 172 -8 13 154 114 70 121
1967 121 -144 -92 -131 230 -48 -36 64 3 -270 157 14 -81 -164 -6 -3 -21 -15 -62 -81 132 92 -68 114 154 45
1992D5O9Ll20P6K44j61J44J22m79K26j30R2j26J83K78j69J77j98k09K62j34m4
2014d9L8k52L56mr7M7J46M5j76J12j10j61K21k47K75k72J83o6J08k21M5K55j58
2037A8j51J07j09K08J17k58Rj5K2J92k86l1L00M6j15K60l9k08J49l33N2nLjJ57
2062H9J06k41J9K44k84j24l7K11o2l2K06o8M2J7j17j43R4J72O1k04K70r5l1p5
2086A8j15K02j32KKK5l3M8P1l1j49J9l1J25J02J60m39J11K22j06j13K16l70L38
2110A42j21Q0j3L1j80j1J01J0m0J3J43k35Nj43J97J9j05K01lk10M26m94J45nr9
2135a46K48k0J32k48L11k26j23Q4k1J36k56N8j1J80L2q5J3M9m5J1j63j43K34J88
2159A89k97%K56k17K56l55J12PK92n29K62q7M00k57L60o45m1M15J31j17o7J34
$$ plain form
1992 45 114 117 -203 -127 117 -44 100 222 -257 -31 -161 -69 -195 -12 266 97 274 76 -133 129 -5 -49
2014 -49 -11 -263 93 89 -8 39 185 230 54 166 56 -105 116 -131 144 -128 55 -11 97 -124 -79 176 18
2037 18 -133 -26 -135 73 190 -68 -59 -74 -52 140 -146 -177 123 169 54 314 275 67 216 -117 -65 -70 -67 -68 89
2062 89 195 -46 -27 217 -67 -191 -228 -17 -79 -111 95 27 69 86 -31 -174 -80 92 153 -51 219 124 93 18
2086 18 -97 105 -27 -25 -23 2 -31 17 88 57 -92 -73 -104 21 123 283 -156 -45 177 71 -42 174 -196 142
2110 142 21 101 88 119 -61 -72 29 39 -1 12 155 -80 -75 -218 -21 -2 -107 94 91 -119 307 -187 -42 -47 -146
2135 -146 102 82 214 -34 277 51 -72 12 -9 127 -129 -71 -82 98 130 45 58 107 62 73 -90 -233 1 189
2159 189 -108 -108 148 -69 187 -168 -56 -49 243 -286 -24 -111 289 32 392 -253 -294 121 252 135 68 202
2181B02l14j72L03J52j58M09j27k65p7j40K82k45K94j50J61m0k1r8j8K13k09j89
2203b07J80k1K17L3k87K81k79k0K26L9j43J34l45PJ89K38j63k49K55n6j22l6Q
2226a21QL1O9K02l14M5o3N7J78M4pk18j75K78n0K19j96K2j76L44j74M5j6j29M3
2251e4j06L71j13O1j43k5j24L55n3m6m5k52J59K67k88j1k36K98J1Nq5K75P1j06
2275A86j54J34j93j8MrP3K2R6n4K3j88r2J54L78l29m2j65J63Qm4p0K46j75j09
2300a55K31K29j91o5K78k78j28R4k72M18j74L10j01r4j26J86k56O4M32m67k18
2321b83J96J9J68m3q9K28l65J28j4J97j12j86L25l15L47r0j16k11K0N77k94K29
2343C16k07P2l40K2N0J16m6J0K21j13m2l06J14J25J00J2j07j2k33N21l85J92j67
$$ plain form
2181 202 -112 -284 19 171 13 422 295 30 -47 -187 95 -150 144 -6 155 115 94 -4 -22 191 -18 -207
2203 -207 -27 -48 169 202 -85 196 -83 -103 123 162 19 153 -192 -185 4 242 79 -170 85 29 -93 -129 -121
2226 -121 -113 -82 -13 189 -125 -80 -143 -86 92 136 129 -89 -264 14 -36 183 -13 9 -167 177 3 48 32 -97 -54
2251 -54 -160 211 98 159 16 -9 -133 222 169 123 78 -174 -15 252 -36 -47 -283 15 26 31 -54 221 292 186
2275 186 32 166 -27 -45 -41 -50 23 45 141 87 110 -78 -170 -16 362 33 -9 -174 -11 -3 -47 -117 129 -46 -155
2300 -155 76 305 114 49 327 49 -79 15 -257 161 -13 297 196 102 -24 162 -94 -30 402 -65 -283
2321 -283 -87 -68 100 57 -32 196 -169 -41 -55 142 30 -156 169 -146 201 111 -5 -216 -196 381 87 316
2343 316 109 181 -159 -137 -87 29 -17 -7 214 101 59 -247 -133 -8 92 104 -3 -15 -248 273 -112 80 -87
2366h7JK18j23j62K27L1k51K67l04L33j07J66j94r1r8J55J24k16nR9J17k27K99
2389A72j72p4m5K72j73l6K01l40K64mj20L70l43p4p8M58k11K06m74K56j78j06
2411b29J02J24J53n6l4j81K28o9r3J46Rm08M14k62n5J73p2J73K4Q9l47J00Q8j40
2435a23J91r6j83Q6N6J44K6q7K8R6l41N08k69J77j51p8k02L89k70K33j5nk93K75
2459I6q8q5J66k1j34J50Jj33M2j82L22o1J19lk74J63j58J64o9m8O8J39m0J8m3
2484A09p6k78K74K1n1j90J36P3o9M9m4J44j06Q7k3n6j35K26j04L9n4o2K05k05
2508i0QJ97q2K61k35j65J04k24J03LJ32J6j41J27j11L0J44N1J7j19L4j13k07J94
2532f6M9M0k41K30Q7l4r4M24o27K35L3rj77L29Jl32J9R4J03O9k42M9J48l56K51
$$ plain form
2366 -87 -86 132 9 -153 74 105 -146 121 -183 150 43 209 15 -76 -174 -19 105 -111 -116 -17 100 -127 172
2389 172 0 -74 -119 153 -20 -56 145 -195 69 65 -55 315 -28 -102 -180 278 67 273 -201 55 -123 -229
2411 -229 -127 -3 150 94 60 -121 107 38 -55 91 100 -308 106 -156 -211 -38 -110 63 87 176 -171 -71 17 -123
2435 -123 68 -28 -211 -125 -69 75 101 14 42 138 -203 305 36 213 62 -16 -218 171 -99 134 119 114 -179 96
2459 96 8 -77 89 68 -66 84 85 -48 -6 -188 134 73 192 189 -85 78 -80 84 15 -33 35 174 134 152 109
2484 109 33 -245 29 50 -1 -191 -55 18 -51 -2 -46 98 -8 79 56 0 -135 91 -13 26 -28 -90 115 -90
2508 -90 -82 115 33 294 59 -106 -2 -226 -123 -120 12 28 -113 14 -97 -67 77 128 145 26 60 -53 -260 -66
2532 -66 -17 23 -218 12 99 65 -29 395 -232 3 36 27 -150 179 180 -152 -133 -39 64 133 -109 -60 88 -268 -17
2557a7J50j93J84j64J28P6l49K12k23K2L20l10J70j18M8K20o7j40lJ0M2j17J84
2580F5R0m6j33J08j25j02j07M2K36k33L14ok67K91m3l06L76n9j1k30J98m8K25
2603B29l13K72k64J15j22j4K52K19n07M74r7j44J8j73L4n5J67k58K26j88O5r2
2625a56q5L71l17J45J23k89K53j62nJ41J26J5n2J17j65O6j48M1J24l05K79j01
2647A6j73J26j09J02K69j80K9J41j07j39on6J16j26o5l8K69j41j03M34l53K63
2669A69j41j34MK80n3m1k11J74J6k94L09m7M6K06j00j88j94K05j74K61j06o1J42
2692F8r5J67k52K05l30M33l22K68Ml04K68m2l1K14l30p6O4J91Ql06Q5P5q4K37
2716A15k03R1K01j09j05k07K63j29J87k80J50m3M8j04L15k68j2R0j4j21Q8L53
$$ plain form
2557 -17 133 -60 124 -40 88 164 -185 27 -196 -174 146 -164 6 -112 -64 156 89 -51 -54 -44 -2 -119 65
2580 65 155 109 -24 84 -41 -143 -250 -208 28 -205 109 103 -164 127 84 -222 154 95 84 -146 52 4 229
2603 229 -84 188 -76 39 -83 -97 155 374 -133 341 244 100 118 -55 -21 -76 91 -167 59 -129 -64 -156
2625 -156 -241 130 -187 -42 81 -208 45 -117 -122 19 145 160 108 225 60 126 -22 19 143 -162 117 16
2647 16 -157 -31 -140 -38 231 51 80 221 114 -25 -31 -87 29 -97 -162 -200 69 -72 -175 259 -94 169
2669 169 28 -106 -102 178 125 84 -127 47 63 -231 78 31 77 283 183 -5 -199 6 -168 93 -13 -74 68
2692 68 -27 140 -112 93 -237 196 -126 142 146 -158 110 68 37 251 -79 -155 -91 100 108 -198 -113 -38 -122 115
2716 115 -88 3 204 95 -10 -217 46 -83 104 -176 -26 -69 -21 -125 190 -78 -90 0 -14 -135 -47 306
2738C06n43J24J53J82j42j70J84j27r6K36j14L33m09k4M6K40n27K57O1q0L71k50
2760A1m4j64K27l09L16j15j89K04p4J83K3r6K32n56L25K9Pj10J09J27O3m55K27
2783b9P4j18J21o0l4R4j61Q9q5P5J66j74J27l69L55O7k94N3J02q8K95j19j90K99
2807A96j63k08J78K05k03m6J72j34j09k5K17l6j33l3L67k05j05J35l15L01m0K3
2829C9r1O3j65K47P7l73K42j07M5k35L88N9l05p0J67K35K9j31Or3j78J39J56k47
2853a03K46l7N8k37M09n52K04p4k6K95m32L40k23K14j17L22k74K25k37j58J75
2874A8O5j85J58kL5J88l90o7K73j20o8o4J29mm5J76j12J21j87O5q4K15j31j11
2898a27L19j44j83J19n0KK5l01K2N84m0o2j69K83k10j1n2J67l50J48M6k25K05
$$ plain form
2738 306 -237 -113 40 222 80 -90 94 -33 -129 107 -7 326 -83 -107 -61 179 -348 -91 -30 -110 261 11
2760 11 -33 -197 30 -279 37 -78 -267 -63 -137 46 69 -27 205 -351 -26 3 10 -100 9 136 199 -256 -29
2783 -29 45 -73 48 -12 -46 48 -113 -24 -109 -34 132 -42 85 -284 71 138 -156 -103 -1 -89 206 87 -103 196
2807 196 33 -175 3 208 5 -41 131 -3 -112 -137 80 44 -89 -122 245 40 -65 70 -245 56 16 39
2829 39 -52 11 -154 93 170 -203 39 -68 -23 -258 130 189 -116 -186 -19 216 245 114 120 27 -151 -12 144 -103
2853 -103 143 106 164 -73 336 -216 -12 -86 -112 183 -249 91 -132 82 -35 287 13 238 1 -157 18
2874 18 83 -102 56 54 89 277 -113 -180 93 -27 -95 -159 -30 -34 -79 97 -15 106 -81 -16 -100 115 -16 -127
2898 -127 192 48 -135 -16 -66 -64 -39 -340 -318 266 226 164 -5 278 68 57 5 172 -178 -30 16 -209 -4
2921dk17L08m81M23K28j78J04k96K99j11K62j37k84K00k52L59l18Qlm2K15j67
2943h4K5J32n1jP9NQ9l51J81NN0J1O2j97K17m0k11J63rj31K75J35k90j64J38J02
2969A40J43j37p3j49M1K22l74K42q1N0n6J61j96p1R2m9M5J10J09j45j71J65J1
2992B9J10O3j24p0m4o5M70n83R9j18M05k50J19J09k46J68j45K39k25j73M39k78
3014g1r0o0m7L01k64J53J63j35J0N7q7J47K8l0p7k0L4p7jR4j07j41M32l38P5K12
3040A61n08O35m33J25Pj03J24o2J44l0M1L3m40R0N6J64R3k55K75k28J41n3Q6k92
3064b29L7O3K9m5M08j15k66P6l6n0Q7L26j98qq2q5M5r2Q4K01q4m4L2k34l0K04
3090fJ67l05KJ27K58l98J18RP6M1k55L2O1j46J15L2K31j02O3k88J78M5k22J11
$$ plain form
2921 -4 -221 87 -394 29 257 79 183 -113 186 75 337 200 -84 116 -136 223 -95 -87 -90 -132 83 -84
2943 -84 -59 73 22 21 100 105 194 -157 24 29 79 90 152 -45 172 132 -79 84 75 -56 219 354 64 -100 38 140
2969 140 283 146 73 -76 -35 187 -187 55 -26 24 -32 129 -67 -138 -46 -95 -50 60 169 24 -147 18 29
2992 29 139 202 78 8 -36 -101 369 -214 -115 -233 172 -78 41 150 -96 72 -73 166 -59 -232 207 -71
3014 -71 -161 -221 -268 33 -231 -78 85 -50 -40 17 -70 77 105 75 -2 -22 12 -65 -66 28 -79 -220 212 -126 -51 161
3040 161 -347 288 -145 -20 -13 -116 8 -54 90 60 101 134 -306 -216 -160 4 97 -158 117 -111 30 -23 63 -229
3064 -229 -192 -129 -100 -145 263 148 -118 -42 -78 -128 -41 285 87 79 -3 -88 -43 -135 -51 150 66 22 54 -180 -210 -6
3090 -6 161 -144 -142 -15 243 -155 -37 -28 48 89 -166 -134 -73 -219 -104 -72 159 57 120 -168 10 55 -167 -56
3114e6j00O7m2Q3Q2j3j97j21L73O6k38K97Jl33J49J95o9Kp3k28m7r0L39o5J18
3139A00k4j63q9K9M36j75L5k80j2m7J05L75k24j96%K55L9j76O0N6Rj23j02l0J27
3164a5J21m18L51P2j25j50J66J17j06n8O5K69l05J93L2k74n5n8J76K51l61j30
3186b42N55l37K8P0j50P9N8qL9j62J27j9J17k99K6L29k50N6O0K7j50pP5O2Q8J71
3212C43j88k81J21K0l4J06j8M4J26j95j32J61Kk46J67J50Q0l01J7J35J1JJ33l8
3236A84m68L80k57N0J43pq6K3j37K64k06M71l94O5j02J34K76l93K0q4K46k22j99
3259b99L50k04J61k6j01M95m05k3p6L60K9k23J16k41NQ4k17J64O7m57M55Kl07
3282b91M97k64l6J80k69J11j05K80J78m16m7L17o0p9P5J5K1k8l9o0l89L80J04
$$ plain form
3114 -56 -156 -89 -131 -48 34 21 -176 -297 76 142 -96 201 202 -131 18 213 144 146 73 -155 -202 -292 47 -18 100
3139 100 76 -87 -176 -147 289 114 149 -131 -143 -190 -85 290 66 -130 -130 125 164 -12 48 104 113 -10 -112 -142 -15
3164 -15 106 -312 39 111 -14 -164 2 119 13 -45 20 289 -16 177 209 -65 -120 -178 -2 249 -112 -242
3186 -242 313 -24 4 74 -76 3 61 53 92 -70 57 38 155 -144 -118 211 -39 17 77 104 -46 -53 22 84 172 343
3212 343 155 -126 -5 15 -19 87 69 113 239 44 -88 73 75 -171 -4 146 226 -75 -58 77 88 89 222 184
3236 184 -284 96 -161 -111 32 25 -61 -38 -175 89 -117 354 -40 25 -77 57 333 -60 -40 -124 122 -100 -299
3259 -299 51 -153 8 -18 -119 376 -29 -52 -128 232 261 38 154 -87 -82 2 -215 -51 16 -441 14 16 -291
3282 -291 206 -58 -94 86 -183 -72 -177 103 281 -135 -182 135 75 -4 71 86 107 79 40 -20 -409 -29 75
3305G5N0j50K26j26k2Q1K2j34J21K4j86J97j77J9O1J22m32J55q2J01J44k0M4p6
3329C7j61Q0M8J7p2J08nL5m4k38QK10o2J46Q0l57J82j66K55pM3r2p0Q6r9O0jJ61
3357A82j75o8K72j12j84%J02n3L01m11j20J02J37oL8kk49L71k19q5K52j04L4L7
3381D0k82J09R8k36P9K10P2N0k31O6p1J08K35k76J75k24J50M8j58OL0Q1j01O8
3405D6qRJ41m49M37l17K04j35j18L0K21j13k60M06Q7o9l90M13L1Mk31J12j98l1
3429a78j90L88J26j37O7j42p0J47J81j93pJ80kl20L88L2k47l81L70n4j55L74k30
3452e3J85j47q6N9j09N3K0lK21r4k3j7K51l29J73l0k40L16L3j89J50j02K99j54
3476A84k55L24k03q8K07j36j62J27J76j52Q2j10j83K28J21k03p5K08j9k79K54
$$ plain form
3305 75 125 -25 201 75 53 134 156 22 143 167 -19 178 1 20 81 203 -229 -74 -156 -55 89 69 113 37
3329 37 -124 -44 4 21 -51 57 52 87 43 -195 -187 23 -39 107 187 -170 12 -154 101 94 137 45 -25 61 -38 22 21 182
3357 182 7 -61 211 99 -85 -85 17 -36 265 -146 -266 -164 -27 -33 5 3 -246 125 -94 -179 73 -31 3 40
3381 40 -242 -133 -35 -271 -192 18 90 140 -91 -25 -96 12 247 -29 146 -78 72 120 -38 -32 -2 79 -22 46
3405 46 38 47 188 -261 176 -141 63 -72 -190 -160 61 -52 -312 94 181 112 -278 135 166 170 -61 51 -147 -178
3429 -178 -368 20 146 9 76 -66 -136 11 192 -1 -8 172 170 -150 238 270 23 -358 12 -42 -197 177 -53
3452 -53 132 -15 -101 -42 -151 -98 -78 -81 140 46 23 6 257 -72 101 71 -169 147 180 -9 141 39 338 184
3476 184 -71 253 50 -38 169 33 -129 -2 174 22 104 -6 -189 39 160 -43 -118 90 71 -208 46
3497D6J79k79M11k02j56j4LM1j55n1K75m5j27O4k8o9J48J48p7k2m28M28j7j65
3521i2j27L45j63J88J28j58L3j58J31n5j10N9q5Q8j50j3j51M21n0j70n5K9J8O
3545i1J9MJ23o5n9K66j86k8O1J12k23n3L97l45j67J80l0J68k28O7j36L15j19K13
3569A95l74K25j65K00q5J6J37R8k7j51M5l06K71k8l9l6L30n31m9K81p9J68j73
3592g7J62j26L9p0n4J57M6m8n8J51j60q7J6J73m5j93J83j31K4J35R3j87J78r7
3616B4K9MK8k80K83j53J81K9L3j68l18N50m74K91J5j47mm4rP5P5N4mj94L6P2J06
3643I0j21m5j92K91j01J05o4n1j1P4j5J38o1j84L53j63M8K19m70J67o1k2j35O0
3667a51K23N3r6P7K6l05J6o8O5L4K40l78L22j41K26l65J11J23l1q6QNQ6Q0k1k7
$$ plain form
3497 46 225 -54 357 155 -1 -15 -12 29 -126 -177 98 53 -74 -10 -38 -107 41 189 112 90 -338 90 73 -92
3521 -92 -219 126 -37 151 279 121 154 -4 127 72 -38 21 -64 24 -126 -139 -290 131 81 -89 -144 -115 -97 -91
3545 -91 -72 -68 55 -10 -69 197 11 -17 44 156 -67 -120 277 -68 -235 -55 -85 83 -145 -78 -214 101 -18 195
3569 195 -179 46 -119 81 -4 12 149 247 220 69 114 -192 79 51 12 -24 306 -225 -274 7 -72 96 -77
3592 -77 85 -41 -2 -72 -126 31 77 29 -29 122 -38 -125 -109 64 19 -174 9 -122 -98 37 130 -57 121 24
3616 24 53 57 85 -195 88 -65 116 145 178 10 -308 242 -232 59 74 -73 -77 -121 -130 -55 20 74 70 -124 -88 -16 90
3643 90 -31 -76 -268 23 -78 27 -37 -88 -99 -25 -40 98 37 -147 206 43 91 310 -160 7 -54 -76 -211 -151
3667 -151 72 125 29 106 132 -173 -157 -225 -160 -126 114 -264 58 -83 143 -222 -111 12 -19 -105 -97 -92 -6 74 53 26
3693B6J19nj67k86M35k38J49qr7m1K2K24J1J47l63K18j18j92j14M07j74L6j8l7
3717f4l6J21J06j73l7p2Q2l4J58j59R5R9j11J8j57P4j15K38k16K18j28M9j28J38
3741c4n3pO1J35l7O2m92N47j05j24J6J30j34j08K19n29N30M2k58K21K5j15J84
3764A76k06L38l82j3r3M39k15L3J01k60o1K97j93p4K10k73p1L55p5l2J1j58L24
3787A78k96L10L2k90o0k41N40k57l4J78N1k00O4J33k08J49q5k38L26J51K07k74
3809A36k63J00K03k27j0J94j78K43k75k77M31j36J99o4r5k3nj41K12J40k28l7
3831a01K56q0k0o8K03l26J60K37j86n2k22qJ68L90k30j98K97k32j65M2M14k39
3853D0k83J59R9j02K20m1J31l94K32N0j54J36J15k78R1P5j12J1N0j26L72K5n50
$$ plain form
3693 26 145 140 -27 -313 122 -116 33 25 -72 -113 -91 133 144 291 -72 146 28 -164 -278 129 -45 -9 -27 -64
3717 -64 -100 21 127 -46 -83 -155 -73 -107 51 -108 -13 86 -25 -7 -164 -90 -205 33 -183 35 -93 -44 -172 -34
3741 -34 -87 -94 -33 102 65 127 -365 182 77 -47 -31 99 -35 -143 76 -453 77 119 -139 82 107 -8 176
3764 176 -30 308 -74 -87 -180 259 44 77 178 -82 -143 154 -39 -113 97 -176 -247 108 33 1 12 -146 178
3787 178 -118 192 224 -66 -126 -367 173 -84 -118 60 111 -89 -25 108 -100 49 -36 -274 52 203 410 136
3809 136 -127 -27 176 -51 -61 133 -45 198 -77 -354 77 -59 140 76 -19 -42 -47 -188 24 164 -64 -101
3831 -101 155 75 55 -13 190 -136 24 261 75 23 -199 -207 -39 351 121 -77 220 -12 -177 -135 279 40
3853 40 -243 -84 15 -87 133 92 223 -171 61 111 -43 93 208 -70 21 96 -16 -5 45 -81 291 316 -234
3876b34J17n9Q5o6J48j09Q1Q6J34n46K75J06OJ11L6r8k0Oj14R8k78P3J83m8K2
3901eR2q9K0l0Q2j43n1J67r8K2J1K9K60m39M1K49J81p8k57r3o7N2J04q6J81j90
3927a35J40o0j31K95j3j40KP0j3K1j39J47r8J38k31K02n6j23J56L0l3l6k4p1J83
3952H1J85k6k94M1J21j37l9L33m27J38j77K28K08k70L32l85J54j07K00k64Q5j21
3974a41K70J48j18k25O9m6k7J60K0mk50M62m53K22n7l99M34n0k40J14J20l0Q0
3997E9j61K21l05M15j74J24n0J90Rl09n2j7J18N2J9J60j56j37l5L29j62k65K5
4020a02K63j03k16k8K97r8k77M48j92m6L90n65K06Q3r6l9K23j92K68k48kK9J49
4043A52k29n3J18J54k68K55r4%M2j84J32jL91n78r1K85j26p2L33Mj03j70K3K15
$$ plain form
3876 -234 -117 -176 -91 -157 -9 -118 -37 49 183 -363 -88 18 24 135 171 73 53 59 -55 43 -235 -162 21 -27 -5
3901 -5 87 -2 18 -12 70 -73 -124 43 -55 -33 -22 7 267 -172 -131 118 299 221 -36 -129 -196 -144 -40 -126 55 -135
3927 -135 5 -55 -186 109 96 -44 -42 28 15 36 -103 44 -54 84 -147 55 -1 -124 32 62 29 -7 -31 -102 81
3952 81 266 240 -54 -13 108 -29 -68 265 -162 -24 -201 27 235 -35 297 -88 66 -41 159 -105 -20 -141
3974 -141 129 277 159 -66 3 -43 -70 90 110 106 -144 318 -135 87 30 -369 65 15 -225 -111 9 -21 59
3997 59 -102 119 -186 229 55 179 129 319 328 19 -33 -50 68 120 139 299 143 6 -29 300 138 -127 -102
4020 -102 161 58 -158 -186 111 13 -264 184 -8 -54 336 -229 -23 60 -36 -75 148 -44 224 -24 -26 3 152
4043 152 -77 -130 -12 142 -126 129 35 35 77 -107 25 24 415 -163 -254 31 -95 -167 166 170 67 -103 -80 135
4067A35j41m4n7J96Ql8q6L2Q1M1k46J15j35K63k42L0L39l91P4K0j36L50l17J54
4091EO3n1j28L3J02K0j72m9L41m32M26p8j8l60M8L63Q9k30J58p8J1J15J24l07
4115eN6J86l12JJ74j56M2k4K47l52J93j79K83j86j79O2J58K97k65K09n19L69j25
4138b5Q0m9j78J83j65L3j95L93l3j72K87m0J83m27o1o2O5J35k45L84n9j60p9K40
4162C3j33N7M9L7l4j56Q1L2P0J34j72K7J55m52K27R5L7l21M34k35Q1k2J42M0n6
4187A50j91K5l76K56K0K40m61J70K06M6k42Q0J55r5K2M7o9J51k99r8K29J24K3
4210A13J56k89k02N42k87j04K11l84K48L6j46J82j99K81j03l8J00j28l49M12K6
4231G8k22K68j72P3m7j52J81j00j94J19J28j21J22j39Q4J48J2K86l49j00J06k6
$$ plain form
4067 135 -6 -50 -107 89 97 59 -27 5 86 127 -119 -4 -139 124 -118 -88 251 -140 -66 -46 -182 168 -149 5
4091 5 68 17 -111 -78 24 44 -128 -177 164 -268 158 80 62 -298 -250 113 202 -28 130 52 63 178 302 -5
4115 -5 51 237 -75 -74 100 -56 -14 -38 209 -143 50 -129 154 -32 -211 -149 9 306 41 250 -269 100 -25
4138 -25 55 6 -172 11 -154 -121 -316 77 44 -128 159 119 302 -125 -186 -248 -183 -48 -293 91 32 -128 -207 33
4162 33 -100 -43 6 43 9 -147 -66 -34 36 170 -2 25 180 -272 -45 50 87 -234 200 -35 46 24 166 206 150
4187 150 -41 -16 -392 -136 -116 124 -337 -167 39 85 -157 -77 78 -17 5 52 -17 134 -165 -263 -34 90 113
4210 113 269 -20 -222 320 33 -71 140 -244 4 40 -106 76 -123 158 55 17 117 -11 -360 52 78
4231 78 -144 124 -48 25 -22 -174 7 -93 -287 -168 -40 -161 -39 -178 -94 54 66 352 3 -97 9 -17
4253a7r0K66j74r4J6K22n7l75K90P7j59J70J48k75R5L3J2R1l33J58L5j8k8J33
4277A26m1K5j35k7o6J28j44J33j3J62l55J02o0M93m26L03N0k11l5O6p1q7J24l02
4301b61M10r5O0j06J13j43j82jL20q3Q5j36R5j10J72j30L4j0j35j52K83p4l9l5
4325a20J5K46O3l92L84k27R0k46J15J2q4J63m8o2O0J4l6K47k07N0k50n2L00j05
4349g0J86j77l6J12Oj80O3L1j5J18J06M8j48P7j82j37K82k05J89j14j18L73Q2
4372B91j22j93K06l91L60j9k56M51m00j81K08K59j25kL3j75N8j05J74NK04l09
4394b9K9n7J40m22K37K16j86M4o7J34j70J0J30j02M5R5J47j2q2M7l91K37r4J59
4418E8m29K07j59L96j91K83M1p5P4p5l6j72K33k14j35M35j72k5kl9R9Q5j25Q0
$$ plain form
4253 -17 -107 159 -15 -109 -93 129 72 -303 -13 64 -95 75 223 -52 43 76 88 179 -154 4 39 21 -7 126
4277 126 85 110 -25 -52 -118 10 -134 -1 -14 148 -207 -105 -165 328 -98 205 255 44 9 75 4 -83 41 -261
4301 -261 149 54 114 8 121 -22 -204 -205 115 32 117 -19 76 -34 138 8 42 32 -103 -255 28 -46 -85 -120
4325 -120 -105 141 204 -188 196 -31 59 -187 -72 -60 -144 19 -29 -91 -31 -17 -53 194 -13 37 -213 -265 35 -70
4349 -70 116 -61 -97 15 21 -159 -96 -65 -80 38 144 192 44 121 -61 -198 84 -121 68 -46 -164 209 291
4372 291 169 -24 182 -209 151 132 -124 327 -73 -254 -46 213 88 86 119 -56 2 -103 71 76 280 -29
4394 -29 0 -57 83 -339 -102 114 -72 -28 -95 39 -131 -121 9 -93 -48 47 194 182 100 147 -244 -7 -101 58
4418 58 -371 -164 -323 73 -118 165 206 131 205 130 94 -78 155 -59 -194 241 69 44 42 3 102 187 62 142
4442A42l41J25o7K41J24k55J06o4K16j54j90J14O5j93J45r5r0K08J2m11M87q2
4464D3q6O6l0K8J79l40o6K42J17ok21J02q9K2k4j15Q7J47M2J4k60K54k94J52J1
4489b5j98M16j74lK99l59J73J5k44N5K0q8j29L11r2k6J66N6k25J4O2k27N6M05
4513B58j58j50M0k94K16J25J87m68Q5M43l74P5J05n7J02l19L00J33k99J42k7r5
4535c0K39l43P4O6O6k44M46l34R1l33L22N2J13j45k53M8O1K15Mk0k28J05p5j20
4559b23R2K45j36o3j2O7J7j89L87k49P7K42j46M3j48k93L04m6q0K8j13R0p1K29
4583E2J66k53j75K22p9K1L1J12j09mJ53j24K75j47m31J24J25K54k00l1J24K1j72
4606d5J81j95k5K87j00l80K7J07J2M2kp6L62k52J4K98j66k47K21n16M40j25J71
$$ plain form
4442 142 -199 -74 -141 100 224 -31 75 11 227 73 -117 -3 62 -131 14 -81 -171 37 49 -362 125 43
4464 43 -43 23 -7 21 200 -140 -206 36 153 147 -74 28 -61 -39 -63 -178 -91 56 98 112 -148 106 -188 -36 -25
4489 -25 -223 193 19 16 315 -44 129 144 -100 -45 -25 -113 -242 69 -23 -49 117 173 -52 -38 24 -203 -147 258
4513 258 100 -50 -10 -304 -88 37 224 -244 -159 284 -90 -15 90 33 135 -184 116 249 -50 92 65 -30
4535 -30 209 -134 -60 6 72 -172 274 -60 31 -302 20 72 185 40 -213 -165 -104 111 115 95 -133 -28 -103 -223
4559 -223 -131 114 -22 -85 -97 -30 -13 -202 185 -64 13 255 109 152 4 -289 15 -31 -111 -83 -196 -106 -177 52
4583 52 218 -35 -210 12 -67 -46 -15 97 -12 -16 137 13 288 141 -290 -166 -41 213 13 -18 106 127 -45
4606 -45 136 -59 -84 203 103 -277 -250 -143 -131 -89 -91 -167 195 -57 -43 255 89 -158 63 -453 -13 -138 33
4629C3p9J27j23j71M10k40K60k68J08k10J62j33J6J82JJ14l41M65m20O8J08j41
4651g2J22j24K69r0j50J33j9l06J50p0L43k90n7R8j6q2J52k43j59L51J76K5j88
4674d7L4k68K98j5k1j75M1K58k3j3j8m2n5J67k21m5K72k49J21K04j53J0j14n6
4698a10JJ68j84M9L9n9j6J42N1k08N1M29l33j19Q1k3j24R6K8J41j68MJ32j08K6
4723a4K94k64j42j6K75j91p6L92k79K48l1j95n7q3K14r7K3k05K49j4j27J32R7
4746A33j95M7J25j56j62L17J35k73J06J34l15Q0J06n6l2L3j57J09N6k90M44%k20
4769c1m0j02L84Oj32nk8Q4k93o0L7K88j36N8N5j9J14k4k55q2K19j49r3n5N48n36
4795b47K40l3J00Q4j76j49J6J22J82j73j22K4J97Pj45O5k9J83l06J25J16j04l1
$$ plain form
4629 33 -46 81 -42 -213 197 -43 217 -51 57 -153 9 -124 -108 74 75 189 -152 313 -107 -39 69 -72
4651 -72 50 -74 195 105 -45 88 69 -237 -87 -157 186 -104 -161 -63 -79 -161 -9 -252 -411 -60 116 141 -47
4674 -47 -13 -281 17 2 -19 -194 -153 105 82 69 51 9 -46 121 -100 -145 127 -122 -1 203 50 60 -54 -110
4698 -110 -109 59 -125 -76 -37 -96 -112 30 81 -127 -76 353 20 -99 -18 -41 -165 -69 -41 100 -68 -64 68 -40 -14
4723 -14 280 16 -126 -142 133 -58 -134 258 -21 227 196 1 -56 -139 75 -22 1 -204 45 31 -96 36 133
4746 133 -62 -15 110 -46 -208 109 244 -29 77 211 -104 -24 82 26 -6 27 -130 -21 35 -255 189 189 -31
4769 -31 -71 -173 211 217 85 80 52 136 -157 -217 -180 108 -28 30 85 66 180 156 -99 -181 38 -111 -204 -259 289 -247
4795 -247 -7 -40 60 144 -32 -181 -165 -43 139 -34 -156 -132 65 72 -73 -8 -37 146 -160 -35 81 -23 -54
4818e4J6j36l7K94j57j51K23M2P4P6l54o2J73K86l94M27k21j22K49j84l26J49
4840a89N8J95j72K0KJ44L9k06K59j89j56K31j16J74J8j74L1J27k54O2k0J39K5
4863D8k11L09j51r9K06J3j92J94j11K9M3P3l11L59k05p1J43J4j42J8Q0k8M6J12
4887A66j45j17J08k0N0k35J89o8j1K71l52K66n5j44K17j66K29J0m54M22k20K71
4909B12k77j37L9K89o9o4K60l46mJ6K70k60l1K51J00l93L46J4m34N9J79j00J15
4932C5N9j45l6Q0M7Nr3k63L39l0J12l8p5J22l70L36NO2n9r5J05J34j24o5J30j79
4958ar9k07K93M0o4l7n7O1K46l18J93n9r9O6n1K88l10l2J82k33N00j47l8N5m4
4983A28k9q6j73J93j91O8M06l19J30P8j86K06k84j51K09R6j69J43m5j42J33J84
$$ plain form
4818 -54 -38 -174 -211 83 -74 -225 -2 40 114 190 -164 -226 -53 233 -161 266 45 -77 172 -12 -338 -189
4840 -189 -131 64 -108 -88 -86 58 97 -109 150 -39 -195 36 -80 94 112 -62 -31 96 -158 -96 -116 23 48
4863 48 -163 146 -5 -104 102 115 -77 117 6 35 78 151 -160 199 -6 -77 66 80 -62 -44 36 8 54 166
4887 166 21 -96 12 -8 42 -193 -4 -72 -83 188 -164 102 47 -97 120 -46 183 193 -261 161 -59 212
4909 212 -65 -202 -163 126 57 -7 253 -93 -97 -81 189 -71 -102 149 249 -144 202 216 -218 -159 20 -80 35
4932 35 94 -51 -87 -7 40 45 -48 -311 28 -2 110 72 -3 119 -251 85 90 152 93 -2 103 237 113 48 178 -1
4958 -1 -100 -307 -14 26 -38 -75 -132 -71 175 -143 50 -9 -108 -42 -93 195 -115 -147 35 -198 302 155 117 172 128
4983 128 99 13 -160 33 -158 -90 316 -3 127 205 19 225 -59 -210 -1 95 -74 69 24 -118 15 199
5005A99j80Q1k16J8J79j55J68n9qL39m12Q5n5o8J26j34J62r3L8L0M8P1j94K13
5029A83m0P7o8Q6n26M24k12k4J78K9K4jo6k3K4j66J19K00k1l1j66r2K76K30n05
5054i1j19K93R7p3m75O65o41K99j19K92k3o9J52m09K09J07j50O5j72O7P2O5K91
5077C33j47k75J94k10K22k95J94k59J59O9J58k50O1J32o0r1m3J66Lj09Q2l7O9
5100F6L8J67k99Q2K16m24J03j3J94L8l25J90J29k98L42j37j95J02J85j36j68L28
5122A85k12l0k7J74j6q6j28K44l77K06L27m10O9N1m1K8m5J99l5k6m0j2k10K77
5146F5l22M08j41R9j96P7j28P9r5K26P7j37L5j15l3j82L12J42l07K73L1qm45J81
5170a04K87m15L79j46k53K03l4K22O0l06J13n6J09j34M8J01l00L18j11N9J77l86
$$ plain form
5005 199 19 100 -116 -98 81 -74 94 35 27 366 -46 39 -16 -84 42 -92 70 -23 15 45 93 164 -30 183
5029 183 143 220 152 238 -288 136 -76 -100 78 107 131 130 64 41 65 -101 18 218 197 166 0 -92 184 414 -91
5054 -91 -210 83 180 107 -368 297 -344 -45 -164 128 105 36 188 -221 -12 95 -55 10 -162 -95 -23 42 333
5077 333 186 -89 105 -105 117 -178 16 -243 -84 -15 143 -107 -46 86 26 -65 -108 58 61 -48 34 -3 66
5100 66 104 271 -28 54 270 -154 -51 -64 130 168 -157 33 162 -136 206 69 -126 -24 161 25 -143 185
5122 185 -27 -57 -84 90 74 -12 -140 104 -273 -67 260 -150 -81 -30 -71 -43 -88 111 76 50 10 -2 -212 65
5146 65 -257 151 10 109 -87 -10 -138 -59 -154 72 149 12 47 -68 -101 -283 29 171 -136 137 168 160 -285 -104
5170 -104 183 -232 147 1 -252 -49 -83 139 199 -107 6 -50 59 -75 -27 74 -226 92 -19 40 217 -169
5192a69K24J74k27K53l78j7L3L68l46J20j2J23p4j89J81j87L30k16K50k38k36
5213b33K21p9J1N8J35k32NL12k22Q9O1j97Q2J9p2l1j8LK52L9l86K60P4j09l0j70
5239a58J12J57L2n3N8j34p4J01J40k08j36K24j07J39r9N0J80k54J06j05L42m49
5261a36P2J15o0k3k79K34J35j52K04k35J32K7L6j08J00j31J71kn4j39N6J99j16
5284D6J67j61M3k26j7J40J25k18Q4N9l4k7N2O4k82J40K51l08K38l05M39m11j31
5307b72K44k28K77j25Q3n6L17l33j7O4K1OR7k12N0J2K80j73R3j39K68j99j26L1
5331c7K89k05K01k28q6L16k33k90J7M72j51m4J69m30R2O8m4K68j80%J3R6j54J43
5355F2j8j25J41r9r4J68k5J53l52J39J01L5l8J5j01j93J20P7qK0j64J73m9q5K23
$$ plain form
5192 -169 55 229 2 255 -123 -140 -107 261 -85 35 23 146 72 -117 64 -123 207 -9 241 3 -233
5213 -233 -12 -91 -80 -22 113 -119 -114 198 -24 65 126 -71 11 30 -42 -73 -91 -88 164 203 -183 77 151 42 12 -158
5239 -158 -46 111 143 90 148 14 -60 41 181 -27 -163 61 -46 93 -6 44 224 -30 76 -29 313 -136
5261 -136 -64 51 -9 -32 -311 -77 58 -94 110 -125 7 34 70 -38 62 -69 102 100 46 -93 -37 162 46
5284 46 213 52 95 -131 -148 -8 117 -101 -17 42 8 -19 33 97 -185 -45 206 -102 136 -169 270 -141 -272
5307 -272 -28 -256 21 -104 -21 -77 240 -93 -110 -46 -25 -19 78 -134 -84 -72 208 35 128 -11 257 58 -68 -37
5331 -37 252 47 248 20 -66 250 17 -273 -256 216 65 21 190 -240 -148 -80 -124 144 -36 -36 -23 73 -81 62
5355 62 44 -81 60 -39 -133 35 10 163 -189 -50 51 86 48 63 -38 -231 -111 -34 -42 -22 -186 -13 -62 -147 76
5380G6k68L84k51M8O5l40J82J95j44J94J0j40k5l0J06K3j21M7k02J19j44K46Q7
5403A17l06K76Oj17n6j8N5k4J31r3m9K5L23k88J92k24L55j59k19L3r2J74j22J04
5427B4n6k1jQ3J43k49K82l04J86k01K50j94j53M96k17j70k08M17j86M6K93l7j03
5450A20r8j48J87l0k09K05m4p1J66k05Q0J91k62K04J54j73o2J2J4J36l09L43k24
5473b3J26k32K50l09K25m3j31J52k60L93j09j13J76j3J96l25J11J56m65M11m19
5494b46O36n58Q9j47rK8M57k77P2NM0k06K70j96J17j09J39mp7p0m6K51m4N0n01
5519c36N55m67K59n4J81l79L23j15J4M3j71J32R2j15J24l18K27J81k36K2J5r8
5541a21J69m4j36O9M8j51J66J99k95J24j48L80m23J54j18J67r4O8K57k09m7Q7
$$ plain form
5380 76 -192 192 -59 -11 54 -286 -104 91 -53 141 151 11 -14 -44 62 85 -36 11 -191 -72 -216 30 117
5403 117 -189 87 93 -24 -80 -98 -43 -67 64 -29 -78 -53 270 -18 174 -50 305 146 -73 -40 -132 42 -80 24
5427 24 -32 -53 -54 29 172 -77 205 -99 87 -114 136 -58 -211 285 68 -102 -310 107 -79 -33 260 223 120
5450 120 22 -126 61 31 -178 27 -17 -88 78 -127 -47 144 -118 86 240 67 5 17 31 167 -142 201 -23
5473 -23 103 -129 121 -188 37 -6 -137 15 -245 148 39 -74 102 89 285 -40 71 227 -238 173 -246
5494 -246 390 -168 -79 -226 -235 -207 250 -27 45 50 90 -116 154 -42 75 -34 105 101 24 -46 -92 159 115 165 -336
5519 -336 219 -248 11 -43 138 -241 82 -33 -19 24 -147 -15 77 -38 86 -232 -5 176 -60 -38 -23 -121
5541 -121 48 4 -132 -63 -15 -166 0 199 -96 28 -120 260 -163 -9 -127 40 -54 14 271 62 15 102
5563A02J27k49j09R3N4k19K45k92L29j75KJ1n2O9J27l20K82L7l0J80m02J90MJ18
5587A22k39J98J0O5m5j98J86p9P9k52q9J95J10j80j9J15j06R2L1K35k08J55K4
5610B02m53K69k33K87K3k64J77k39M20k97J86l6p8J78k73K77l58J17j08Q1M6K73
5632A97n15N31l79K3j85L10k09R7L32m83K92j29K45l57J35J58l05J22K12k56K87
5653A23j50j92K17J60o7m41L47j3J75Kn21K94k28K95j40K21J02p5j44P1J14k44
5675i4K92j21j10j32L9K3j59R7j9J38J95j72L62l77K14q6j77j45J36K49l0j73
5697e0J47Lk39J46k88K17LK22j64P2J5%q3o9M7J3J56Q6k72j4J11P1l10Q9K25j95
5723f1J99p0j62J11Q3n8j76Q2K84k74J63k81p0J85j70L15r9P3L4q9l9M0p0K09
$$ plain form
5563 102 229 -20 -129 -36 18 -201 44 -248 81 -94 -92 -81 -133 -64 63 -257 25 62 32 212 -190 0 4 122
5587 122 -117 81 91 156 111 -87 99 20 99 -153 -242 -47 63 -117 -136 -21 -127 -35 -4 231 23 178 202
5610 202 -251 18 -215 72 95 -169 8 -231 189 -108 78 42 -36 142 -131 146 -212 -95 -203 -122 -76 197
5632 197 -318 213 -166 -143 -328 -18 -227 -130 202 -281 11 -118 127 -230 -95 63 -242 -120 92 -164 123
5653 123 -27 -219 -2 158 91 -350 -3 -16 159 161 -360 -66 -294 1 -139 82 184 109 -35 36 150 -94
5675 -94 198 77 -33 -165 -126 -103 -262 -165 -184 -46 149 -23 339 -38 176 90 -87 -232 -96 153 123 -50
5697 -50 97 100 -139 7 -281 -64 -61 161 -3 69 84 84 1 -68 -21 -8 148 234 -38 -52 59 130 -180 -91 134 -61
5723 -61 138 68 -94 17 100 42 -134 -52 232 -42 121 -160 -230 -45 -215 100 1 74 108 19 -20 20 -50 159
5747A59k66Q3K00l01r4J21m7L78n51M60k46O7q5j07M21k72J71R4k37K02m2l51
5769b43L53j19M7o0j8M9j83J8K68k93J2K50j03K10k30K54k01J97j30J45m3k24
5791d4P2k7K93o76K08q9L35k9k75L53j12j16O2J94j85%k11K61KP4j38K30m99M27
5815A10j21J13J31o2K5k46L7J57n2j54QJ03P2m08J91J69m7j11J46N4m87M08Q2
5838A18L0k59J47j7P8j98n3K27l8k92K51j5oJ1j07j69J36J20o7L23l72K00J61
5861B09l20L18n06K20j4O6j31M6K59j20J17j27o3N5j41J25K95k91j64M1J47n3
5883c2Mj9j4M9J51K52m39K88l20K45J35j81Q1j31k72L08R1j66k44K44J95k06J14
5906A33N8q5p7M9J42j30r9J79k6k20k3ok0K27k25K7K32m50J96M9JQ0j72J08rJ47
$$ plain form
5747 159 -107 -24 176 -125 -219 -98 -145 233 -318 142 -104 -37 -122 -229 192 -80 91 185 -52 150 108 -243
5769 -243 110 -9 38 -22 -40 9 -174 -156 112 -181 -169 81 -22 188 -42 212 11 208 78 223 180 -44
5791 -44 28 1 294 -382 -174 -263 72 43 -232 121 9 -107 -45 149 -36 -36 -247 14 16 90 -48 182 -317 110
5815 110 -11 102 233 171 196 -50 -13 144 92 -62 -54 49 121 -287 -96 73 26 -85 61 115 -372 36 118
5838 118 148 -111 36 19 97 -101 -154 73 35 -257 -6 -21 -27 -16 -123 -292 -156 -36 -103 220 -152 48 209
5861 209 -111 207 -299 -79 -93 -27 -158 -112 147 27 144 17 -46 9 -132 -7 288 -3 -167 -126 21 -32
5883 -32 -28 -47 -61 -12 139 391 -48 240 -80 165 300 119 200 69 -203 105 196 30 -214 30 225 19 133
5906 133 191 106 29 78 220 90 -9 170 144 -76 -99 -105 -125 102 -123 -96 136 -314 -118 -69 -68 12 -160 -52 -61 86
5932H6M5r7j62k2J11r3J90K6J37r0j59L76k57p7J09j51J47k40J87q0k2p3O1K28
5956A80k8K8m13N29k31L27j21k74j31lL44m01K11R7k22JJ16o5K07J9j67j35K08
5979G6J87l38q0K80j21j41k16L40j80Q3j52K50P1J14j59J91l13J9k3L43j99m6
6001a4o7j7J46O8k38J20K12k81PrJ77p5q5N1k5J84ll05J46ll2M7J88k55K21k84
6027a26j98K56N2J07L0p5J0O7n4r5J57j32J26n6n0K40k67M07n88L24j59k3L0O2
6051D5l30L6J06N24m39J27j34J24r8k69L18j85j49L30l38L44J71r5k19L26l10
6072a15J95J11k45K86p7k21J93l2J58j75l94K37q9R7J62J56NO1l45k30M08qJ8
6095A56p7K05k59O4L0L5k2j52OM33l23j41K64j20k32J12M0k1m9J44q1Q3k54K38
$$ plain form
5932 86 131 34 -128 -150 -39 -132 58 84 221 131 -28 348 91 14 123 -28 119 -121 66 -14 -36 -109 -48 180
5956 180 152 180 -233 296 65 392 271 -3 -134 -137 207 -194 17 114 -108 -107 9 -56 151 170 3 -132 76
5979 76 263 -75 -155 125 4 -137 -353 -13 -193 -110 -262 -12 59 173 14 205 -108 -89 -112 231 32 -14
6001 -14 -81 -98 48 116 -122 -2 210 -71 -64 -73 104 29 -56 -5 -30 154 151 -154 -8 -11 -43 4 192 -63 158 -126
6027 -126 -324 -68 -16 91 121 46 56 123 69 -26 131 -1 125 69 19 259 -8 399 -189 135 -24 -47 -17 45
6051 45 -285 -249 -143 381 -58 69 -65 59 -39 -308 10 -175 -324 6 -332 12 183 88 -131 195 -115
6072 -115 80 191 -54 232 155 -66 127 95 253 78 -316 -79 -168 -71 91 247 252 313 -32 -262 146 138 156
6095 156 79 284 25 89 119 154 132 -20 -14 419 96 -45 219 99 -133 -21 19 -2 -51 93 12 95 -159 79
6119G9j14j36L90p9j53k05O0j51K89K04j25p9M2k3j22K34l1j79k85L91j51O8N0
6142b6P5q8M20m78MQ4m6J97K0Q2j59M5j65R0j28j84K04Jl0l9J43j22pL6j0K50
6168A69j35k47L13q0p8l3J87J14j79o7n3m9K94j60J35J28k81JL62n08J07k56J15
6191b01L38J22j42n16K16K43k92K64r1N7J05j72lM6J0j25J94J52K0l41J58k7M
6214A9R7j47j9J2L02j22j81K36o2Oq9j22R7l28K63j20lR8J03O4m35K45j18J79
6238b5k5J46qj6n5m3j28M8J59l03K98j23R9j22L13j57N5j78K35k42Q4O6o7P1K6
6263A08k48K00p9o5m1rL53k99J07M8l0k38K82p8j10L9Q7J17l6j45J26k73M7O8
6287f9J10J47k76M8K30j58P4K8k75J64j64K92l64K01J31j47J01M9m6R2q8j28J
$$ plain form
6119 79 -35 -171 219 140 -13 -218 -158 -309 -20 184 59 -20 22 -1 -123 111 80 -99 -384 7 -144 -76 -26
6142 -26 49 -39 381 -97 -93 -9 -55 142 162 244 85 130 -35 55 -73 -257 -53 -52 -82 -121 22 -100 -107 -71 -81 169
6168 169 34 -213 100 20 -58 -91 96 210 31 -36 -89 -138 156 -4 131 259 -22 -21 341 -167 -60 -316 -201
6191 -201 137 259 117 -399 -183 60 -232 32 -59 -2 103 -69 -72 -26 -16 -141 53 205 225 -116 42 15 19
6214 19 116 -31 -50 -38 264 142 -39 197 135 141 52 -70 27 -301 -38 -158 -161 -63 40 104 -331 -86 -204 -25
6238 -25 -50 96 88 72 17 -26 -154 -106 53 -250 48 -75 24 -98 215 58 113 -65 170 -72 12 78 11 82 108
6263 108 -140 60 -19 -84 -125 -134 219 -80 27 75 45 -193 89 11 -99 -60 27 144 108 -37 89 -184 -137 -69
6287 -69 41 188 -88 -40 190 32 106 134 -141 23 -141 151 -213 -12 119 -28 73 122 76 168 80 -48 -47
6310d7J50J93m56J17l4J81M0k36j4K89l68K90k28q7K21J51o7m8OJ58j68J35J26
6333C04m02J39Oj69J90n8k26J99m8Q5K04k54J21j89k3J64j40K09k24P7J39O2j65
6356AK94k8m25K78J45n38J98j12L30r0j03K07j39J06j61j79J4J73M4J76l17Q7
6378c9j47L97o3M5k47j38J5L66J62j50l32L18j51j88O7J65k3k94L91l92M47l62
6400a53Q3L00k72J43p5J12j87k4K84j58J03k1mO7j59j71q3M64k47jL3j8J81l17
6424a20K21n2r4l0K3O6Q2j38QK45l8k64K04j71l7j29K85l6po3O1k89K00K25k53
6449a01L38j20k83M05j71k97J85q5M3j51J43J22J40m3P0l50J88l0J19k49K32m31
6471c26K02J28k82q9L05K28k7q4j8R7l5j52J99o0j06j67J67J78j29j88J87J38
$$ plain form
6310 -47 103 296 -160 -43 -77 104 144 -92 -106 183 -185 105 -123 -210 11 162 95 47 53 211 43 178 304
6333 304 -98 41 47 -122 68 10 -216 -17 -65 20 224 -30 91 -98 -121 43 -97 112 -112 -35 104 166 1
6356 1 295 267 -158 120 265 -273 -75 -187 143 53 -50 157 18 124 -37 -216 -202 -29 15 191 -126 -39
6378 -39 -186 211 148 193 -54 -192 -177 189 351 201 -131 187 36 -152 -85 80 57 -237 154 -238 209 -153
6400 -153 -70 230 -42 101 26 138 -49 -73 211 53 156 135 131 198 39 -132 -215 249 2 1 34 16 197 -120
6424 -120 101 49 -45 -75 -52 14 96 -42 -34 211 173 -91 113 -58 -95 -224 61 25 18 -45 16 -273 -73 152 -101
6449 -101 237 117 -166 239 68 -229 -44 -129 -86 -237 -94 28 168 125 195 -155 33 3 122 -127 105 -326
6471 -326 -124 4 -278 -367 -62 166 139 55 37 134 99 -53 146 86 -20 -187 -20 158 29 -159 28 166
6493A66l81l1L39j62m5Q9j8k7J21m7Q1j16Ml8R9J15j40J7K2J68l75J56l2j09Q6
6518e8K55m3k93N3J07k4J35k8J08l64J54J4j33L48k40p9P2J68J29l41J82j29p7
6541h4L18k97J24m2L36k11k07J47m13L06r5j18K68n4R7j17K5j32J10K6J16k61
6563a58J04l9j83L89Q2r4k09q6N3K05L04m21r4K17R0j10O8j02j99K11Kk89O6L29
6587A36l49K53j77P1r8M16k37J73j83L4m8j22K48j8J47l67K93l79M06l29r5J82
6609d3o1R5O1j58K28j23l18J93Q9r9P2mJ61k67J32J8J62j64L4L11k63j16N4l2
6633c8q9P9J26N3k2j88L66l60o1J68n9J5k48L07K69k69J48O6k55J47k10M9l0o4
6657a00o2K96n9j17R6jK9j09j94J87J48q5n29L08K58l0j47K26R3k62M5j34lJ82
$$ plain form
6493 166 -215 -246 93 -69 -114 -25 -43 -70 51 4 85 -31 -27 -65 34 149 9 26 48 216 -159 -3 -35 -144 -58
6518 -58 197 154 -139 -86 21 -3 132 104 212 -152 2 16 -117 231 -9 -88 -16 152 281 -60 122 -7 -84
6541 -84 234 -63 61 19 355 144 -63 84 -329 -23 -118 -236 32 -22 75 -42 -17 -149 -39 -13 103 -158
6563 -158 -54 -93 -276 113 195 101 -108 -194 -141 64 368 -53 -147 70 160 50 118 16 -183 28 30 -259 -193 136
6587 136 -213 40 -137 -66 -164 252 15 188 5 39 -9 -131 117 99 246 -121 172 -207 199 -130 -225 -43
6609 -43 -104 -9 52 -106 122 -1 -319 -126 -37 -136 -64 -68 93 -174 -42 -24 138 -26 8 319 56 -60 -6 -38
6633 -38 -127 -48 78 131 109 -79 287 -73 -134 34 -25 -10 -258 49 318 49 197 263 8 155 -55 -6 -36 -100
6657 -100 -162 134 75 -42 54 53 82 -27 -221 -34 114 29 -500 -192 66 36 -111 115 208 -54 -9 -143 -146 36
6681C6j44J00J15P7k14m7J30K01k73L5J5j46q2L19l55Q8K77j70J56k31P3j29K57
6704H8k31J81j8m9rj16L05o9j83O3kM8K6j29R6K28k57j30R5J01k0n9j38K09K34
6729B64n62J56J73P1j05Q3l6j2l75L08l7J53j89L68j75J1R4k33j28Q8j11j39N65
6752B32j6l40O8R7j13L41l77R0m4J51P7j66J55j99j4k77L48m9k4R7J05p1Q0l58
6776b07J44L16m28J94m2j7L25l32K72l28P6j71K57j87J13Q4n9R6k45K02j70L13
6798B06j73r4L25l46j47K14J16j76Q5m2k42M19k09J3Q1K11k94j32P0J55j35K31
6820A36k54K64k05K46Q3j76O0p4n2j17J53pj67J54k08K63j74o2K3L67j83Qk41
6843a63K07k54M0J35q1K06o1N4NQ2m5k91J41J73m0oq7N8K3j48J21oQ0j7k4j46
$$ plain form
6681 36 -108 -8 107 184 -30 -77 53 254 -19 16 31 -115 -197 122 -233 -145 132 -38 118 -113 -40 -169 88
6704 88 -143 38 20 -29 -38 -154 151 82 -101 -38 -40 8 34 -95 1 229 -28 -158 -63 38 18 -41 -179 30 264
6729 264 -298 -142 31 102 -3 80 44 32 -343 -35 -72 81 -108 260 85 96 190 -43 -171 -83 -194 -333 232
6752 232 216 -124 -56 41 -72 269 -108 -18 -62 89 166 0 155 -44 -58 -335 13 -36 -60 37 142 71 151 -207
6776 -207 -63 253 -175 19 -23 -40 285 -47 225 -103 -27 -198 59 -128 -15 69 10 106 -139 63 -107 206
6798 206 33 -61 264 -82 -229 -15 101 -75 10 -32 -274 145 -64 -51 30 241 -53 -185 -115 40 -95 136
6820 136 -118 146 -59 187 270 94 154 80 28 -89 64 57 -110 44 -164 99 -75 -137 -114 253 70 78 -163
6843 -163 44 -210 -170 -35 -116 90 29 83 88 170 125 -166 -25 148 108 102 15 73 96 -52 69 63 143 126 102 -44
6869d4J7L79n66K44k48K77L3L3j42P2r0J01mj43J7J74p3OQ3j80P7k3P5j25o1L01
6895A90l48P6J26l6j68L20Ml0l03J58j6K50m4l07j38K49m5J18l08M40k10o2O9
6918a5N7J86k66j1J42p0M9M4k35K48k13K9Q1N4m36L00J59j2j14J24l1j92L5J44
6942E7O6P6n2R7m9k03L0j28K35k04J21Q7j40n6Q5j88K12j72R9k2pJ3j46J5K89
6967A15k62J57p8K5Mj84L29J66J0k54m2j2Qk43K81O6L0p6r2Q6J20j42O3m1q2p4
6993a22K17j28L14l51J32J87j44l79O0L13j76j83M00l9N6r3p9j29M11k28n6P2
7015E5j07J26p4M2j35J58J08j85L8q1L15m95K97Q8j19N1n40M71j0lk33L14R2l5
7039A38l37K15K54l92J45l02J23J00j37L27Q8q0k55P5j48J51K18j67j14P8k78
$$ plain form
6869 -44 -27 352 -214 30 -218 59 92 125 -17 55 -35 66 62 -81 -64 110 37 43 126 -54 23 0 75 -50 -111 190
6895 190 -158 -82 44 8 -160 160 164 134 -169 -11 -27 223 179 -128 -266 -17 -62 56 -252 188 -22 -84 -15
6918 -15 42 228 -38 -49 93 23 72 116 -119 129 -84 -55 26 80 -356 -56 103 91 -23 101 70 -122 -87 57
6942 57 123 199 147 244 195 -8 22 -106 129 -75 46 133 -7 -63 22 -166 46 -126 -27 -49 -56 -43 -189 -174 115
6967 115 -147 10 -68 -43 -39 -223 106 272 282 28 -14 -26 -18 -261 20 86 116 40 -52 34 154 12 75 34 -48 -122
6993 -122 95 -33 281 -70 62 249 105 -274 -214 99 -77 -260 140 101 157 64 -15 -144 267 39 -17 55
7015 55 -52 74 0 42 -93 65 173 -12 26 -55 260 -235 62 150 31 82 -458 13 3 0 -233 81 173 138
7039 138 -199 16 270 -122 23 -279 -156 -56 -193 134 222 142 -113 -38 -186 -35 183 16 -98 -20 -298
7060b98K95J05p8k2k0J39j65k4K33J7k92k4M84m40j06n5J9J23J55lM4k30j5J66
7084HN6P3k02K68j12m02M25j94K20j71l58K75J91k41K02M5RJ89m25J86J4Q5k75
7107a34L6l0K14k37J4L29p3j78r7j0R4P3j33K4J54j44J68J11J0p6l5l60J15k7
7131a92K00m2QK65l59K01l72M72m0k60Nk8k1J76j09J05K83k49J9p2j03J06J47
7154A40n6k56J51q9L09r1k46J40j8rj03K55mk74J96M3Kk54K29r4l5R3p4N2j58
7179a51n5K64q6Pj45K15j4j12J00n5P9K84l28j53K52N1j27M4l1k7l20J01Q6K46
7203A25Qk53L9J53Qj59O5j07J89jj01L06m01m0L08k3k50j00K36j72K74j68O5N0
7227E1j4m4q0J5J21J22k04O3L5J44p5l6j77M3n5j01O3P6j36K0L51j90j90J13p1
$$ plain form
7060 -298 -3 102 24 2 -18 121 -44 -68 165 182 -110 -134 350 -90 -196 -251 -232 -109 46 43 87 -143 -158 8
7084 8 64 137 -65 203 91 -311 114 -80 140 -31 -389 -114 77 -164 38 83 92 281 -144 42 56 141 -134
7107 -134 -98 -128 86 -151 -137 192 119 -59 -156 -166 -72 1 -132 -108 46 -98 70 181 191 115 80 -280 -165 -192
7131 -192 8 -34 -26 239 -120 81 -291 181 141 -119 -114 -142 -163 13 -96 9 292 43 62 -10 -113 -7 140
7154 140 84 -172 -21 -110 199 108 -138 2 -16 -25 -128 127 123 -151 45 88 90 -164 65 -29 -64 29 -45 7 -151
7179 -151 -206 58 -28 -21 -166 49 35 -77 23 -32 47 331 3 -150 102 153 26 70 39 12 -308 -207 -121 125
7203 125 133 -120 -81 72 80 -79 -14 -121 68 67 -34 272 -129 -169 139 116 -134 -234 2 -170 104 -64 1 51
7227 51 37 -7 -87 -72 49 171 -33 30 65 209 134 98 -79 -36 -91 -192 -129 -53 -189 -169 182 -8 -198 -85 -156
7252a56J70m2j37jJ73J0j74L37k63k14J77K16l8j65N5J43j59l1l7J38k02P0M3
7275h7K54l04J28o3n4L12k31n3l0j26j7K59K49j91l73J96K54q7J15j99pJ82l76
7298b49O5J99r5J80j14kj43L1O3o0P0j33Q5L26j87O3k9J4l67K84J73k55j08L45
7322A56j64J50k00J35q0J78j70r6L8k0m8L64l88J94NJ04j34R5j20o8P9J84k43
7345d9J31q8J34j89o5K55m39P1L63j92L50l84M08k87L16k89k11K9K01k3j25K13
7367A30j39N1n6K26j62j24j03L42j88J08j04Nl1j21K91J55k35R0j12o1J44k02
7389i6J57j61K26j93j81j87N23l22J98o0P0q5N2P8K00l56M3J69O0j86j16L51j99
7412a5n8rQ3j12j05j11M44n7j79P2K33k46K10o7r5K8j10O7lj20K96J6j67P6k37
$$ plain form
7252 -156 14 -28 -165 -166 7 17 -157 180 -83 -297 -120 96 58 -107 -52 91 -68 -99 -136 2 -200 -130 -87
7275 -87 167 -137 -9 -72 -126 186 -45 -98 -128 -254 -271 -12 237 46 -327 -131 123 36 151 -48 -55 127 -249
7298 -249 -184 15 -80 100 -14 -16 -159 -128 -65 -125 -55 -188 -103 223 36 99 70 84 -283 1 174 -81 -189 156
7322 156 -8 142 -58 77 -3 175 5 -91 -53 -73 -121 243 -145 49 54 158 24 119 -1 -69 10 194 -49
7345 -49 82 -6 128 -61 -126 129 -310 -239 124 -68 282 -102 306 19 335 46 -165 -136 65 42 -83 130
7367 130 -9 42 -14 212 50 -74 -177 165 -23 85 -19 -14 -45 -166 125 280 45 135 23 -38 106 -96
7389 -96 61 -100 126 -67 -248 -435 88 -234 -36 -96 -26 -111 -59 19 219 -137 -94 75 135 -51 -167 184 -15
7412 -15 -73 -82 1 -111 -216 -327 117 60 -119 -47 186 -60 150 83 -12 16 -94 -27 -30 -150 146 162 -5 71 -166
7437a66K38N0n6l9l3J17r8j01m9J98j62J58J3j40K4R4o7j55K43n0k69J41K75r1
7461G5J03j01k54K24K4j8l24L73j07K01l6k27P9j31P7N0K6J13J4Rk21L94j99k44
7485a00K56j03rJ97k97K3j73J66o0J11R0n5N6N3Q4j48k66J00k1J8R9Q3j95K1l6
7510a06J10j04j24L41l06J18J14K09m18QJ36L9k24J15J52J0r7r5j09J14J17J35
7532A35k69k2M10k86k19L41j8r0J46M7j46K1K71j73J12K15o56K50l1j79j70L23
7554A2j34R6J06j10n4J24k5K2M4J24j78j48J38q7j65J76K08k84r1K14j6l4n3M3
7578g2Q4j29k7K7J40M2R8kk08J13N2j63P1M1N1P9k54j22L6k2J23RK7pK12k99J20
7605B0m8m5k80O10l09K8P6k29K45j74J00m3l4K01k17M10m31J60R0l15M00k29N5
$$ plain form
7437 -166 72 122 66 27 -6 111 13 -88 -137 61 -101 57 70 -70 -46 48 -19 -174 69 19 -250 -109 166 75
7461 75 178 77 -177 47 71 53 -271 102 -5 196 160 -67 12 -119 -42 8 34 147 161 170 -51 343 144 -100
7485 -100 156 53 44 241 -56 -33 -206 -40 -100 11 101 46 102 155 239 91 -175 -75 -96 -78 21 104 -91 -70 -106
7510 -106 4 -100 -224 117 -189 -71 43 252 -166 -158 -22 17 -207 -92 60 70 -27 -122 -231 -117 0 135
7532 135 -134 -156 254 -32 -251 90 72 -18 128 175 29 50 321 148 260 475 -181 69 38 -141 -311 12
7554 12 -122 -26 80 -30 -84 40 15 37 81 205 27 -121 17 -70 -235 -59 149 -135 -226 -12 -28 -62 -115 -72
7578 -72 12 -117 -144 -117 23 65 163 161 -47 66 118 -45 26 67 118 197 -57 -179 -143 -165 -42 -33 -6 -13 199 -100 20
7605 20 -28 -73 -353 257 -52 -24 52 -177 68 -106 -6 -49 -83 118 -99 311 -120 40 130 -185 215 -14 41
7628D1j13J18k35J71k88M26j97J79j85L8j41K17j65L9J75O4j10l9J66r1Qj51K5
7651d8J28Rk56L28J23l38j5O8j13J25J76r3j11P1j83j54K06j00J19K09k58J17
7673A0L6j68No1K57n8p3j3j28O5K05j55M3J38j14J58k66L61j22K7l46J38n5M3
7697g3J07K27l04j78L49k47K31k5l66L33J02Ll83R3L67k01j18J94j8j54J9K27
7719A85l90j04L17J23k6l33J66K35j47k19L06j90mK3R6L6O1l66L35k7j57q3M29
7742B66l66J18J78k7k51l2J30J05Rk55L18p0k22L10j43j8Q6k06p8o6K03J25n9
7765E5k21L2J77j02K18jj27J48p8j12j24J43N6k38L51k69J46n9K1KQ8J60l64K57
7789A59k04l6L1O1j15J14P2J42m08L59r5m2k06K23J88k97L28m12J84k24K57o3
$$ plain form
7628 41 -72 46 -189 -18 -306 120 -77 102 -83 -45 -186 31 -134 -95 80 144 34 -5 161 70 78 -73 -48
7651 -48 80 89 -167 161 284 -54 -69 -1 -114 11 187 94 -17 54 -129 -283 -77 -177 -58 151 -107 10
7673 10 46 -122 -117 -178 79 21 -52 -65 -193 -128 77 -78 -35 103 -11 147 -119 242 120 147 -199 -61 -116 -73
7697 -73 34 261 -43 -221 128 -119 112 87 -279 54 156 159 -224 -131 236 35 -83 111 93 -61 -42 185
7719 185 -205 -309 8 131 105 -228 -62 173 26 -193 113 -77 -81 -58 38 74 135 -231 104 77 -80 -163 266
7742 266 -100 18 196 169 -82 -114 16 121 130 -125 193 123 -99 211 68 50 136 -70 -148 -214 -11 114 55
7765 55 -166 -134 43 -59 159 158 31 179 101 -11 -135 8 64 -174 177 -92 54 -5 16 18 106 266 -98 159
7789 159 -45 -81 -50 11 -104 10 82 224 -184 175 80 38 -168 55 243 -54 274 -138 46 -178 79 16
7811A6p8r1K34l6q9O7K47k23k5J77k74o9J45J4j91J28Q3pK95k98L45l90k7J69
7835A22m09O25j95k84J90k94K70o0K70k17K05l03J36J2k23N71l20l9q7j35K15
7856E0N8j53j34M9M4m9M25k94Nk06M74m00L54k30p7M26k85j02n4K8Q9K5MJ13r9
7881F1R7j08K9j75L58l52J24J17k99L66j81K39o76L08R1pO9j66O1L0J77j12J7
7904F8m8K5o6J13j33O3k70L22j09J55k40J46J22K7m30K18J00l15K39J98j05j28
7926d8n7K41m08M08o1L6j17M9j18m4J3K6Q5j12L00kk32QQo1J44p6k8J97l67P2
7952a44R4J74n0N0J03j81r1N6J6l5J8q8J97k05J18k3m3K22m10K82j53P4P9L1j99
7977a08r7J46j75L24K2k12J90k04l3J92j0K55m36K27J40L5k94j7n7J51l0J09j51
$$ plain form
7811 16 -62 -153 81 45 -44 23 270 47 22 199 -75 -144 1 15 -176 -48 35 28 323 25 370 -20 -47 122
7835 122 -287 338 143 -141 49 -245 25 -35 235 18 223 -80 56 68 -155 416 96 57 -30 -165 50
7856 50 108 -45 -179 -130 -86 -135 290 -4 1 -205 269 -131 223 -7 -84 342 57 -45 -99 -71 18 43 47 160 61
7881 61 158 50 79 -96 262 -90 34 151 -148 218 37 276 -400 -92 -1 -8 61 -105 -44 -14 163 51 68
7904 68 20 45 -21 92 -41 22 -248 74 -35 120 -120 26 148 175 -255 -37 63 -252 -13 185 80 -48
7926 -48 -105 136 -272 136 75 111 -6 43 -75 -119 -106 -80 5 -107 193 191 -41 -33 -25 -86 58 -18 -46 151 -216 -144
7952 -144 -50 124 74 124 227 46 -45 11 27 -8 10 -78 119 -86 32 9 -34 188 -222 60 -93 -19 60 91 -108
7977 -108 -205 -59 -234 90 112 -100 90 -114 -147 45 35 290 -146 81 221 256 -38 -55 -112 39 9 118 -33
8000c3O0J01J17j40J4p5j34J43P5M3l29K64J31n63M41K38j19k03o5K19j08l9J85
8023B23n60L88j68J38K04k3l8j86J10j01j17rK90k02J43j39j21L15K32l90Roj17
8046a25n1K89k02J53J42k04N9K3R9j09L1nL7k03m7P0J3J64j05J9n1k8k29K22p
8071d5k05L5J31J17j29J86j62N4o2M9L4O7q5K7k21K13lJ2j93K28q5K25j3j55J02
8096A22j37K01k84P5j6J95k81K43P6l6j15J8l18%Q4J57Q9j56J95k1j85n5l6q5
8120b70K78j99M99l76J11j94LJ64k82L05j02k03J68K91m30J05K70k80P7j28J71
8141b2J49k63J4J68k13L38J1m02L08j20p4J50K7j3J29j54k16J06j79K55J81J09
8163B89l15R0q6j69j7J24J85j33m1R7p2J69j7o5j19J10k19J95J7r1J75r3p4j09
$$ plain form
8000 -33 27 128 245 105 119 44 -90 53 128 171 -158 106 237 -326 115 353 234 31 -34 185 77 38 223
8023 223 -337 51 -117 21 225 202 164 -22 88 -13 -130 -139 151 -51 92 -47 -168 147 379 -11 -2 -8 -125
8046 -125 -176 113 -89 64 206 2 61 84 183 74 105 100 137 -66 -113 -43 -30 134 29 48 -3 -31 -260 -38 -45
8071 -45 -250 -215 -84 33 -96 90 -72 -18 -80 -31 3 70 -15 12 -209 4 1 13 -180 48 -37 188 175 20 122
8096 122 -15 186 -98 -23 -39 156 -125 118 194 158 43 61 -257 -257 -173 -16 73 -83 112 91 -94 -149 -185 -270
8120 -270 8 -191 308 -68 43 -151 -148 16 -266 39 -63 -266 -98 193 -237 -132 138 -142 -65 -193 -22
8141 -22 127 -136 -122 46 -167 171 182 -220 88 -32 -106 44 71 58 187 33 -183 -77 -256 -1 180 289
8163 289 -26 64 -22 -191 -208 -84 101 -32 -73 24 -48 121 104 39 -80 30 -189 6 23 -68 107 14 -60 -169
8187a69J31JN5J60
$$ plain form
8187 -169 -38 -37 18 178
8191A78
$$ Imaginary data points
##PAGE= N=2
##DATA TABLE= (X++(I..I)), XYDATA
0@%%%%%%%%%%%%%%%qJ6j6J6j6J6k4L2l2M0m8N6o4P2q8J03j14J26j46J67j85K09
37A12k35K61k92L25l63M03m46M94n46O03o65P35q10Q91r82J082j194J319j459
56g67J618j798K008k253K544k899L343l912M673n759P439j0420J7345o9408j8932
71g7178P0423J6993J2570j7582r599p234J3479P075K993j0609q552o840Q447J1299
85E685O794n963p344p828J000P007Q215j735n708n732m48L736P518J770m765o096
101c894j275J764M870L636j336n261k713J192L114L313Q98m033m233L95L123K826
117B386J277j485m262j539K000K815J404n11k412k742L11L618J638n90j169k478
133a739j284K033L031l5r00j434j912Q88K195J392j111j388q58n66J121J935N34
$$ plain form
0 0 0 0 0 0 0 0 0 0 0 0 0 0 0 0 0 -8 8 -8 8 -8 8 -16 16 -16 24 -24 32 -32 40 -48 55 -59 67 -79 88 -97 112
37 112 -123 138 -154 171 -192 211 -235 259 -287 316 -349 386 -424 467 -515 567 -627 692 -767
56 -767 851 -947 1061 -1192 1352 -1547 1796 -2116 2557 -3202 4237 -6183 11162 -58246 -77178
71 -77178 -6755 10238 22808 5226 -4373 -11607 1872 8947 11940 1331 -7221 -14061 -5614 5685
85 5685 12479 6516 -828 -8656 -7656 -649 7566 5831 123 -5609 -6057 -2321 5197 6967 2202 -3894
101 -3894 -5169 -3405 1465 5101 3765 -1496 -4209 -3017 97 3410 4308 275 -3958 -3563 -440 2386
117 2386 3663 2178 -2084 -3623 -1623 1192 2596 2085 -327 -3069 -2758 860 2498 1908 739 -1739
133 -1739 -3023 -990 2041 2006 1106 -328 -2240 -1352 843 2235 1124 -264 -1122 -1688 -567 1368 1902
150A902j603j018l07J36J458J087n12j620m93j44Q09J523K17j257r51o9K72P06
168A36P18j90j292l44O91L92M05K27q50q03M86N06M23n1p6l93n72N15N32k62J86
189C84m13m38O1N57N66o63p0m00o5L33K93K38k74j74j79l40M51L91l8l85J62j70
211a73j20L90L06m02k32J40k21J66M03l37l40J50J17j9M70l11P5j12J9J11p1R8
233A07J1j31j19J07o4J26J26k7l69Q2R6n0K42j35k18J06K99k47J81l6K93o10J60
256g0P0np7J64k7j23J00J29j20O6m18L14n5j40L16l84L76j11J07j22l4J63j04
279A5k94L26L4j2n9P2m13L15J9n0J66j29k74J66J99J35k90J14j53J51N0q6O9n25
303d54N69M6m58L11o6q9K46J50j90O1J84j80r3Q6Q5n1k86J69K3k3j50L80m56K00
$$ plain form
150 1902 299 -719 -1026 -890 568 1655 1143 -477 -970 -1114 -305 1218 1435 178 -773 -842 -570 136
168 136 854 664 -628 -972 -281 111 516 743 -107 -910 -424 82 505 454 378 -15 -587 -72 460 198 384
189 384 -29 -467 -406 151 717 54 -16 -416 -481 -148 145 383 109 -65 -244 -584 -133 258 220 -165 -3 -173
211 -173 -293 97 403 1 -231 -91 -312 -146 257 -80 -420 -270 -153 -172 298 -13 62 -50 -31 80 9 107
233 107 118 -13 -132 -25 -89 37 163 136 -233 -151 -55 -105 137 2 -216 -110 189 -58 123 87 380 -230 -70
256 -70 0 -5 -82 82 55 -68 32 161 41 107 -311 3 -52 -192 124 -260 116 5 112 -10 -44 119 15
279 15 -279 47 81 69 10 82 -331 -16 3 -47 119 -10 -284 -118 81 216 -74 40 -113 38 88 2 71 -454
303 -454 115 161 -297 14 -52 -141 105 255 65 126 310 130 37 123 208 157 -129 40 63 40 -110 270 -186 14
327A4k0l53L14K33k61j2K50k05J07j97P2j46N73k19j51K52j69j28o2K54P9j54
349G1j00p6J98k61P4r4K34j43M41k60N4N9j09O0l19k7J26P5J54j32Nj65J62J94
373B21j04l9j80J59n7J37j09J0r0K6j11K03j35J98R4l65J38N1j01J92k22q3J01
396f6L42Q8n44J78j91J44m3j9J58L3K5k15j51K64J16j5O7m97M00j06Rk45L68l64
420b64L03k20L25J8m6l20O1j63L51J47l19J89n9J31l14k8O3Q4J29Nk83N11l36
443c5j23O3O4j78L85j03O2k1j16K28j97K59l35K8J89l26N6L64k34j87K35P2j14
466C6M4q4K95k07p6Q8l8m3J39l51L30k52j6K37k15j24Q6K31m8J39j74J29J2n3
490H5j42K57l78N9J21m6J20k07M61k86j13%L6K05l34L72l63R4L63n79K73m09L51
$$ plain form
327 14 -6 -359 -45 188 -73 -85 165 -40 67 -130 -58 -204 369 150 -1 251 82 -46 -108 146 225 71
349 71 -29 -105 93 -168 -94 -188 46 -97 344 84 138 197 88 148 -171 -198 -72 3 157 25 30 -135 27 221
373 221 117 78 -102 57 0 137 28 38 -52 -26 -137 66 -69 129 223 -142 -4 47 -54 138 -84 -167 -66
396 -66 276 364 -180 -2 -193 -49 -92 -111 47 80 105 -110 -261 3 119 104 171 -326 74 -32 -23 -268 100 -264
420 -264 39 -181 144 162 116 -204 -143 -306 45 192 -127 62 3 134 -180 -208 -145 -61 68 73 -210 301 -35
443 -35 -158 -95 -31 -209 176 73 135 114 -2 226 29 288 -47 -19 170 -156 -100 264 30 -157 78 150 36
466 36 80 -4 291 84 8 96 58 15 154 -197 133 -119 -135 102 -113 -237 -151 80 32 171 -3 126 138 85
490 85 -57 200 -178 -119 2 -44 76 -131 330 44 -69 -69 -33 172 -162 210 -153 -59 304 -275 -2 -411 -60
513f0J21O2k05M2N5lo5O1J18j24j64K69k17L6j28K48rn4rJ00j85J9J55r6K41j78
539C0j76K94L6j05Q4k8M4j0l73K52j55J61J82n03L40m3p9O4N4j37J13j38J73j07
563b7p0J10j03J52j07J5J98k80pJ86j99J17m8j07L65m05J22J60j19J25k3Rr6r0
587a22Q1J65j50j75j2K58J16l56J84M2P0l54K93K1Mk36M0J67J0k20O8n9J11om2
612a02j45o6N25k50J58o7M5j95KK22k33K16J99k35n7P0j08J58j84j87L26j02l8
635d8Q2J24L65n70mnJ68j45PJ74k66%K88l11j20L71L3j70RR1O2p1K09j60K5k79
661a41K39j25P0l27K15J64k4j39j81K56j56K70J43m12L18k98L1J65p3Q0j56j80
683b61K09q2L26k08P3K00n2j10j69J22k2J22q8j15K10j97J80R6p0k18J29J05q4
$$ plain form
513 -60 61 123 -82 -40 15 12 -53 8 126 2 -162 107 -110 -74 -202 46 37 -17 -26 74 -111 -92 63 -33 208 30
539 30 -146 148 184 79 163 135 179 169 -204 48 -107 54 236 -267 73 30 -49 15 69 -68 45 -93 80 -27
563 -27 -97 13 -90 62 -45 -30 168 -112 -119 67 -132 -15 -63 -170 195 -210 -88 72 -47 78 55 64 -32 -122
587 -122 -41 124 -26 -201 -213 45 161 -195 -11 31 101 -253 40 61 65 -171 -131 36 46 -174 -106 -165 -54 -60 -102
612 -102 -247 -313 212 -38 120 53 98 -97 -95 127 -106 110 309 74 17 87 -21 137 -47 -234 92 -10 -48
635 -48 34 158 523 -47 -51 -56 112 -33 -26 148 -118 -118 170 -141 -261 110 143 -27 -18 73 135 64 273 113 138 -141
661 -141 98 -27 43 -284 -69 95 71 -68 -249 7 -149 121 264 -148 170 -128 -97 68 -5 75 -81 -261
683 -261 -52 -134 192 -16 57 257 205 95 -74 48 26 148 60 -55 155 -42 138 234 164 -54 75 180 96
706I6p5K02l65K30r7J71j89J35rj60K01l1J27j62l45K53M7J15j67N3l9R7o2j7
730IM14k74j73J14j56rN2j4j6kK28k63L4j17J20p7r0L76k09J87J10m37J8oL59
755A78j02J16J67n77J52J22J95k08k23J36J90m13L10j96j32M16j97j1N5M7J9j09
777f5m4QK73l78M6L78m96J53K49j39K7J78k38J3l0N6j84L21j51N0p8pk77K09j18
802b44L68k05L1O8j01K71k96L68l67K07Lm6r8J1R7l30L53p1L0J97k11j53k89K77
826a30r8K07PM7r6Q9K9J67k39pr2J80j89j35K56o6N0m1J29j55L1J55J0J69j31
851A47O1j32N9l31J57J61r8J14j59n5J07Jr9O6J66o7j02J37O2k69J3L2l0J73j88
876g4j04K43L6j47K8K49j7k48J88j9j17k0j80nJ69K2J28j36j2L9M4k06J99J33
$$ plain form
706 96 21 223 -142 88 -9 162 -27 108 99 -61 140 109 236 74 -271 -18 29 144 -23 30 -9 88 26 9
730 9 423 149 -24 90 -66 -75 -23 -37 -53 -55 173 -90 -56 -173 -53 -130 -220 156 -53 134 244 -193 -175 -181 178
755 178 76 192 359 -218 -66 56 251 43 -180 -44 146 -267 43 -153 -285 131 -66 -77 -22 25 44 -65
777 -65 -109 -101 172 -206 -160 218 -278 -125 124 -15 12 190 -48 -35 -65 -9 -193 128 -23 27 -51 -58 -335 -126 -244
802 -244 124 -81 -50 18 -83 188 -108 260 -107 100 103 57 -41 -30 67 -263 90 19 49 246 35 -118 -407 -130
826 -130 -228 -21 -14 33 -63 26 55 222 -17 -24 -116 64 -125 -260 -4 -70 -20 -61 68 -87 -56 99 109 278 147
851 147 208 76 135 -196 -39 122 24 138 -21 -76 31 32 -67 -1 165 98 -4 133 195 -74 -61 -29 -59 114 -74
876 -74 -178 65 101 -46 -18 231 214 -34 154 135 18 -2 -182 -187 -18 4 132 -4 -16 23 67 -139 60 193
900A93j24P0p0K92l68K45k49k6J32r3p4J84n2q5Q4j26J22k79L37J56k45j75p3
923b24K41j38K29j4J6LJ3l48J16J30o4Ko5Q2L8j07j55J89J47m4J21k5k57p9K79
948H6J67k35j49K60k2l1O0j71pk44M40l33J54K2j94J62k88M94k56q2L48Q5k04
971F2k53j57M98j12K27n10qJ21J47M0k32K5m7nJ92pJ91r7o4K41k47M5p3L17o6
996B28k05P8p0j0P1r8k12J96N1o6J52l17P3J20j70K86L62m25R7k79J76Q2Ro6j92
1021a29m8K86m0J00j48k66K84j84J08j57K90j6j76J48J53k49N3k49K17P8j97J4
1043a28J79Rk39K24R5k92K44n2p5oJK6P6p0J78P5j66q9N2M68l43q3om3n4RJ40
1070A30l47K29p4j35K06J3Ql69N52p3J8k06J3N2j77L29j70K35m66O2M28m19J46
$$ plain form
900 193 69 139 69 361 -7 238 -11 -37 95 2 -72 112 60 -25 59 -67 55 -224 113 269 24 -151 -224
923 -224 17 -121 108 94 110 113 126 -222 -106 24 -40 -38 -103 -21 17 -90 -245 -56 91 47 168 143 -114 -193 86
948 86 253 18 -131 129 107 76 136 -35 -42 -286 154 -179 -25 -3 -197 -35 -323 171 -85 -167 181 266 62
971 62 -191 -348 150 38 265 -245 -253 -132 15 55 -177 -152 -199 -204 -12 -19 172 75 11 252 5 50 -23 294 228
996 228 23 101 31 21 92 -6 -218 -22 29 -37 115 -202 -129 -9 -179 107 469 44 141 -138 38 120 129 63 -129
1021 -129 -177 109 69 169 21 -245 39 -145 -37 -194 96 80 -96 52 205 -44 9 -240 -23 55 -142 -128
1043 -128 51 60 -179 45 140 -152 92 40 -35 -41 -40 -14 62 -8 170 245 79 -10 42 510 167 84 78 35 -19 -10 130
1070 130 -217 12 -62 -197 9 22 30 -339 213 140 158 -48 -35 17 -160 169 -1 234 -232 -170 258 -161 -15
1093a5l8n1K48k94L5r7L85J91k73J8k6j25J45N9j73p8J68O0j14L4R8k18j0J24
1117E3P7j63K56j95j74q2L06K32j82o0R1L1k34K5j94K23p1q6M2j06J77R7R5j20
1141C8l38J80K30j79j04J42j0J01J02oj43j8jJ22R5k33J61J0k30J24l86L90L04
1164C51m31n5R4n1L82k50M4p6K06j56k53J28J45j31J4K01k76J98R2j34J26k7l56
1187b15L71Nj89l6O2q8J36J2j13j66K88Pj03K30l43L1qk8n9K41lj90K52k14J05
1212a5K73m60L65k64J26m3J09J06l71Q5r4K07l26M01l13K24p4R2j12NJ92jm5L8
1236A05o2M9L3l16J24K7k33K59j91L07O0j93K50m66L47M0j78P9P9L2l25M67k85
1259IK15j85P5j84l1J63k36K22j29RJ31K09j22j92J37k3j86Q6r7J07j67L83l67
$$ plain form
1093 -15 -53 -104 144 -150 -115 -212 173 364 91 109 83 -42 103 162 -11 -89 79 139 25 59 157 -61 -71 53
1117 53 130 -33 223 28 -146 -228 78 310 128 68 159 190 -44 -19 -213 10 -61 -147 -105 -211 -34 63 158 38
1141 38 -300 -120 110 -69 -173 -31 -41 60 162 156 13 -5 -6 116 211 -22 139 149 -81 43 -343 47 351
1164 351 -80 -135 -41 -92 290 40 84 8 214 58 -195 -67 78 -53 -39 162 -114 84 176 42 168 141 -215
1187 -215 156 161 -28 -64 -2 -90 46 58 -55 -221 67 74 -29 201 -142 -111 -119 -147 -206 35 32 -158 94 -120 -15
1212 -15 258 -202 163 -101 25 -18 91 197 -174 -89 -183 24 -302 99 -214 10 -64 28 -84 -79 113 112 67 105
1236 105 43 92 125 -191 -67 -40 -273 -14 -205 102 162 -31 219 -247 100 140 -38 41 120 152 -173 294 9
1259 9 224 39 114 -70 -101 62 -174 48 -81 -72 59 268 146 -46 91 68 -118 -32 -129 -22 -189 194 -173
1282a73J54r0l7J70J5J99n10K87p3J83k5m2P0kJ30j57P8k24K20j51m7J87n6LK2
1307A31j33j66M21l3P5m1k94N1k2j35L99k01n4k72K54L2k8k14K10N1k2j55J12
1330c4r1R3K78m35O4n7J71K28k0k06L8nK35l83K13J41J2k90Qr9L13L5k39N8m5
1355a7K04l39K38o7j56J48J12k41K61j39j49L88k65l3l7J22k5k3j91K19R4j64
1377f0j05R6J26j49J70J08l31K83k34R0n1L32m09K90k01R5K7j06j2R2j30k16J91
1400a04K20o3j37J03K7q6J18J76J24m43L80l48o3j93M66j77R6j70j10K88l11L81
1422A74m44J79L7l7R0r3j87J74K94l34o5N52j73m90J75r7K10J28j42L0Q8L6j28
1445b3K66m24K47l2n6k07K97j39K50m8j16p0J46k04j38K29o0j66L61j4j18J87
$$ plain form
1282 -173 -19 -109 -146 24 39 238 -272 15 -58 125 100 58 128 126 256 99 177 -47 173 22 -25 162 106 109 131
1307 131 -2 -168 253 220 295 254 -40 11 -11 -146 253 52 -2 -274 -20 12 -16 -230 -20 31 9 -146 -34
1330 -34 -125 -32 246 -189 -125 -182 -11 217 197 -9 29 24 259 -124 89 230 242 -48 -40 -139 174 209 -30 28 -17
1355 -17 187 -152 86 19 -137 11 123 -118 143 4 -145 243 -22 -55 -92 30 5 -18 -209 10 104 -60
1377 -60 -165 -69 57 -92 78 186 -145 138 -96 -6 -57 275 -134 156 -45 50 77 -29 -41 51 -79 -295 -104
1400 -104 116 53 -84 19 46 -40 78 254 378 -65 315 -33 -96 -289 177 0 96 -74 -184 104 -207 174
1422 174 -270 -91 -54 -91 -1 -94 -281 -107 187 -147 -212 340 167 -323 -148 -245 -35 93 -49 -19 69 105 -23
1445 -23 243 -181 66 34 -22 -229 68 -71 179 131 15 -55 91 -113 -251 -22 -82 -248 113 99 -19 168
1467A68J01k28j27j55J8L70j86j4O2L0j05kJ35k13j8J21J7K1k08K14K90j67p0
1490E4q0l2J50m18M65l60J41L50j97M5J2k68J92K80l09o4J66j97l6L2m5M53l54
1513b0J24K6k66L38o4j43j03L47k71K5j29J0L12r2l22J82k4J48k4l4p1J65j29
1536a5Q4O4j41l18L32o2J84j6j76kJ44Jl6J79l64L42j58o4m9J14k9o9l7j53j2
1561b57L93j26j04k24J36J79l4n2L56l25K71k27Mq3L1j15M02l32M26k51r3O5j48
1584a08L36k02j01k5J58j48lK34k0j81Q4k82M4k7K67M2%r9o9j28K77K5p6j06J41
1609C3J3K6l9J33j19p7qp3n8J05K99q1j76m2j18J80m1L4j28L55k37j11N20l20
1633G0J13j06j56Q8K25m25L69k20Q3j3J94k18L39n53J40N5J18j6k43K76Mj03k25
$$ plain form
1467 168 269 41 -86 -241 -223 147 -39 -53 9 39 -66 -68 67 -146 -164 -43 -26 -5 -213 1 291 124 54
1490 54 -26 -58 92 -326 139 -221 -80 270 73 118 130 -138 54 334 25 -39 127 -70 -106 -74 -119 334 -20
1513 -20 104 130 -136 202 138 -5 -108 239 -32 -7 -136 -126 186 94 -228 -46 -70 78 54 20 -51 114 -15
1536 -15 69 133 -8 -326 6 -56 128 112 -64 -66 78 79 43 222 -142 200 42 -22 -71 43 14 -55 -92 -245 -257
1561 -257 136 10 -94 -318 -182 -3 -37 -89 267 -58 213 -14 -10 -93 -62 -177 225 -107 319 68 -25 40 -108
1584 -108 228 26 -75 -100 58 -90 -93 141 121 -60 24 -258 -214 -241 26 68 68 -31 -100 -228 49 74 -2 -108 33
1609 33 46 72 33 166 47 -30 -38 -111 -169 -64 235 154 -22 -64 -182 -2 -43 -9 -137 218 -19 -130 390 70
1633 70 183 77 -79 9 234 -191 178 -42 41 28 222 4 343 -210 -70 -15 103 87 -156 120 124 21 -204
1656b04J78J6J88k79J44m32N61k5m18K47K19k24O4PJ58q5q1o3m4J05J0Nn7J89
1680A79j4k23n0K27q3k72K57j9K1K85k95K90k23j31N2Pk5j63J82Q1o3P6j15K02
1704A83k04K7j06M15l00n7J19m14N14j43Q2k48J68j2KM1N5k21P8N4M8j1l18K67
1728A9J01k86M54k73j50J2J94k17J7P5K02j61j17O7J96j97O9N4J7j79M3j4J31
1751E7j19m5j82O52j65k25k09K87q2q1J44J1k10l5L18n0j80J47o7R0r8J73j70
1774c9p7P0n9J49j77J61L2k14J34J43m01M27j50J63k46J4J16n5m4O0p6J50o7K93
1798C07m22K46k13j22L1N1J83L8k72q8L43k55Q6J16N5j19n8N1J47j86K50j49o7
1821d7l3J72j17j44J48l8j20j13K29J75k95J7K07M4j65L39k61R9J31j45j42J57
$$ plain form
1656 -204 -26 -10 178 -101 43 -389 172 147 -271 -24 195 -29 35 42 200 115 34 -29 -73 32 42 47 -10 179
1680 179 165 -58 -108 119 36 -236 21 2 23 308 13 303 80 -51 1 8 -17 -180 2 83 20 96 -19 183
1704 183 -21 6 -100 315 15 -42 77 -337 177 34 116 -132 36 24 26 67 122 -99 -21 33 81 70 -248 19
1728 19 120 -166 288 15 -135 -123 71 -146 -129 -54 148 -13 -130 -63 133 -64 5 59 76 -103 -60 -74 57
1751 57 -62 -107 -289 363 198 -27 -236 51 -31 -112 32 43 -167 -202 116 66 -114 33 -34 56 -42 131 -39
1774 -39 -116 -46 -105 44 -133 28 60 -154 -20 123 -278 149 -1 162 -84 -70 46 -9 -53 7 -69 81 14 307
1798 307 -115 131 -82 -204 -173 -122 61 99 -173 -261 82 -173 -87 29 84 -35 -93 -42 105 -81 169 20 -47
1821 -47 -80 92 -25 -169 -21 -59 -179 -292 -63 112 -183 -166 41 85 -80 259 -2 97 228 83 -59 98
1843I8j32R0m6L2r5j50M12j26K84k14r2r1K05k33J76q2j14j9j12m6M59l10m4K0
1867a30L02j84J49r4q8n4J23j95r8L17j05L03m40K74LM23n24P4l10L05k14j79
1889c42M25k44N10j36o0m44M26m61N66m73K76j8K02Nk75K86k75k81K57lJ2P6j15
1912h6J3J11l58L28m9K5J68j42j76q0K30k22L92j52m29K98N9O9J5j09r5J48qJ00
1936E0j71P7j21P9J55J66n42N09j31P2K5m1k07n6M2J9K18j51l6L4k3mj67J20k26
1961c10N3L44J32o0q1j81L32r0k55K21j82O2L7k1P1m59M84m04L56J11j37Q7j20
1984a0O1o6l00L15k68P8K84p0k59J45K54r6K48k53M6j3k43K73l2l17J94j49J01
2007g7R0N4J51o9l16J23N0K23l88K83j11K2M9O0l10L10j68K67m22M57r0j91o6
$$ plain form
1843 98 -34 56 10 42 -53 -203 209 83 367 153 61 -30 175 -58 118 36 -78 -97 -209 -255 204 -106 -150 -130
1867 -130 172 -12 137 43 -45 -99 24 -171 -269 48 -57 246 -194 80 83 506 -18 56 -254 51 -163 -342
1889 -342 83 -161 349 213 153 -291 135 -326 240 -233 43 25 227 232 -43 243 -32 -313 -56 -59 -47 29 -86
1912 -86 -73 38 -320 8 -41 -16 152 10 -166 -246 -16 -238 154 2 -427 -129 -70 -1 14 -95 -190 -42 -50 50
1936 50 -121 -44 -165 -86 69 235 -307 202 71 143 168 127 -80 -136 -94 -75 143 -8 -44 -10 -33 -37 -204 -84 -310
1961 -310 -257 87 219 159 78 -103 229 139 -116 105 -77 -15 22 1 72 -387 97 -307 49 160 23 110 -10
1984 -10 51 -15 -315 0 -268 -190 94 24 -235 -90 164 68 316 63 109 96 -147 126 94 -223 -29 -178 -77
2007 -77 13 67 218 149 -167 -44 6 229 -159 124 13 35 84 144 -166 144 -24 243 -179 278 188 -3 -69
2030f9N4K37m66L01Q0m25L88J27k42k7R6Q0j16k29K52j26K14n2j25K54k41j7l00
2053c52L78R8r1k5P3j8k48J61J25L7q5k25K81Q0k25J24o8k9p5K77k70p6Q5j04
2077a72L45m78M59l71K53K2j83J94k95L75o4j07j00K28m5l71K80r9J4K51m98N32
2099A70r1k59L56j1pm68J55K16K50k93k92M65l74L31k52K38k60k7L2L30p3k13
2121g7j24P7J2J33j48L22j10n57L51J76N7j43N2l52L55M0j06j77K8M03k96J57
2143G3J3j86K12j44%j02J88m30L9N08j52m2j30J92j15N9J45k06N9m8o7K37NL6
2167A44k73j33M3J28l0q9P1K14N4Q0m70L24j71k0K0J45j78J30J51RL6l33L60k97
2191h5K30j07j66J59nj38J85J14j15k8PJ21l35k11K93k35M05k84J02L67l03m1
$$ plain form
2030 -69 -15 222 -244 57 137 -288 100 227 -15 -42 54 134 18 -211 41 -85 129 77 -48 206 -35 -52 -352
2053 -352 26 124 33 8 81 63 -185 -24 101 138 53 -172 109 189 -36 88 20 -9 -84 193 -77 -153 -68 -172
2077 -172 173 -305 154 -217 36 58 -125 69 -226 149 85 -22 -122 106 61 -310 -30 -129 -115 136 -362 170
2099 170 79 -180 176 165 158 -310 -155 61 311 18 -274 191 -183 148 -104 134 -126 -153 -121 209 136 -77
2121 -77 -201 -124 -112 21 -127 195 85 -472 -121 55 112 -31 21 -331 24 64 -42 -219 -191 212 -84 73
2143 73 86 -100 112 -32 -32 -134 54 -376 -337 171 19 -23 -153 39 -76 -17 128 -78 -19 -67 -134 103 108 144
2167 144 -129 -262 -219 -91 -121 -210 -139 75 129 209 -261 63 -108 -128 -108 37 -141 -11 140 149 185 -148 212 -85
2191 -85 145 38 -128 31 26 -112 73 187 72 44 51 172 -163 -374 -81 -316 89 -195 -93 274 -29 -70
2213g0L9J13k84J50j87J12L4k1K43k86O9k8J12k4O7j24J63j61J6p6J61M8m4j36
2237a14k53M58k10K04l10L51k32J79j3j59Q0L19k21K4L7j48j23P7J05r1nR3p0
2260b2M3p5O4J52m1k63j9l5j0K04q4%J28k38J30K75k18qJ24j0j58K32q8r3j66
2285a76L49l06K6n8J99K7j28J61l84J59J80j78j66L36P0q7j92L58j32o5j37M78
2307C34k58j02p2L05k55L9J7P8M33l42j46J03K6j75J34l07N79m28l0K50n69L45
2329d1q3L46j13J26k64O9k44K58k43L24l9k20M5J12n0RJ20j65J66j06J76j90J93
2352A86M3k07j2q6j13j34K67K91K07m22J06k95K70k33J51j36m2J62m5L6l7J06
2374F3K4j7n9J95m2R4l22J93j93K60k82j13K02J67j70j03j2J86k92J33K06k9m70
$$ plain form
2213 -70 -31 82 -202 -52 -239 -127 -93 -114 129 -157 -88 -116 -4 -28 39 -85 78 -83 -67 -143 18 66 22 -114
2237 -114 -367 91 -119 85 -225 126 -106 73 60 -99 -19 300 79 103 140 -8 -131 -54 51 -40 -45 48 -22
2260 -22 21 -54 10 162 121 -142 -161 -196 -206 -2 -86 -86 42 -196 -66 209 -9 -17 107 97 -61 171 83 -10 -176
2285 -176 173 -133 -107 -165 34 61 -67 94 -290 -131 49 -129 -295 41 111 24 -168 190 58 -7 -144 334
2307 334 76 -26 -98 207 -48 -9 8 86 519 177 31 134 160 -15 119 -188 391 -37 -67 183 -386 -41
2329 -41 -124 222 109 235 -29 40 -204 54 -189 135 96 -124 -79 33 -17 -8 112 -53 113 7 183 -7 186
2352 186 229 22 10 -76 -189 -323 -56 235 442 20 126 -169 101 -132 19 -117 -159 3 -42 -6 -43 63
2374 63 87 70 11 206 164 258 -64 129 -64 196 -86 -199 3 170 0 -103 -115 71 -221 -88 118 89 -381
2397c81L61j80K71j36N3J03j84J89M0j67%L74r9k60L2j05P1j31K85l68J57J15
2419D0k09L34j34%l2J23m34N47l56K7k28M23J20l23K66k67K36j61p1J60j87m7
2441a73j83L10J42kO7k80L02j98K12k59J29j66K29k13L34l30L45l98J97Rj16J00
2463E8l41Q2K56j03M8j39J32O4q7o0O6J59j30p6m5j65kj1K98j59J41l6k5J54k2
2488E7j68P8k30N12k17j2j62m6L11k46K63j87j39J46j78l0R8K24Q8j95K02k63
2510i4K05j95J45j59l0P1QR3R1j7l4N9k24Q1M7k67K06L3n8J51k41K37Rj26j3L6
2536A4K01p4L3j56J4K24k60n7O5p0J7k6r5K60o3j02K69j7j75j59J47K79m45LK82
2561A09L6o5q1j17j96L87k99L29K4n7l06L04m0K33k17q6K60l81J87P6j43K37j29
$$ plain form
2397 -381 -20 -200 71 -65 -12 91 -93 96 136 -31 -31 343 244 -16 16 -89 -18 -149 136 -232 -75 40
2419 40 -169 165 31 31 -1 122 -312 235 -121 -94 -322 101 221 -102 164 -103 133 -28 -99 61 -126 -173
2441 -173 -356 -46 96 94 161 -119 183 -15 197 -62 67 -99 130 -83 251 -79 266 -132 65 74 -42 58
2463 58 -283 -201 55 -48 0 -139 -7 57 -30 -90 -24 135 5 -71 -116 -281 -283 -294 4 -155 -14 -50 -75 79 57
2488 57 -111 -33 -263 249 32 20 -142 -188 123 -123 140 -47 -186 -40 -218 -248 -150 74 162 -33 169 -94
2510 -94 111 -84 61 -98 -128 -57 -49 44 135 118 84 143 -81 0 47 -220 -14 19 -39 112 -129 108 117 -9 -22 14
2536 14 215 141 174 18 32 256 -4 -61 4 -66 -49 -75 -170 90 27 -75 194 177 2 -157 -10 269 -176 -173 109
2561 109 145 80 -1 -118 -314 73 -226 103 127 70 -236 68 28 261 44 -42 218 -163 24 100 -43 194 65
2584F5k5K43n68J35L27j60J79j16K39m79L58l08J52J18j16k4p1l6p5l5K53k66
2606b10L21j07K0M4j95MJ14J00k10K46L7k20j82J25N7J02j27l2J80K0j18P0j07
2629f8K94j65k93K67M5j84J4L28l37J35k93K32O9k65J74O4J99Kk02J11k5j56P9
2652B5m2P8N1k89K64p2J70k46QJ98J9m10L08r8o9K30k73j65L76j8l16Q9K30k01
2676a53J38J02k87K99j61K69k01j30L63l33Q2j53L87k13L3j4j11J55o0J51o3k96
2698a96R8J15j98Q7j56L14k01K04k24q7L42n2pj31K81l41J81M7K9j3j5j32k77
2721c32K57jK55k09j20K29K48m39J56M6k4Q9n2K08m22J66n5K2j12j7q4K85k18
2744a24J65J94m68Q6J43j3J8k42K18p2J72Pr7q8m3K42j93L93m62J50L4PJ6j79
$$ plain form
2584 65 40 283 -285 -150 177 17 196 80 319 -160 198 -110 42 160 44 20 -51 -87 -162 -197 56 -210
2606 -210 111 4 24 68 -127 -123 -9 91 -119 127 164 -56 -238 -113 -56 46 -81 -113 67 87 -31 39 -68
2629 -68 226 61 -232 35 80 -104 -90 238 -99 36 -257 -25 44 -221 -47 17 216 218 16 127 102 -54 25
2652 25 -17 61 112 -177 87 15 185 -61 -53 145 164 -246 62 -36 -105 125 -148 -313 63 45 -271 -182 48 -153
2676 -153 -15 87 -200 99 -62 207 6 -124 239 -94 -12 -165 222 9 42 28 -83 72 12 163 100 -196
2698 -196 -98 17 -181 -94 -250 64 -137 67 -157 -244 98 46 39 -92 189 -152 29 76 105 92 77 -55 -332
2721 -332 -75 -76 179 -30 -150 79 327 -112 44 90 66 155 103 311 -111 55 0 22 -90 -107 -191 94 -124
2744 -124 41 235 -233 -147 -4 -17 1 -241 -23 -95 77 84 -13 -101 -144 98 -95 298 -164 -14 20 27 43 -136
2768a36j9J9K70P6l26K24j81J75k41j0J77J58l26J56K42l57K50l16J92k39M99
2789B87k91k0L1k22K18K94m27J70K4J72j75j42N0N5J98k69j1l0J19k78L10j93
2811a30L26k55J95l12l5L06k90J26K69m17L13p6O6p5j12k6L56l42J76k1J66j93
2833A5J09l38n6L62l05L57N0j11k47K16j86o4J13j19K20P3m0n9J33o2o7j50L63
2856B07k07pJ88k92K12o7J4nJ36k36j86lq9L62L0n0qj67K70o9q8k6j23J48K14
2881A58j42j12K90l15k4j3P2M17l90J95j14J08j10j38J1n7K3K69j16j76L1J72
2903C9K32l40J05L4r4N6N9j47j13j98M88J6k69J85j1k50J79Q7rl1n8J07k6j19
2927g8L3j19J67Q6j36k62L83M5j89J31k5M2k26K76J42k93j89K80K00k26L6j92
$$ plain form
2768 -136 -155 -136 134 210 -116 108 -73 102 -139 -149 28 186 -140 16 258 -99 151 -165 27 -212 287
2789 287 -4 -24 7 -215 3 297 -130 40 64 236 61 -81 -31 24 222 -47 -58 -88 31 -247 63 -130
2811 -130 196 -59 136 -176 -211 95 -195 -69 200 -217 96 20 86 11 -101 -127 229 -113 63 42 208 15
2833 15 124 -214 -270 92 -213 144 194 83 -164 52 -134 -198 -85 -204 16 89 49 -10 123 61 -6 -156 207
2856 207 0 -7 181 -111 101 34 48 43 179 -57 -243 -246 -335 27 57 7 -1 -168 102 33 -55 -81 -204 -56 158
2881 158 16 -96 194 -121 -145 -158 -86 331 -59 136 22 130 20 -118 -107 -164 -141 128 12 -164 -133 39
2903 39 271 -69 36 70 -24 32 91 -56 -169 -367 121 137 -132 53 42 -208 -29 58 49 18 -40 67 41 -78
2927 -78 -45 -164 3 89 -47 -309 74 119 -70 61 36 78 -148 128 270 -23 -212 68 268 42 78 -114
2949a14J23N5K25l23j40Q1K1K14j68p8M1P9m6m7J86rl38M73j92j32J06J6M6m3
2973C6j10j05J79k33L53k09Q1j67J54k9k32L38j55j1rJ40N4j92J72J49k99J1K02
2996A18k70L60k95R6L8Q9o6l34l5J44K57J29k72l4R8j29J24j37K71J4r6j2k08
3019a50L65k33J3J12J62k94L1J37l65L16j59K27N5j61l33M27jK52m29j92L44m36
3041c12L50N4K34m82O1J05n7l88O84j93r3j29K99J5r3N0r9n7Q1K9P2O6k45R9j90
3066a39O0o4J80j91P7J37k62Q0J69J88o0l99L05j92M9K46k93R4R7k39L91m0l31
3089a37J33k5n2J29k05n0K46m3l3Q4R7j65J52m25M60P1l77O8QJ23j11J96k69R5
3113c0j34J04k17K73n9J01l0JJ58l10L84k13J57k73O6M6o8J52K19l50Q9K26l04
$$ plain form
2949 -114 9 64 289 -34 -174 -93 -72 142 -26 -104 -63 16 -30 -77 109 100 -238 235 43 -89 17 33 79 36
2973 36 -74 -179 0 -233 120 -89 -8 -175 -21 -50 -282 56 -99 -110 -119 21 75 -117 55 204 -95 -84 118
2996 118 -152 208 -87 9 47 136 70 -264 -299 -155 102 231 -41 -75 23 -106 18 -119 152 166 70 58 -150
3019 -150 215 -18 -5 107 269 -25 6 143 -222 94 -65 162 217 56 -277 150 149 401 -28 -220 124 -312
3041 -312 38 92 326 -156 -95 10 -47 -435 249 56 -37 -166 133 148 55 105 6 -51 30 59 131 197 -48 51 -139
3066 -139 -79 -143 37 -154 -77 60 -202 -122 47 235 175 -224 81 -111 -62 184 -109 -15 82 -157 234 194 -137
3089 -137 -4 -29 -81 48 -157 -207 39 -4 -37 47 144 -21 131 -294 166 237 -140 -72 -64 59 -52 144 -125 -30
3113 -30 -164 -60 -277 -4 -63 38 8 9 167 -143 241 28 185 -88 -22 24 -44 108 327 -23 66 292 -12
3136a2k24K06Qq9q5L03j86m7K45j10K1Mm85O52k16jK66j84j38P4M9j05J13L9j40
3161d2k6Q9Rj49K94j0r3j15NJ35j62K34J13l01NJ51k50K47j15o9K46k75K26J16
3185B63k24l62R5L06k10J83Q6j26O0l99M13j41R5J37k55K49l69J06K6K8M2J28
3207A31j78Q5J41k08p4k2k7n5J04K0l8K42j24j28k1R4m6Q1K24j40k06J58l88M56
3231H1j17K21k20J36q0J33J3k01j7J81j41J92Q0m55K50J04j28j05K14r6n3n4q3
3254a45L03l15J19j51K07K18k64N3j5j68M48k57k09K86k17K04k88K48J45l33J47
3275A6k0N1Q8j04q6J27j75mJ65l79K69q8J07k17J46M0L96m57j14R5J96J40q7j14
3299im0p6R7J22k47m1J88K14l07P7o3J94J88m55K7J30k5K58j64k13J91k25K61
$$ plain form
3136 -12 -236 -30 -22 -111 -196 107 -79 -126 119 9 30 34 -451 201 -15 -16 250 66 -72 2 51 -54 59 98 -42
3161 -42 -68 21 30 -119 175 165 72 -43 -38 97 -65 169 282 -19 -14 137 -113 134 19 -50 196 -79 147 263
3185 263 39 -323 -228 78 -132 51 137 11 71 -328 85 -56 39 176 -79 170 -199 -93 -67 -39 3 131
3207 131 -47 38 179 -29 -103 -125 -152 -207 -103 -83 -121 121 -3 -131 -152 -58 -104 -23 201 61 -145 13 -375 81
3231 81 -36 185 -35 101 21 154 167 -34 -51 130 -11 181 261 -194 56 160 32 -73 141 45 -8 -62 -145
3254 -145 158 -157 -38 -189 18 236 -28 25 10 -158 290 33 -176 110 -107 97 -191 57 202 -131 16
3275 16 -4 47 135 31 -55 72 -103 -107 58 -321 -52 -140 -33 -250 -104 -64 332 -125 -239 -144 52 192 105 -9
3299 -9 -49 -125 -28 94 -153 -194 -6 208 -99 -22 -85 109 297 -158 -131 -1 -26 232 68 -145 46 -179 82
3322H2k12L6j74K74N9j82K7O1K27j5k19j05J23m1j43K92p2O0J40l24N9K1k4Q1
3346C1J36m2k13J26J19j56p2q3K93J37k11k05j1J80r4J20k99J96q7K91o4K5n0
3369F7j0j59P3q9J0J12J19m59K73K70m52K37p1M60k07o0L3j73k09J34K3J33L5
3392I0j8j47j3J81j26M2j68J73Pj8Q7M3k55l3L75k25J63k87K27q3j4Q8o6Mm5j1
3418b9K13j49J52j46j98M19l83K49j30n4N8n3J07k66K81r2K19j36j96K55p0m58
3440d07M62k67L70l86L88k32p9J37j44L20l53K50n0J47l91K96k36J63l0k91J33
3461b00J72J50J25j83J1L8Pk12K08M8l8j8j2n7l4J85l45K55N7n3k21Q8q8J34j86
3486a69L16k49N7J70j94m5L33k75j38K03O9j78P6NP8j17j9j20J11P3n9K73n6N
$$ plain form
3322 82 -130 -94 -268 6 65 -117 -90 -29 198 183 -36 -141 -18 -59 -202 90 18 78 218 -106 -47 -26 -50 31
3346 31 167 125 -88 38 157 1 -71 -154 139 276 65 -140 -151 29 -65 55 -244 -48 -135 156 92 117 67
3369 67 57 -102 -29 -118 -108 4 123 -336 -63 207 -245 -8 -79 381 174 114 147 -26 -235 -101 -78 55 90
3392 90 72 -75 -88 93 -33 9 -159 14 21 3 90 133 -122 -155 220 -5 158 -129 98 15 1 89 23 27 -18 -29
3418 -29 184 35 187 41 -157 262 -121 128 -2 -56 2 -51 56 -210 71 -21 198 62 -134 121 51 -407
3440 -407 55 -212 158 -228 160 -72 -151 -14 -158 162 -191 59 9 156 -235 61 -175 -12 -42 -333 -200
3461 -200 -28 122 247 64 75 113 120 -92 116 164 126 108 96 39 5 190 -155 100 157 104 -117 -29 -117 17 -169
3486 -169 147 -102 -45 125 -69 -114 219 -56 -194 9 78 -100 -24 -19 59 -58 -77 -197 -86 -13 -72 201 145 150
3510A50j54j05J17j00j52M77l35p3M33l50P3J7Lj70P2J91j60K37k92M01l70L6
3532e4Qk6j51J47J57%Kp5k9p8m8N6o8K94k42J93J87j10L3j1K7k32J42j31K77n44
3558b76R6L62k32K7J50m85L12K37l48K51Qj16J21K13k93N6j74J08Oj93K12j07
3580f5Q7J69o4p2K32j24k64J79k25J11K2r2K44J66l68Q0n8j4K9l1J54R9j33p7
3604a5l22M75O7j93K76j2n78L65%j1M2k2p5Q4j01P0k9n4J66k40N9J16k96O4K64
3629A00j45L09k66j2K05j70J23k80k4J57J0j58K06k56RL38j86m0O1J7P0M0j10
3652bl0O6j98L90l42J42k1o5m7q4K02k02K48l3L06k21p2j75L2J16j81L3K13rj55
3677h9J09J29k12J55P5p8o1j12J26m8J10j54J84l58L75k20J5m6Q7k01K96j58K61
$$ plain form
3510 150 -4 -109 8 -92 -244 233 -102 -175 258 -92 -19 -2 1 -169 -97 94 -66 171 -121 280 -90 -54
3532 -54 -46 -72 -223 -76 81 81 83 8 -21 -99 -147 -91 -159 135 -107 86 273 163 196 185 212 -20 122 -9 268 -276
3558 -276 -180 182 -50 -23 127 -358 -46 191 -157 94 102 -14 107 320 27 83 -91 17 23 -170 42 -65
3580 -65 22 191 127 55 287 163 -101 78 -147 -36 -14 -106 138 304 -64 16 -42 -56 -27 -58 96 195 62 -15
3604 -15 -337 138 205 12 288 276 -302 63 63 52 94 72 -3 81 -20 50 21 -33 133 -107 -48 68 -228 -164 100
3629 100 -45 264 -2 -14 191 21 144 -136 -160 -3 7 -151 55 -201 -192 146 -40 -80 -19 -2 68 108 -2
3652 -2 -32 34 -164 226 -116 26 5 -60 -107 -191 11 -191 57 24 330 109 37 -138 -106 10 -171 -138 75 66 -89
3677 -89 20 149 -63 92 167 89 28 -84 42 -6 104 -50 134 -224 151 -69 -54 -100 -13 -214 82 -76 185
3700A85P9l16J08k10J23K1k21L61m3K0K5j79o9R4J81N7k65J66k11Q1k67J2L80
3723A12J04l03L11k07o9J59k35J00k66M59j82L8M6L9j67r9N6J34J5k6j13J20o3
3746c7o7Q3k16J99J27%j79J25R9q2k19J4K14L8j51K79J09k78o4O1J61j42k44O7
3770a03JJ42O4k66J82j08N7kk4R3J14n25M34K25j17o0j55J65j89R9K5j89j88K00
3794a25O7p6N0o1L32o6j20K01j66j52J51J29j97j72J99J60k01O7j85p2L2K94r0
3817aK2k8K5j30J47J23l04K50j16m0K2o0J44Q4k22J71j01J15lm2j80J85j02q2
3841a23P5M9N4k34nJ46K6M5j63Q5J28j03J03J83l91q8M43m60M9J93o5M9Q9l39
3865b54L41Nm7j56K22j04Q5k73R8r2L96J18j5l16j79J73RN6l9j47j10J15k1J86
$$ plain form
3700 185 264 -52 56 -154 -31 -10 -231 130 87 107 132 -47 -116 -22 159 216 -49 117 -94 -13 -280 -268 112
3723 112 216 -87 224 17 -52 107 -128 -28 -294 165 -17 21 67 106 -61 -160 -104 30 45 19 -94 26 -37
3746 -37 -104 -21 -237 -38 89 89 -90 35 134 52 -167 -153 61 99 -52 227 336 58 -6 55 216 74 -170 -103
3770 -103 -102 40 104 -162 20 -88 -31 -33 -57 36 150 -375 59 284 167 107 -48 117 -72 27 52 -137 -325 -125
3794 -125 -58 -134 -84 -145 187 121 1 202 36 -116 35 164 -33 -205 -6 154 -47 20 -165 -237 -205 89 -1
3817 -1 21 -7 18 -112 35 158 -146 104 -12 -52 -30 -90 54 138 -84 87 -14 101 98 56 -124 61 -41 -123
3841 -123 -48 1 55 -179 -184 -38 -12 33 -130 -45 83 -20 83 266 -125 -213 230 -230 -181 12 -53 -4 85 -254
3865 -254 87 92 45 -111 111 7 92 -181 -83 -175 221 339 324 8 -171 2 11 67 28 -119 -229 -114 -135 51
3889E1k41n2J03r6K26J6J29j73J02o6j62J59K33k82J23J08K5j73k50L23l60K43
3911a4n1j02J20P7j0o7j4O8j0N7O0N5k12n8r0J77J57j76j26K55j00q7p6j4L91
3936B10l75o1N37p21M12rr2K03o8j5o8r5O2J45K12l29J68k16K10k7k32Q0p1R4
3960d6q3K77k44m6O4n7Q1J46n6J54l97R1J65k26L9n5L30o2L0k51J07J71L5l65
3984a98L63p2j48J67r5j63J66rr4L0J64k1o2j05O0J44o4j72J24K91k65n2m1K56
4008B04Q8K6l19L5j64J35K7J01l21M22k00P1m54L10j0o5L00k67L7J30j24K17p8
4031A01k25K16j13L3NK4j89J10J74j36%o3J34j1k14O8R5j61L57k82k5p3K62L3
4055A20J0j67K41J06j99k62L2P5K05l80K88J06j00N0j82J51q6P2j65j7K43%l4
$$ plain form
3889 51 -190 -242 -139 -235 -9 7 136 -37 65 -1 -163 -4 229 -53 70 178 203 30 -220 103 -257 -14
3911 -14 -65 -167 -47 30 20 -47 -61 7 -3 54 114 169 -43 -101 -191 -14 143 -33 -159 96 -4 -91 -167 -181 210
3936 210 -165 -226 311 -410 2 -7 -99 104 36 21 -47 -142 -80 65 277 -52 116 -100 110 83 -149 -69 -140 -46
3960 -46 -129 148 -96 -142 -78 -135 -54 92 36 190 -207 -116 49 -177 -138 -193 137 75 105 -146 -39 132 167 -198
3984 -198 165 93 -55 112 17 -146 20 11 -83 -53 111 90 28 -77 -17 127 63 -109 15 306 41 -11 -52 204
4008 204 292 318 -1 34 -130 5 32 133 -188 234 34 105 -349 -39 -49 -114 186 -81 -44 86 -38 179 101
4031 101 -124 92 -21 12 17 41 -148 -38 136 0 0 -63 71 60 -154 -86 9 -152 205 -77 -102 -175 87 120
4055 120 130 -37 204 310 111 -151 -119 -44 161 -219 69 175 75 125 -57 94 8 80 -85 -102 141 141 107
4078A07m41K07K9L75j11j25j38J16m9o2J2J52k1L17k08j15j50K00j23j38J13j43
4100a96L08q0K38k73p4J86m22L96j05j51L55l59M35j94k39PJ33K73j77n9JOM4
4123E3L2j46J89k27M28j29j85J55p4k04l3J51l9K7k12L40k26J76K5m09J87mP3
4146e2M32l87Jl2q7R2N2j48J54j47K11k82J46J42p9k31K87j86K01j1j3k42L29
4169A50j85P8J43l92J09lJ65Q4j30k6o8R1j38q2J51o7m2M96k54m9k20L8O8J90
4193A07p8k41J47Q6N1LR6l07R0oO2m29P11l71M3J65m0j7k1k35K52q9R5k18K61
4218A17j29K53p4j71J91l04M5j3R6R0Jk14J88k00J8l5J66j87J57j18L61l27J35
4241D6R6n5l06M65m28J87K9P3l41J17Q5j48J49o6m5K90j33Ol3R3J3j78J16k02
$$ plain form
4078 107 -334 -127 -98 277 166 41 -97 19 -30 -92 -80 72 51 368 160 45 -105 95 -28 -166 -53 -196
4100 -196 112 32 270 -3 -77 109 -313 83 -22 -173 182 -177 258 64 -175 -168 -35 238 61 2 3 9 53
4123 53 85 -61 128 -99 329 200 15 170 96 -108 -141 10 -29 -2 -214 126 -100 76 101 -308 -121 -125 -52
4146 -52 380 -7 -6 -38 -125 -33 19 -129 25 -122 89 -193 -47 95 16 -215 72 -114 87 76 63 -179 150
4169 150 -35 43 186 -206 -97 -100 65 149 19 -7 -75 16 -122 -204 -53 -120 -162 334 80 31 -189 -151 -83 107
4193 107 29 -212 -65 21 72 75 171 -136 -46 -52 10 -419 292 -79 -36 129 89 72 51 -184 68 -21 74 -144 117
4218 117 -12 241 167 -4 187 -117 -72 -85 11 101 102 -112 76 -124 -106 -141 25 -162 -5 -123 238 -89 46
4241 46 142 87 -219 246 -182 5 34 107 -234 -117 -32 -180 -31 -97 -142 148 15 21 -12 81 94 -84 32 -170
4265a70K42k87K72K83k46j37j67J26K5K56m12k7L17R3j84j3l0K8NN6k35rK72n9
4289aJ2k50L03k11J38r6J94k84L15k84K58j26J8O5N2l4k04m9K91M0k95J62OJ36
4313A56K47n07K07j11J14m60K70Q9J15p8n3J34j88J52j09L53k25j81N4K91k96
4334b6J51j33m7j64J62J04l06J65J84jj08J58j1q5j19J9L05j82m02K33K71k48
4356h0L0R0K8j08Mr3JL25j78j70J29n1J42j47P1j31R1j29K08j52J20J8qOJ02k75
4382a57K93l72K35N6jp7k24L98k90K37J39m4l33J50j76K21K06l62pJ48j98M2L04
4405A88j14R9l73J53r2K14M8n8n3j94N2L76m89K94j23L27k60n8jj54K79k22J76
4428A5n2n4J01m3j27M0J53M1Q0j12n6P8k11L24r5K4j70q3J13j07J47l42M60k68
$$ plain form
4265 -170 72 -215 57 340 94 -43 -210 -84 -59 197 -215 -242 75 168 -16 -29 -59 -31 -26 30 -205 -214 58 -1
4289 -1 11 -239 64 -147 -9 -105 89 -195 120 -164 94 -32 -14 51 103 69 -135 -184 107 147 -148 14 20 156
4313 156 403 -104 103 -8 106 -354 -84 5 120 42 -11 123 -65 87 -22 331 106 -75 -21 270 -26
4334 -26 125 -8 -55 -219 -57 47 -259 -94 90 89 -19 139 128 43 -76 -57 248 66 -336 -103 168 -80
4356 -80 -50 40 68 -40 -36 -129 -128 197 19 -151 -22 -73 69 -78 -7 -138 -47 -176 32 -120 0 18 10 16 118 -157
4382 -157 136 -236 -1 55 54 -23 -247 151 -139 98 237 193 -140 10 -166 55 261 -101 -108 40 -158 -116 188
4405 188 74 173 -200 -47 -139 75 123 65 12 -182 -130 246 -243 51 -72 255 -5 -63 -64 -218 61 -161 15
4428 15 -37 -91 10 -33 -160 -120 33 74 154 42 -14 64 -147 177 82 106 -64 -147 -34 -141 6 -336 124 -144
4452a44k6J66r9O5L7k24R4M20l64L7n3j8k59M87k68J4K3n2Q9Q8Q3J02kJ8j17o8
4478B9J25j17Mj96K08K72k26k06K07q3l7K76n9m07L76m7k65K07L3mJ61k76j68
4501a93L42o7l25J59R4KN6mk76K11k7j36J58N6j88J57j14J12R8L2q4j4Q9k47M09
4526C00l11j77N11l00J40P5l11J22J15k83M53k17j92Q2J61J75J38o36L22j17%
4547E0l02M63k94j6L58n13K81q6r6R0j52L50j80P3m8j82J81J47o6p2O7k11O6J39
4571D7m32L70j34k32O09l96K53j71J30m9K8l3k62K97Kj35K01j40L41l52K32j52
4593B2k67J22Q3p1J67q6j88Q6K37l2j10lJ51j10LJ9j36N33m19R9j20j8J18j72
4617i2M7j21J58k33J12L06J11k93k0K20ok29K44l17j21L69J59o6l33pJ2l8L85
$$ plain form
4452 -144 -170 -4 -103 -38 -1 -225 -131 289 -75 -38 -91 -109 -368 119 -149 -135 -112 -164 -75 13 96 198 196 214 97 29
4478 29 154 37 41 -155 53 325 99 -107 100 17 -20 256 197 -210 166 119 -146 61 94 90 251 -25 -193
4501 -193 149 82 -243 -84 10 12 68 64 -212 -1 -28 -164 -6 50 -138 19 -95 17 115 147 63 49 138 -109 300
4526 300 -11 -188 323 23 163 238 -73 49 164 -119 334 117 -75 7 168 343 481 -155 167 50 50
4547 50 -252 211 -83 -99 259 -254 27 -59 -155 -65 -217 133 -47 26 -22 -204 -23 124 58 -14 53 -158 -92 47
4571 47 -385 -15 -149 -381 228 -168 85 -86 44 -5 23 -10 -272 25 27 -108 93 -47 294 -58 174 22
4593 22 -245 -123 -40 -111 56 -30 -218 -132 105 73 -37 -40 111 1 4 23 -113 420 1 100 -20 -38 80 -92
4617 -92 -45 -166 -8 -241 -129 177 288 -5 -25 195 189 -40 204 -113 -234 135 294 228 -105 -112 -100 -138 247
4640B47J7m19J00l2LMJ29j04k09J89Q0M1o5Q4K4o8O6K80l54j87L02n9O1k45K77
4665A62l71L49p4k53J13m0o7K01J4m09L24L7r7J53K6j63q4N0J12n2J17J00k25
4688g7O7k04J68o6J86k37L18j38j13Q4J42j65j97M47m4j88Q5J6p6n3K2j85j4J67
4712e5p8L86n14J21K16k48K04k19K6K94k42J66p5k5k92L94k00N5j02K13j24J9
4734h0J89j51J43l7K46n63K36J04j02J29j43j22J0J57k71L56o1Mk03L41j49J98
4756B31j51j98L14k64K9lRq5K26k36P0J4j45K28j%l1l0J85j37P3j87o4L13M2q6
4782A16K7M3j79o0l7K09om1R6j10q9j70L3J77j31L70k74l4l4j6l8nL91m34L56
4807A60k71k90P11j57j87k98L79M7J7k24J74j13L89n22L32j26J4J36r5k12R1n7
$$ plain form
4640 247 264 -155 -55 -87 -84 -80 49 -55 -264 -75 5 46 -19 65 89 21 87 367 13 -174 128 69 130 -115 162
4665 162 -209 140 66 -187 -74 -114 -181 20 34 -375 -51 -14 -111 42 68 -95 -179 -129 -17 -69 48 148 -77
4688 -77 -10 -214 -46 -112 74 -163 155 17 -96 -12 130 -35 -232 215 171 -17 68 84 8 -45 -23 -208 -222 -55
4712 -55 -133 253 -261 -140 76 -172 32 -187 -161 133 -109 57 -18 -43 -335 59 -141 -86 -188 25 -99 -80
4734 -80 109 -42 101 64 310 -253 -17 87 -15 114 -29 -151 -141 16 -255 101 40 44 -159 182 33 231
4756 231 80 -118 196 -68 -39 -42 -33 -118 108 -128 -58 -44 -189 39 38 38 7 -23 162 25 98 -89 -153 160 202 116
4782 116 143 186 7 -53 -90 119 113 72 168 58 -31 -201 -168 9 -122 248 -26 -60 -94 -110 -148 -153 238 -196 160
4807 160 -111 -401 310 153 -34 -332 47 94 111 -113 61 -52 337 -185 147 21 35 171 76 -136 -45 -102
4829a02P3K73n84R2L93Or2l28M32k0j15K93k15j62Q6q2L4K8J65j54J12J53m94
4852b08K19J18j88jM4P3n90K44J70J45j03j37J19M2q8K70k98N3K07j76R3R9k9
4875G8J44k12R1Q0n2l62K87o5r0J81L1r5J79j35k61R8jJ58j85L73l85L12k63Q4
4899a0k51J32M54l24J26n5J00k12j1L25j13l5l86L03K65j44p3k83K92R8j87J11
4921A22k06l6J32M9j19J10k38J83j21L96l06j5K5l3o7N5n7M1L11l82J27l6k3K4
4945f4l2K90k26r7M19k73n2j63K30kr5N4j06K67l10j50J92m6L37Jk23K61m15J05
4969i8Q5%J03k75N7M7J39p9L9j86J53Mm92M30J21p8Q5l6J27j86K0j11J7P9J79
4994A44n7k42J77j76j16N18k33K71m68K29r2j20o4N0j13L82j07K85k19l06J11
$$ plain form
4829 -102 -29 244 -340 -248 145 151 59 -269 163 143 28 321 106 -56 30 -52 -18 10 175 21 133 286 -208
4852 -208 11 129 -59 -60 -16 57 -533 -289 -119 26 -77 -214 -95 -53 -141 129 -169 -116 91 -85 8 107 78
4875 78 222 10 101 181 129 -233 54 -11 -101 80 111 16 195 60 -201 -103 -104 54 -131 242 -143 169 -94 -10
4899 -10 -261 -129 325 1 127 72 172 -40 -51 274 161 126 -260 43 308 164 91 -192 100 198 11 122
4921 122 -84 -120 12 61 -58 52 -186 -3 -124 272 -34 -49 -24 -57 -124 -69 -126 -85 226 -156 -29 -65 -88 -64
4945 -64 -96 194 -32 -129 290 17 -35 -198 32 30 -65 -11 -117 150 -160 -310 -118 -164 173 174 -49 212 -203 -98
4969 -98 -13 -13 90 -185 -128 -81 58 -21 18 -168 -15 -11 -503 -73 48 -30 55 19 146 -40 -20 -131 -114 -35 144
4994 144 87 -155 22 -154 -270 248 15 286 -182 47 -45 -165 -229 -179 -292 90 -17 268 49 -257 -146
5015a46L84Q9m52J12q2M0K08j92J47j71K96l0k62J60N8p4M0l47ML27R9k11n7J40
5039H0j38o7J21kL4N7q4m3K07j46l23R9J05K54k62K71n25L59L0l2L3J59nj14M6
5064A14k95M10R6o35M08j75L5R9lj2j97J58n5J59j67J66k39L71l51P4K4R6lj56
5088g8K8jL56l25j83L43l81L68l03L32j81K29k11p7N2l1J96k94K59Kj60K02k08
5111f6kL63m24J94k43J11K0k5K03r5p2m9J0K54l07K23l60M80j83R1l13N30k55
5134H5K13j89k53L42M0O0j47j31j98K48j15K2m4J14J12k81J07P4J8j5j72R8L00
5157B88j52M7l62L38m74J16L49r8P0j66Q3j51n9J96J54J27n11M2J29P2j77J77
5179C8j31J43K1N7j93q2J21K80j35k73K4J65J67M5j99j49J94r2j01K63l68J66
$$ plain form
5015 -146 238 327 -125 -13 -95 -55 153 -39 108 -63 233 203 -59 101 159 85 125 -222 -218 109 208 -3 -60 80
5039 80 -58 -125 -4 -6 28 85 1 -42 165 19 -304 -205 -100 154 -108 163 -362 -3 27 -5 28 187 182 68 114
5064 114 -181 229 325 -310 98 -77 -42 57 54 42 -155 3 -52 107 -60 106 -133 238 -113 -39 -15 81 78 -78
5088 -78 -50 -51 305 -20 -203 140 -241 127 -176 156 -25 204 -7 -84 -32 -63 133 -161 98 100 -60 142 -66
5111 -66 -68 295 -129 65 -178 -67 -47 -72 131 36 -36 -85 -75 179 -128 95 -265 215 32 123 -190 340 85
5134 85 298 109 -144 198 238 298 151 20 -178 70 -45 -23 -67 47 159 -122 -15 59 77 62 -110 -12 288
5157 288 136 183 -179 159 -315 -199 150 52 122 -44 39 -112 -171 25 179 306 -205 -163 -34 38 -139 38
5179 38 -93 50 71 128 -65 -147 -26 254 119 -154 -130 35 202 247 48 -101 93 1 -100 163 -205 -39
5201c9R1J01k26p9J13M7o5K02q9k97K71J97k66J39J7r7O9j41n6K31k90J94L0j72
5225a15p2J53L14r0m9m7J80j43j99m5M5K06k33J98M1O7l00J64J23k22J84j10j93
5248a43J24J29j18K2J41Q1k09j5l76M19K4j24j93K19n0J11R4j89Or6K17P5j72
5271b3r1K26k46P8k29J52J00JO8mj18M3j94j24L17P0k25j0J36Q3J11q5J85k63
5295d2p7M48k66j07j8K25k08j44l2O3Q8J03p3j10K00o0r3K62p0j03K4J48j97J26
5319H7J3JM6j24J54j59o7p1J62J83J06l42P7J80l08J76n2L8j4L7J64j68k54L55
5343B20l48k01M55J33j49O4k08k0J67J4j11j06J84K08l22p8m2j2P7J45r9p1K12
5366A12Q0j18M7k91J87n3J2o5m4J35QJ65k10M1L7k51K15o8k3jj06O4K18q3K74
$$ plain form
5201 -39 52 153 -73 -152 -39 8 -57 145 56 -241 30 227 -39 100 117 20 89 -52 -108 123 -167 27 57 -115
5225 -115 -187 -34 280 190 141 94 274 131 -68 -113 -68 138 -95 103 144 211 -89 75 198 -24 160 50 -143
5248 -143 -19 110 -8 14 155 236 27 12 -364 55 79 -45 -238 -19 -69 42 136 -53 -47 -143 74 149 -23
5271 -23 -114 112 -134 -56 -285 -133 -33 -32 36 32 -86 -43 -237 -361 -44 26 -199 -209 -73 10 121 36 221 -42
5295 -42 -119 329 63 -44 -62 163 -45 -189 -221 -158 -70 33 -40 -150 50 -10 -103 159 89 -14 10 158 -39 87
5319 87 100 101 147 23 177 18 -49 -120 42 225 331 -11 66 246 -62 114 62 100 86 123 287 119 -135 220
5343 220 -128 -329 126 259 110 174 -34 -54 113 127 16 -90 94 302 -20 -98 -140 -152 -75 70 -29 -100 112
5366 112 192 74 121 -170 17 -36 -24 -89 -133 2 10 175 -35 6 43 -208 7 -61 -84 -85 -191 -127 91 8 282
5391B82l30n3K38j24j52j35K01K5J86j54R5j5L08k89p0R8k14j1K5j81K2M75j90
5414C7k2jn8Q6J85k44P0L6k74J53L6O6j14J42j6l7j81J87M9pk40J72lJ13k41Q4
5440b2J61j90J68M8m8N9k54K97m25m5M75k76pO1r6L2J45j55n6L40r9k56J31m7
5464e9j11N08l34J02m47J79M09L1k18j9j15j81j25L69N4n6J39n3O3r9J39k10J42
5487A08k27K69k23K2K17k86J19p0M33l73L4j3mJ89l17o1M9j08J30K17k00J93m8
5510E0j04k0j97K37J52j01m2o9J77n1r2J37l7K11l05K8k0L4qP3J2K10k28j49j16
5535b18K48j08j27K47q4n0M54m76O8m2j72L01l4N8l2K0N5j16rRP0k02N1K00m1
5560G0k07J43n5J24j74K27m9q2j64K32p5J3j4o8K0L2pJ40J47l39J11m3N1l01L12
$$ plain form
5391 282 -48 -101 137 13 -139 -274 -73 -48 138 -16 79 64 372 83 13 111 -103 -114 -89 -270 -248 227 37
5414 37 15 14 -44 42 227 -17 53 89 -185 -32 4 70 -44 98 82 45 -136 51 100 93 -147 25 22 135 -106 -22
5440 -22 139 -51 117 165 117 176 -78 219 -206 -251 224 -52 -59 2 -94 -62 83 -72 -128 212 113 -143 -12 -59
5464 -59 -170 338 4 106 -341 -162 247 278 60 41 -74 -255 -380 -11 43 -13 126 73 136 37 176 -34 108
5487 108 -119 150 -73 -51 166 -120 -1 -71 362 -11 23 10 6 195 -122 -183 -134 -242 -112 105 -95 98 50
5510 50 -54 -74 -271 -34 118 17 -25 -94 83 32 -60 77 40 251 -54 -26 -46 -12 -20 53 65 275 47 -102 -218
5535 -218 30 -78 -205 42 -42 -92 362 -114 -46 -88 -260 41 7 65 33 53 108 -8 -17 -8 62 -140 -89 111 70
5560 70 -137 6 -49 75 -99 128 79 -3 -167 65 -10 3 -11 -79 -59 -27 -34 106 253 -86 25 -18 33 -268 44
5585D4r0p3JK06o8P0p8j10K61n6j16j37L0K71N8j67J96j67k49M34l27l9q2J38
5609e0j2L2l4j19L92j95R3k31J27k8k32K76p9j45L29k07K78p9k26J2J51Nj6q0
5633c8K96k95n0J70p6n7J46K9k0j10P7O8r0P3rj96J85j19j20L28l71K32j32P6
5657cJ66k00O8K88p15K15N6j62K20m1j17L05l14J27j19L19J77j04k84J04j91K38
5679C3j2ml3k9j87K66k1j72K26J79q1NJ20l83K01N0k52n6J74r9rJ8R3J08o9J37
5705B03l48J93o2N9N0k45J08K41k71j12K33m5j8J84j64K4j24Kr1J59N3O9J49k94
5729d7Jo2J45K1r7kPj65M3J24l15K99J68MO1k2j92p7K8j26L65k15K10l41K81m1
5755E5k72M26Kj1m52K85J18K7l26L51j64r1L08r8l48K65j19J47mk40J24L1m9J28
$$ plain form
5585 44 -46 -119 -118 88 20 90 12 -98 163 107 -9 -146 -116 155 213 46 242 75 -174 260 -67 -106 -188 -50
5609 -50 -62 -30 -64 -183 209 14 107 -124 3 -25 -257 19 -60 -205 124 -83 195 116 -110 -98 53 58 42 -38
5633 -38 258 -37 -87 83 7 -50 96 125 105 -5 72 140 50 123 114 -82 103 -16 -136 192 -179 53 -79 -3
5657 -3 163 -37 31 319 -396 -181 -125 -287 -67 -108 -225 80 -234 -107 -226 93 270 166 -118 -14 -205 33
5679 33 21 17 -16 -45 -232 34 13 -159 67 246 165 170 290 -93 108 158 -94 -150 24 -75 -84 -66 27 135 66 203
5705 203 -145 48 -14 45 95 -150 -42 199 -72 -184 49 4 -14 170 6 30 -94 -92 -183 -24 29 98 247 -47
5729 -47 -46 -108 37 58 -39 -41 -34 -199 -156 -32 -347 -48 120 124 185 163 -29 -106 -78 -204 161 -54 156 -185 96 55
5755 55 -217 209 211 200 -252 33 151 178 -148 203 39 -52 256 158 -190 75 -44 103 99 -141 -17 14 -35 93
5779I3m8K4k46K11K61Kp5k95J57k00K2J61N6j13rM3j56O6R2K6R3l24K99P7l28
5804a11J94O8l05J49j53M25l04J00K7o9JO2j83J30NL01k79J03l83M20k96K16J8
5827A36m9Nk08L80l33J8J06j19k51M01j28M4j8J73r7L0M1p4M8k67J73oj41M8Q2
5852fj53K67j62N5j03J29K57k91Q0l6jj54NK61k08J50n6N9k24P7J28j79K04J46
5876B45j61j81j33L27k10J55n2j04p2P8J8j51K87Q3L8j16Lo6J03r8J00j5j35J5
5900d2K98k70N6j46j90J43J00N8n8j22K18J03k83J23N6P1j86q5O7J31rR6q8J8
5924E9j07m2k3K05Qj49j04Q5JJ13J59q6m25N7K38M9k55N40m03o2L44k89J02r8
5948h3K78j79M9p5K69m72J96J56l89L26l27J38Q3J16J27k57p4J66O6m06L80o1
$$ plain form
5779 93 45 69 -177 34 295 297 222 -73 84 -116 -94 67 123 10 1 44 -112 -46 46 72 165 -159 140 217 -111
5804 -111 83 151 -154 -5 -158 267 -37 63 90 21 22 84 -99 31 36 337 58 161 -222 198 -98 118 136
5827 136 87 92 -116 264 -69 -51 55 -64 -315 86 -42 2 -16 157 60 90 131 57 105 -162 11 5 -136 -88 -6
5852 -6 -159 108 -54 1 -102 27 284 -7 73 37 36 -118 -113 148 -60 90 34 93 -131 -54 74 -105 99 245
5876 245 84 -97 -230 97 -113 42 -10 -114 -186 -108 -90 -241 46 129 167 51 54 -12 91 -7 93 78 -57 -42
5900 -42 256 -14 42 -104 -294 -151 -51 7 -51 -173 45 148 -135 -12 44 115 -71 -156 -89 42 33 129 41 59
5924 59 -48 -90 -113 92 100 -49 -153 -68 -67 46 205 119 -306 -249 -11 38 -217 323 -80 -142 202 -87 15 -83
5948 -83 195 16 65 -10 259 -213 -17 139 -250 76 -251 -113 -30 86 213 -44 -118 48 114 -292 88 27
5970B7l3J99j9k0k10K6j21J68j00L43j92L01l67o7K96P7j94o9J4m7m1J25j9k82
5994b05L19r0j87K13l3l3r1R7j68L8p7K53J98k61K16L6j1l22L89qj40k52K37o2
6018E6j38J59q1k45K69p8J3L2J9J90l76k2K57k07K81mq1j50j00K72j39O1K90m90
6042b12K60J81l12J26M0j13l0J51K8J3o8k44L10j10k3k82M29oJ28L2m92J79K89
6065B74m04K02J19j7j16k2Q1J7j61J40k46L25k3j11J0K3j18L22k39K2pL1j82J2
6089f8Q4J78j06k1k8j30kj04p9M76q4l37K99j14JJ11m5Q8j42j13J75K18m55L14
6113A16r3j06J84j60j8N7J57M0j0L8k89J76r5j34L18j83O3J3j37J5J91l5j07O2
6137F3M2j94j20J7J17J88j40M4j12MK98l67K16J58k29Q3j60J96k00K89k08J15
$$ plain form
5970 27 -6 193 174 154 -56 -30 -151 17 -83 260 68 369 2 -65 231 308 114 45 59 12 -29 96 77 -205
5994 -205 114 24 -163 50 17 -16 -107 -10 -178 -140 -217 36 234 -27 189 225 214 -108 281 273 133 -119 118 56
6018 56 -82 77 -4 -249 20 -58 -45 -13 6 196 -180 -202 55 -152 129 125 44 -106 -206 66 -73 -12 278 -212
6042 -212 48 229 -83 43 83 -30 -60 91 119 132 64 -180 130 20 -3 -285 144 138 266 298 -194 -15 274
6065 274 -130 72 191 174 58 36 117 134 -27 113 -133 192 169 58 68 91 -27 295 56 78 71 102 -80 -68
6089 -68 16 194 88 67 39 -91 -93 -197 -276 200 116 -221 78 -36 -35 76 31 119 -23 -136 39 257 -198 116
6113 116 23 -83 101 -59 -77 -20 137 177 167 205 -84 92 -3 -137 181 -2 61 74 -63 -48 143 108 1 63
6137 63 105 -89 -209 -192 -75 113 -27 17 -95 -91 207 -160 56 214 -15 68 -92 104 -96 193 -15 100
6159A00J47j77r6J0P9r5k6qo7M7M9K28k8m97N8K58L3O1mK8j50K17k14m0K2Q1o2
6186d6J08j63J70j65n2K40r8R9j7k47K76k35J4k48M35o4o2J69K62k74j03o6j31
6209a98K49q8R8M1M9k43K10j4J8l25K44J68m82K61P2p6K55p3j44j72Q0r0K5o7
6233b02K83K0j31J45k4p4r0J13L9J39j69Q7J1k33L9J3P1J40j13l4K27l09lN7j15
6258a13K89k2p7k75K26k29M03m47K21K17m98M20m4N6l11r1K79k23K52J01l02L25
6280A57l3k05J23j18K2K7J53J9l0k30R1l03K98p0K25K77n98L58j94l2K8J05K5
6303I5K24m6n7j78qj0q4KJ54j25J76m7l02L14o2lm5M01k21l20M53j77K3r0j86
6328a19l2J74m3j84M95j99k20n3J73M04k84k15j79L56JKj47o8M07j63K6k0j28
$$ plain form
6159 100 247 70 -26 -16 63 -32 -58 -66 -133 -86 -37 191 163 -334 -276 -18 15 76 72 100 -50 167 -47 -87 -65 16 -46
6186 -46 62 -101 69 -96 -148 92 -6 93 76 -171 105 -130 -116 -364 71 7 -55 114 376 102 -1 -67 -198
6209 -198 51 -37 61 102 151 -92 118 104 122 -203 41 209 -273 -12 60 -16 239 166 22 -150 -70 -160 -135 -202
6233 -202 81 101 -30 115 91 17 -73 40 79 218 49 136 147 -86 -47 -34 37 177 64 30 257 -52 -55 2 -113
6258 -113 176 154 77 -198 28 -201 202 -245 -24 193 -305 115 71 127 -184 -275 4 -219 33 134 -168 157
6280 157 124 -81 42 -76 -54 -27 126 145 115 -115 -24 -327 -29 -99 126 403 -195 163 -31 -63 -35 70 95
6303 95 319 273 216 38 30 20 -64 -62 92 -33 143 96 -206 108 46 43 -2 399 178 -142 311 134 157 67 -119
6328 -119 -151 23 -20 -204 291 92 -128 -181 -8 396 112 -103 -282 74 75 77 -70 -138 269 106 132 112 -16
6351a6p3K10p3o0k0o8J6O0n8K66J4m73L70k7j54Q2J92j24k17o3M15k28m40L83
6375h6j97J00J12M1M01l38j57j4K9N7k7K0k59M4K02J47r4k7O8j6l2r1J83o5j25
6400a24J70P9j49p4Q6J64qq3l75L33K05k58r5l7P5J85Nj50J96k48M8M5j66J27
6424d9l5K07k71p0K58j55L7J20j30L03l76K08oR2j40l5l9J8K07k04K28k70M8L30
6448B76l80J31J64r2j37N7r9O8Q4J98l62P1J2K39m18J91j80K17k72J08K90j3J33
6471B86m28J67Lk02K56k13J97o8p1Q0K81j81lj04j41L35k17j0k2k06J89M9k5k4
6495g2K9o6J8j12l1P9M5MK62k31k8K25J04k00lj07J85j72N2J05j96K06rj14l0
6520e7q8O6K30k47L12j37j37q0M2Rj1P0J38L2j84J04k18K09L0K1j55l6J40j6P
$$ plain form
6351 -16 -89 121 48 -12 -32 -100 -84 -24 -82 184 198 -275 95 68 -86 -4 188 64 -153 -216 199 -29 -469 -86
6375 -86 -283 -183 -71 -30 371 33 -124 -138 -109 -52 -79 -59 -318 -274 -72 75 -19 -46 22 6 -26 -117 66 1 -124
6400 -124 46 125 -24 -98 -12 152 144 61 -314 19 224 -34 -129 -166 -91 94 99 -51 145 -103 -55 -10 -176 -49
6424 -49 -84 123 -148 -218 40 -115 -78 42 -88 215 -161 47 41 133 -7 -42 -81 -63 144 -60 168 -102 -54 276
6448 276 -104 27 191 99 -38 19 -80 -12 72 270 -92 -21 -9 230 -188 3 -177 40 -232 -124 166 153 286
6471 286 -142 25 28 -174 82 -131 66 -2 -73 7 288 107 104 0 -141 194 -23 -33 -55 -261 -72 -23 -48 -72
6495 -72 -43 -109 -91 -203 -234 -155 -110 -106 156 -75 -103 122 226 26 23 -84 101 -71 -19 86 -110 96 87 -27 -57
6520 -57 -145 -79 151 -96 216 79 -58 -138 -96 -87 -98 -28 110 142 -42 62 -156 53 83 104 -51 -87 53 37 44
6545D4J46j82k03OM14k7J3j31p1q6J30MJ09l78N9n5J10N4k92M04k49J47j8J50
6569I8L0j71J39j80k5n9J04O4m3j97OK29k5N4M0k46K23l33K45k02K22j7j34J65
6593a3j97L78j9j21p3M4l3jj60K46j39k34N4K86m2J56n8j67Q8j97K87q1L59l69
6617fKo4J98L1k63j27L20j16j46L19N9l97K2L38k11J44k76L08j22J74m4j20j85
$$ plain form
6545 44 190 8 -195 -189 225 198 211 80 9 -77 53 57 166 -212 -153 -208 -98 -44 -336 68 -181 -34 -52 98
6569 98 128 -43 96 -84 -109 -168 -64 0 -43 -240 -234 -5 -30 24 64 -182 41 -292 -47 -249 -27 -44 -178 -13
6593 -13 -210 168 149 28 -45 -1 -34 -35 -195 51 -88 -322 -268 18 -24 132 74 -93 -5 -202 85 4 363 -6
6617 -6 -4 -68 130 161 -102 -229 91 -25 -171 148 207 -190 -168 170 -41 103 -173 135 13 187 143 23 -162
$$ [...]
8191G5
##END NTUPLES=NMR FID
##END=
