##TITLE=1H_26-2025-Bay
 200.13MHz, CDCl3,
 8 sc
 
 13.2.2025
##JCAMPDX= 6.0         $$ Bruker NMR JCAMP-DX V2.0
##DATA TYPE= NMR FID
##DATA CLASS= NTUPLES
##ORIGIN= UXNMR, Bruker Analytische Messtechnik GmbH
##OWNER= pz
$$ XWIN-NMR		Version 3.5
$$ Thu Feb 13 14:07:01 2025 Russian Standard Time (UT+4h)  she@DPX200
##.OBSERVE FREQUENCY= 200.1313
##.OBSERVE NUCLEUS= ^1H
##.DELAY= (6, 6)
##.ACQUISITION MODE= SIMULTANEOUS
##.ACQUISITION SCHEME= undefined
##.AVERAGES= 8
##.DIGITISER RES= 18
##SPECTROMETER/DATA SYSTEM= spect
##.PULSE SEQUENCE= zg30
##.SOLVENT NAME= CDCl3
##.SHIFT REFERENCE= (INTERNAL, CDCl3, 0, 14.3821)
##AUDIT TRAIL= $$ (NUMBER, WHEN, WHO, WHERE, WHAT)
$$ ##TITLE= Audit trail, XWIN-NMR		Version 3.5
$$ ##JCAMPDX= 5.01
$$ ##ORIGIN= Bruker BioSpin GmbH
$$ ##OWNER= she
$$ F:/spectra/data/she/nmr/H-C/1/audita.txt
$$ ##AUDIT TRAIL=  $$ (NUMBER, WHEN, WHO, WHERE, WHAT)
(   1,<2025-02-13 14:04:51.54 +0400>,<she>,<DPX200>,
      <created by zg, POWCHK disabled, PULCHK disabled
       configuration hash MD5:
       00 E9 B6 7A A2 85 ED C7 34 08 36 98 17 FE 4E 26
       data hash MD5: 16K
       C4 7A D3 84 82 F1 ED 27 62 7B 57 42 38 D9 0E C0>)
$$ ##END=
$$ 
$$ hash MD5
$$ FF CA 01 11 19 DB 55 9C 68 8B 73 1E 85 20 C0 E7
##$RELAX= 
##$RELAX= 
##$RELAX= 
##$RELAX= 
##$RELAX= 
##$RELAX= 
$$ Bruker specific parameters
$$ --------------------------
##$DU= <F:/spectra>
##$EXPNO= 1
##$NAME= <H-C>
##$PROCNO= 1
##$TYPE= <nmr>
##$USER= <she>
##$AMP= (0..31)
100 100 100 100 100 100 100 100 100 100 100 100 100 100 100 100 100 100 
100 100 100 100 100 100 100 100 100 100 100 100 100 100 
##$AQSEQ= 0
##$AQ_mod= 1
##$AUNM= <au_zg>
##$AUTOPOS= <>
##$BF1= 200.13
##$BF2= 200.13
##$BF3= 200.13
##$BF4= 200.13
##$BF5= 200.13
##$BF6= 200.13
##$BF7= 200.13
##$BF8= 200.13
##$BYTORDA= 1
##$CFDGTYP= 0
##$CFRGTYP= 5
##$CHEMSTR= <none>
##$CNST= (0..31)
1 1 145 1 1 1 1 1 1 1 1 1 1 1 1 1 1 1 1 1 1 1 1 1 1 1 1 1 1 1 1 1 
##$CPDPRG= <>
##$CPDPRG1= <>
##$CPDPRG2= <>
##$CPDPRG3= <>
##$CPDPRG4= <mlev>
##$CPDPRG5= <mlev>
##$CPDPRG6= <mlev>
##$CPDPRG7= <mlev>
##$CPDPRG8= <mlev>
##$CPDPRGB= <>
##$CPDPRGT= <>
##$D= (0..31)
0 0.7 0 0 0 0 0 0 0 0 0 0.03 0 0 0 0 0 0 0 0 0 0 0 0 0 0 0 0 0 0 0 0 
##$DATE= 1739441090
##$DBL= (0..7)
120 120 120 120 120 120 120 120 
##$DBP= (0..7)
150 150 150 150 150 150 150 150 
##$DBP07= 0
##$DBPNAM0= <>
##$DBPNAM1= <>
##$DBPNAM2= <>
##$DBPNAM3= <>
##$DBPNAM4= <>
##$DBPNAM5= <>
##$DBPNAM6= <>
##$DBPNAM7= <>
##$DBPOAL= (0..7)
0.5 0.5 0.5 0.5 0.5 0.5 0.5 0.5 
##$DBPOFFS= (0..7)
0 0 0 0 0 0 0 0 
##$DE= 6
##$DECBNUC= <off>
##$DECIM= 32
##$DECNUC= <off>
##$DECSTAT= 4
##$DIGMOD= 1
##$DIGTYP= 9
##$DL= (0..7)
0 120 120 120 120 120 120 120 
##$DP= (0..7)
150 150 150 150 150 150 150 150 
##$DP07= 0
##$DPNAME0= <>
##$DPNAME1= <>
##$DPNAME2= <>
##$DPNAME3= <>
##$DPNAME4= <>
##$DPNAME5= <>
##$DPNAME6= <>
##$DPNAME7= <>
##$DPOAL= (0..7)
0.5 0.5 0.5 0.5 0.5 0.5 0.5 0.5 
##$DPOFFS= (0..7)
0 0 0 0 0 0 0 0 
##$DQDMODE= 0
##$DR= 18
##$DS= 0
##$DSLIST= <SSSSSSSSSSSSSSS>
$$ [...]
##$SUBNAM0= <"">
##$SUBNAM1= <"">
##$SUBNAM2= <"">
##$SUBNAM3= <"">
##$SUBNAM4= <"">
##$SUBNAM5= <"">
##$SUBNAM6= <"">
##$SUBNAM7= <"">
##$SUBNAM8= <"">
##$SUBNAM9= <"">
##$SW= 18.0517328524113
##$SWIBOX= (0..15)
0 0 2 0 0 0 0 0 0 0 0 0 0 0 0 0 
##$SW_h= 3612.71676300578
##$TD= 16384
##$TD0= 1
##$TE= 0
##$TE2= 300
##$TE3= 300
##$TEG= 300
##$TL= (0..7)
0 120 120 120 120 120 120 120 
##$TP= (0..7)
150 150 150 150 150 150 150 150 
##$TP07= 0
##$TPNAME0= <>
##$TPNAME1= <>
##$TPNAME2= <>
##$TPNAME3= <>
##$TPNAME4= <>
##$TPNAME5= <>
##$TPNAME6= <>
##$TPNAME7= <>
##$TPOAL= (0..7)
0.5 0.5 0.5 0.5 0.5 0.5 0.5 0.5 
##$TPOFFS= (0..7)
0 0 0 0 0 0 0 0 
##$TUNHIN= 0
##$TUNHOUT= 0
##$TUNXOUT= 0
##$USERA1= <user>
##$USERA2= <user>
##$USERA3= <user>
##$USERA4= <user>
##$USERA5= <user>
##$V9= 5
##$VALIST= <valist>
##$VCLIST= <CCCCCCCCCCCCCCC>
##$VD= 0
##$VDLIST= <DDDDDDDDDDDDDDD>
##$VPLIST= <PPPPPPPPPPPPPPP>
##$VTLIST= <TTTTTTTTTTTTTTT>
##$WBST= 1024
##$WBSW= 4
##$XGAIN= (0..3)
0 0 0 0 
##$XL= 0
##$YL= 0
##$YMAX_a= 260817
##$YMIN_a= -286383
##$ZGOPTNS= <>
##$ZL1= 120
##$ZL2= 120
##$ZL3= 120
##$ZL4= 120
##$ABSF1= 10
##$ABSF2= 0
##$ABSG= 5
##$ABSL= 3
##$ALPHA= 0
##$AQORDER= 0
##$ASSFAC= 0
##$ASSFACI= 0
##$ASSFACX= 0
##$ASSWID= 0
##$AUNMP= <proc_1d>
##$AZFE= 0.1
##$AZFW= 0.1
##$BCFW= 1
##$BC_mod= 2
##$BYTORDP= 1
##$COROFFS= 0
##$CY= -3
##$DATMOD= 1
##$DC= 2
##$DFILT= <>
##$DTYPP= 0
##$F1P= 0
##$F2P= 0
##$FCOR= 0.5
##$FTSIZE= 0
##$FT_mod= 4
##$GAMMA= 1
##$GB= 0.15
##$INTBC= 1
##$INTSCL= 1
##$ISEN= 128
##$LB= 0.25
##$LEV0= 0
##$LPBIN= 0
##$MAXI= 10000
##$MC2= 0
##$MEAN= 0
##$ME_mod= 0
##$MI= 1.114404
##$NCOEF= 0
##$NC_proc= 0
##$NLEV= 6
##$NOISF1= 3.799351
##$NOISF2= 2.8
##$NSP= 1
##$NTH_PI= 0
##$NZP= 0
##$OFFSET= 14.38212
##$PC= 1
##$PHC0= -466.0853
##$PHC1= 10.99221
##$PH_mod= 1
##$PKNL= yes
##$PPARMOD= 0
##$PSCAL= 0
##$PSIGN= 0
##$REVERSE= no
##$SF= 200.129724274929
##$SI= 16384
##$SIGF1= 3
##$SIGF2= 2
##$SINO= 400
##$SIOLD= 16384
##$SREGLST= <1H.CDCl3>
##$SSB= 0
##$STSI= 0
##$STSR= 0
##$SW_p= 3205.1282051282
##$SYMM= 0
##$S_DEV= 0
##$TDeff= 0
##$TDoff= 0
##$TI= <>
##$TILT= no
##$TM1= 0
##$TM2= 0
##$TOPLEV= 0
##$USERP1= <user>
##$USERP2= <user>
##$USERP3= <user>
##$USERP4= <user>
##$USERP5= <user>
##$WDW= 1
##$XDIM= 8192
##$YMAX_p= 0
##$YMIN_p= 0
$$ End of Bruker specific parameters
$$ ---------------------------------
##NTUPLES= NMR FID
##VAR_NAME=  TIME,          FID/REAL,        FID/IMAG
##SYMBOL=    X,             R,               I
##VAR_TYPE=  INDEPENDENT,   DEPENDENT,       DEPENDENT
##VAR_FORM=  AFFN,          ASDF,            ASDF
##VAR_DIM=   8192,          8192,            8192
##UNITS=     SECONDS,       ARBITRARY UNITS, ARBITRARY UNITS
##FACTOR=    0.0002768,     1,               1
##FIRST=     0,             0,               0
##LAST=      2.2672688,     0,               0
##MIN=       0,             -286383,         0
##MAX=       2.2672688,     260817,          0
$$ Real data points
##PAGE= N=1
##DATA TABLE= (X++(R..R)), XYDATA
0 0 0 0 0 0 0 0 0 0 0 0 0 0 0 0 0 0 0 -5 8 -8 8 -8 8 -10 16 -16 17 -21 24 -28 31 -37 42 -46 52 -60 66 -74 82
39 82 -92 103 -115 127 -140 154 -171 189 -208 229 -253 278 -307 339 -374 413 -457 508 -567 636
59 636 -717 814 -934 1086 -1287 1566 -1978 2639 -3903 7141 -33174 -35152 117357 239672
73 239672 260817 138077 47656 140752 187999 -8552 -144142 -18814 120853 19836 -147226
84 -147226 -79974 79063 16039 -136155 -134109 -14475 64021 5126 -81939 -13160 108458
95 108458 76752 -76675 -132560 1846 81121 -61519 -135741 25159 153401 75491 -45602
106 -45602 -11642 100759 65969 -71947 -107511 -20950 68440 28116 -89053 -37497 124266
117 124266 96599 -66265 -84068 51453 97310 -32854 -102402 4624 85994 25927 -76774
128 -76774 -88810 24524 72559 -46121 -96404 38043 145583 73151 -47400 -11137 93736
139 93736 29868 -121171 -143596 -52977 7586 -45207 -108568 -18764 115734 92067 -23750
150 -23750 -34660 76892 108470 -19417 -74371 41034 114771 51752 -32176 -23057 58816 50095
162 50095 -77198 -129395 -36918 41346 -19266 -106089 -30072 94452 47798 -65941 -60829 22150
174 22150 52367 -20835 -76004 8719 109670 75810 -19961 -20911 75336 79844 -55516 -104471
186 -104471 -6048 46402 -15760 -77556 -31787 66718 54971 -42181 -59327 18260 64761 -5374
198 -5374 -86395 -19630 79266 28411 -66924 -48375 37051 52572 -27887 -60458 22938 88401
210 88401 49815 -21909 -14016 71417 67011 -53750 -87584 -560 34306 -34751 -90523 -33288
222 -33288 51612 24253 -53604 -49385 23429 58900 -6184 -64596 10859 94695 43894 -35930
234 -35930 -14286 62417 56952 -39340 -68690 6290 44794 -4028 -58461 -29782 54040 45892
246 45892 -49549 -60523 19229 46517 -21962 -72032 -6677 68045 27772 -36250 -17460 43337
258 43337 55709 -15280 -62928 449 56204 4267 -59503 -29429 48486 41207 -43629 -50403
270 -50403 23632 44496 -7867 -51379 -14929 55366 35809 -40107 -34655 36832 53511 -16454
282 -16454 -60791 3377 57775 4226 -52414 -24116 35832 37566 -29525 -53733 13891 51538
294 51538 -525 -51769 -17216 54526 36596 -42006 -33771 38158 46183 -11814 -47132 -3971
306 -3971 48344 11976 -50061 -33450 28867 37474 -26503 -55931 11616 51967 -5910 -50125
318 -50125 -13727 40807 31337 -29545 -31573 33120 52780 1539 -39057 -5145 51272 19532
330 19532 -51141 -32409 32913 32639 -23504 -45705 6164 44004 -2923 -52232 -26500 25989
342 25989 25851 -32179 -43892 26870 55968 -1110 -37166 1298 47695 21352 -39892 -28356
354 -28356 31368 37226 -9624 -35368 5003 50878 11379 -48891 -25057 29656 21464 -34117
366 -34117 -45011 13430 39461 -10512 -43773 -12194 30150 20639 -32250 -31516 34275 50188 -2949
379 -2949 -29034 10288 48084 10083 -46913 -25418 25787 19716 -24322 -36542 9840 44982
391 44982 2357 -42097 -11297 36794 23737 -29122 -28991 32535 45011 -11100 -36884 -3817
403 -3817 26602 1152 -48984 -35257 25641 33516 -10619 -23761 21647 53537 6286 -46303
415 -46303 -19961 19839 2577 -38764 -37225 15729 42840 1694 -27227 5979 41370 20061
427 20061 -31400 -24151 34895 40886 -6908 -17095 21439 45186 9646 -39929 -25570 15507
439 15507 3949 -39604 -46792 -494 28423 -15100 -51416 -15622 21361 41 -38637 -27020
451 -27020 30356 48943 11017 -684 37313 65169 35304 -18358 -12360 32080 18884 -34627
463 -34627 -41635 -1156 19929 -17349 -52613 -23111 16712 3126 -31666 -27448 21745 43415
475 43415 -644 -27057 8608 34363 4816 -36300 -23948 25794 28433 -10500 -14279 21858
487 21858 41563 9267 -35407 -21468 19335 4434 -36304 -30428 17789 38551 1218 -24175
499 -24175 8289 31897 4369 -32678 -29201 13903 25814 -14296 -26537 14785 38657 7537
511 7537 -31540 -13726 29407 18499 -19612 -14062 23536 38195 4168 -33299 -15831 11337
523 11337 -14749 -55578 -48411 -752 19682 -10783 -16171 31249 57401 31476 -1227 4567 35485
536 35485 27388 -18357 -28394 3901 19682 -10908 -45191 -23155 15573 -964 -35418 -22740
548 -22740 17816 31896 2612 -17293 11269 34345 8153 -27634 -22300 16625 21658 -17457
560 -17457 -23382 18559 35097 4565 -24694 -10497 20740 7541 -30702 -27236 9179 23422
572 23422 -4796 -28786 -1359 29748 5679 -27567 -15496 20800 26710 -5942 -16935 16608
584 16608 32564 3503 -26204 -16795 15965 13845 -20967 -17748 23787 37137 8164 -16928 -459
597 -459 21057 -3979 -41819 -37273 -6713 2997 -21651 -34248 2014 30939 8704 -16910 -1401
610 -1401 31096 29827 -4195 -7587 26863 37891 9844 -15831 -4475 21129 5505 -34052 -30500
623 -30500 3918 11866 -15185 -30483 -1711 24118 1355 -26445 -13484 15444 18447 -9523
635 -9523 -18405 14960 33481 6514 -18161 -4264 22511 11667 -24570 -22648 10435 16023 -8558
648 -8558 -22843 -2934 23117 8431 -21442 -11783 19576 23006 -5470 -17493 11665 28787 153
661 153 -23910 -10740 12362 7799 -20778 -22655 10978 23486 -1063 -18138 -730 23693 8638
674 8638 -25142 -18148 12871 13660 -11676 -20728 3773 23901 3335 -21320 -8228 16860 15036
687 15036 -12175 -18491 13612 27347 -837 -17563 -66 20337 8129 -20839 -17812 11101
699 11101 14899 -8448 -19955 369 22909 5434 -22434 -10019 16330 11757 -13118 -18318 7335
712 7335 22397 -1097 -18882 -2696 17824 10595 -16051 -17802 12763 18819 -7633 -18912 1638
725 1638 20793 5822 -20036 -9953 16506 12833 -10549 -17375 4676 21617 252 -21362 -4886
738 -4886 17642 9597 -15594 -16109 11489 18645 -6692 -17739 1259 17884 7306 -17057 -12752
751 -12752 14848 14125 -11412 -17386 3811 18694 1399 -20229 -5000 17145 9598 -12223 -14454
764 -14454 7705 18776 -3843 -18497 -49 17988 7821 -15004 -11699 14084 14947 -10606 -16783
777 -16783 2512 15749 2115 -18162 -7795 16282 11594 -11563 -14316 7164 18276 -2762
789 -2762 -19603 -1012 17759 6502 -13095 -11362 11304 15850 -7964 -17838 1510 15786 3002
802 3002 -17058 -8988 16913 12487 -11505 -12600 7066 16653 22 -16998 -2148 17349 7971
815 7971 -12069 -11761 8460 14883 -8237 -20009 -385 13679 809 -16827 -10486 12075 11311
828 11311 -11018 -14034 5468 16493 3362 -13093 -588 22445 13853 -8973 -7735 10796 15304
841 15304 -5843 -19727 -2537 12294 -73 -17638 -13057 7609 9829 -13155 -19467 2319 13817
854 13817 157 -13891 -2548 19608 14313 -7347 -7278 10443 15878 -1414 -16300 -1685 16968
867 16968 5914 -12812 -8411 10176 12574 -9548 -19084 -105 10804 -2932 -16682 -9126 12376
880 12376 11190 -9998 -11755 8474 15885 -372 -14181 -766 18430 8765 -10903 -6439 10908
893 10908 13643 -5027 -16798 362 14309 386 -15722 -8668 10095 9917 -12595 -16466 4304
906 4304 11532 -3232 -14996 -3361 16028 10933 -9022 -6248 12847 15431 -1864 -14032 872
919 872 15830 2105 -15357 -8428 8121 7930 -11037 -17366 1758 12672 -1170 -12466 -2336
932 -2336 16625 13749 -7713 -8091 10808 12807 -4208 -14920 -3009 12749 3405 -14400 -8252
945 -8252 9265 10132 -7545 -16381 775 13244 -2010 -14555 -4050 12969 10605 -7931 -10374
958 -10374 8843 13473 -2699 -12978 -1846 14579 7901 -11288 -6652 12443 12756 -4210 -12510
971 -12510 2119 14972 1347 -13365 -5130 9396 7253 -10842 -17305 42 7622 -8591 -19018
984 -19018 -6900 9418 5853 -10125 -5984 14234 16655 2162 -4861 7347 20256 9744 -8751
997 -8751 -2706 11930 7923 -10093 -16732 -1115 8001 -7758 -18836 -6600 7920 5357 -10440
1010 -10440 -10590 8435 12886 -3305 -10588 1392 14999 6672 -10662 -4790 12036 9782 -6453
1023 -6453 -12112 1009 11054 -1340 -14721 -4438 10283 7087 -7765 -9909 7581 14017 -2351
1036 -2351 -10812 905 12191 6454 -9436 -7378 9518 9732 -6929 -12429 -63 10906 716
1049 716 -13759 -5296 10518 7096 -7492 -10615 4101 12244 -2604 -13424 -2088 9517 4343
1062 4343 -10280 -9355 8619 11648 -4426 -9448 3378 13821 5533 -9397 -3464 12398 9014
1075 9014 -6416 -10042 2792 10638 -2454 -14856 -4357 8750 2743 -10495 -10169 5472 10315
1088 10315 -4728 -11046 1673 11346 5068 -8638 -5498 10843 9580 -6096 -9153 2936 10544
1101 10544 -28 -12568 -4045 9526 4625 -7866 -8566 5312 11469 -2144 -10974 842 10961
1114 10961 3977 -9508 -6890 8449 8834 -6785 -9582 2301 9644 1079 -10725 -4691 10282
1127 10282 6849 -7156 -7788 4992 11013 -1348 -11186 -278 10323 2816 -9008 -7788 5085
1140 5085 8648 -5395 -10928 1660 9641 2076 -8769 -4414 10222 8177 -5905 -6583 5294 10142
1154 10142 587 -9779 -2265 9543 3021 -8770 -7923 4149 7818 -4469 -11971 665 9427
1167 9427 1223 -8436 -4682 8612 8559 -5387 -7501 4762 10025 775 -8979 -2740 9484 4584
1181 4584 -8391 -7190 4421 7840 -2982 -10264 -476 9356 1862 -7920 -4721 6580 8094 -4649
1195 -4649 -8718 3669 9252 375 -8152 -3606 8013 5276 -7300 -6975 4160 7399 -1535 -9283
1209 -9283 -950 9379 2824 -7476 -4445 6046 7727 -3173 -8357 2554 9136 483 -7574 -3630
1223 -3630 6783 5965 -7129 -8215 3446 6911 -2119 -9248 -2407 8021 3008 -7840 -4596 5910
1237 5910 7408 -2015 -7835 2175 10270 2569 -6711 -2447 7128 6611 -5093 -7839 3128 6952
1251 6952 -2043 -8856 -3402 6369 3351 -7791 -6166 4380 6273 -2309 -7636 60 9351 2790
1265 2790 -6818 -2454 6490 6423 -3765 -7639 2422 7771 -789 -7728 -2470 6633 4623 -6457 -6474
1280 -6474 4339 6182 -2608 -7284 -971 7743 2832 -6861 -3519 6262 6074 -2781 -7600 1286 7776
1295 7776 -980 -7888 -2384 6198 4903 -5063 -6506 3984 6937 -2082 -7387 -906 6998 3733 -5997
1310 -5997 -3716 6355 6260 -2454 -6734 164 7236 396 -7771 -2548 6147 4927 -3999 -6576 2618
1325 2618 7210 -2012 -7939 -2046 5877 3061 -5645 -4849 5606 6767 -2405 -6179 501 7458 2112
1340 2112 -7169 -2836 6495 4489 -4115 -6383 1649 6948 -909 -6989 -573 6907 4700 -4069 -5076
1355 -5076 4077 5952 -3459 -7831 -1551 4988 1320 -7349 -4036 5886 5029 -3517 -5590 1494 7063
1370 7063 869 -6307 -415 7439 4880 -2846 -4538 3796 6283 -2924 -7473 -1073 5028 2120 -5725
1385 -5725 -4065 5407 5251 -4428 -7103 -273 4869 -484 -7540 -2030 7134 5143 -2268 -3142 4195
1400 4195 7554 -1052 -7098 -868 5161 1199 -5852 -4527 4374 5837 -3760 -6413 1030 5777 827
1415 827 -5946 -2212 6325 4823 -3273 -4453 2027 5586 -1278 -7243 -1128 6031 2964 -3755 -3260
1430 -3260 4046 5965 -3001 -7148 -419 4249 269 -6104 -3539 5526 5146 -3557 -4306 2687 6007
1445 6007 511 -5350 -729 6736 3639 -4103 -4404 2438 4281 -3324 -8011 -878 5339 1837 -3902
1460 -3902 -1883 6246 6142 -2681 -5734 390 3979 -1222 -7184 -3091 5701 4442 -3150 -2309 3969
1475 3969 6230 -797 -6501 -1024 5081 795 -5087 -3578 3589 4759 -2745 -6096 920 4945 277
1490 277 -4483 -1563 6259 5116 -2805 -3703 2450 3731 -2233 -7711 -2652 4157 1309 -4465 -2167
1505 -2167 4565 6116 -565 -4914 1048 5292 -73 -5410 -2947 3925 3607 -3612 -4996 1626 4423
1520 4423 -717 -5485 -1302 5764 3334 -3665 -3112 3067 3996 -1849 -6409 -901 4659 1151 -3766
1535 -3766 -1326 5185 5451 -1831 -4901 1137 3872 -1446 -6008 -3035 3772 2699 -4000 -3574 3203
1550 3203 4352 -1095 -5068 -485 5418 2026 -3863 -1745 4178 4465 -1966 -5328 -99 3808 -987
1565 -987 -5493 -2034 4115 4049 -2828 -3524 2955 4504 -1496 -4978 -1631 4220 1828 -4205 -2115 3948
1581 3948 4764 -935 -4706 421 4619 -115 -5014 -2427 2839 2948 -3153 -4507 1808 4195 -962
1596 -962 -4114 -618 4710 3501 -3058 -2455 3866 4193 -1185 -4504 -915 3930 359 -5335 -2432 3248
1612 3248 3048 -1740 -4313 1335 4524 -410 -4091 -1215 4061 3165 -2852 -3155 3047 4064 -1600 -4428
1628 -4428 -719 4044 1103 -4216 -2187 3180 3406 -1420 -3844 625 4255 -224 -4488 -1291 3344
1643 3344 2958 -2608 -3566 2410 4226 -989 -3878 -243 3694 2174 -3736 -2742 3176 2955 -2133 -3940
1659 -3940 -232 3708 156 -4656 -1331 3583 2871 -1741 -2953 2324 4771 -245 -3775 -278 3427
1674 3427 1534 -3746 -3488 2260 3027 -2246 -3931 253 3878 1052 -3438 -1138 3943 3001 -1609 -3056
1690 -3056 1336 4226 -286 -4104 -1089 3260 1715 -3061 -3177 2217 3218 -1198 -3748 0 3229
1705 3229 873 -3964 -2512 2832 2871 -2099 -2928 1168 4531 881 -3754 -655 3635 1657 -2913 -3293
1721 -3293 1361 3246 -1222 -3755 104 3517 991 -3475 -2800 2490 2786 -1990 -2973 1500 4192 1469
1737 1469 -3194 -839 3498 1654 -3271 -3436 971 3316 -956 -3851 24 3255 1228 -3198 -2930
1752 -2930 1883 2669 -1927 -3328 1242 4023 1142 -2635 -1055 3455 2218 -2578 -3020 1061 3277
1767 3277 -232 -3456 -139 3191 1109 -2944 -2752 1566 2799 -1588 -3303 1145 3882 935 -2591
1782 -2591 -1708 2664 2351 -2646 -3037 1324 3491 231 -3493 -791 3338 1205 -3090 -2505 1640 3316
1798 3316 -229 -2785 1167 3862 689 -2954 -2390 1373 1714 -2648 -3165 1586 3743 866 -2412 -552
1814 -552 2904 1262 -3608 -3224 1223 2234 -63 -2459 1008 4319 1767 -2436 -1498 1847 2095 -2001
1830 -2001 -3606 878 3344 105 -2768 -1251 2102 811 -3639 -3002 1341 3206 606 -1537 1520
1845 1520 4850 1863 -2429 -1800 1152 1478 -2388 -4352 303 3225 240 -2657 -982 2533 2054 -2323
1861 -2323 -2674 1603 2743 -221 -2521 -259 3253 986 -2996 -1939 1494 2584 -551 -2098 996
1876 996 4037 637 -3084 -1948 943 747 -3033 -3568 1087 3166 220 -1627 134 3110 1518 -2318
1892 -2318 -2269 1502 2031 -645 -2442 418 3550 807 -2807 -1502 1233 1602 -1992 -2437 1340 3465
1908 3465 34 -2514 -1236 1515 380 -3469 -3661 665 2490 -354 -807 1537 4856 2841 -1766
1923 -1766 -922 1533 803 -2443 -3810 -160 2343 380 -2669 -817 2122 1692 -1883 -2334 1530 3051
1939 3051 -88 -2027 218 2504 1088 -2684 -2502 1142 1505 -1241 -2060 871 3237 1076 -2314 -1010
1955 -1010 1813 851 -2174 -3229 320 2663 108 -2206 780 3032 1829 -1914 -2047 1874 2154 -1018
1971 -1018 -2524 -68 2092 317 -3004 -1917 1788 1152 -1290 -1625 1821 3935 1204 -1558 119
1986 119 1967 602 -3238 -3975 -288 1172 -1608 -2485 347 3013 1745 -1748 -953 2451 1780 -1279
2002 -1279 -1916 870 3331 806 -2523 -512 2101 813 -2423 -2657 809 2159 -702 -2534 -63
2017 -63 2297 1111 -2082 -1891 1390 1692 -1249 -1910 964 3015 1393 -1775 -751 2222 933 -2307
2033 -2307 -2755 21 1781 -675 -2728 -376 2282 1539 -1473 -1642 1730 2612 -917 -1894 698 2251
2049 2251 790 -2162 -1490 1441 717 -2158 -2143 712 2305 380 -2001 98 2888 1229 -1970 -1870
2065 -1870 661 1714 -1070 -2577 314 2115 920 -1712 -1205 1664 1818 -1204 -1674 978 2492 575
2081 575 -1751 -429 2067 931 -1998 -1949 621 1548 -625 -2299 146 2646 1169 -1222 -1353 1537
2097 1537 2054 -1088 -2317 478 2018 -194 -2161 -1284 1494 1336 -1745 -1789 871 2156 -52 -1713
2113 -1713 -86 2507 923 -1454 -1565 1244 1922 -1367 -2430 7 1882 281 -1690 -989 1642 1649
2129 1649 -1451 -1752 703 1629 -413 -2300 -568 1966 899 -1345 -812 1515 2213 -245 -1722 791
2145 791 2320 443 -1400 -1290 1048 968 -1448 -2406 100 1551 -459 -2086 -419 2143 1427 -1045
2161 -1045 -1015 1031 1591 -547 -2158 -255 2051 412 -1521 -829 1595 1911 -592 -1535 692 2187
2177 2187 -156 -1910 -785 1258 1096 -1541 -1471 896 1578 -445 -2077 -573 1825 881 -1736 -698
2193 -698 1122 1428 -452 -1559 46 2089 -174 -1849 -941 1312 1464 -743 -1129 1033 1822 -99
2209 -99 -1498 -388 1559 711 -1746 -1231 1282 1264 -717 -1778 289 2083 -53 -1808 -786 1504
2225 1504 1502 -607 -1340 731 1393 -342 -1720 -477 1213 758 -1440 -1012 1085 1174 -803 -1972 -526
2242 -526 1239 426 -1490 -224 1614 1821 -292 -814 743 1704 -361 -1640 -503 1246 974 -1277
2258 -1277 -1479 961 1252 -1031 -2294 -908 1212 56 -1534 -755 1505 1728 -382 -694 397 1729
2274 1729 56 -1705 -374 1371 1015 -612 -1048 937 1504 -918 -1800 -412 974 178 -1590 -1107
2290 -1107 1336 1422 -529 -1557 106 1480 151 -1577 -325 1705 1387 -4 -278 1044 2039 -164
2306 -164 -1632 -513 780 206 -1754 -1756 910 1048 -934 -2121 -89 1248 373 -1495 -228 1557 1227
2323 1227 -202 -1074 332 1296 -469 -1856 -545 1172 809 -1038 -640 1170 1492 -607 -1457 -53
2339 -53 704 54 -1786 -961 1285 1439 -522 -653 518 1340 -163 -1935 -386 1050 646 -870 -1134
2356 -1134 1082 1790 -599 -1430 -79 1318 149 -988 -367 1603 1628 -852 -1188 -100 590 -629 -2645
2373 -2645 -1201 733 517 -775 -611 1262 2236 462 -779 325 1529 552 -1148 -929 546 1158
2389 1158 -899 -1782 -398 847 -286 -1500 -857 1554 1268 -564 -947 824 1442 38 -1432 -419
2405 -419 1459 740 -879 -457 1205 1706 -551 -1636 -33 758 -390 -1865 -1048 1003 1203 -674 -1181
2422 -1181 757 1559 174 -1188 -521 1592 1009 -718 -438 940 1524 -332 -1884 -402 746 21
2438 21 -1116 -679 1356 1682 -42 -1045 275 1111 -276 -2011 -976 645 275 -1162 -835 646 1428
2455 1428 246 -1104 41 1769 846 -896 -524 1016 1241 -429 -1495 190 1072 -321 -1348 -870
2471 -870 632 843 -931 -966 799 1306 103 -1234 -544 1523 763 -845 -585 931 1027 -221 -1229
2488 -1229 -238 1113 -100 -1622 -1104 600 786 -782 -1136 941 1390 6 -1098 80 1218 980
2504 980 -846 -719 679 1008 -456 -1412 -402 871 -47 -1317 -520 1227 939 -140 -809 714 1455
2521 1455 210 -960 -506 1113 436 -681 -1131 418 620 -309 -1197 -254 1042 21 -1041 -331 987
2538 987 1237 -69 -793 377 1424 132 -1294 -402 722 593 -627 -869 706 1185 -318 -869 -367
2555 -367 1128 819 -1164 -953 610 917 -127 -1140 -26 1156 416 -1115 -321 789 923 -218 -816
2572 -816 611 1331 -281 -1057 -412 772 430 -1015 -947 743 1070 -295 -804 189 1145 481 -1075 -556
2590 -556 742 341 -593 -1190 170 826 -324 -1480 -362 902 887 -593 -575 1115 1127 20 -816 -52
2608 -52 1022 164 -1002 -821 353 572 -478 -1111 329 1148 114 -1114 -89 827 706 -672 -1047
2625 -1047 241 953 -246 -1071 -291 1275 719 -577 -437 1091 786 -315 -715 -117 647 -299 -1377
2642 -1377 -792 494 379 -760 -674 242 1036 -43 -616 351 1229 1011 -558 -695 918 777 -524 -934
2660 -934 -279 880 29 -1247 -962 343 450 -596 -1069 50 1020 114 -933 10 1061 817 -396
2677 -396 -430 806 987 102 -646 293 1032 69 -743 -717 603 681 -883 -1021 252 643 86 -936 -717
2696 -717 667 222 -812 -891 182 853 -93 -771 434 1236 806 -377 -196 872 711 -428 -955 -24
2714 -24 900 10 -899 -263 878 524 -1022 -892 209 582 -15 -890 -94 1142 493 -675 -868 423
2732 423 877 -519 -1002 156 767 208 -489 -183 1069 827 -440 -647 278 1007 171 -674 -134 779 260
2751 260 -537 -399 419 947 -378 -602 205 988 466 -367 -340 600 580 -414 -801 314 819 -131 -845 -550
2771 -550 800 348 -1041 -871 252 593 -275 -664 245 1024 609 -430 -203 756 952 -348 -673 478
2789 478 826 24 -593 -506 670 410 -995 -953 130 375 -666 -1227 -24 865 368 -606 -237 428 871
2808 871 -147 -752 708 1327 386 -865 -232 789 694 -814 -817 368 798 -374 -876 -473 592 441
2826 441 -748 -765 467 330 -301 -1198 -63 826 21 -474 -5 814 792 -458 -769 620 853 -274 -934
2845 -934 -202 544 71 -1281 -790 122 348 -234 -875 20 1107 171 -453 -155 598 723 88 -709 366
2864 366 1107 -121 -699 -270 711 88 -1072 -1087 259 248 -544 -1140 -88 1035 218 -549 -446 640 708
2883 708 -189 -778 203 1029 -34 -910 -333 896 94 -851 -904 379 787 -231 -735 164 935 558 -377
2902 -377 -266 734 842 -416 -625 -37 492 -4 -1227 -604 851 367 -569 -862 395 1093 121 -368
2920 -368 269 983 459 -648 -469 612 477 -412 -907 -34 707 -32 -856 -719 507 455 -622 -706 427
2939 427 985 359 -479 177 1051 392 -444 -787 393 521 -610 -1184 96 794 183 -697 -290 865 510
2958 510 -333 -568 349 1051 205 -621 -2 1226 395 -617 -544 92 710 -549 -892 -218 550 18 -608
2977 -608 -570 603 636 -258 -507 292 641 27 -814 40 696 260 -553 -578 296 791 -440 -606 44 819
2997 819 366 -772 -306 835 739 -280 -691 -30 318 -81 -858 -326 660 463 -549 -667 465 535 -65
3016 -65 -856 -230 743 330 -594 -395 427 806 -386 -805 2 859 228 -673 -410 750 772 -522 -396 295
3036 295 904 -136 -844 -103 663 384 -574 -464 -80 724 -530 -948 -187 625 153 -645 -342 467 789
3055 789 -354 -614 347 960 423 -460 -3 936 409 -519 -602 63 458 -413 -908 -373 321 -123 -760 -723
3075 -723 180 618 -262 -720 396 873 150 -374 -270 1002 558 -410 -398 711 675 -129 -540 -167 510 355
3095 355 -552 -187 304 491 -199 -874 21 721 50 -344 -186 634 797 -282 -496 567 685 -202 -503
3114 -503 -237 904 448 -746 -600 382 611 -379 -838 -3 486 -44 -720 -361 648 593 -364 -573 246
3133 246 597 90 -457 -160 502 492 -755 -542 394 352 -308 -754 -136 812 146 -654 -355 367 705 -193
3153 -193 -573 159 609 -257 -672 -410 410 495 -293 -353 481 648 302 -309 -166 961 214 -181 73 497
3173 497 375 -331 -902 -85 672 -212 -884 -311 176 377 -692 -783 510 583 -158 -290 137 762 679 -504
3193 -504 -427 387 440 -129 -685 46 326 67 -687 -209 144 332 -357 -607 254 678 -53 -746 -52 739 219
3214 219 -665 -397 850 588 63 -282 120 734 331 -868 -269 565 307 -712 -536 32 673 -468 -795
3233 -795 -128 526 156 -348 -355 574 844 -192 -423 39 861 414 -315 -499 620 417 -442 -731 135 548
3253 548 -336 -839 -18 575 444 -562 -521 543 794 -150 -225 378 654 109 -437 -550 345 434 -637 -405
3273 -405 220 512 223 -594 -126 684 33 -621 -439 539 666 -164 -809 82 775 101 -664 -457 586 379
3293 379 -307 -351 99 612 50 -606 -107 498 600 -395 -404 217 478 -204 -939 91 698 164 -300 -600 254
3314 254 620 -280 -296 163 615 6 -230 -10 819 616 -546 -567 189 599 38 -413 -271 319 -53 -324
3334 -324 -362 45 574 -80 -493 -51 624 163 -372 -170 677 504 -507 -685 294 454 281 -399 -216 679
3354 679 433 -610 -341 606 360 -101 -878 -238 908 165 -351 -298 193 662 -206 -318 219 285 -4 -647
3374 -647 -99 622 457 -472 -491 381 503 -347 -672 20 490 134 -602 -494 206 196 -627 -710 441 655 51
3395 51 -330 -250 796 558 -597 -646 498 629 63 -550 -173 423 79 -634 -322 68 522 -226 -593 -38
3415 -38 535 139 -728 -133 535 525 -235 -606 93 562 -19 -484 -171 405 195 -524 -687 182 558 91 -608
3436 -608 -7 851 452 -349 -46 414 931 -167 -500 339 535 -114 -450 -198 416 160 -309 -453 566
3455 566 507 -438 -303 112 576 347 -246 113 521 630 -380 -672 114 759 -141 -518 -116 634 242 -487
3475 -487 -481 198 463 -153 -240 -166 635 207 -467 -331 589 344 -376 -559 172 696 -18 -652 -494 433 382 -427
3497 -427 -518 237 552 -113 -630 -78 253 257 -402 -541 548 407 -211 -629 185 550 233 -575 -177 531 346
3518 346 -251 -655 185 377 -220 -652 -241 373 488 -235 -542 382 696 -128 -122 337 394 441 -761 -574 309
3539 309 321 -463 -438 -65 886 317 -429 -165 787 370 -220 -337 145 620 -83 -829 -75 324 167 -508 -516
3560 -516 285 565 -186 -577 36 297 68 -541 -88 388 292 -78 -349 268 787 267 -480 -103 548 101
3580 101 -591 -396 195 412 -324 -796 144 473 228 -348 -405 586 682 319 -204 350 817 -192 -477 -201
3600 -201 319 12 -505 -540 216 503 -268 -515 -31 269 -101 -551 -316 433 548 -444 -254 168 710 177
3620 177 -467 122 338 573 -260 -511 493 641 96 -461 338 363 225 -409 -220 284 528 -250 -534 203
3640 203 155 279 -288 -213 366 339 -202 -410 -46 477 -55 -678 -501 257 -16 -190 -174 95 487 -312 -493
3661 -493 136 545 135 -404 -428 635 554 -236 -322 316 389 261 -364 -110 380 -19 -654 -436 218 48 -231
3682 -231 -607 138 392 43 -358 -341 471 490 -182 -422 322 539 41 -247 72 389 375 -563 -266 191 526
3703 526 377 -410 -496 706 203 -212 -298 324 546 -111 -697 -174 326 -309 -535 -372 109 214 -300 -348 321
3724 321 357 -84 -386 33 397 -17 -309 -301 128 444 46 -271 -162 304 181 -443 -345 491 394 -221 -360 198
3746 198 328 -146 -254 -241 -2 387 -371 -211 440 450 -48 -539 244 496 61 -540 -139 334 233 -338 -553
3767 -553 31 504 -82 -603 84 284 351 -463 -108 272 427 23 -427 260 269 -21 -315 -205 323 88 -336
3788 -336 -330 106 417 -339 -451 -230 432 253 -187 -182 364 565 -199 -220 -59 275 -25 -645 -257 257 9 -181
3810 -181 -247 206 398 85 -357 -156 282 322 -191 -238 114 517 -18 -337 238 230 160 -236 -227 -13 44 214 -297
3833 -297 -6 627 165 -372 -50 385 337 -241 -116 137 426 -111 -372 216 460 165 -578 -343 -144 359
3853 359 -41 -746 40 433 70 -329 -413 476 313 -449 -207 17 628 7 -603 -166 389 177 -518 -110
3873 -110 314 429 119 -331 30 385 274 -369 -297 629 396 32 -229 176 526 105 -430 -103 580 -265
3893 -265 -135 -310 68 265 -68 -319 -255 591 31 -475 -270 124 114 -452 -433 84 251 42 -503 35 333
3914 333 281 -166 61 21 192 165 -480 -114 87 -174 -227 -85 77 286 -184 -346 -42 135 65 -198 -164 170
3936 170 276 -88 -376 53 436 -16 -356 -22 440 69 -510 -626 27 258 -275 -381 3 263 259 -180 -262
3957 -262 498 329 -319 -275 27 355 45 -359 -239 184 256 -176 -566 247 -40 101 -371 204 798 70 -411
3978 -411 115 474 316 -375 -598 130 51 -91 -404 -390 553 182 -270 -390 -64 79 -106 -308 -165 367 350
3999 350 -87 -242 235 326 177 -252 87 415 115 -483 -298 122 196 -380 -81 -222 -41 -333 -154 -150 631
4020 631 92 -318 -13 146 530 -294 -281 -234 245 -161 -593 -232 343 423 -357 -239 311 543 377 -228 -69
4041 -69 94 185 -540 -374 0 262 121 -104 119 539 346 -96 -1 285 200 -288 -664 4 218 4 -80 -132
4063 -132 238 121 -295 -207 486 603 78 -450 47 484 217 -41 -482 118 113 -367 -368 -4 298 -198 -261 23
4085 23 16 73 -31 -403 -100 -3 -74 -273 -16 290 339 -335 -262 172 422 48 -536 -72 213 72 -295 -234 -31
4108 -31 212 -124 -235 138 291 -76 -195 -97 231 549 -194 -340 109 -46 -193 -553 114 274 137 -131 -273
4129 -273 289 339 -181 -325 160 593 -148 -238 -86 105 308 -147 -392 206 136 -393 -494 7 525 172 -295
4150 -295 -271 437 246 -324 -337 59 427 -94 -205 150 210 329 -356 -168 4 423 -33 -388 91 26 -24 -246
4172 -246 -228 142 56 -214 -400 -38 114 -29 -213 -71 139 260 -97 -351 168 120 -180 -109 -17 161 -167 -84
4194 -84 -102 -183 325 -236 -159 -31 270 316 -358 -219 13 52 -51 -400 -110 310 -163 -197 -4 263 35 -228
4216 -228 -281 -38 83 -145 -57 70 154 164 -188 -279 368 190 170 -523 -74 311 212 -123 171 61 -132 -291
4238 -291 -287 237 221 264 -400 119 276 -152 -271 -170 372 -40 -106 -356 322 463 -295 -105 -166 277 207 -339
4260 -339 -54 191 103 -79 -478 -129 278 201 117 -86 147 342 -126 -104 308 303 107 -306 -132 177 161 -212
4282 -212 -321 174 296 186 60 -286 328 340 -133 126 -117 448 -62 -58 -85 80 127 -106 21 -55 358 -116
4304 -116 -69 99 3 159 -67 -235 394 153 -202 -297 317 162 -113 -13 227 262 38 140 -354 303 332 -324
4326 -324 -384 -145 339 12 -288 -377 226 392 -221 -263 80 211 159 -159 48 269 30 -51 7 104 -121 -335
4348 -335 -108 176 539 74 24 112 88 58 -58 -237 126 162 106 -356 -90 314 -31 -215 -257 -120 75 -143
4370 -143 -401 51 158 80 -282 117 197 54 -331 -240 241 414 -8 -293 -220 304 171 197 -172 19 48 -98
4392 -98 -266 65 -47 -150 -274 -270 142 214 -134 -203 103 242 -129 -271 38 181 148 -114 -338 -39 212 -235
4414 -235 -359 -182 319 127 -374 81 149 162 -155 -77 -127 285 -231 -313 -145 278 421 -89 -194 194 338 153
4436 153 -183 50 472 -237 -221 -165 -14 176 -99 -38 -31 61 20 -195 -99 74 140 -327 -94 -13 249 -253 -415
4459 -415 87 107 144 51 -230 280 40 -5 -262 -38 -38 -208 -116 -165 -40 14 -148 -83 151 234 -155 -150 129 202 25
4484 25 -21 -221 -33 55 -276 -99 -200 -51 399 -110 -25 230 368 -29 -209 14 429 43 3 -66 -39 -170
4506 -170 5 -226 130 327 -276 -35 55 232 287 27 -334 12 395 -256 -132 -211 185 257 -380 -23 278
4527 278 146 -384 -5 215 42 -69 -344 -93 96 -291 -115 33 137 178 -251 -158 -170 70 -70 -208 -96
4548 -96 107 235 -17 -158 10 21 -148 -209 10 216 178 -146 -51 89 170 59 -185 114 4 238 -243 -155
4570 -155 55 459 -157 163 -121 289 1 -301 194 324 -157 -172 -113 168 -110 -241 -24 55 460 169 -187
4591 -187 -323 87 135 -111 -346 -16 203 98 -179 -59 49 378 -244 138 -48 208 266 -292 -115 170 73
4612 73 -13 -130 364 20 -87 -42 -131 181 -38 -294 0 -74 87 -71 -60 -86 -104 -284 -184 -23 180 -41 -38
4635 -38 -148 41 95 99 47 -230 256 17 156 128 184 140 -133 91 -227 409 28 -96 121 -221 13 -49 -313
4658 -313 128 38 -174 -154 -97 183 -30 -96 121 83 101 15 111 237 329 42 -60 234 148 135 66 -225 100 406
4682 406 137 -192 235 202 -36 126 -231 165 -107 -41 -261 211 242 -222 -83 -81 195 -30 13 -219 183 244
4704 244 -71 -224 81 52 146 62 -233 -52 210 -61 -64 -181 120 79 -71 -198 275 164 -127 7 -78 59
4726 59 43 -191 33 78 93 -32 -82 446 279 -231 41 140 219 377 -395 -139 265 478 -176 -321 -91 164
4748 164 187 -296 -198 122 -121 1 -233 426 206 56 160 145 -336 -129 -194 -5 269 142 7 -215 83
4769 83 291 134 -113 -39 117 125 -232 -97 358 147 -73 -243 83 235 198 -55 20 228 -11 -51 -180 130
4791 130 125 -20 -154 168 246 -91 -389 -129 26 61 98 -306 152 88 504 -253 73 236 66 72 -211 173 170
4814 170 57 -214 -86 140 -122 -317 -76 97 57 -9 -159 235 56 136 47 -182 169 300 -102 -167 120 76
4836 76 -117 -270 23 45 369 -92 -7 -80 204 -316 -75 -43 64 138 35 -38 109 315 -88 146 -324 72
4858 72 25 -243 131 167 99 163 21 73 -6 -21 -180 -124 64 54 -332 66 14 126 90 -324 89 -32 9 21 36
4883 36 261 103 -272 -29 241 188 -121 -81 46 5 201 56 30 -82 -42 -4 -98 -104 376 -89 -37 -203 -56 416
4907 416 -86 -268 223 284 -235 126 70 -126 183 -105 -196 -94 187 -68 -254 -142 470 252 -230 -28 -172
4928 -172 7 -25 92 -186 159 -77 -66 -153 178 194 -233 -30 179 43 -29 -350 -195 247 -11 40 -53 141
4950 141 300 15 -263 -107 4 93 -177 -50 -163 18 -33 -336 -62 117 -22 -27 -91 191 30 30 -294 -126
4972 -126 71 117 -277 209 168 64 -165 -146 -49 152 -23 162 150 408 144 -229 -10 152 252 37 -146 -138
4994 -138 -40 69 -441 45 148 39 148 98 327 -28 264 -172 -27 100 -133 -74 -18 -75 -134 97 169 34
5016 34 191 -24 -99 187 145 32 44 -10 54 -66 199 52 -1 96 -64 -35 164 159 81 8 -242 153 205 90 165
5041 165 -7 -70 77 -293 -235 116 -90 184 18 -59 275 35 -63 98 85 22 291 -137 -131 110 48 74 -212
5064 -212 2 -23 -427 -115 -177 300 -146 -74 89 39 231 224 13 224 103 -30 0 60 81 -87 -103 -207 -67
5087 -67 -86 -74 -219 37 99 37 -211 7 24 342 16 -183 166 233 -175 32 304 -42 -167 148 -152 96
5109 96 -83 59 -183 256 -48 -19 -4 -186 45 3 -148 -20 191 147 153 -229 191 46 -152 -206 -219 245 -123
5132 -123 -23 -205 107 196 120 65 45 366 -12 -261 -89 2 92 -110 -103 69 267 84 -129 80 -316 182 -57
5155 -57 -164 -215 -256 28 -146 -136 186 49 53 208 179 69 -418 -434 -122 106 -32 -515 264 -225 206 -107 -154
5178 -154 220 33 -34 -414 -66 142 -21 -58 33 122 -180 -104 -315 13 -129 49 267 -100 252 64 13 -211
5200 -211 -140 234 0 115 -104 202 106 142 23 39 475 -41 9 -85 14 -125 -20 -296 247 -187 -196 36 -139
5223 -139 193 175 -157 -136 62 -126 119 -84 -67 -27 -84 -145 50 17 285 117 -251 342 96 -130 32 148
5245 148 -21 -61 50 -74 -169 194 -77 -191 -92 146 129 118 -238 -15 125 -181 -14 -109 48 -315 -208 -41
5267 -41 190 -3 -2 18 46 122 143 -70 -175 -25 -27 227 18 -127 228 -194 -40 29 25 -252 -47 111 261 -86
5291 -86 -139 101 206 131 -59 168 61 160 91 -137 -119 224 -82 -50 -367 81 25 140 -35 -175 97 -157 121
5314 121 -154 112 145 -160 -176 -37 85 -136 -131 -6 -159 -399 55 -285 19 -82 -47 -159 32 -30 -93 -144 -81
5337 -81 -82 16 39 -537 -8 -119 142 -131 -167 264 -56 -100 -163 -3 82 -79 -69 70 -26 26 21 -1 55 323 14
5362 14 -299 236 84 125 51 -128 167 195 93 98 -147 -44 -61 -145 38 -15 63 236 -97 104 245 -69 -64 -58 238
5387 238 195 -161 -39 -135 -71 143 -96 -199 83 323 -10 -19 -78 250 19 -399 -175 103 -146 60 59 72 92
5410 92 6 -82 146 333 -34 -65 101 158 -37 247 -155 -77 109 87 15 -114 84 -68 -222 -133 -55 16 -42 -243
5434 -243 119 82 -20 -91 85 237 -175 -131 52 -101 32 86 -65 -56 190 -244 -143 26 -92 114 -129 94
5456 94 -72 113 -125 -155 -141 266 161 -135 -89 -350 -27 37 -18 114 -24 -3 187 -53 41 65 -267 -123 35
5479 35 -230 -132 -16 -2 328 55 -232 25 148 78 58 -194 53 234 -89 -141 111 -48 148 -151 -58 265
5501 265 393 -112 67 126 -54 114 116 -196 -55 -28 337 230 241 342 -339 111 -265 -142 113 -128 -7 -53
5523 -53 183 41 -50 -68 13 -98 12 -90 124 -18 126 193 -58 172 6 10 -329 -143 129 116 13 19 -93
5546 -93 130 189 -116 -93 61 213 -42 108 102 -78 -19 -167 -81 -25 -196 53 76 142 -109 -27 249 36 54 76
5570 76 -274 67 37 70 -117 28 132 205 189 -216 84 13 -41 -69 92 119 8 -157 107 -51 292 -268 -289
5593 -289 -17 -194 240 117 -3 62 -40 -207 -65 148 30 -360 -157 -49 89 -143 134 212 43 216 -109
5614 -109 80 191 38 111 -139 -13 323 -159 -110 -172 -77 -29 71 -32 139 -17 66 -52 -165 249 -201 146
5636 146 2 203 125 35 80 375 -57 66 -61 -211 -55 195 55 -187 155 229 -55 -114 -100 6 -341 29
5658 29 -185 53 -126 70 29 313 38 -60 23 -177 182 127 32 -20 -18 81 -28 -64 78 -19 8 -87 -232 251 -136
5683 -136 19 -120 11 -46 193 -212 -248 41 -90 24 51 -112 -231 102 -172 -1 -216 68 -110 -15 -35 -24
5705 -24 179 14 -10 287 -17 -11 55 89 265 -180 -34 30 -85 -170 -113 -173 -15 137 -70 172 -287 21 -130
5728 -130 -73 395 -98 -200 -164 -28 -66 203 11 -137 -105 -169 -312 158 29 240 72 124 238 89 435 65
5750 65 -248 -197 -295 26 -64 -193 -72 72 31 17 57 37 34 -233 5 165 -70 50 -107 -10 195 144 3 -122
5774 -122 277 -114 -175 -141 67 114 -59 -80 4 102 -65 -39 -75 -44 183 99 147 -6 -96 7 -224 42 -20 -13 -44
5799 -44 -61 -68 151 7 -235 87 -85 -101 -202 12 52 130 -64 62 102 14 34 -132 73 -92 119 -171 -209 63
5823 63 -438 -161 -49 -26 151 109 -100 -17 277 224 70 -126 24 -31 -94 -119 -239 125 -21 -12 204 106 -279 60
5847 60 -197 -163 -120 281 -109 -37 89 -2 -227 -236 -170 -309 68 -487 19 64 126 279 30 -17 44 -60 134 -64
5871 -64 203 151 -132 259 14 73 -155 58 309 -84 -52 -17 -245 40 299 -24 -110 -331 189 -42 101 107 35
5894 35 -228 -239 132 -97 -64 -74 234 -314 403 71 96 63 73 255 146 0 -116 -168 80 -280 -228 -116 58
5917 58 -85 -122 112 -123 276 -15 -69 -31 46 -144 7 227 151 131 -231 -110 108 154 47 -115 119 -159 -8
5940 -8 -212 252 131 163 -8 135 199 -211 145 -116 322 178 -89 -100 162 -61 -273 -56 116 -125 33 -58
5962 -58 -19 105 -28 -2 -200 -232 70 214 -74 -360 135 -142 -124 -87 -79 25 205 42 122 101 219 -46 -143 -63
5986 -63 105 100 33 47 93 -46 150 46 39 7 15 -41 -153 -105 59 34 17 -80 -54 -92 -21 139 -155 -106 81 -24 36
6013 36 -122 36 7 140 69 -474 205 23 221 137 -112 -143 -121 -37 -177 -78 159 -9 -63 90 215 -9 72
6036 72 151 123 -56 -2 -20 124 -13 -69 311 -68 80 -75 101 125 -6 -128 130 87 -45 -32 -197 23 -103
6059 -103 52 47 20 234 -225 -31 304 -317 -50 -60 48 44 -144 38 200 163 -84 -29 -112 225 -15 28 8 -205
6083 -205 107 -266 284 35 72 -191 -169 334 -163 100 -85 -101 -92 54 19 -367 -48 258 141 218 -185 187
6105 187 -71 -141 7 39 198 180 20 -47 -37 -135 -21 -128 -243 226 166 -187 19 282 107 200 30 41 196
6128 196 79 -164 -79 20 141 110 -27 -20 1 -229 65 -170 -140 56 -168 -63 -41 72 -355 -44 -49 182 -35
6151 -35 8 -164 -140 190 21 38 -156 13 -99 39 -64 2 315 -106 283 266 44 71 -139 221 -66 -4 -61
6174 -61 282 -43 -57 -55 47 63 -18 106 75 -105 66 1 -153 -97 122 -183 -49 -262 -244 241 123 -263 8
6197 8 -200 128 22 -271 -47 -77 -100 2 -63 -35 347 85 -79 16 125 88 -75 -223 123 160 -87 -95 100 -137
6221 -137 201 -31 203 -141 -73 -61 -86 85 92 -337 -229 -50 165 -11 -290 -19 50 80 177 81 -12 53 -45 -185
6245 -185 -119 69 -30 -123 34 26 114 -64 148 104 274 179 84 241 -100 -165 108 -27 -210 199 -320 -129 23
6268 23 -111 -18 -67 -42 271 -42 -16 -212 119 -146 81 -135 5 -159 3 167 -178 113 -3 25 82 -27
6290 -27 204 -39 -64 -104 -87 125 -36 168 -12 126 275 138 -113 286 59 251 -247 25 -5 51 -133 41
6312 41 18 -154 -146 -62 -53 -50 44 -391 167 -112 -221 9 143 -24 -183 -38 14 34 234 191 84 25 -104 170 19
6337 19 -161 185 161 71 109 235 -4 -76 -101 107 26 -51 -214 18 -4 142 -44 19 241 277 -163 95 -75 -51
6361 -51 -143 -45 -177 -71 88 211 237 30 1 -292 2 -213 121 52 -87 255 -228 -109 -95 -125 -150 167 -11
6384 -11 -41 -60 36 -139 -46 -1 141 103 45 -7 148 15 -110 -3 -37 256 -31 99 23 37 -39 -21 -255 -78 22
6409 22 59 -71 -122 -48 1 294 -96 -343 -157 -3 -45 -242 -163 214 195 170 183 16 70 89 5 -68 130 -214 -64
6434 -64 -289 -84 -216 -38 60 -73 -111 37 -311 198 -7 96 -8 -132 151 -10 153 -240 9 -55 -309
6455 -309 -91 -202 118 -105 175 -86 90 114 65 -77 -97 397 83 170 -168 98 32 -170 -126 97 -6 -32
6477 -32 39 -180 130 42 -2 -120 -92 76 60 -22 81 67 47 -62 -50 -198 -207 103 -24 69 239 -29 -185 -223 -69
6502 -69 -189 95 186 168 184 -142 178 258 -108 -15 -66 -106 -103 249 -231 -173 -223 -181 43 -54 -324 361 188 -103 -31
6527 -31 -207 95 -86 18 -279 -278 -124 124 -1 -22 78 133 100 114 206 160 64 136 32 -51 -25 -302 -56 -67 184
6552 184 -140 198 -25 -155 -18 -182 -4 -79 64 -29 226 -155 -44 255 46 -197 57 -229 -98 41 26
6573 26 196 280 -2 -164 192 -51 283 -162 -19 235 -267 84 68 160 185 238 50 86 144 -63 -55 -116 98 95
6597 95 240 -25 -37 71 -245 -225 130 62 17 -105 37 150 82 76 -26 245 96 -98 33 -188 -63 -301 83
6620 83 77 148 137 -22 96 -126 4 -7 73 -121 -199 -32 -212 -23 70 60 5 58 51 12 -6 170 93 -65 -10 -91
6646 -91 132 -4 -21 -71 -175 61 364 -131 240 6 14 88 -41 -11 7 310 -174 143 -24 121 124 -116 2
6669 2 128 127 129 21 27 31 -98 -45 -58 -163 -4 -25 -180 -42 -108 -38 -106 -102 29 105 -53 -44 -44 -195 -113 -138 -76 -120 -237
6698 -237 -198 138 82 -27 -313 88 -260 14 -222 -35 -42 283 89 42 -119 147 162 145 51 89 109 -17 138
6721 138 196 74 86 234 -101 -123 50 -149 -179 -159 -23 80 131 -139 10 219 -117 26 -181 207 263 -32
6743 -32 -269 88 -4 -126 -35 44 -74 -306 -312 -10 172 141 12 -6 51 107 112 -149 24 48 56 -226 316 -205 163
6768 163 -181 -2 82 59 265 62 245 -85 337 -343 107 -137 -7 35 82 30 -21 -166 -89 150 121 -98 77
6791 77 -311 91 -124 -46 8 -186 -134 67 -128 -132 63 -90 -198 -148 286 -106 69 -168 106 21 -70 -27 -399
6814 -399 -133 151 -69 11 -1 149 64 -57 53 -58 -40 310 -118 -106 136 340 268 -281 -82 -123 -187 142 8
6837 8 231 272 -93 -177 75 121 -17 108 -103 -43 162 201 18 119 64 154 -16 61 118 137 40 -195 -178 -48 80
6862 80 89 415 121 -28 20 95 266 -171 -64 -147 -203 108 45 86 -18 -135 -6 -51 -135 -75 159 -49 -154 -52
6886 -52 111 230 161 -25 -125 -166 -7 -113 -57 -29 -46 149 -70 -41 -56 39 377 181 -43 -205 -95 32 -187
6909 -187 236 102 -107 64 60 -78 20 15 -128 -112 -103 -169 16 -116 -73 -162 -164 -32 22 -74 -218 21 -44 -33 -208 154
6935 154 325 42 234 101 -60 -32 -132 -147 -75 -28 -129 -69 72 -56 43 -105 -211 91 -69 -88 -13 63 62 78
6959 78 -184 -18 -85 16 94 -214 56 -292 208 55 41 59 -130 -11 269 25 -6 19 86 93 -1 139 -111 -201
6983 -201 -173 -75 64 118 128 197 150 125 -60 149 11 -36 -195 179 202 -57 -92 -22 54 -114 78 86 111 -14 -154
7008 -154 12 74 -48 259 36 -53 173 88 386 13 -46 -74 140 -192 69 -135 -17 59 -166 9 -243 -105
7030 -105 209 176 -149 142 138 -71 -102 11 189 -127 56 163 -73 153 -70 106 79 85 -54 24 -155 96 285
7053 285 -115 40 -52 69 33 95 361 67 199 -83 -108 -143 -61 53 83 105 179 142 -236 -137 -276 -27 53 -101
7077 -101 15 127 -42 -108 -240 -37 -163 180 -139 -90 -190 -70 209 -83 -78 -366 -187 -131 27 5 35 -72
7099 -72 -27 186 -2 100 319 -92 -94 167 141 -102 -126 62 7 197 -4 -83 58 -100 219 211 3 -46 -28 124
7123 124 49 66 115 -366 175 -105 -142 -121 278 -198 25 108 -270 -140 -177 146 145 -24 230 299 9 125 214 -25
7147 -25 213 -37 33 87 244 -228 149 -11 141 -120 202 72 -95 -73 -208 287 179 93 -95 -241 55 -60
7169 -60 50 -209 -85 -29 35 83 -61 -16 192 -148 65 35 33 202 42 -243 -44 178 -79 -12 -95 57 -31 39
7193 39 -17 -280 152 278 -142 126 234 37 33 -36 -326 -89 -167 54 265 -200 131 196 -131 206 -206 -313
7215 -313 -272 272 -286 186 36 89 154 14 145 79 -109 -40 -100 -40 -14 -109 -57 -108 115 137 11 -93 54 -101
7239 -101 -53 133 235 258 -34 104 -7 70 147 93 -223 -278 235 -32 228 49 -302 145 92 54 -353 -102 154
7262 154 -6 -120 108 -67 -36 1 169 66 -71 -95 -212 110 141 124 -230 91 -85 110 53 -271 308 -36
7284 -36 164 -89 -193 215 0 -122 26 -16 85 44 39 -42 -155 -118 -68 -191 -263 209 -2 -163 191 -3 -8 15
7308 15 211 125 -13 49 -27 44 -7 121 323 97 -72 96 -1 169 130 166 -74 95 -171 75 -52 -84 27
7331 27 146 18 208 84 -64 111 153 -197 46 21 -113 59 150 99 188 214 -79 -35 59 39 -117 25 -86
7354 -86 -211 48 -84 -124 143 97 -186 -84 129 -355 153 -4 -31 64 -15 -58 -99 7 32 -47 -145 -28 271 37
7378 37 -14 195 156 172 -183 19 -27 162 -80 -127 120 78 108 -165 5 -110 -85 62 83 -224 -226 165 -28 -232
7402 -232 -152 -17 -97 -248 -106 -182 104 -169 16 96 181 -45 78 -83 119 141 -503 -33 -37 -120 -304 -225 277
7425 277 18 -84 -125 -223 166 -74 318 -73 5 -310 99 103 25 24 90 0 259 -35 -182 308 -113 106 -144
7448 -144 -7 212 100 322 -111 6 9 25 142 -60 88 175 -199 99 213 122 69 -83 -233 -31 -35 127 200
7471 200 105 90 -6 -251 74 7 -270 -166 -18 -282 84 -90 -136 3 55 47 -5 125 11 220 149 -8 147
7494 147 104 4 -256 -90 93 -152 -214 -207 -194 79 90 141 76 -178 287 47 -196 153 -146 4 113 -186 94
7517 94 20 -180 -210 110 -174 -27 -181 -224 236 32 126 -42 56 -2 -170 -182 48 76 -203 60 -141 211 -93
7540 -93 -84 70 200 -28 -72 69 -279 -59 101 -38 -12 25 197 -432 -224 -37 58 -183 54 -140 -92 45 -82
7563 -82 154 -196 -112 -120 54 19 44 -48 -281 21 282 132 242 139 -27 56 226 50 187 30 22 71 -145 6
7587 6 -197 -140 -118 37 109 10 212 -272 -125 -82 -74 6 317 223 117 112 27 82 96 107 -225 25 47 -117 -156 57
7613 57 -205 -42 -65 -11 97 135 46 44 15 -136 -17 362 -78 59 -40 -117 89 144 -135 20 98 -352 -67 -101
7637 -101 13 47 -120 -137 134 -72 20 117 105 190 -20 144 71 141 126 160 5 -205 -321 190 232 -57 71 158
7661 158 36 268 12 -48 -46 -158 180 -124 15 64 -16 -15 67 -181 81 -24 -200 51 56 -21 -154 -93 -393 -89
7685 -89 4 -47 -19 -106 0 151 -74 99 265 63 -130 -44 90 -29 -130 -184 199 -393 328 42 -194 -161 85
7708 85 105 68 319 29 -211 -45 -120 131 -97 79 -133 -53 -84 -191 -17 -11 42 180 32 48 -207 -314 243
7731 243 -130 115 -4 -32 196 7 140 -16 -109 -87 -38 129 -20 117 -54 151 96 186 304 150 137 119 175
7754 175 379 40 222 -41 83 -252 -61 -125 117 -56 83 100 -58 171 -24 -237 252 185 66 -42 -261
7775 -261 -58 -6 -152 56 75 80 -207 -150 112 211 -128 -136 -97 -103 124 -333 -121 151 -216 3 -290 -218 -211 22 68
7800 68 -41 178 210 -64 -111 164 269 59 66 56 -71 28 114 229 136 200 271 58 104 -81 -56 68 -149 105
7824 105 -1 -224 72 340 106 -112 -51 382 29 -172 208 48 -119 -22 150 -16 10 -255 83 18 33 -39
7846 -39 117 75 51 -19 76 89 121 -115 108 53 -153 241 -30 -90 -127 42 -195 -117 -72 -61 37 -162 -18 -222 213
7871 213 177 -79 -25 -45 -16 289 80 -342 114 -174 -39 25 -51 -422 -247 88 -14 133 -47 104 62 -92
7893 -92 -27 -125 -197 77 -105 -51 3 -5 -5 34 -350 174 78 154 34 -106 -52 -8 16 -12 38 36 25 -122 49 123 -137
7920 -137 43 113 15 -3 -106 -56 -146 55 -188 -126 123 274 9 10 269 193 -91 208 -92 88 139 -61 216
7943 216 -69 72 169 141 -119 104 138 -121 -208 157 9 -127 -172 -202 -14 -199 117 38 16 263 32 -24 78
7966 78 -165 105 76 260 257 -161 -422 -83 261 104 -6 -225 -32 -13 -6 -269 42 209 -91 -282 44 -31 -160
7989 -160 -15 -19 84 112 -125 47 -157 -90 -11 199 167 118 -94 423 87 113 -405 64 -51 -229 213 -158 111
8012 111 -72 33 63 -115 -127 259 -212 304 160 -152 18 57 121 -14 5 49 40 -86 -136 64 -165 71 54
8035 54 -117 108 -159 -106 63 189 -116 115 277 -237 -212 68 78 -160 113 91 364 146 160 258 79 -246
8057 -246 6 30 165 68 -143 194 82 60 117 9 261 -20 51 118 240 -25 -48 -106 -60 127 -68 22 -47 -44
8081 -44 -16 13 -151 254 -32 184 -10 -4 -4 27 -182 -47 101 -175 36 58 -30 151 -190 -13 -79 36 -144 -108
8105 -108 -128 74 68 5 9 67 28 -148 -205 113 7 179 24 -108 -268 118 75 -2 -11 -66 311 -54 -116 -178 -108 -176
8131 -176 14 56 118 71 64 -78 83 74 -188 250 39 59 204 134 -12 83 -59 -55 46 -32 205 135 58 21 29 106
8157 106 117 332 59 9 -151 -168 13 -76 298 -270 -42 -108 -138 114 4 -109 -101 -12 235 202 73 -71 -43 123
8181 123 -64 -2 55 91 48 70 -163 -291 -55 29
8191B9
$$ Imaginary data points
##PAGE= N=2
##DATA TABLE= (X++(I..I)), XYDATA
0 0 0 0 0 0 0 0 0 0 0 0 8 -8 8 -8 16 -16 24 -31 32 -40 48 -57 72 -81 96 -113 130 -152 176 -201 231 -263
32 -263 297 -336 381 -430 481 -538 602 -671 749 -831 921 -1021 1129 -1247 1376 -1517 1673
49 1673 -1843 2030 -2237 2465 -2719 3007 -3328 3696 -4118 4607 -5187 5881 -6735 7812 -9220
64 -9220 11149 -13960 18471 -26885 48040 -222884 -286383 51982 -134982 -210225 -22535 204646
76 204646 146778 44026 28210 98485 129760 99539 -47550 -48345 138830 159683 -64317 -109184
88 -109184 53814 100613 -74171 -165397 -26585 98242 28786 -53911 -31401 65557 95446
99 95446 -43282 -160472 -54281 61006 -17200 -129368 -47520 126194 113497 -37852 -48742
110 -48742 53235 75309 -18591 -119483 -65221 81049 60639 -76069 -64484 77958 110936
121 110936 -27163 -102148 16737 104153 24305 -64966 -37369 65644 77483 -64340 -130474
132 -130474 -11244 67661 -13981 -91761 -1277 148938 122338 -7575 -8445 73920 67386 -49956
144 -49956 -148677 -90329 18680 -18445 -113380 -75304 58140 88050 -36436 -92464 22226
155 22226 84093 2039 -56471 3021 109276 115537 6485 -31456 53309 85967 -17586 -117531
167 -117531 -52734 65353 19535 -84655 -45659 52798 54939 -39380 -102552 -34365 44419 -5019
179 -5019 -81237 -37071 84845 106586 -6652 -42122 60342 88443 -13031 -82773 -34391
190 -34391 50793 32094 -57723 -51515 40078 69225 -8568 -79759 -15270 77290 19015 -76112
202 -76112 -36699 51833 44853 -46672 -81444 -3925 45082 -10176 -63552 -21549 76428 86978
214 86978 -11097 -27731 69175 86574 -8926 -69322 -16925 50599 8802 -71227 -50794 25981
226 25981 38832 -33584 -87058 -18545 56748 -1358 -72241 -21586 68970 65002 -19413 -35727
238 -35727 43836 66821 -5923 -57523 -21426 51399 40111 -46295 -43856 45293 58700 -23241
250 -23241 -70604 -11393 49445 -3209 -68668 -29138 42295 46590 -14472 -45190 20041 69173
262 69173 4527 -58871 -19264 51383 35493 -46019 -44788 36379 47291 -19302 -53140 -12195
274 -12195 45814 19293 -53488 -36453 41709 48844 -19981 -51277 14409 64253 2482 -54780
286 -54780 -13073 44383 31831 -32288 -47205 20756 51123 -11280 -56427 -13605 48080 23748
298 23748 -51996 -36863 42254 42821 -20531 -40424 10129 55682 15099 -44958 -19195 40992
310 40992 34606 -29302 -50548 16306 52180 -12806 -55605 -8278 38521 14900 -44269 -41551
322 -41551 24758 38385 -16120 -40699 5239 56879 24982 -42000 -18909 46994 33845 -28018
334 -28018 -38896 16624 50447 1297 -43311 -7623 37969 19919 -40894 -51011 13627 36748
346 36748 -24224 -50905 2961 47715 17303 -38558 -22627 36424 30177 -24184 -37570 9258
358 9258 49871 14077 -38496 -5895 49659 28841 -30348 -35607 19449 38969 -15497 -44103
370 -44103 -2183 33538 10313 -41358 -40251 19044 28340 -27806 -41446 12107 50735 16080
382 16080 -32670 -5691 44058 23222 -29481 -35419 9529 36595 -5797 -43872 -4893 40601
394 40601 15520 -37162 -32427 26722 37514 -17105 -29881 19504 47883 15136 -33135 -23637
406 -23637 23900 14453 -40040 -45401 8363 43148 7178 -29468 9289 51471 19016 -33539
418 -33539 -34388 6013 18410 -26324 -47297 -1454 36554 12159 -32490 -23001 28725 25040 -30144
431 -30144 -32828 18806 45157 17253 -14702 11336 53879 32162 -19469 -24837 14584 31573
443 31573 -12882 -44821 -2933 31663 -3263 -48776 -42332 -1250 -503 -46894 -53169 -1186 33397
456 33397 14949 -14460 9044 61320 48470 -7255 -9418 32167 42537 908 -31140 -1068
468 -1068 31618 2984 -40448 -36270 4572 16856 -24225 -40705 8479 39997 8179 -28275
480 -28275 -14320 24253 13484 -34220 -34081 11203 32748 8368 -18046 6492 45664 21571
492 21571 -30633 -29118 9583 16974 -21084 -36878 7909 40155 11926 -19679 -10166 22006 20088
505 20088 -26793 -39018 6416 29647 -1103 -28808 -4325 34871 15582 -30793 -23800 16939
517 16939 28277 2626 -14409 18699 53453 25678 -20940 -19895 6928 -353 -48861 -63425
529 -63425 -17567 9847 -12718 -27536 -329 39540 36619 -2980 -5946 31121 40972 7168 -20536
542 -20536 1986 33903 7742 -36892 -27560 6524 6677 -24228 -35051 2770 32685 9581 -18939
555 -18939 -5779 26175 20427 -24621 -32984 10569 26077 -4167 -20936 4399 35794 19964
567 19964 -20781 -18340 14754 17499 -14517 -32248 -1348 29963 3583 -30319 -14640 16815
579 16815 11675 -22892 -28963 10237 30057 2939 -16695 1142 27791 15815 -25731 -28199 10440
592 10440 19178 -8529 -17907 14985 45596 26299 -7205 199 22900 13422 -23420 -41244 -12710
605 -12710 10303 -16483 -39880 -17483 13766 7034 -25443 -24733 13655 26233 671 -10626 13184
618 13184 41248 27579 -10234 -6356 24663 20466 -14417 -28275 -249 22685 -1943 -28520
630 -28520 -10657 15932 8045 -21859 -29055 3778 20973 -5292 -22336 2140 29992 18397
642 18397 -15960 -12803 19273 17938 -12542 -23205 -868 20534 3193 -25895 -14000 16082
654 16082 12731 -16195 -22515 9840 28507 2295 -16871 4621 25758 13230 -17077 -20259 9277
667 9277 16079 -12367 -23605 692 25316 10901 -19099 -9062 21407 14288 -15799 -21959 2861
680 2861 19560 -1803 -23726 -5633 19266 10329 -17096 -21337 8708 20375 -8233 -20807 4833
693 4833 24787 11285 -14854 -9580 18000 16099 -11985 -19832 2158 20687 2946 -22420 -6297
706 -6297 21025 10761 -15758 -17506 7385 18398 -6488 -21717 37 19734 8265 -15679
718 -15679 -13950 14453 17477 -11717 -20043 4109 19512 2817 -19976 -7590 19347 11631 -13844
731 -13844 -15139 7302 19795 -1447 -21165 -1563 20970 7803 -16463 -13420 12263 17018 -10440
744 -10440 -19160 4050 17889 3690 -16813 -9583 17061 14048 -13235 -15832 7526 17696 -1466
757 -1466 -20281 -3401 18600 6582 -14998 -12314 9465 16381 -5997 -19428 2042 18127 3549
770 3549 -16241 -9091 15843 15326 -11017 -14504 7784 16570 -360 -17994 -6351 16394 8801
783 8801 -15093 -12951 9191 16756 -4874 -19589 675 18292 3143 -15989 -8827 12824 14927
796 14927 -8625 -15784 5822 16760 57 -17609 -7888 15429 9992 -14692 -12738 9368 14774
809 14774 -2826 -16862 -1056 18181 6121 -13291 -7868 12867 16652 -5599 -15335 5212 17422
822 17422 -737 -16787 -8016 12022 8767 -14395 -15963 5218 11024 -5829 -19776 -6417 15323
835 15323 6701 -13886 -6483 15742 18806 -680 -11057 7553 20651 3796 -13359 -5644 12765
848 12765 12042 -11195 -17257 4424 11425 -7726 -21028 -8851 10844 4617 -16019 -9867 11772
861 11772 15009 -1777 -12986 1683 18487 4408 -14155 -5057 14449 14512 -5328 -11519 8192
874 8192 16956 -1952 -15998 -6706 9817 6109 -15033 -15024 7327 12045 -5633 -16528 -1883 15309
888 15309 3999 -15335 -6406 13469 13452 -3950 -11395 5884 18563 1694 -14440 -3884 13612
901 13612 9743 -11016 -12715 8088 12883 -6634 -17040 -5074 10306 2514 -16768 -10663 11005
914 11005 12227 -4166 -11437 4781 19059 4135 -12556 -1874 14352 10413 -7730 -12815 5000
927 5000 12064 -6408 -18286 -6340 9078 4763 -13221 -9354 13159 14889 -2804 -9784 3539
940 3539 15483 3891 -14139 -6048 12056 9477 -7248 -12352 4477 14734 -3419 -17308 -4518
953 -4518 10009 4243 -12603 -12038 8905 12979 -5370 -12808 -254 12777 3841 -14413 -8219 12307
967 12307 10680 -6690 -10041 5781 16724 1892 -12321 -458 14987 9952 -5315 -7743 9340
980 9340 15562 -4098 -15527 -3594 6866 -2012 -19757 -16001 3763 4353 -11608 -13989 1397
993 1397 13829 4429 -9537 1021 19196 14623 -1850 -4157 11192 17453 -942 -13714 -1578
1006 -1578 9654 1185 -14045 -12717 5838 8777 -9069 -14075 498 11286 1877 -13265 -5562
1019 -5562 13003 9873 -6622 -7755 6208 13783 -15 -13626 -2888 10818 3566 -11148 -10571
1032 -10571 6120 11132 -5612 -12846 1755 12009 3594 -9972 -5697 11704 10711 -5924 -8412
1045 -8412 4836 12248 850 -13545 -4107 11159 4890 -9866 -9059 6047 12227 -2851 -12727
1058 -12727 523 11258 2236 -11439 -8885 7473 8469 -8878 -12635 2417 9959 151 -11688
1071 -11688 -3840 12737 8361 -6654 -6033 7845 13626 513 -10692 364 12607 3311 -10645
1084 -10645 -8036 5466 8438 -7411 -13095 858 9043 68 -11050 -5975 9792 8369 -7641
1097 -7641 -8020 6184 11290 -52 -10563 -1310 11600 3817 -9645 -7336 5674 9035 -4052
1110 -4052 -12115 1361 11410 1702 -9557 -4671 9487 8801 -7117 -9227 4522 9608 -717
1123 -717 -10619 -3604 10395 5013 -9460 -7806 5827 9858 -2585 -10727 1438 12135 2676 -8685
1137 -8685 -4940 7261 8367 -5586 -10532 2341 9050 -1377 -10737 -4757 8427 5453 -8940
1150 -8940 -7603 5943 9139 -902 -8989 275 11944 4548 -7657 -4364 7117 8459 -4313
1163 -4313 -10543 1799 9351 -1161 -10300 -4588 6827 5624 -7573 -8714 4900 8757 -1198 -8463
1177 -8463 -802 10965 5347 -8236 -4917 7011 7843 -3369 -9411 961 9791 368 -9532 -4149
1191 -4149 6845 6195 -5916 -8999 3931 8515 -1644 -8167 -1327 8748 5114 -7282 -6080 6193
1205 6193 7208 -3115 -8599 -312 9050 1451 -9250 -4325 6338 5974 -4818 -8361 3199 9288
1219 9288 -456 -7800 -1496 7963 5565 -6092 -6506 6142 7899 -2761 -8161 -621 8178 1961
1233 1961 -9511 -5375 5365 4787 -4961 -8406 1346 8848 -3 -8324 -1478 7752 5857 -4468
1247 -4468 -5506 5934 9098 -1413 -7002 -375 7382 3118 -7666 -5713 5251 5241 -4588 -8223
1261 -8223 171 7530 250 -8776 -2764 6706 4949 -3984 -6075 3833 8703 -1153 -7366 -564 7194
1276 7194 3747 -6349 -5674 6021 6491 -3793 -7149 161 6782 913 -8246 -3621 6722 4975
1290 4975 -4159 -5999 3232 8413 -695 -7792 -1046 6660 3211 -5517 -5643 4577 6889 -2912 -7087
1305 -7087 116 6379 1630 -7583 -4691 6327 5551 -3745 -5201 2789 7942 642 -7618 -1602 6581
1320 6581 3204 -4855 -5310 4031 7683 -1724 -7055 205 6256 1476 -7022 -5214 4497 4883 -4139
1335 -4139 -5920 1458 6958 747 -7563 -2310 6776 4030 -4666 -4557 3090 6927 -1531 -8164 -618
1350 -618 6103 2041 -5341 -4143 5595 7439 -2453 -5411 2179 6393 510 -7553 -4272 5405 3286
1365 3286 -5303 -5690 2028 5908 -1236 -7822 -1861 5964 2282 -4803 -3463 4992 7866 -1344 -5580
1380 -5580 1940 6453 644 -6320 -3766 5536 5177 -3979 -4635 2859 6120 -776 -7962 -3484 4527
1395 4527 602 -6635 -5178 3797 7093 -258 -5372 2132 7375 1357 -5397 -3487 4487 4868 -4069
1410 -4069 -5925 2183 5706 -617 -6949 -3191 5241 3018 -4752 -3782 3988 6603 -477 -6275 -308
1425 -308 5787 959 -5802 -3415 4377 5769 -2150 -4867 2476 6185 -101 -6574 -3406 3981 2772
1440 2772 -5374 -5259 2725 5319 -828 -6371 -603 6214 2183 -4303 -2332 4969 6335 -1171 -5840
1455 -5840 514 5181 -1165 -7124 -3839 4010 4499 -2803 -3193 4348 6686 102 -5800 -2707 3851
1470 3851 1037 -6706 -4520 3438 5510 -575 -4488 1881 6909 909 -5300 -2540 3757 4053 -3240
1485 -3240 -5230 1977 5188 -1242 -6197 -2858 4274 2812 -4327 -2995 5248 6522 287 -4074 126
1500 126 5224 3 -7240 -4074 2540 3359 -2715 -4762 2374 6799 603 -4820 -1244 4875 3458
1515 3458 -4049 -4349 2944 4396 -1726 -5312 -1463 4351 1376 -5166 -2866 4371 4459 -1421 -4308 942
1531 942 4862 -371 -6233 -2657 3463 3314 -2193 -3418 3579 6436 -50 -4075 -933 3608 1782
1546 1782 -5407 -4262 2965 3717 -1970 -4823 -158 4823 466 -5717 -2240 4379 3733 -1584 -3554
1561 -3554 2476 6041 -302 -5165 -1779 3246 1665 -4770 -3937 3433 5027 -911 -3804 143 4218
1576 4218 976 -5511 -3282 3155 2946 -2213 -3511 1615 5630 689 -4468 -808 3690 2639 -3368
1591 -3368 -4026 2255 4202 -1522 -4494 -844 3464 1192 -4576 -3046 3618 4229 -1117 -2896 1490
1606 1490 5285 992 -4492 -1611 3397 2112 -3278 -3737 1513 4539 -969 -4854 -688 3115 1651
1621 1651 -3581 -3120 3215 4280 -1344 -3089 851 4331 1048 -4580 -2298 3249 2325 -2670 -3654 1610
1637 1610 4449 -441 -4637 -958 3915 1597 -3113 -3510 2107 3797 -1549 -4151 536 3874 1718
1652 1718 -3634 -2175 3514 3518 -2304 -3325 1045 4124 17 -4739 -1905 3007 1623 -3166 -3223 2019
1668 2019 4358 -783 -3758 649 4263 1753 -3001 -2098 3278 3146 -2445 -3940 505 2965 -166
1683 -166 -4434 -1784 3584 2204 -2632 -2777 1962 4247 -210 -3712 7 4003 1378 -3071 -2434 2549
1699 2549 3562 -1781 -3676 790 3662 600 -3279 -2143 3201 2241 -3185 -3263 987 3202 -452 -3886
1715 -3886 -296 4240 2142 -2430 -2120 2330 3194 -1649 -4157 801 3762 678 -3462 -1811 2761
1730 2761 2690 -2884 -3841 1046 2825 -357 -3730 -438 4389 2396 -2182 -1956 2158 3153 -1229 -4261
1746 -4261 172 3663 970 -2867 -1369 2910 2743 -2568 -4088 577 2436 -422 -3343 -709 4006
1761 4006 2511 -2555 -2147 1927 3095 -959 -3707 -163 4025 1426 -2667 -1062 2725 2477 -2045
1776 -2045 -4200 872 2898 -398 -3369 -1010 3447 2507 -2620 -2974 1613 2785 -805 -3392 -289
1791 -289 3587 1524 -2865 -1759 2020 2417 -1858 -3793 632 3886 768 -2488 -445 3126 2519 -2533
1807 -2533 -3574 948 1930 -1074 -3022 27 4107 2391 -2331 -1725 1946 1684 -2288 -4075 -364 3020
1823 3020 568 -2387 -118 3294 2769 -1472 -3038 1182 2909 -504 -2757 -21 3340 2217 -2967
1838 -2967 -3008 1154 1017 -2675 -4209 -531 3184 1216 -1681 591 3988 3090 -1055 -2934 448 2419
1854 2419 -1256 -3060 -1023 2505 2022 -2303 -2813 1606 2507 -1537 -2856 116 3119 1168 -2502 -1482
1870 -1482 2421 1480 -1805 -2954 434 3567 722 -1973 495 3551 2275 -2331 -3270 349 1670
1885 1670 -2273 -3697 -512 2489 2067 -2141 -1541 2486 1989 -1872 -2879 160 3185 728 -2420 -187
1901 -187 3249 1550 -1691 -2694 784 2295 -790 -2139 614 3623 2119 -1807 -2440 1028 644 -3329
1917 -3329 -4417 -924 2132 989 -1758 380 4304 3265 -565 -1895 633 2165 -866 -3698 -963
1932 -963 2683 1261 -2094 -2219 1422 2168 -1361 -2785 451 2904 1540 -1738 -1418 2359 1988 -1894
1948 -1894 -2551 -279 2246 84 -2342 34 3490 2008 -1520 -2139 583 1745 -1650 -3396 -469
1963 -469 2185 1172 -1702 -1353 2355 2660 -1329 -1828 677 2640 818 -2466 -1146 2291 1152 -2596
1979 -2596 -3217 -72 1900 -596 -2105 1055 4006 2513 -769 -836 2014 2106 -1954 -3904 -1005 1140
1995 1140 -487 -2698 -1340 2268 1897 -1529 -2040 526 2237 94 -2334 54 3033 1624 -1298
2010 -1298 -1320 1695 2369 -1066 -2858 -105 2479 647 -1755 -1174 1821 1642 -2247 -2668 97 1961
2026 1961 -267 -2604 -262 3347 1981 -993 -997 1279 2005 -992 -2903 -656 1694 114 -2369 -1455
2042 -1455 1495 1917 -1272 -2489 609 2581 487 -1528 -277 2770 1722 -1915 -1870 637 1480 -683
2058 -683 -2698 -291 2687 1029 -1589 -838 1628 1742 -1131 -2610 167 2033 -151 -2134 -1117 1718
2074 1718 1708 -1707 -2138 883 2210 -188 -2011 -130 2723 1441 -1733 -1219 1065 1751 -914 -2803
2090 -2803 -385 2067 220 -2098 -743 1831 1801 -854 -1826 1169 2104 -106 -2013 -516 1805 1296
2106 1296 -2353 -1870 774 1438 -992 -2332 -23 2379 588 -1688 -794 1751 1749 -876 -1875 703 2363
2123 2363 -427 -2102 -604 1651 1186 -1432 -1461 1171 1770 -504 -1745 -504 1545 396 -2164 -1731
2139 -1731 1090 1158 -1151 -2130 494 2383 640 -1037 -95 2090 1963 -963 -1685 897 1694 -719 -2178
2156 -2178 -1073 1245 332 -2153 -1337 1343 1698 -763 -1480 245 2010 295 -2312 -1206 1169 1050
2172 1050 -1084 -1529 907 2247 120 -1495 -72 1667 1035 -1424 -1057 1153 1606 -721 -1483 -225
2188 -225 1736 223 -1774 -1035 1058 1051 -1046 -1425 572 1949 34 -1418 -498 1496 1107 -1472 -1299
2205 -1299 1154 1514 -600 -1426 322 1931 572 -1565 -1135 1028 1023 -926 -1534 338 1877 -89 -2036
2222 -2036 -547 1254 841 -968 -1320 1088 2265 -45 -1456 83 1573 811 -1315 -1007 1471 1242
2238 1242 -706 -1368 25 1433 -361 -2256 -1176 853 395 -1016 -1081 830 1992 376 -1076 298
2254 298 1606 865 -1205 -1102 1272 1728 -154 -1062 362 1625 63 -2252 -1381 568 422 -1464 -1369
2271 -1369 425 1573 221 -1292 -198 1710 361 -1133 -1108 1293 1946 -407 -1083 739 1406 269
2287 269 -1414 -1278 956 991 -1197 -1420 344 1215 -226 -2121 -799 943 301 -1285 -889 984 2098
2304 2098 276 -873 812 2025 842 -1229 -1213 977 1173 -1223 -1459 251 999 -39 -2012 -740
2320 -740 1163 709 -1074 -876 1241 2015 77 -1320 -115 1365 148 -1578 -1296 1132 1449 -678
2336 -678 -1043 599 1675 112 -1505 -978 787 508 -1253 -1161 470 1936 240 -1344 -15 1228
2352 1228 396 -1789 -1290 822 1179 -554 -1120 245 1633 271 -1416 -900 1166 1056 -711 -895 1338
2369 1338 1994 414 -1381 -804 770 -253 -2075 -1616 133 434 -467 -1319 575 1699 614 -347 -323
2386 -323 1408 1423 -345 -1029 636 1295 -230 -1384 -1039 880 128 -1627 -1315 689 1171 -159 -1206
2403 -1206 129 1430 86 -1702 -691 884 1593 -97 -670 803 1487 185 -1483 -678 1011 283
2419 283 -1424 -1580 363 1238 -201 -1131 -601 1301 545 -1121 -718 1209 1457 -425 -871 374 1556
2436 1556 -236 -1726 -939 535 634 -812 -926 1047 2033 478 -901 221 1059 392 -1567 -1242 621
2453 621 727 -667 -1526 21 1294 152 -1048 -756 1140 1128 -359 -984 612 1834 147 -1121 -575
2470 -575 910 399 -1379 -1337 396 927 -82 -1434 35 1125 476 -1166 -751 771 1135 -257 -567
2487 -567 600 1794 263 -1074 -534 732 555 -1253 -1596 296 1026 -360 -1172 -213 955 449 -1120
2504 -1120 -601 1196 1543 -176 -564 554 1389 182 -1371 -788 347 25 -835 -1351 433 1488 -61
2521 -61 -1300 213 1069 776 -580 -753 892 1171 -529 -1229 82 895 100 -1283 -534 617 534 -770
2539 -770 -966 229 1414 -88 -1150 -83 1058 433 -755 -991 749 1109 -255 -1365 188 970
2555 970 316 -1270 -548 1009 459 -342 -1062 134 1170 56 -1275 -425 839 513 -752 -811 319
2572 319 1523 -50 -989 168 959 361 -800 -969 608 541 -562 -1102 -31 1060 587 -687 -263
2589 -263 1076 783 -719 -608 391 912 -174 -1539 -361 654 257 -1004 -861 442 931 -253 -1100
2606 -1100 371 1216 492 -706 -470 936 705 -742 -793 250 892 -276 -1356 -266 1014 631 -753
2623 -753 -711 466 666 -401 -1342 -218 762 517 -901 -698 786 785 -334 -470 524 1324 611 -677 -99
2642 -99 871 403 -761 -820 -15 575 -315 -1508 -263 770 392 -636 -261 863 1310 -147 -476 434
2660 434 1050 283 -751 -395 935 517 -1021 -1014 250 551 -317 -1201 -270 631 396 -933 -307 532 829
2679 829 -435 -991 318 1489 634 -561 -225 1000 1043 -274 -517 179 509 -335 -912 -468 1028 363
2697 363 -699 -785 347 656 -757 -1189 -252 439 -54 -686 -250 731 1189 -38 -648 579 1028 327 -683
2716 -683 -66 966 562 -769 -704 181 786 -465 -1106 -158 753 -41 -881 -376 588 956 -326 -942 228
2735 228 944 -126 -803 -487 753 252 -835 -591 585 871 -108 -868 -244 815 698 -896 -220 519
2753 519 571 -230 -1024 -45 683 -48 -861 -122 981 678 -514 -519 670 974 29 -891 -25 915 401 -843
2773 -843 -405 514 255 -603 -1153 -383 687 -73 -1091 -433 457 821 -309 -501 605 941 -96 -649
2791 -649 257 1028 798 -593 -246 573 414 -470 -781 -304 577 46 -1037 -336 485 554 -372 -902 452
2810 452 834 -58 -1123 4 896 447 -522 -497 744 908 -638 -908 -8 501 164 -687 -258 927 448
2829 448 -604 -954 -327 892 -535 -1582 -566 617 629 -530 -436 721 919 252 -295 273 1341 634
2847 634 -558 -393 560 321 -737 -995 -311 435 -224 -1451 -337 624 326 -539 -689 567 1023 -54
2865 -54 -798 206 778 644 -602 -418 809 919 -695 -912 -272 523 -190 -1071 -455 687 212 -576 -568
2884 -568 468 1004 -244 -706 107 944 637 -537 -729 554 549 -676 -1198 -163 539 121 -890 -359
2902 -359 652 848 -178 -74 753 840 84 -564 104 364 206 -889 -690 176 667 -500 -1008 -124 982
2921 982 301 -544 -228 1242 823 -77 -385 378 838 287 -642 -204 831 53 -897 -973 288 603 -536
2940 -536 -1024 299 486 364 -538 -459 294 658 -469 -706 364 708 148 -831 -240 474 470 -682 -851 103
2960 103 796 -180 -890 -316 931 352 -476 -88 280 730 -269 -610 289 767 186 -838 -436 553 499 -799
2980 -799 -563 414 928 -168 -735 -109 635 239 -652 -494 679 730 -148 -1041 -28 681 269 -553 -289
2999 -289 526 585 -237 -838 579 719 -8 -620 -129 830 -107 -857 -629 576 672 -160 -934 -12 872 265
3019 265 -685 -345 602 406 -572 -844 138 603 64 -614 -556 601 342 -916 -448 245 772 104 -625 37
3039 37 810 421 -473 -468 442 639 -343 -735 -79 625 -12 -903 -514 439 174 -873 -679 362 468 37
3059 37 -602 -158 1150 314 -483 -277 803 794 -30 -511 122 852 255 -877 -466 461 407 -315 -919 138
3079 138 477 -348 -888 -345 543 271 -602 -791 586 596 -88 -685 287 1005 248 -632 27 802 526 -242
3099 -242 -724 323 662 -164 -1150 -310 614 524 -389 -819 550 626 81 -679 -202 645 278 -555 -272 481
3119 481 424 -382 -928 226 680 -104 -963 -482 297 485 -549 -494 595 952 -123 -524 -69 701 492
3138 492 -749 -159 683 543 -223 -675 12 564 -120 -939 -55 486 475 -578 -669 219 681 6 -671 -144
3158 -144 323 72 -625 -617 49 562 -188 -729 17 611 387 -581 20 847 690 -275 -469 213 890 -83 -634
3179 -634 -81 454 -114 -534 -689 206 462 -260 -874 -100 423 -67 -708 -344 683 617 -367 -338 -106 738
3199 738 129 -665 -88 519 128 -431 -983 -18 709 -312 -842 -180 421 -29 -721 -522 683 614 -332 -276
3219 -276 389 743 408 -526 -169 873 360 -37 -416 265 703 -410 -891 80 317 4 -574 -451 169
3238 169 579 -389 -575 80 504 207 -689 2 814 692 -201 -81 468 517 -39 -833 -264 475 -212 -252 -533
3259 -533 285 505 -314 -693 100 493 -101 -506 -232 738 362 -238 -248 313 351 -272 -978 -200 818 198
3279 198 -440 -416 585 640 -134 -624 195 899 236 -468 -311 304 388 -510 -935 195 370 13 -595 108
3299 108 859 334 -788 -582 455 508 109 -505 208 656 93 -700 -534 470 355 -395 -810 -76 234
3318 234 -264 -667 -250 679 376 -575 -498 673 747 187 -236 52 1056 377 -513 -359 359 314 -203 -594
3338 -594 22 685 142 -704 -179 491 399 -366 -602 336 334 4 -592 75 558 245 -695 -228 173 480 -208
3359 -208 -641 231 872 -121 -396 23 427 535 -754 -887 147 620 -249 -737 -286 564 119 -420 -399 581
3379 581 581 -234 -665 -45 930 10 -614 -100 436 509 -420 -678 -181 303 -209 -973 -269 195 313 -510 -470
3400 -470 325 608 -157 -356 278 727 207 -558 -89 405 493 -654 -692 -27 606 -287 -562 -211 605 522 -188
3421 -188 -433 747 892 -295 -285 -162 608 229 -526 -391 414 314 -482 -846 11 823 -153 -545 -132 562
3441 562 683 -251 -303 593 856 -94 -468 14 771 507 -321 -638 423 288 -699 -841 -437 30 283 -611
3461 -611 -230 576 643 -289 -427 263 1089 6 -594 -326 483 604 -480 -487 333 471 -362 -704 148 358
3481 358 302 -243 -303 673 575 -55 -555 488 421 165 -377 -68 585 330 -430 -659 192 647 -192 -373 299
3502 299 439 227 -622 -408 210 484 -718 -565 32 670 176 -525 -191 687 382 0 -307 288 479 219
3522 219 -629 -55 532 208 -662 -387 -57 420 -111 -350 261 609 74 -360 -658 276 553 -295 -526 -79
3542 -79 251 -270 -844 -238 204 52 -235 -325 451 846 -34 -612 213 661 386 -515 -681 351 347 -152 -241
3563 -241 299 362 47 -507 -198 490 382 -262 -221 -111 270 132 -765 205 968 194 -364 -299 382 563 -495
3584 -495 -724 12 285 -68 -775 -282 465 543 -564 -550 377 522 289 -252 -61 755 202 -374 -364 197 306
3605 306 -67 -535 1 521 18 -561 -602 175 355 -431 -791 20 618 -255 -603 -21 413 387 -506 -347 252
3626 252 762 307 -502 236 771 524 -376 -528 664 482 -296 -312 -254 262 13 -526 -255 391 228 -603
3646 -603 -419 342 271 7 -487 274 414 470 -233 -202 244 554 -98 -288 -151 538 177 -652 -344 351 213
3667 213 -252 -381 350 403 309 -185 -166 774 397 -501 -108 540 396 -59 -531 237 402 -117 -294 -21 237
3688 237 328 -145 -389 358 223 -193 -300 100 277 217 -531 -308 32 174 -138 -287 159 742 57 -571 -80
3709 -80 472 521 -469 -532 139 825 78 -189 -208 262 -2 -575 -402 236 195 -42 -456 62 489 91 -293 -305
3731 -305 203 490 -350 -291 195 366 148 -356 -193 636 352 -292 -257 394 255 -18 -519 -53 416 234 -430
3752 -430 -341 577 383 202 -442 164 538 180 -334 77 335 385 -131 -641 68 96 -275 -352 17 339 191
3773 191 -300 -617 -4 288 -596 -436 298 677 31 -326 42 408 376 -186 -224 -183 372 142 -331 -118 143
3794 143 -59 -306 -518 215 456 -391 -376 99 627 -21 -180 -263 496 352 -43 -306 137 619 4 -495 -23
3815 -23 230 68 -510 -262 158 432 -175 -355 31 467 277 -70 -71 316 122 -151 -469 -79 589 -99 -453
3836 -453 -286 349 367 -282 -346 2 627 -22 -196 35 622 487 -200 -43 458 530 -438 -491 64 262 149
3857 149 -221 -30 428 -169 -359 -119 322 206 -43 -335 75 520 -32 -244 -320 406 438 -415 -203 287 347
3878 347 16 -430 -220 401 237 -298 -573 183 346 -26 -478 -32 681 319 141 -278 265 363 39 -267
3898 -267 75 173 -343 -189 -170 52 324 -218 -590 208 136 120 -601 -92 325 -225 -293 -370 63 321 -101 -556
3920 -556 105 605 382 -659 -238 51 318 -101 -383 37 300 65 -89 -311 -41 363 -493 -352 190 448
3940 448 -136 -572 -178 352 264 -292 -108 90 468 -30 -373 -150 450 -182 -220 -113 128 39 -231 -263 245
3961 245 216 -43 -103 -58 313 149 -248 -356 116 269 -200 -295 3 207 482 -283 28 337 572 -104 -315
3982 -315 77 315 -175 -533 -111 329 221 -110 -199 161 327 -150 -97 -271 518 86 -476 -472 107 -30 -194
4003 -194 -365 -64 329 4 -304 -30 294 502 -171 -158 116 534 -51 -403 72 301 45 -454 -365 417 189
4024 189 106 -15 67 280 -5 -474 -101 245 151 -43 -177 445 287 17 -420 114 396 322 -219 -180 120 45
4046 45 -91 -419 -65 309 269 -364 -405 301 531 7 98 204 462 55 -637 -87 264 327 -462 -221 51 221
4068 221 -141 -261 264 332 139 -5 -201 200 195 -319 -695 -53 391 22 -233 -79 350 282 -216 -300 50 398
4090 398 116 -262 188 416 121 -244 42 61 442 183 -257 -77 128 -57 -471 -189 198 134 -512 -321 136
4111 136 299 -196 -273 9 210 260 -218 -214 -65 451 29 -180 -161 207 -135 -265 -169 212 305 -297 -237 -90 189
4134 189 -129 -197 249 128 126 73 -110 197 185 -137 -61 70 520 -106 -298 -353 407 131 -67 -280 80 418
4156 418 -164 -366 -230 367 -46 -46 -149 419 240 -227 -132 176 408 75 -87 -359 0 241 -133 -327 -199
4177 -199 306 -28 -108 -77 143 29 7 -28 200 552 121 -194 116 362 53 -368 -18 228 268 -69 -530 211
4199 211 2 106 -135 10 9 244 -176 -245 477 392 246 -215 -158 376 23 -31 -2 90 317 -140 -327 215 176
4222 176 -6 -93 -112 192 55 -380 -138 -11 232 -320 -198 -90 283 257 -236 -77 175 337 -402 -648 206
4243 206 274 275 -12 -170 275 51 -150 -2 149 173 -113 -370 -117 177 102 -128 -300 198 134 -164 -569 -95
4265 -95 461 158 -178 -128 -1 555 12 -53 81 302 28 -12 -199 262 146 -438 -84 195 357 -306 -232 -145
4287 -145 206 39 -197 -117 -224 -112 -28 -356 -165 175 -221 -289 -19 75 134 -140 -67 178 305 72 -542 -131
4309 -131 421 -3 -55 -240 14 306 -100 -247 115 158 144 -247 -410 290 307 -82 -457 163 -5 -228 -397
4330 -397 -87 98 456 -259 -98 95 305 37 -20 -197 175 76 137 -105 -10 99 -262 -122 118 24 -250 -441
4352 -441 119 256 -16 -244 -99 109 302 -92 -43 -6 346 200 -225 82 135 419 5 -409 8 322 -234
4373 -234 8 -137 284 82 -126 -118 199 117 -3 -213 -208 238 20 -146 -269 125 154 -168 -63 287 247 71
4395 71 -210 -368 119 227 -136 -427 -125 406 68 -131 -138 129 199 -74 -504 31 181 98 -205 54 289 5
4417 5 -234 229 2 408 -64 -189 146 -65 13 -239 -66 288 291 -197 -93 212 186 -33 -177 75 62 -20 -240
4440 -240 -163 28 89 -339 -297 -103 330 313 -60 92 300 412 -152 67 -119 238 -52 -148 -43 338 106 -255
4462 -255 -335 113 195 -190 -161 147 401 173 -206 -60 361 -87 -160 -40 -21 -37 54 -182 149 220 204 -111 -214
4485 -214 148 303 -130 -349 -131 86 79 -332 -131 68 -74 -91 -331 278 220 126 138 -156 138 47 -343 -315 53
4508 53 166 -70 -454 33 388 -19 -210 -215 -11 361 -3 -229 -37 177 -61 -226 -102 270 256 -15 205
4529 205 557 359 -20 -287 43 162 -191 -306 8 -142 -52 -296 -139 277 153 330 -67 -102 210 -81 -57
4550 -57 -326 -146 237 100 -263 -38 -35 -25 -156 -357 52 52 118 -71 -164 418 -71 -171 -109 381 226 -87 -118
4573 -118 44 285 53 -164 33 16 302 -320 -165 -315 149 -81 -255 -52 166 -226 -60 -77 237 72 41
4594 41 -105 21 3 6 -317 -270 355 77 -93 -281 80 197 -52 -8 35 150 199 -108 -81 0 313 -124 125
4617 125 256 2 -3 -286 -188 9 252 -218 -23 236 -18 -60 -253 -55 -39 74 -244 -155 359 147 -156 13
4639 13 209 159 -95 -349 -413 138 -66 -268 -423 180 88 -218 -212 -162 195 243 43 -199 159 106 128 85 251 95
4663 95 150 -13 44 187 -100 128 -91 -293 120 -147 -135 211 384 139 -195 62 162 10 -79 111 -73 35
4685 35 160 -104 -236 -165 337 -50 47 123 439 -42 -270 -15 176 158 66 -46 109 178 64 -166 70 393
4707 393 282 -141 137 194 6 -91 -22 178 -122 -6 -147 53 278 93 -153 -390 84 238 169 -357 74
4728 74 326 207 10 -301 90 98 -29 -432 22 30 61 -99 -104 183 -199 93 -113 -265 -12 33 -56 189 -109
4751 -109 55 -33 -39 181 40 -76 -21 185 109 142 -102 23 2 133 1 -85 234 150 -99 -81 28 119 -198 247
4775 247 -203 -133 317 -3 -17 261 158 28 -178 141 69 -23 11 -104 315 116 315 -217 -86 158 -80 -24
4797 -24 -100 -133 66 -166 -279 56 223 -50 -157 -75 89 72 28 -138 38 258 112 -185 -211 104 -109 -273
4819 -273 -95 145 220 -8 -356 26 212 -49 27 -181 170 177 -123 -84 359 268 -86 -173 -167 -223 -290 -126 -289 -120
4843 -120 168 26 -247 -122 197 -79 -88 -105 79 -113 -99 -287 33 41 104 -8 -158 342 182 12 44 133 108
4866 108 -159 -54 72 232 137 -105 -104 123 56 -158 -44 -18 187 -29 49 32 90 208 -244 -103 73 440 -214
4889 -214 -44 -305 44 159 -178 -134 -97 311 -61 -150 258 67 -120 -146 -197 10 18 -97 205 10 214 410
4911 410 -335 58 248 368 -45 105 22 118 74 -478 229 -205 249 40 -18 95 28 -68 -64 204 100 -136 -58
4934 -58 -157 -78 136 130 -1 -15 159 88 -184 73 260 -80 -13 59 155 -192 -510 69 98 16 35 -225 42 -81
4958 -81 1 -217 -195 -55 72 -194 -387 -361 96 150 -192 -256 102 -3 -88 -20 22 190 71 -168 36 133 92 135
4982 135 -408 156 86 -140 -77 4 201 201 31 10 336 110 -228 -3 -142 107 303 -14 -26 -77 -273 77 -223
5005 -223 -138 407 -128 -67 23 41 162 -173 96 -129 59 -133 -436 233 182 -26 107 -184 202 335 -230 -133
5027 -133 -32 164 -130 -334 114 86 185 6 -261 -68 76 -176 -213 66 -48 161 -50 102 -51 -96 -170 -209
5049 -209 -148 232 -106 65 -268 29 305 -49 71 43 -16 48 -225 107 286 -54 56 -68 121 197 -318 -191
5071 -191 -14 196 103 -119 -46 168 166 138 -110 313 345 137 -224 -118 61 200 56 22 -128 268 -93 -124 85
5094 85 63 -153 66 -60 216 -180 -491 26 -61 99 23 100 -34 -152 154 14 -253 138 -9 -229 -55 -15
5116 -15 136 -52 -57 -25 89 164 -243 -2 -55 174 46 -13 -371 80 -106 80 -202 238 245 255 192 -36 74 -41
5140 -41 -98 -69 75 71 203 -261 229 151 13 -8 -12 149 -147 -173 -184 33 -17 -98 -127 64 -143 -230 219 -205 123
5165 123 -113 -171 -41 21 169 161 2 234 24 332 -115 -183 501 -40 0 7 124 222 -92 -255 -63 128 0
5188 0 -223 -80 -44 176 -52 -132 255 -42 -100 -140 21 -130 30 -8 -178 56 77 154 -137 -87 -10 60 14 142
5212 142 199 99 34 -104 -62 12 152 114 74 34 34 -40 -10 -94 -37 -57 -142 -256 98 72 79 -72 31 199 154 245 402
5239 402 -11 182 99 -98 49 66 114 -33 -201 63 360 -292 -294 -222 179 200 -117 111 -259 200 13 -170
5261 -170 205 54 230 -159 -335 211 -92 -374 77 -175 -176 -64 120 -33 195 -106 -41 -58 -20 40 -40 18 20
5284 20 10 -177 20 -108 -36 -169 44 -291 289 59 53 -128 -27 82 234 33 55 90 98 2 -42 177 235 -33
5308 -33 -107 -103 -29 130 -24 -180 -84 -82 -32 -124 -61 16 63 274 -220 174 134 170 -362 -135 133 -134 -314 52 -23
5333 -23 187 110 -9 75 -30 -16 166 217 102 292 12 -31 154 -54 -261 30 -29 163 80 113 47 -44 335 -145
5357 -145 -274 111 132 147 7 -140 -208 7 -2 96 20 147 49 -24 -139 256 138 -237 275 253 -19 -123 -42 -96
5381 -96 -28 48 -209 -55 -214 15 -383 -218 336 -81 -101 -225 224 218 230 51 60 185 -14 -189 -55 215 104
5404 104 -49 -417 60 54 178 -6 -30 42 19 136 106 15 -159 -83 -296 -16 -35 -231 -175 -65 7 -51 -232 -31
5428 -31 -223 -242 -29 39 -303 -12 -28 -393 -90 117 158 -75 -66 52 -118 302 289 33 120 -118 -249 -178 -14
5451 -14 -23 18 141 -155 -29 118 -12 -148 314 -18 173 -3 -2 133 167 55 -119 44 22 -13 -16 -102 -73 -56 38
5476 38 -146 -11 -148 -174 -228 165 106 34 -46 19 193 10 38 -291 -247 -48 141 -259 17 -165 -154 -30 51 145
5500 145 -27 -166 -64 129 166 81 -330 -34 35 -96 30 -160 -328 26 -148 -54 -76 50 12 30 27 117 219
5523 219 28 -172 -152 186 39 -39 29 85 -201 96 -87 8 165 13 -61 -301 -125 32 81 -103 182 171 -190
5546 -190 -147 46 123 158 -267 -81 114 -113 -81 -49 112 132 -188 -20 140 28 83 218 -180 -187 233 74 -118
5569 -118 2 -23 -12 114 -62 -82 -2 -82 118 -40 -17 62 -55 45 -54 -304 129 -89 131 120 -53 101 -74
5592 -74 256 304 189 -82 42 -97 161 158 178 -136 240 -12 -175 226 97 116 -80 -12 -67 -118 -95 -7 -318 141
5616 141 -158 -297 -111 1 -13 -115 57 6 74 -226 265 241 324 14 -182 169 -48 41 4 -186 88 94 132
5639 132 136 -91 -185 -53 268 -71 37 92 64 36 151 175 134 2 88 -64 96 -169 118 -18 45 155 -132
5662 -132 112 84 152 124 184 -11 119 155 -268 43 311 85 70 165 92 31 -344 -174 239 -69 -342 -115 -51
5685 -51 123 -10 -281 101 166 -3 69 41 169 236 -84 115 60 -201 112 110 -128 14 21 46 184 85 -12 -114
5709 -114 -339 -162 75 146 -166 57 8 80 58 -345 -135 237 65 81 -69 -235 -173 -96 -51 -91 31 -102 -61
5732 -61 -24 84 73 -90 59 -38 194 158 -95 167 16 57 -23 -113 58 55 29 -247 56 47 275 102 46 -25 126
5757 126 -50 211 -31 30 -44 -241 -125 165 -23 -45 -150 219 -17 50 -30 110 -290 -16 253 40 -86 87
5779 87 263 -3 -193 16 223 132 -10 28 -96 105 29 233 205 22 -52 -52 -81 -37 -60 27 -40 77 -155 -166 48
5804 48 205 116 -35 164 -13 -149 83 -249 204 -47 97 -172 -53 127 -117 17 -140 31 134 -53 -267
5825 -267 -106 139 -14 13 -54 -75 6 -244 44 -99 65 -35 -60 -141 0 -81 -6 -20 -105 -49 -291 -177 99 214
5849 214 -304 -31 -107 -74 79 28 139 1 -50 -49 -72 -45 296 235 -76 -183 113 64 8 -117 -266 -10 156 -4
5873 -4 23 140 102 68 21 -178 180 -56 -171 53 230 120 -37 -211 263 140 -242 46 124 -75 235 -28
5895 -28 -82 -37 97 -331 49 -2 -91 153 -114 30 218 -80 -231 -34 -16 -98 77 174 115 -13 -208 10 -69
5918 -69 172 -65 21 15 102 -98 91 -184 -70 143 97 20 -186 -94 160 146 56 5 281 20 202 -115 138 -133
5942 -133 -31 56 25 294 249 -259 -138 369 162 -66 87 140 177 16 -36 -150 325 -112 181 -178 -27 256
5964 256 -65 57 7 5 107 189 -69 -73 -165 -121 25 76 -125 124 -196 197 -90 43 328 -91 85 -269 72
5987 72 45 147 100 -35 -385 -191 -102 43 -36 -194 62 -183 14 -381 121 171 336 67 -13 -35 314 134 -258
6010 -258 89 -5 -56 77 14 206 -149 -171 28 64 -107 87 -11 -103 2 321 7 151 -36 -5 53 -204 0
6033 0 231 -148 -44 -16 -249 -103 -57 -79 -212 -71 137 17 -125 193 59 163 -9 -12 43 107 165 -99 -102 -217
6057 -217 -47 -7 184 233 80 69 58 -117 -28 109 365 -29 111 207 -269 290 132 -222 -172 -104 -28 -112 -52 96
6081 96 217 -102 -61 -116 99 -104 -311 -47 284 -14 34 -235 67 114 -106 243 -253 185 -67 -238 -77 -104
6103 -104 39 377 126 -137 14 -305 -55 -19 85 -195 58 -8 48 93 10 1 -253 -136 172 95 -216 113 108
6126 108 -59 120 -140 -71 -72 -21 -135 145 56 -263 -103 8 63 285 -24 -100 -364 113 5 -121 -156 -2 -110
6149 -110 211 36 -151 -45 62 -80 -47 86 -114 -36 -229 146 306 146 25 58 116 -56 125 -58 196
6170 196 187 -373 122 -229 151 -78 178 -64 84 67 -85 -303 238 -245 -97 -259 -172 145 -15 -107 -30 25
6192 25 84 -61 -85 -169 9 253 410 270 -65 23 -45 -91 -7 -26 -96 195 -288 197 -107 94 60 44 -46 195
6216 195 54 -318 149 53 201 -72 42 -16 -141 27 -117 98 84 48 -181 -99 214 -203 328 52 60 -291
6238 -291 -255 -41 44 78 34 -37 378 140 96 -94 94 238 322 32 -166 -76 -151 -92 16 18 -141 298 138 -104
6262 -104 22 181 -129 -101 -63 154 -24 19 48 -106 133 166 159 3 -6 240 -68 9 61 254 84 -251 -62 153
6286 153 -66 -245 17 -93 -146 18 22 -179 -164 147 36 110 164 19 -101 -157 -229 -51 -106 42 206 2 144
6309 144 -98 -226 -168 85 129 -186 219 118 30 271 109 271 157 -182 -89 238 -20 -46 -120 119 -27 12
6331 12 -133 90 -96 -18 -46 17 -79 129 -6 -148 142 328 94 -60 -104 -94 -109 13 151 -97 257 -249 38
6354 38 90 195 91 -332 -68 432 22 -85 -133 137 381 -111 -133 -53 171 95 154 170 -31 127 -107 57 104
6377 104 340 -98 149 97 -166 -44 68 259 -113 112 169 106 23 116 70 43 -190 -104 74 -236 -99 -16 -232
6400 -232 -47 -34 -131 57 104 -3 -84 -125 70 68 117 70 -93 165 -45 48 -198 32 31 -37 211 124 421 173 170
6425 170 40 207 176 89 -55 -43 50 -181 -31 -83 6 -91 -119 13 133 -114 -198 -97 126 -247 89 -237 -9
6448 -9 156 -12 42 175 83 187 12 -329 -32 -99 42 -81 -270 3 -26 -64 84 209 178 -177 -119 49 244
6471 244 -78 270 244 254 -200 333 228 -30 -163 -273 -41 171 114 8 57 -44 -10 -84 106 -46 26 388
6493 388 324 18 432 111 135 -17 -33 69 80 39 -59 -89 49 -132 13 -97 -137 19 73 -158 88 220 100
6516 100 130 332 87 137 41 -143 100 -86 -40 -117 -126 177 108 -66 24 210 -2 -258 -126 34 103 75 -209 -17
6540 -17 81 -137 -18 -112 27 9 -129 -96 56 63 200 66 17 50 287 -197 -180 118 23 164 33 -95 151 2
6564 2 -57 70 69 -2 -236 -49 139 93 -57 126 275 -13 118 48 -160 242 188 117 215 69 -120 170 122 -76
6588 -76 97 87 1 -91 -57 74 25 -392 -74 -47 -42 -37 -275 9 23 37 -103 -42 -27 242 -4 -49 85 230 -48
6613 -48 -17 -140 -190 115 -112 -43 -110 39 65 -89 15 59 45 44 -72 -208 207 111 15 -186 88 134 -36 -44 11
6638 11 310 122 -153 35 145 133 -71 -303 131 -82 126 50 -64 98 -227 -73 167 393 -180 204 -116
6659 -116 79 -119 27 -297 101 242 115 2 -44 23 -192 -16 -131 -80 95 196 -105 247 62 298 94
6680 94 132 90 -34 36 20 -204 -125 -97 193 20 -135 -198 -40 161 -57 -64 27 262 -7 39 50 -84 -173 -451 1
6705 1 -251 70 -117 -114 255 -242 60 55 -201 -66 -60 -114 -6 -35 -303 131 -444 -57 -75 -204 -168 121 36 -6 148
6730 148 209 -131 206 -145 -45 111 141 -17 153 64 34 -179 -304 -103 79 -37 -171 5 163 27 -275
6751 -275 6 -165 81 234 -104 -52 201 61 17 -24 74 -147 -3 -167 107 -62 116 -14 92 -3 57 94
6773 94 56 104 118 381 -296 113 89 164 19 135 185 28 -158 189 190 123 6 -85 45 -171 -116 107 53 -210
6797 -210 82 226 -156 -135 133 -60 -201 57 280 220 -98 -399 -73 -120 83 156 72 -145 90 -61 -182 62
6819 62 -120 -76 -35 190 -185 163 -98 -219 174 280 317 -176 -151 -61 38 73 -106 -135 -41 -66 87 15 287 -121
6843 -121 -21 217 220 -48 -331 141 169 -229 94 137 -75 149 -112 107 38 199 183 -252 -69 74 -91 -68
6865 -68 32 -334 395 -119 -176 102 253 231 312 98 66 210 -32 218 18 58 72 -131 146 143 -58 -51 -107 -17
6889 -17 -121 162 -57 -98 -138 150 5 -122 -18 88 35 -132 -79 107 50 -36 -217 207 -7 42 -39 -79 92
6912 92 72 -196 75 248 -108 -263 -175 153 101 -186 -201 -134 271 364 310 -210 39 88 -36 27 10 60 -163 74
6936 74 51 36 -14 -298 174 172 3 277 284 64 -16 -16 43 -290 -133 151 -104 -113 -41 21 95 -263 9 65 -65 -239
6962 -239 98 -57 46 123 -107 273 181 -152 -76 154 115 -85 -128 -14 46 171 -7 -91 51 91 131 -19 117
6985 117 11 -89 -20 1 -68 36 -51 -166 30 -256 127 16 29 -74 -29 -39 41 198 -53 279 217 76 241
7008 241 130 65 220 -175 -45 -124 -121 -87 46 32 59 -145 -102 92 -299 -63 -176 137 -92 -195 -43 53 -123
7031 -123 -50 -7 22 -197 145 -28 -156 92 16 4 -304 -66 17 21 -217 87 -7 -46 -44 -301 -21 179 -101 423
7055 423 88 -153 16 -84 -23 -254 189 4 173 -133 35 31 171 130 -148 199 -127 269 112 87 87 93 -156
7078 -156 -96 -65 -17 -165 -170 -18 -131 249 -174 149 -195 -32 -5 -24 67 79 180 -12 57 -71 161 -21 215
7101 215 69 87 -2 -225 -44 -96 -262 130 -40 -281 202 -35 -43 317 -354 -45 -140 -65 -32 -133 -394 -174 210
7124 210 -223 6 -98 55 76 127 -408 -188 81 -101 354 101 63 -74 51 -1 190 -64 46 -33 139 171
7146 171 91 53 180 132 -16 -272 36 -122 -97 -144 -190 118 61 128 -222 152 71 -163 120 127 172 -57 -42 385
7170 385 19 159 171 194 256 49 -23 140 82 -224 193 159 -222 -63 212 -7 53 36 240 -46 -56 53 47 -23
7194 -23 131 60 -60 329 -26 -72 -259 -63 -203 -38 -30 115 -120 -209 -109 -102 -259 24 -248 -80 64 -60 193
7217 193 -196 111 -95 -122 -69 -134 -158 10 -290 -21 -16 283 -45 -72 -102 -198 -16 91 -127 57 -30 13 -53 -44 -109
7242 -109 99 254 -284 -117 88 -7 -15 -24 -209 103 -181 -81 -22 -80 176 -57 34 -100 -207 -134 -41 -94 63 215
7266 215 17 -42 -101 79 74 -381 -144 183 183 170 -2 42 -72 -66 28 257 -48 70 -2 -116 209 70 -157 253
7290 253 52 64 -30 94 -191 102 -179 -181 72 283 -21 195 112 69 312 -149 233 255 157 275 -291 -106 1
7313 1 -133 -219 -308 8 -53 10 222 106 -4 -214 -143 -221 443 -167 7 92 89 -95 329 -76 60 33 28 -112 37
7338 37 243 -431 -27 -45 79 76 192 -21 73 -131 -270 183 118 58 -48 -116 64 -15 -39 103 -117 141 -21
7361 -21 -118 -68 88 -215 -211 402 118 -108 -75 -13 15 31 174 -131 -68 -169 66 -106 305 -187 144 2 50 -144
7385 -144 -181 9 51 -302 59 219 -59 -143 -267 -101 61 -151 17 34 69 -166 50 65 -24 90 -49 -131 0
7408 0 -75 154 -289 84 -98 191 108 -117 47 19 263 87 -3 133 -13 74 37 -66 256 65 -237 -124 -53
7431 -53 333 120 -1 159 32 187 139 -102 -106 93 46 -57 169 -9 94 23 -34 -87 103 52 -353 5 296
7454 296 135 -142 -60 34 165 21 185 -172 -2 -20 -84 148 79 302 44 -203 16 -158 -148 -17 44 218
7476 218 222 34 0 -118 -10 -63 -55 -7 205 -125 177 294 90 -17 -58 77 57 83 130 71 -12 261 77 120 -182
7501 -182 -299 -216 -281 -60 -124 17 42 69 -223 -34 -178 99 -248 35 -58 -224 -70 -118 -68 162 132 60 19 33
7525 33 75 43 47 -51 71 -106 -73 -307 201 -24 -118 -153 -92 216 -105 -86 204 165 105 -154 385 140 92 74 -138
7550 -138 -234 -46 -229 48 -90 -281 207 173 -343 -129 152 95 -6 -150 94 -24 -85 -182 -198 53 109 59 160
7573 160 74 15 -79 -187 288 -19 -47 -114 -89 -137 -48 31 14 -74 -52 28 49 -173 -91 10 79 314 26 -86 -249
7598 -249 -45 15 241 13 -113 88 8 59 186 -167 138 96 66 61 -106 -392 -116 96 -63 19 -83 130 97
7621 97 -64 -130 -42 -25 165 219 118 66 152 -180 -36 -1 115 -273 -302 -14 121 54 187 -114 16 -18 -91 137
7645 137 82 -209 -151 -101 57 33 -342 172 -24 13 -10 -233 64 25 -53 -32 -58 -34 154 300 29 -98 -91 -209
7669 -209 -30 118 -192 6 -115 190 117 -57 90 -3 -1 -72 21 107 -87 -32 -68 -118 77 -26 -131 59 -52
7692 -52 -8 -109 -75 -17 -244 -3 -443 -97 75 119 17 53 -56 -28 -38 -291 -256 148 -94 -27 161 131 187 280
7716 280 -40 -138 -214 37 -48 171 89 -200 217 317 60 372 35 2 -154 8 57 -21 98 138 16 -33 -217
7739 -217 -139 4 -69 13 149 126 -182 88 130 -285 -161 70 39 -17 111 130 374 196 179 19 60 53 16 -40 -31
7764 -31 -92 -153 -284 261 137 -185 129 135 15 34 97 -133 -38 -2 -203 -62 -53 -94 -66 9 -22 253 -77 -113 -118 -32
7790 -32 -230 65 113 140 -143 120 119 -45 105 -183 201 88 84 -231 25 -107 113 65 -59 71 -281 88 14
7813 14 -316 148 208 -54 97 -40 88 136 14 -113 400 -16 -229 13 -29 278 437 -43 116 -39 104
7834 104 12 -109 -88 -168 133 146 -52 71 100 185 -112 -80 91 -30 -17 84 -226 -55 38 54 180 -233 -121
7857 -121 2 -42 103 -55 109 29 97 -32 -34 -70 -12 333 166 -120 -67 -152 -262 -166 -245 99 18 -33 -40 241 16
7882 16 46 -104 211 66 2 77 -118 -24 41 -83 -54 51 -14 161 -210 -80 122 -140 -230 320 108 -59 53
7905 53 121 123 84 231 -188 5 -336 68 -78 -60 -213 153 139 -223 -177 54 -244 -108 -92 188 -57 58 83
7928 83 -167 -175 -264 9 -84 78 138 34 -126 226 168 39 -207 -136 -46 83 -11 -24 -131 -16 237 137 62 153
7952 153 -116 -5 -22 -33 -316 -75 367 -2 -199 27 -170 -170 160 70 32 -258 -158 75 60 96 -108 137 107
7975 107 -179 126 135 -36 -240 -285 -151 -343 94 -27 -26 -242 -135 44 13 -14 -2 181 -247 67 23 -58 -100 19
7999 19 84 19 -45 -19 69 32 97 -236 232 227 -135 64 -38 -135 81 59 127 9 -92 -139 -135 221 53 131 211 -173
8025 -173 27 -172 34 -177 212 21 -27 12 -216 -215 -81 -308 96 197 -8 18 108 207 -169 -166 252 34 -120
8048 -120 5 91 169 -113 -72 83 8 -92 -76 106 -108 -159 -22 -57 -39 -230 35 192 -56 23 157 83 13 -125
8072 -125 169 -356 -76 -71 -57 -26 -78 -111 339 -243 47 92 -181 -41 216 135 -198 203 27 -279 -84 140 162
8095 162 -225 -8 -17 21 -166 -132 -121 -99 -93 -66 71 -29 154 -121 52 89 229 -126 -140 66 -175 36 -134 319
8119 319 13 -122 -130 -11 -75 164 -92 126 74 7 106 -33 107 176 132 44 -130 -196 157 49 -194 -219 177 -142
8143 -142 -56 -13 158 -34 157 -167 -111 -138 19 -97 -52 119 -48 -40 -137 -115 -271 -147 43 141 209 60 96 67
8167 67 -383 -80 -1 -172 -76 -17 94 -195 -65 130 -6 193 63 362 40 201 -184 -301 74 -41 -13 33
8189 33 -97 7
8191G
##END NTUPLES=NMR FID
##END=
