##TITLE=1H_26-2024
 CDCl3
 8 sc, 
 2.4.2024
##JCAMPDX= 6.0         $$ Bruker NMR JCAMP-DX V2.0
##DATA TYPE= NMR FID
##DATA CLASS= NTUPLES
##ORIGIN= UXNMR, Bruker Analytische Messtechnik GmbH
##OWNER= root
$$ XWIN-NMR		Version 3.5
$$ Tue Apr  2 14:35:45 2024 Russian Standard Time (UT+4h)  she@DPX200
##.OBSERVE FREQUENCY= 200.131
##.OBSERVE NUCLEUS= ^1H
##.DELAY= (6, 6)
##.ACQUISITION MODE= SIMULTANEOUS
##.ACQUISITION SCHEME= undefined
##.AVERAGES= 8
##.DIGITISER RES= 18
##SPECTROMETER/DATA SYSTEM= spect
##.PULSE SEQUENCE= zg30
##.SOLVENT NAME= MeOD
##.SHIFT REFERENCE= (INTERNAL, MeOD, 0, 15.7039)
##AUDIT TRAIL= $$ (NUMBER, WHEN, WHO, WHERE, WHAT)
$$ ##TITLE= Audit trail, XWIN-NMR		Version 3.5
$$ ##JCAMPDX= 5.01
$$ ##ORIGIN= Bruker BioSpin GmbH
$$ ##OWNER= she
$$ F:/spectra/data/she/nmr/H-F/1/audita.txt
$$ ##AUDIT TRAIL=  $$ (NUMBER, WHEN, WHO, WHERE, WHAT)
(   1,<2024-04-02 14:33:26.04 +0400>,<she>,<DPX200>,
      <created by zg, POWCHK disabled, PULCHK disabled
       configuration hash MD5:
       00 E9 B6 7A A2 85 ED C7 34 08 36 98 17 FE 4E 26
       data hash MD5: 16K
       8D B3 1B 77 35 F4 19 87 94 5E EF 7F 5C 48 83 35>)
$$ ##END=
$$ 
$$ hash MD5
$$ CE FD 9A EA 37 18 60 02 01 28 21 74 82 D2 DA EF
##$RELAX= 
##$RELAX= 
##$RELAX= 
##$RELAX= 
##$RELAX= 
##$RELAX= 
$$ Bruker specific parameters
$$ --------------------------
##$DU= <F:/spectra>
##$EXPNO= 1
##$NAME= <H-F>
##$PROCNO= 1
##$TYPE= <nmr>
##$USER= <she>
##$AMP= (0..31)
100 100 100 100 100 100 100 100 100 100 100 100 100 100 100 100 100 100 
100 100 100 100 100 100 100 100 100 100 100 100 100 100 
##$AQSEQ= 0
##$AQ_mod= 1
##$AUNM= <au_zg>
##$AUTOPOS= <>
##$BF1= 200.13
##$BF2= 200.13
##$BF3= 200.13
##$BF4= 200.13
##$BF5= 200.13
##$BF6= 200.13
##$BF7= 200.13
##$BF8= 200.13
##$BYTORDA= 1
##$CFDGTYP= 0
##$CFRGTYP= 5
##$CHEMSTR= <none>
##$CNST= (0..31)
1 1 145 1 1 1 1 1 1 1 1 1 1 1 1 1 1 1 1 1 1 1 1 1 1 1 1 1 1 1 1 1 
##$CPDPRG= <>
##$CPDPRG1= <>
##$CPDPRG2= <>
##$CPDPRG3= <>
##$CPDPRG4= <mlev>
##$CPDPRG5= <mlev>
##$CPDPRG6= <mlev>
##$CPDPRG7= <mlev>
##$CPDPRG8= <mlev>
##$CPDPRGB= <>
##$CPDPRGT= <>
##$D= (0..31)
0 1.2 0 0 0 0 0 0 0 0.06 0 0.03 0 0 0 0 0.0002 0 0 0 0 0 0 0 0 0 0 0 0 
0 0 0 
##$DATE= 1712054005
##$DBL= (0..7)
120 120 120 120 120 120 120 120 
##$DBP= (0..7)
150 150 150 150 150 150 150 150 
##$DBP07= 0
##$DBPNAM0= <>
##$DBPNAM1= <>
##$DBPNAM2= <>
##$DBPNAM3= <>
##$DBPNAM4= <>
##$DBPNAM5= <>
##$DBPNAM6= <>
##$DBPNAM7= <>
##$DBPOAL= (0..7)
0.5 0.5 0.5 0.5 0.5 0.5 0.5 0.5 
##$DBPOFFS= (0..7)
0 0 0 0 0 0 0 0 
##$DE= 6
##$DECBNUC= <off>
##$DECIM= 32
##$DECNUC= <off>
##$DECSTAT= 4
##$DIGMOD= 1
##$DIGTYP= 9
##$DL= (0..7)
0 120 120 120 120 120 120 120 
##$DP= (0..7)
150 150 150 150 150 150 150 150 
##$DP07= 0
##$DPNAME0= <>
##$DPNAME1= <>
##$DPNAME2= <>
##$DPNAME3= <>
##$DPNAME4= <>
##$DPNAME5= <>
##$DPNAME6= <>
##$DPNAME7= <>
##$DPOAL= (0..7)
0.5 0.5 0.5 0.5 0.5 0.5 0.5 0.5 
##$DPOFFS= (0..7)
0 0 0 0 0 0 0 0 
##$DQDMODE= 0
##$DR= 18
##$DS= 0
##$DSLIST= <SSSSSSSSSSSSSSS>
##$DSPFIRM= 0
$$ [...]
##$SUBNAM2= <"">
##$SUBNAM3= <"">
##$SUBNAM4= <"">
##$SUBNAM5= <"">
##$SUBNAM6= <"">
##$SUBNAM7= <"">
##$SUBNAM8= <"">
##$SUBNAM9= <"">
##$SW= 18.0517599122864
##$SWIBOX= (0..15)
0 0 2 0 0 0 0 0 0 0 0 0 0 0 0 0 
##$SW_h= 3612.71676300578
##$TD= 16384
##$TD0= 1
##$TE= 0
##$TE2= 300
##$TE3= 300
##$TEG= 300
##$TL= (0..7)
0 120 120 120 120 120 120 120 
##$TP= (0..7)
150 150 150 150 150 150 150 150 
##$TP07= 0
##$TPNAME0= <>
##$TPNAME1= <>
##$TPNAME2= <>
##$TPNAME3= <>
##$TPNAME4= <>
##$TPNAME5= <>
##$TPNAME6= <>
##$TPNAME7= <>
##$TPOAL= (0..7)
0.5 0.5 0.5 0.5 0.5 0.5 0.5 0.5 
##$TPOFFS= (0..7)
0 0 0 0 0 0 0 0 
##$TUNHIN= 0
##$TUNHOUT= 0
##$TUNXOUT= 0
##$USERA1= <user>
##$USERA2= <user>
##$USERA3= <user>
##$USERA4= <user>
##$USERA5= <user>
##$V9= 5
##$VALIST= <valist>
##$VCLIST= <CCCCCCCCCCCCCCC>
##$VD= 0
##$VDLIST= <DDDDDDDDDDDDDDD>
##$VPLIST= <PPPPPPPPPPPPPPP>
##$VTLIST= <TTTTTTTTTTTTTTT>
##$WBST= 1024
##$WBSW= 4
##$XGAIN= (0..3)
0 0 0 0 
##$XL= 0
##$YL= 0
##$YMAX_a= 73776
##$YMIN_a= -41210
##$ZGOPTNS= <>
##$ZL1= 120
##$ZL2= 120
##$ZL3= 120
##$ZL4= 120
##$ABSF1= 10
##$ABSF2= 0
##$ABSG= 5
##$ABSL= 3
##$ALPHA= 0
##$AQORDER= 0
##$ASSFAC= 0
##$ASSFACI= 0
##$ASSFACX= 0
##$ASSWID= 0
##$AUNMP= <proc_1d>
##$AZFE= 0.1
##$AZFW= 0.1
##$BCFW= 1
##$BC_mod= 2
##$BYTORDP= 1
##$COROFFS= 0
##$CY= 11.3945322036743
##$DATMOD= 1
##$DC= 2
##$DFILT= <>
##$DTYPP= 0
##$F1P= 15.7292609196834
##$F2P= 12.9074282941183
##$FCOR= 0.5
##$FTSIZE= 0
##$FT_mod= 4
##$GAMMA= 1
##$GB= 0.15
##$INTBC= 1
##$INTSCL= 1
##$ISEN= 128
##$LB= 0.24
##$LEV0= 0
##$LPBIN= 0
##$MAXI= 10000
##$MC2= 0
##$MEAN= 0
##$ME_mod= 0
##$MI= 1.114404
##$NCOEF= 0
##$NC_proc= 0
##$NLEV= 6
##$NOISF1= 3.799351
##$NOISF2= 2.8
##$NSP= 1
##$NTH_PI= 0
##$NZP= 0
##$OFFSET= 15.70392
##$PC= 1
##$PHC0= -25454.77
##$PHC1= 9.387311
##$PH_mod= 1
##$PKNL= yes
##$PPARMOD= 0
##$PSCAL= 0
##$PSIGN= 0
##$REVERSE= no
##$SF= 200.130013532006
##$SI= 16384
##$SIGF1= 3
##$SIGF2= 2
##$SINO= 400
##$SIOLD= 16384
##$SREGLST= <1H.CDCl3>
##$SSB= 0
##$STSI= 0
##$STSR= 0
##$SW_p= 3612.71676300578
##$SYMM= 0
##$S_DEV= 0
##$TDeff= 0
##$TDoff= 0
##$TI= <>
##$TILT= no
##$TM1= 0
##$TM2= 0
##$TOPLEV= 0
##$USERP1= <user>
##$USERP2= <user>
##$USERP3= <user>
##$USERP4= <user>
##$USERP5= <user>
##$WDW= 1
##$XDIM= 8192
##$YMAX_p= 0
##$YMIN_p= 0
$$ End of Bruker specific parameters
$$ ---------------------------------
##NTUPLES= NMR FID
##VAR_NAME=  TIME,          FID/REAL,        FID/IMAG
##SYMBOL=    X,             R,               I
##VAR_TYPE=  INDEPENDENT,   DEPENDENT,       DEPENDENT
##VAR_FORM=  AFFN,          ASDF,            ASDF
##VAR_DIM=   8192,          8192,            8192
##UNITS=     SECONDS,       ARBITRARY UNITS, ARBITRARY UNITS
##FACTOR=    0.0002768,     1,               1
##FIRST=     0,             0,               0
##LAST=      2.2672688,     0,               0
##MIN=       0,             -41210,          0
##MAX=       2.2672688,     73776,           0
$$ Real data points
##PAGE= N=1
##DATA TABLE= (X++(R..R)), XYDATA
$$ [...]
822E93K94r06J002j540J421j489N39J45j436J754j634J038m94J89L46o87J484
839F19j652J694q26Q1R36j517J799j516Q98m01k56O33j237J511j498J046n21j4
857b21Q99j550K050j609P39L98j052J186j220R82r91P76o27j22J161k254K405
874I50j354K8J043j248J211r86Q69o83M33l07l84J138k234K130j273k91J353j734
892a339J620j139O96K70k67M16R0Q76j675K309j383k24J587k418J961j375k50
909b45Q44j230Q0J24M39j757K139r56o72K103k166K120j126M8J346j520Q36k15
927A92L37j179J268o12p06J399j925K089j550l6J911k304J306K03j74n74J169
944H14n25p28J674k219J996j129q17K388k412Q74M45l20m90Q94K6r45J518j737
$$ plain form
822 593 887 -19 983 -557 864 -625 -86 59 -1377 377 -1257 -219 -713 -524 -178 -865 619
839 619 -1033 661 -165 -84 852 -665 1134 -382 516 115 -141 492 -745 766 -732 314 -207 -221
857 -221 678 -872 1178 -431 308 706 -346 840 -380 602 -389 387 -240 -362 799 -1455 950
874 950 -404 -376 667 -581 630 -356 513 -170 263 -44 -428 710 -1524 606 -667 -958 395 -1339
892 -1339 281 -858 -162 108 -159 257 347 1223 -452 1857 474 250 1837 -581 1380 5 -245
909 -245 599 -631 -551 -427 12 -1745 394 -562 -1234 869 -1297 823 -303 -255 1091 -429 407 192
927 192 529 -650 618 6 -700 699 -1226 863 -687 -723 1188 -1116 190 393 219 -355 814
944 814 289 -439 1235 -984 1012 -117 -934 1454 -958 -84 361 41 -449 445 471 -474 1044 -693
962f93J862j133j010K644k903R70M46r45J16Q6M8l81Q96j379K216j324o44L404
980B276l503J857P58j617J337o72N3K25j57j246K040j811r84L299l654J563P60
997E24j741J697j155Q10J62m86r1J349j361l91K466l084J720q0j388K100k358
1014a307J373L97j514Q41Q75j382K8K287k934J752L25j678K374k412J319N35j713
1031h34J047M22r27k85J854k126J162K32j166K163k620J695L18k028J830n25o20
1048d08R2Q02j409P96k17p42K098k894K084L79k299K531q11k77M45L93o74O52
1066E41j70p63J981k563J422O01k303K023r37O9j09K23J03l32L54m87J299j778
1084h26J244L74j884K140j292K90J13m81N30m60J17m35J358j997J093Q44k347
$$ plain form
962 -693 1169 36 -974 1670 -1233 -263 183 -762 -646 -560 -512 -893 3 -1376 840 -484 -1128 2276
980 2276 -1227 630 1388 -229 1108 436 489 714 557 -689 1351 -460 -1444 1855 -1799 -236 524
997 524 -1217 480 -675 135 297 -189 -280 1069 -292 -683 1783 -1301 419 339 -1049 1051 -1307
1014 -1307 66 463 -1051 -210 665 -717 -689 1598 -1336 416 741 -937 1437 -975 344 879 -834
1031 -834 213 635 -292 -577 1277 -849 313 545 -621 1542 -1078 617 935 -1093 737 212 -408
1048 -408 -316 486 -923 -127 -344 -1086 1012 -1882 202 581 -1718 813 2 -275 170 563 -111 541
1066 541 371 -392 1589 -974 448 1049 -1254 769 -168 -99 -208 15 118 -214 140 -347 952 -826
1084 -826 418 792 -1092 1048 -244 46 159 -322 208 -252 -135 -570 788 -1209 -116 728 -1619
1101a619K437j160q3O87p20Q07k96l4k16J140j531P43Q75k214K432j403P7Q00
1119G22j396J478p92j52K82K71q80P62K58j654K093j672P23O25j937K163j226
1136c32l7O45n83m0L61K84j188J445j306P32N91j763K053j322N27M88q97N99l96
1155a39O36p48O72o19K87N92j300J411j222N43L94p89P51r05J010n89K01j78k81
1174b73P93j218J337j248K54O10r66Q66r45P19l72L98j9n31J193j184J257n47
1192A24k68P66p02Q48r89N45k99lL90r32P92r30R64n22k29P67r74J391q91K30
1212G8K41l18O90p34O71r40Q10k25o44Q53j322J049n73n1J67m67Q59q72R50p28
1232e06L92M29p32J022r98Q34m26J05K70q28J061r53P22l02k41N24n67Q94j065
$$ plain form
1101 -1619 818 -342 -425 262 -458 349 53 19 -197 943 -588 155 1030 -1184 1248 -155 -78 722
1119 722 -674 804 12 -140 142 413 -467 295 553 -1101 992 -680 43 668 -1269 894 -332
1136 -332 -369 276 -307 -347 14 298 -890 555 -751 -19 572 -1191 862 -460 67 555 -342 257 -139
1155 -139 497 -251 421 -198 89 681 -619 792 -430 113 507 -282 469 -436 574 -15 186 8 -273
1174 -273 520 -698 639 -609 -355 255 -711 155 -790 -71 -443 -45 -64 -595 598 -586 671 124
1192 124 -144 622 -80 768 -221 324 25 22 412 -520 272 -658 306 -216 -445 322 -652 739 -152 78
1212 78 319 1 691 -43 628 -312 498 273 -371 482 -840 209 -364 -415 -248 -715 144 -728 222 -506
1232 -506 -114 315 -417 605 -393 441 15 120 390 -438 623 -330 392 90 -151 373 -194 700 -365
1251c65R16l58k16P62j158R25n98K11k26k66M06q45J057r83M61O1l30Q38p94Q71
1271C69n52N48P7n86R32r75Q06n68Q3j0n20P12j117R79p40Q9O46q90J029p01O67
1292B78j83K80K03o17J070j107P66l88l44N13q08O41q81N34k92k05O54r54R94
1311A54p08N19k6k78P31q43R13o71L69O1m54N41p13P60p26N01L2n87J109j008
1331c24P83k44j11M10n04N20o62O26p58K81J44r07J085j167O63j17k34O08o06
1350e14P25m37M84k31K00K49p05J056j063O27k13n57P66j067O04k87j0k9Q5K90
1370b7o63J206r06O00K90o52J133r97N57J0l17K1m1J73q75Q88q24K51K76r35J334
1391E02j210N76K82n71M91j32J47m56P94p80M01J57r84J461j305M64N36r74Q43
$$ plain form
1251 -365 551 193 -23 739 -419 506 -92 119 -107 -373 33 -812 245 -738 -277 -216 -546 292 -502 369
1271 369 -183 365 442 -144 788 -187 619 51 134 124 -396 316 -801 178 -562 -473 173 -717 312 -389 278
1292 278 95 375 578 -39 1031 -76 690 302 -42 471 -337 304 -577 -43 -335 -540 114 -840 154
1311 154 -554 -35 -61 -339 392 -451 462 -209 160 221 -233 308 -405 355 -371 130 162 -425 684 -324
1331 -324 459 215 104 514 10 530 -132 494 -264 17 161 -746 339 -828 -165 -282 -516 92 -514
1350 -514 211 -226 258 27 227 476 -229 827 -236 391 178 -379 387 -680 -76 -363 -373 -402 -317 -27
1370 -27 -690 516 -390 210 500 -152 981 -16 541 551 234 255 214 387 -488 400 -424 -173 103 -832 502
1391 502 -708 -132 150 -421 70 -62 85 -371 423 -357 44 201 -783 678 -627 -163 373 -601 242
1410B42k78R7r1M57m48M15J01q90J397j437M36P14j361R36m93R3q5M1K1L6J16
1431A9n35J226j184M94O31j197J181p33J87J69m81K32l4j30n55J147j140K85R42
1450E24j506J324n75J00M49m84M43M1j20l67J099j162K25R43j604J302p61q7P79
1469E63j093P00j0m74O7P31j018M54O39j401J476r31P6Q44j540J270l12n87N45
1488aJ95n86L32L63r33J186j020M09P95j566J447m58m03O05k33j29J1L14o12O53
1508C69o66K96O07j371J309m86l80O46l87O9j15K95m68O39n98O6P93j564J275
1527C29k86o92R41n31J60q0J18k33N50n74J81Q03j472J395m36o23J164r93N06
1546B27J8l07K54N9n36K95N59j395J380n82m34J045j129Q54l04l04O28l68r6K14
$$ plain form
1410 242 -36 61 -30 427 -21 394 495 -395 1002 -435 1 715 -646 290 -203 -110 -195 -154 -133 -97 19
1431 19 -516 710 -474 20 651 -546 635 -98 89 258 -223 9 -25 -155 -710 437 -703 -418 524
1450 524 -982 342 -233 -133 316 -168 275 316 196 -171 928 -234 -9 934 -670 632 -129 -216 563
1469 563 -530 170 160 -314 -247 484 -534 -80 559 -842 634 -297 -221 623 -917 353 41 -546 -1
1488 -1 194 -392 -60 303 -630 556 -464 -55 740 -826 621 163 -240 365 132 3 14 328 -284 369
1508 369 -297 -1 606 -765 544 58 -322 324 -63 6 -109 186 -282 357 -241 -175 618 -946 329
1527 329 43 -649 292 -239 -79 -159 -41 -274 276 -298 -117 686 -786 609 173 -450 714 -279 227
1546 227 245 -62 192 251 -285 10 569 -826 554 -28 -462 583 -546 308 4 -300 328 -40 -136 78
1566G8J94p62R09m43l77Q44j093Q66m52j20N87n72K53q6L53m80N33n4l92P79q20
1587b55P79l00l26O99o84K91j56J62m77M45p8n53R02r92P28k9o45Q87o41K37Q7
1608H1n4j70K69k2m52P12r12O81j60o12J032q23M71j9k15K67r6J75j27L56o25
1629b43N67j37m60Q59r83O38j61k56M17n57M64k23K23j95J92Q9l32O44p95M75
1649B26m4l24L93n86M58m63K78k39r0L06m95O80m67K71R1j67M59l99M63k74K12
1670B89q9j52L11n37O16n43J60R2n12O07o04L44j19M5K14k20L27m37N64l54M9
1691E1K15n83P06o33K96r5k42L87m53M64m41L21j09O3K49m54N76m33L16n9l01
1712a59M54n57M64m09J44N5k39N01n67M99k77K22R9l34N82n30N29l60M8J16m68
$$ plain form
1566 78 272 -490 419 -24 -401 443 -650 216 -236 -356 231 -341 -88 -174 179 -301 232 178 -214 565 -255
1587 -255 524 224 -102 597 -87 204 48 210 -267 178 100 -453 449 -543 185 156 -489 398 -243 -6 81
1608 81 27 -143 126 104 -348 364 -548 133 -27 -639 393 -430 41 22 -193 74 -22 153 26 382 -243
1629 -243 324 187 -273 586 -397 241 80 -176 241 -316 148 -75 148 -47 145 234 -98 546 -249 226
1649 226 182 -142 251 -335 123 -340 -62 -301 -391 -85 -580 100 -367 -96 -5 -172 287 -112 351 77 289
1670 289 200 48 359 -178 438 -105 55 147 -365 242 -362 -18 -137 -92 122 -98 229 -208 356 2 51
1691 51 266 -317 389 -244 52 -43 -285 102 -351 113 -328 -7 -116 -53 196 -258 318 -115 201 142 -159
1712 -159 295 -262 202 -207 -63 -8 -247 254 -313 186 -91 131 230 -104 478 -52 477 117 165 281 -187
1733a87M47n45L71m35N0K42m37M89m91M00q2n3L16k90N69m94M19j81QL04o25N41
1755C36m91K45l9j92K50l90M39l88K56m3j16L95l88N06m14J72R5l16L91n09L73
1776A72k99L9R7l58M81n24M56k56K4L57m29M84m26L47j93k9J90l29M18n85M30
1797F7j91j62M26n17N59l89K35M7p5K87l18M61m14L78j91j87L85o12N05m16j5
1818a37J83l58K74k46J65k49L90r6j88O32o59N92l03m2L87n81M54l08K13k70J36
1839a1M4k87M65o36O03k70j11N39n58N09k70O0P0nJ01l11M12o21N72k87k84O28
1861C52p30M84j51m1Q2m1J30k12L20n06M69k8m25O87q32M74m0k81L25l37K62j24
1883a63K72l24M16j11k86P38q37O13l6m61O16m63J89j00j3j65K21j71k58O57p72
$$ plain form
1733 -187 260 -285 86 -349 -299 -57 -494 -5 -496 -96 -178 -231 85 -205 364 -130 289 108 116 420 -205 336
1755 336 -155 90 51 -141 109 -281 158 -230 26 -17 -133 262 -126 380 -34 138 233 -83 308 -201 172
1776 172 -127 -88 9 -349 132 -392 64 -192 -168 189 -240 244 -182 165 -28 -57 133 -196 222 -363 67
1797 67 -124 -286 140 -377 182 -207 28 75 0 287 -31 430 16 394 203 16 401 -211 294 -122 -137
1818 -137 46 -312 -38 -284 -119 -368 22 -74 -262 370 -289 303 0 -42 345 -236 218 -90 123 -147 -11
1839 -11 33 -254 211 -425 178 -92 -203 336 -222 287 17 77 147 142 243 -68 344 -277 295 8 -276 352
1861 352 -378 106 -45 -86 -4 -45 85 -127 193 -313 156 128 -297 390 -442 32 -8 -289 36 -301 -39 -163
1883 -163 109 -215 201 90 -196 542 -295 318 282 -179 437 -26 163 63 50 -115 106 -65 -323 334 -438
1904d38N00L9m63P06n99L13m6q0J06P7q5k37N81p57M86o2n15Q05o95K91J10k29
1926a92K74o0n0j08M73n37L69K7m53P56p59L68O9m08M09j82K8n6L45n74K73J79
1948A91n45Q22p75K77K64n88N78k69p4O5J19k96K41J6l55O92p62M72J71p07Q36
1969C73n12J29J61j04l7J46k2k52M99o98M82J25p12Q39m96L7J94k57J62m3P1k59
1991a74M52n66L02K10o18P61n62O5K03l20K63q4K8j56L07l44K50K27o80Q36n76
2012a76J5L91m29M37k42k6Q3K25l66K14J73p16R14o45J23L85p33O68l76L4J56
2033A09p9j28P5J48m11N89n69K03L05o87P93n68N3L34l57J79k7J1k22M60m28J50
2055f7L06o04P11l98J1K86l49L12k75K59k47K78k15q4L26n58N77l43l5L25m22
$$ plain form
1904 -438 62 101 -362 344 -255 58 12 -68 38 115 30 -207 374 -383 103 41 -474 331 -364 -73 37 -192
1926 -192 82 22 -28 -136 337 -200 169 196 -257 499 -260 108 177 -231 178 -4 24 -32 313 -261 12 191
1948 191 -354 468 -307 -30 234 -354 224 -45 -119 -54 65 -231 10 26 -329 363 -399 73 244 -463 373
1969 373 -139 -10 151 47 10 156 134 -118 381 -317 165 290 -422 417 -79 -42 152 -105 57 14 85 -174
1991 -174 278 -288 14 224 -394 367 -195 -130 73 -247 16 -68 -40 -196 111 -233 17 244 -436 400 -176
2012 -176 -161 230 -199 238 -4 -30 53 278 -88 126 299 -417 497 -148 -25 360 -373 295 -81 -47 109
2033 109 30 -98 -23 125 -286 303 -266 -63 242 -445 348 -220 -167 167 -190 -11 -38 -27 -249 211 -217 -67
2055 -67 239 -365 346 -52 -41 245 -104 208 -67 192 -55 223 8 -76 250 -308 269 -74 -109 216 -206
2076b06L37k65J77o4P7n4j63L82n89N70k94p7K38m28M62k54J15J0J2M0j17L32
2098B41m90N47k38j46M48n77M34k34M2J04j33Q0j82K65m10L87j51j27L78m43M02
2119A97k54Q7J04l05L39k87K21k35J46nk36M04m69L64k39k7K47l20L19j72K36
2140A15k30J17J86l06N09n24K48Kj50K45l71L09k24R2Mq6J55k65L73l30J83M0
2162I2j86M10m69L07j93j8J00j63J51k71K90k94J92L2j29L75m03L36j65k8J99
2183A65k92L88m66L08o0p1J64l63M48l44K37k03J5K30l48L80k50J08N4j20K27
2204B07k69L21l40J46k9j35K10l73L76l40J05L4j37L57l45K95j72J03Q1k03K59
2225A51k77K63j79Q3K4j47K55l24K50j57%J98k89L84k70J99j39k2K03l12K64k38
$$ plain form
2076 -206 131 -134 43 -21 56 2 -161 221 -368 202 -92 -169 69 -359 103 -151 -36 -26 -14 26 -91 241
2098 241 -249 298 60 -86 362 -215 219 -15 27 131 -2 78 -104 161 -249 138 -13 -140 238 -205 197
2119 197 -57 30 134 -171 168 -119 102 -133 13 8 -228 176 -293 71 -168 -195 52 -268 51 -121 115
2140 115 -115 2 188 -118 391 -133 115 117 -33 212 -159 150 -74 18 22 -64 91 -174 199 -131 52 92
2162 92 -94 316 -153 154 -39 -57 43 -120 31 -240 50 -244 -52 -20 -149 226 -177 159 -6 -34 165
2183 165 -127 261 -205 103 43 -28 136 -227 221 -123 114 -89 -74 156 -192 188 -62 46 100 -20 207
2204 207 -62 259 -81 65 36 -99 111 -262 114 -226 -121 -87 -224 133 -212 83 -89 14 95 -108 151
2225 151 -126 137 -42 41 65 -82 173 -151 99 -58 -58 140 -149 235 -35 164 25 3 206 -106 158 -80
2247h0J51j49m4K26l42L82l44J39R9k07K41l05L20j91J15M6j58K80l51L45k52
2268g9J10k6k08M19m75L30j23P0N2j87K75k47L26k27P9J13l14M11l65J68n8q6
2290d2J83k78J93k45L09k53K6J91l33M68l54J11P2j79K49k49K16k23J85q1j0J45
2312A01m11N53l77J42R7l02M06k51J06k9P0j1n4J46l63M38l19M4J77l41L28k62
2334a12J23o1q1J09n7J95l49L76k01PK26m18M22k47M4J00k22J57r2J10k04K38
2356F3k06J18K51n42N21k10J6K19k97J97j00J08r5J22j86k9K79m93M94l25k4K55
2378A36l42L43j90j3N0O4j75M2L04m62L99k57m6M01n63M02j61PJ19p9pk7J71l55
2402b39M82k91o2M68n57M16k22n0K18j94J21p4J28k49K75j61r3L25n45M42j87
$$ plain form
2247 -80 71 -78 -122 104 -238 144 -200 -61 38 -169 72 -233 87 -104 11 57 -101 179 -172 173 -79
2268 -79 31 5 -203 216 -259 71 -52 18 70 -117 158 -89 237 10 89 202 -112 299 -66 102 44 -42
2290 -42 141 -137 56 -189 120 -133 -107 84 -249 219 -135 -24 48 -131 118 -131 85 -138 47 -34 -44 101
2312 101 -310 243 -134 8 105 -197 209 -42 64 35 105 94 40 186 -177 261 -58 -14 163 -178 150 -112
2334 -112 11 -50 -131 -22 -79 116 -233 143 -58 -51 175 -243 179 -68 -24 76 -146 11 -81 29 -175 63
2356 63 -143 -25 226 -316 205 -5 11 230 -67 130 30 138 43 165 -21 -50 229 -264 230 -95 -119 136
2378 136 -206 137 -53 -66 -16 48 -127 -85 219 -243 156 -101 -147 254 -309 93 -68 -61 58 -21 -28 -55 116 -239
2402 -239 243 -48 -110 358 -199 217 -5 -55 163 -31 90 16 144 -105 170 9 -84 241 -304 138 -49
2423d9j69L82l17J66m1K4q5J64o6k08M35n22L92j23j72L98m22K78k7o5J7M8m6
2446hn1L12m72M15j25j78M00m67K53lj55J66l6m4l2J86l94L70j04k64M96n04L12
2469G3o6j08J66j18P1j05J75k18K22r4k39N15n17K81j7j40K43k10Q6j0P8j74K28
2492A22r2j28L71m57L20J3k93M07l96J65j0o1lN8k8l2K48l83K97j09j97L77l52
2515a63K43p2m8N9q6M5q0J85k38K15o3k45M37l30J80M0j20J27r3J13j25J52j79
2538d6J83n4k44L60l33J76Qj41J65j48J19p3P4q3L4J05k47L43k97R3Q4k77K73
2561G4k03J31p1P0n0J5J17k63L26k51R2J57l02L30k10P3j4j1L6l4M9j40K46k23
2585e6O3J14k61L00l06J58mo5J46r4J15j81J76j43N7N8k62L21k56R9N5j24J91
$$ plain form
2423 -49 -218 164 -153 13 -28 -4 -89 75 9 -199 236 -286 106 -17 -189 209 -213 65 38 -27 -10 38 -8
2446 -8 -59 253 -219 196 71 -107 293 -174 79 76 -79 87 51 7 -25 161 -233 137 33 -231 265 -239 73
2469 73 7 -101 65 -53 18 -87 88 -130 92 -2 -241 274 -243 38 21 -119 124 -86 0 -10 68 -106 122
2492 122 30 -98 273 -184 136 149 -144 263 -133 32 22 -39 -42 16 -12 -44 204 -179 118 9 -188 189 -163
2515 -163 80 8 -40 19 -67 -22 -102 83 -155 60 -3 -248 189 -141 39 79 -41 86 -7 106 -19 133 -46
2538 -46 137 83 -161 199 -134 42 50 -91 74 -74 45 -28 46 -37 -3 102 -145 198 -99 -6 78 -199 74
2561 74 -129 2 -69 1 -49 -34 83 -180 146 -105 -13 144 -158 172 -38 35 21 10 46 12 61 -79 167 -56
2585 -56 7 121 -140 160 -146 12 8 -57 89 -5 110 -71 105 -38 19 77 -185 136 -120 -21 34 -90 101
2608A01j57O0k8J09q0m7J54k72L40k05M7O6j59K14k11J09m8NN2j17J34j56J76
2631H7j32J6J68k45K66k11J00rr4J24j54J74k32J85j24n5K00k32K49k01P4R1j36
2654i1K02k17K22j65R4j7l6J06j46J95j30L1K1j45J72j76J54j14J53K9k21K14
2676A35j82J54j29j0R3j09J24j60J05m9Q9o2j24K25k24J38m4j5J38k26K60j99
2698g2R6k8m4R6j34K46k59J84o0r2J66k01K22j69R5qq8J95j88J69j92J01K6j18
2722e7J82j85J23o4%K4j12J29j52J53q4j4M0j04K13k11J69o3k3J21j68J93j66
2745e6J54r1o2J69j80J70j68J41m4p6J77k39K74k30J00M3j25J27j57J91j64O0
2767A4J4r6K18k51J64j69P1N7j21Q4p7J12n6J1N3j03J88k46K12l2j14J77k09J47
$$ plain form
2608 101 -56 4 -24 85 5 -42 112 -160 180 -25 22 88 -71 143 -68 41 -7 -2 50 -67 67 -89 87
2631 87 -45 -29 139 -106 160 -51 49 40 -54 70 -84 90 -142 43 -81 -136 64 -168 81 -120 -46 45 -91
2654 -91 111 -106 116 -49 45 28 -8 98 -48 147 17 48 69 -76 96 -80 74 -40 113 142 -79 135
2676 135 -47 107 -22 -32 61 -48 76 -84 21 -28 61 -1 -125 100 -124 14 -30 -45 93 -133 127 -72
2698 -72 24 -4 -48 48 -86 160 -99 85 25 -67 99 -102 120 -49 46 38 -50 145 -43 126 -66 35 61 -57
2722 -57 125 -60 63 -1 -1 23 -89 40 -112 41 -43 -57 -17 -121 92 -119 50 -13 -36 85 -83 110 -56
2745 -56 98 7 -55 114 -66 104 -64 77 33 -43 134 -105 169 -61 39 82 -43 84 -73 118 -46 14
2767 14 28 -68 150 -101 63 -106 -35 22 -99 -15 -92 20 -36 -25 28 -75 113 -133 79 47 -67 110 -99 48
2791D8j07J06o6L4nq9K48k22O1O7j34J78j56J57r0rJ4j7M5j13J88k94K28n4j50
2816a32J72j85J64o1J0L2J0K3j06J35j43J65Lk17K62k39J28M8j30J11k6K2q9J43
2840A00j18R4M4k46K90k35R2L5j47K44k07J41p6J4j26J53j2j46J97k31J50O8k03
2863a25K19j27O7l0k5jN8K9r2J80k59J37K0j97K85j63R7lj13J08n3K7o3J88j97
2888c3J19O7k40K15k04Q7J01j66J12p8L1j22J30j48J41M4k57L54l05J06Q2j82
2910a46K87j58N4j07R0p5R5ok24L92l28J03J71j83K12j79K1N1j1LJ1jj68K08j95
2935h3R3Q9k82K58j60M4Q9j05N1k4Q0j32J77j27R5M8k98K84j85P6O6j28N7k7M5
2960Ar3J98j30K7J32k73K91j76M8J06j74J32j15L0j1L2l3l1J09k05J81j06l2K00
$$ plain form
2791 48 -59 47 -19 15 10 -79 169 -53 8 75 -59 119 -37 120 30 21 35 18 63 -50 138 -156 72 18 -132
2816 -132 40 -145 19 -42 -32 0 10 33 -73 62 -81 84 87 -130 132 -107 21 69 -61 50 24 46 -43 100
2840 100 -18 76 120 -126 164 -71 21 56 -91 153 -54 87 11 25 -101 52 40 -106 91 -140 10 78 -125
2863 -125 94 -33 34 4 -21 -22 36 65 -27 153 -106 31 51 -146 139 -24 73 70 -43 65 12 39 -24 164 -33
2888 -33 86 153 -87 128 -76 11 112 -54 58 -20 11 -111 19 -129 12 56 -201 153 -152 -46 36 -146
2910 -146 141 -17 37 -70 20 -55 40 34 -190 202 -126 -23 148 -35 177 -2 19 70 59 62 73 72 -96 112 -83
2935 -83 10 99 -183 75 -85 -41 48 -57 -6 -30 50 -82 95 -32 63 111 -187 97 -88 -12 54 -74 -17 -44 1
2960 1 -92 106 -24 3 135 -138 153 -23 25 131 -43 89 -26 4 -7 25 -8 -39 70 -135 46 -60 -92 108
2984A08j84J54j05L5j6%M9q8J39j63J35j43jJ49k74J98l2k3Q2k7L4l6P0p8P4j05
3010d8L4J96k89J94n7OJ6p4N0q3Q8r6J18m9j05K13k19J73j04j1J21j90J74p2K1
3035Gl5O6m1o8J59k08J73o3r1K16k23J85j44O7N0ml8p1J25j25J65q7o1J55j94
3060h5J73n8n6M6o8J04j23J46j32J6Q1j89K55j96J16q7JJ13j41J25j35M9k4N2
3084a7L7j08J20q3P7Pj2L2j38J65q2M2m0J1P1j57K44k17J05l0o6J08j13R0r4Q7
3110C9o1KO3j51J75j14O4m0m6J64j85J21n1l3K8j6N6m2J01p2L7k2j02K26j93J18
3136F6p3l3O2r9J71j30J43j11k1J53k00J96j74J36o2j04J93q9L0r8N1lo4Q3j01
3161g8J31r3R3l0j60J84j04J37j28qM7k7J53j38Q7p9Q1Mr9J09j14J09l0n1N3q4
$$ plain form
2984 108 -76 78 -27 8 -8 -8 41 -47 92 -71 64 -79 -80 69 -205 -7 -39 -62 20 -7 27 -9 61 -17 57 -48
3010 -48 -14 182 -107 87 30 36 52 -22 28 -55 33 -63 55 6 -99 114 -105 68 -36 -47 74 -116 58 -14 7
3035 7 -28 38 -3 -71 88 -120 53 -10 -101 115 -108 77 -67 0 50 46 8 -63 62 -63 102 15 -46 109 -85
3060 -85 88 30 -26 20 -48 56 -67 79 -53 -37 44 -145 110 -86 30 -57 -56 57 -84 41 -94 -45 -69 -17
3084 -17 20 -88 32 -51 26 33 21 53 -85 80 -2 40 0 11 82 -75 169 -48 57 27 -39 69 -44 46 -48 39
3110 39 -22 -20 43 -108 67 -47 17 -23 -69 95 -90 31 -20 -53 -25 -41 15 -27 74 2 39 17 -85 141 -52 66
3136 66 -7 -40 22 -77 94 -36 107 -4 -25 128 -72 124 -50 86 24 -80 113 24 54 -44 7 4 -60 23 -78
3161 -78 53 -40 53 23 -137 47 -57 80 -48 -56 -9 -36 117 -21 66 -13 68 72 -27 82 -32 77 47 -4 49 -35
3187c5J41j30J22j19O2K7j44J34j58J24j2l1J3p2J42j64J31l2o1J29j88J43r2
3210g0P9%l2L4o7R6q8N8J9m0J29j72J45j31L8N8m1P6j49J18j3nl8NO0j82J85o8
3238Dj9P4j73J81j25N1J8m0P6q4M4p2J16o1RM0q1J05j16L9Lk3J08j22R4j07J33
3265G2l0p8R7j22J62p6nM5j33J07m7J51j19j1j7k4P5j23J20n6pJ12j89R1o0N7
3291hLj1m5J5Q6j13J01o9l7J20j14J57r8kQ4p6K5k4P9n6O6m1m5N7j09R0k8j0P4
3320G1j18J28r8LnJ6ln8J21j54J50j10qJ99k11N3n2J17p6P8m4k4J35j95J67j30
3346d8K9N2r9J25p3MK1k1j6j3J12q9M3j4o2J91k25J66j7r9KL3j7k3Q0j28O6j1
3374c1m8J75j94J26o1M0M3j16N1K2L5m2L9k4o8J27j62J56p2N0k2k4L5l9M4k3Q
$$ plain form
3187 -35 106 -24 98 -21 41 68 -76 58 -100 24 12 -19 -6 -78 64 -100 31 -1 -62 67 -121 22 -70
3210 -70 9 9 -23 11 -56 40 -48 10 29 -11 118 -54 91 -40 -2 56 15 91 -58 60 47 42 4 9 69 -113 72 4
3238 4 -15 59 -114 67 -58 -7 11 -29 47 -37 7 -65 51 -10 -1 39 -42 63 -53 -14 -11 -34 74 -48 46 -61 72
3265 72 42 -36 61 -61 101 25 20 65 -68 39 -8 143 24 13 -4 -28 47 -76 44 -12 -19 93 -96 -5 -65 -8
3291 -8 -5 -16 -61 -46 40 -73 28 -41 -78 42 -72 85 -13 -15 69 -7 18 -6 73 17 83 42 -3 54 -55 35 7 -3 71
3320 71 -47 81 -17 -14 -19 -3 -6 -64 57 -97 53 -57 -65 134 -77 -24 -76 41 -35 43 -1 -25 110 -85 82 -48
3346 -48 -19 33 -66 59 -14 -10 11 -10 -26 -39 73 -16 27 13 -49 142 -83 83 66 -33 -31 2 -15 -38 42 -86 -20 -31
3374 -31 -79 96 -98 28 -33 7 50 -66 -15 7 42 0 39 15 -53 74 -88 68 -4 46 24 0 35 -4 40 17 25
3401B5K4o1O8p5J16n7r1J98j99P3k2k4j0M4pq6J19m7Q2l3m0J17j20m3O6j35J15
3428cJ6K1r6O9n2L7L1q0J35j44J12N2o5L5n9K1n3J4rM6Qj01J69j58Q3P9j24L8
3456B2o9J03o2k0M1j0J0l4J27j59P1k9l5J15j29J8O1k8j1pM6k7R8r3mR9j37J10
3484F7j06R8qp2M1l2L7q2R2k9J0J05k13J27r2O3M1q7M1k1M3m8RJL0k1l5L4l3j8
3514e8J00q1N9n6L9k8Q7n8k0Q6n8R7j45L8N2q4R1l4L3p3K6L4l8L7j09J13q0RM9
3543B8o4J12j37L3P2m5K3m9M9j00R1%n3O6o7J0M9mk6J4O7l1ml6J2K9k2P6j52J21
3573F2l1J5K3p7M2n6P0j15P1L8o2M2p2Q0n6K7Oo4Q6l1L3k8m2Nk4R2j07J37m7m3
3603b6N1o2O3k4M5jm0K3o9R6j00O4K2k0k1j6L5m9L7J10j19k2k2N4o0O0K4m8J08
$$ plain form
3401 25 49 -12 56 -19 97 40 -51 147 -52 21 -1 -25 -35 9 2 -84 35 -12 70 37 -3 114 -6 -49 17 -118 -3
3428 -3 13 34 -62 7 -45 -8 23 -57 78 -66 46 98 33 68 9 30 -23 -9 -18 28 36 -65 104 -54 29 108 -16 22
3456 22 -47 56 -6 -26 15 5 15 -19 108 -51 20 -9 -44 71 -58 -40 21 -7 -18 -25 21 -6 92 -1 -5 94 -43 67
3484 67 -39 59 51 -21 20 -12 25 -57 35 6 16 121 -92 35 -57 6 47 -40 1 -20 23 -25 -16 -15 15 -6 -41 -7 -40 -58
3514 -58 42 -39 20 -36 3 -25 62 4 -16 70 12 109 -36 2 54 -30 61 27 60 -13 13 47 9 46 -63 50 -30 -21 28
3543 28 -36 76 -61 -28 44 -1 22 -27 22 -78 13 13 -40 26 -41 -31 18 14 -12 2 69 38 34 -2 10 39 17 93 -59 62
3573 62 31 46 69 -8 34 -22 48 -67 4 42 -20 22 -50 30 -26 1 7 -57 29 -2 31 3 -39 -34 -58 34 -73 64 17 -26
3603 -26 25 -37 26 2 47 46 6 29 -40 56 -44 20 42 22 1 -15 20 -29 8 118 -1 -23 -45 9 -51 9 33 -15 93
3632I3j09L1l4qjj0P3r0N4k5P7pj00O7k4MJ2j3K8J1L1o7K4J9k2l2k8P5p5Q3j1
3663B6JK4r6O9k2J3j0m6K0l0O5l9M4Om9L4k3M0m6K7M7r0M6q2O6m9J3O2p3J24r9
3694b7M1j3L1N6o2J3r2L5J7k5JqN6o6J02p9J2P5r2OK3K6k5JK0j10J07q0Q5j5j19
3725a06J15p2O3j3k2LpQ7p9J32j39P9km6O6q6L0n%K4l7Q0o1PN9p8Q7q1K9p3O4
3756A8j2j6J1L2l6j6m5L5PO6r2Q9r1K6Kj3J24j49R4l6M9n3m3L0l3N3qK3l0N8J3
3787E7q9P5j9qPJOk2J5l4L3O0j01M2p8Q4L7r9Ol1N3o1N5PLK8l6L1j6J1K2p0Q4
3820E3q3O8k9Kj3L2l7m7J28j08M1rj6M4m5L8L5k5n3JL6m6R7j01K2K4p0M8k1L9
3850Eo1M9Mn9Q3n9jLP0Jr4R9o8P5m7n4J18r4Q7l7n8R6m5L2KM2j07j0R6q0O3p0
$$ plain form
3632 93 -16 15 -19 -27 -28 -38 35 -55 -1 -26 51 44 -56 11 -13 -9 3 -10 18 29 60 -7 17 36 14 -18 -46 29 -46 37 26
3663 26 27 51 -45 24 2 15 5 -41 -21 -51 14 -25 19 25 -24 10 -13 27 -19 8 55 -35 11 -71 -5 -54 -41 21 -52 72 -27
3694 -27 14 1 32 88 26 39 -53 -18 -1 -26 -25 -33 23 -43 59 -20 -8 67 -25 -19 4 30 5 6 26 -84 23 -57 28 13 -106
3725 -106 9 -63 0 -13 -35 -32 -39 48 -31 101 -38 41 39 -7 59 -27 3 -2 -2 22 -15 65 4 11 70 -8 79 -2 27 -46 18
3756 18 6 -10 1 33 -3 -19 -64 -29 -22 44 -48 41 -50 -24 -22 -35 89 -60 34 -2 47 -6 -49 -19 -52 1 -7 16 -14 44 57
3787 57 -32 43 24 16 23 24 30 8 23 -11 22 82 -19 23 -55 29 66 -33 -27 -58 -5 -66 -11 -4 -1 27 -9 22 6 17 39 -31 53
3820 53 -30 38 9 11 -2 30 -7 -54 74 -34 7 -2 -18 26 -19 19 54 29 -24 -23 13 -33 64 -37 -15 9 -61 -13 -34 5
3850 5 -56 -7 -3 -62 21 -38 -39 -36 34 35 -59 40 -28 47 0 -54 64 -30 57 20 -38 58 13 45 47 89 -18 -28 68 -12 51 -19
3882a9J2k8L3j1m6Q0j01Q9nj7J4K4J0p4J6Nj2M5kL1m9M6n2J5L1j06J21m8j4M7
3912C5p4Q0l8Rn6L3ROJ2l6O0j06P7J8n8Q2r9L7j9L2J0K6Lo3N3q4J9mK2L2oo3L7
3945a4J1L0o2M1Knk5l9J27r6O8j8k8j3JK6K8L1r1K2M2n7L7q9P3l3k9J9N8M6r4
3976c1K5j4L9l3k8M6j7M4j8m6K8J4pk6O1J2k1nm0P6j36J25o0N2m0j2M9k6m6M8
4006A3nl8N4J1p5M9k0kO2l3J7l3L8o3K5m0QM8J8q2%K7Mk9L8k3J7K9o3L6L7nl8
4039a8J6j7QL7n4Q1m3Ok8nJ0k5L8n2O3J0n4J29j82J26j6l3kj5L8l9jRqM2o0K6
4071a3k9P0n4LL2j3J7k2L8o2L9K4k6N7j05J17l0r4Q6m0mL1J2k8n0P9p1R8j23N3
4101hK2o0O1m5M9r%J9j9J6k3K3q6L8Rm7J05j01P2o1k9J17j08N9qO2q1rO2J6k7
$$ plain form
3882 -19 -7 -35 -2 -13 -59 21 -80 9 4 -13 1 25 35 -39 -23 -18 -30 15 13 44 -5 41 -11 4 35 -71 50 2 -12 35
3912 35 -39 41 3 12 -44 -11 -2 4 16 -20 40 -66 11 29 -29 53 -46 -9 -28 4 14 40 43 -20 33 -51 -32 -36 -14 18 12 -51 -14
3945 -14 -3 27 -35 6 8 3 -22 -61 66 -30 38 20 -8 -21 -20 6 34 65 -26 -4 38 -19 18 -71 2 -31 -60 -41 17 63 -31
3976 -31 -6 -20 19 -14 -42 4 -13 31 13 -33 -5 9 2 -24 37 49 28 23 -17 59 -77 48 -12 40 0 -12 37 11 -35 13
4006 13 8 -30 24 35 -40 9 -11 -13 49 16 33 0 38 -25 0 -40 -32 16 34 -48 -48 -21 -17 -46 -8 -31 -14 15 -48 -12 25 20 -18
4039 -18 -2 -19 -11 26 -28 53 10 16 -12 -17 -7 -32 6 -46 17 27 -27 102 -80 46 30 -3 -5 -20 18 -21 -22 -13 -21 21 -39 -13
4071 -13 -42 28 -26 -23 9 -4 13 -9 29 -33 6 30 4 61 -44 73 43 -51 35 -5 -9 22 34 6 -44 35 -36 62 -61 -8
4101 -8 14 -46 15 -30 19 10 10 29 10 26 3 26 -60 -22 -13 -60 45 -56 16 -45 -74 43 -65 -6 -14 48 -33 -42 20 36 9
4132Io5J12k8mJ2l7L6l8Nj5lM4n1N7j24J05PPJ6m8NJ6jm3lK0O4J3r3LJ10j13O6
4165D1o4L9M0o0K0%n4L5J7l4l4R4o2J5k5K3Qk0P5o5L3j2L9n5K7l7PK3m3j1P5o1
4197b6L9Rk3j9L1j1l5RK0m5K6L9J7k3K2m8lL5qL4j00P5j3P2j14N4k3n8J05j7l7
4228a6j6K8nJ2k3Nj4M5J4k4k1jJ5J5j7n4J49k7l8j1m1J9PJ0K1n4M4m8M5q9J08
4259C8o0J6MK1l9K2j1K0j3K5O6m5o3P4j12K6K8n0J06k1k2mJ6l2K6O8p6JLj4j6
4290a8K6J7l1K2j1J6j8j8K3m7N6l9M1k0p7J35p7N1j1n2j6M4K7n5O4Qo5M5oN3j54
4321h7P6J7m4R6pp1j4J9K7m3O9j31J32o4NL0M6q0K5N1p0N9l0k5N1q2L1M4o6P2
4351C6j04Q3k1k3K7J9k8KO0l8j6qj2N0J0k0m9P0r0M8L5r1J07o1L5k7K9J3k7j1
$$ plain form
4132 9 -56 56 28 24 36 -1 35 -3 2 -13 -16 28 -23 34 -90 15 22 29 45 -3 2 18 17 -26 -29 -9 55 68 -25 -22 88 -25 41
4165 41 -23 16 56 -4 16 16 -38 -3 14 -20 -54 40 -22 -7 -32 -9 -1 -21 54 -11 22 10 49 -6 21 -16 -9 14 -29 -40 35 -26
4197 -26 13 22 -1 -20 11 0 -35 -26 -6 -51 -25 14 31 8 30 -18 -21 14 6 40 -60 15 2 74 -40 14 -9 -67 38 21 -16
4228 -16 -32 -4 -9 3 -20 -15 -29 16 30 6 -15 -16 -1 14 -3 -57 92 65 27 16 -25 -6 1 11 32 -22 22 -26 19 -70 38
4259 38 -22 -6 -2 19 -20 2 -9 11 -2 23 89 44 -19 55 -57 -31 -3 -53 53 32 10 6 22 -10 16 84 8 9 12 -2 -18
4290 -18 8 25 -6 16 5 21 3 -15 8 -39 17 -22 19 -1 -78 57 -20 31 20 -32 -48 -4 23 -32 32 40 -25 20 14 67 -87
4321 -87 -11 6 -38 58 51 -20 -34 -15 12 -31 38 -93 39 -25 -20 10 56 -24 1 52 -18 41 11 -14 37 -45 -14 30 -36 36
4351 36 -68 15 -6 -29 -2 17 -11 -9 51 13 -3 -11 -23 27 37 17 -32 38 -52 -4 31 -60 47 -14 21 -6 23 36 9 -2
4381bJ1J6Kp1M8m2N3%kl2J5K2j6R6o1J6l0m9L4Kl5pO0k6K3k1j1O1o3k5lMQ3p8
4415b8l6M8M4o8L3oL7rK5l7Lm4M8K4o9L4mM7n9j2L1K8L8j39M9K5PRm0K5m6k8N4
4448a6O1n0k2O7o3l7O6J7j5OL4n1M4o4M4lL8k0L9o3j1j6J5l9P0k2k4K4%j0n5J00
4480D4r1Q7n0l4O8l8J9K1L7p3mOQk0l8Q9r0P7mL2n0J3j4O4p1OM9k6KJm5L3J2J3
4514C3l5l7O9l7J2R9j62Q4J6l8l2N2l5RL9p5N0p1J00m6n8P5j0J3Oj5M5k5l5K5
4544A6K2m5K5k4LpP3o3k6Kok7P1oJ4l5K0L4l6OJ0o8K7jL7m7N9n7L6k8N9Ln9Rk0
4579b9O2m6rN6m4RL1o9P8jn8k2N9l8N9m2j5k3L9nK7l8L9p2O4pK8l9M5mk3OK1k4
4613A5k7j4k4P2pn2M3j7J0lL0J1m5L2J3n1K6LJJ4j5Lj4Pl3O0k5j8Ml1J6j1P3L
$$ plain form
4381 -2 9 25 27 -44 4 -38 15 15 13 -19 -4 18 2 98 37 53 23 -26 8 10 -25 -32 28 2 25 4 -7 54 -9 -34 -37 -33 50 -28
4415 -28 -64 -16 28 -40 -7 -13 24 15 40 3 6 -38 10 34 -35 -1 -5 42 -17 -29 2 30 68 -71 -22 3 10 19 -21 4 -42 -70 -16
4448 -16 45 -5 -27 40 -23 -60 6 23 8 14 48 -3 41 -23 21 18 56 36 75 12 1 -15 0 -39 31 9 -15 9 9 -1 -56 44
4480 44 -47 40 -10 -44 24 -14 5 26 63 -10 -14 -8 0 -20 -58 31 -59 18 14 46 -4 9 -5 59 -12 -6 43 17 19 20 -25 8 20 33
4514 33 -2 -39 30 -7 5 104 -58 26 42 4 -28 24 -11 -2 37 -38 12 -59 41 -5 -63 12 2 15 21 6 51 26 -9 16
4544 16 38 -7 18 -6 -3 -10 63 0 -26 -24 -30 -57 14 8 22 -13 7 41 5 11 21 -47 -20 -21 16 -31 28 -29 7 -21 38 41 -18 -9 -29
4579 -29 33 -13 -22 34 -10 -1 30 -39 39 38 -20 -42 17 -21 38 -4 -19 -42 -3 -8 19 -19 20 -52 12 5 33 -6 39 35 12 18 39 15
4613 15 -12 -26 -50 22 15 -37 6 -11 -1 -4 26 37 -8 24 37 -14 12 15 16 30 15 18 4 11 -22 38 13 -5 -1 -32 -16 -27 46 49
4647D9k9m9L4n1K3j7M5qJ8j5J7j00R0j7JM2l0j3j6P4l1J4l8K3k2J3M9n4kmM7j0
4679C3K9o7Ppk1J6J5j2K6J0rJ8q5Q1nj7j8Rl5PK7L1o7L8lN3km5L6m7nl7N5j6L7
4714C0Nn3M3q9oR0L6l1qq9P7nm1P7Rl7L4n9M0m4N5j7o4P5o7O1Rk1l0PO0n5LK1
4748A6m6P2n7k7MN5n4K6lk4N4j5pj3L2JNqj8M2m5J5k1j9O4p0Q1kk7N0n4J4m7L6
4782A0M0m7Qp5O2%K4l2lj0JK4N2j2m7l8Q1Qj2l7K8pn6N0k4J3j7l8J8J6J9L7m1
4815ekK7j0m1Q6m9K1K8o9NN3j1o2M8n2RK9nLJ5m4L6k2RLk5L6k0kk8K5Kkl1L5r
4851a9K7rk6O0kn6j7J15m6n0MQ2n4k0j0L9j4J7M1l0m4N8o8N8p0M3j5qK3kk4j8
4883c5K0jK5n4N5J0l1j7L8Pk5%N2m6m%j2L6n6rK6N0k1M4k0l7L7j1j8nK7mjJ3p7
$$ plain form
4647 49 20 -29 5 -46 -23 -40 5 -3 15 0 17 -83 7 -10 -9 33 3 -10 -26 48 17 31 -7 16 -6 7 56 2 0 -4 43 33
4679 33 62 -5 2 -5 -26 -10 5 -7 19 29 20 38 -47 34 29 12 -6 3 -32 -25 2 33 -34 4 1 54 52 7 43 -4 -9 -46 9 -7 30
4714 30 35 -18 25 -64 -70 20 56 25 17 -72 5 0 -41 36 45 8 42 -17 23 -21 34 17 -47 28 -39 22 31 10 -20 -13 47 -8 -5 16
4748 16 -30 42 -15 -42 -38 17 -37 -11 -14 -38 16 1 -6 -19 13 14 19 11 -7 35 -10 5 -16 -35 29 -41 40 38 11 61 7 21 -26 10
4782 10 50 3 11 -64 -2 -2 22 -10 -13 -23 -22 2 54 42 -5 -43 38 46 34 -3 25 18 -38 12 -12 1 -16 -54 -36 -20 -1 36 -5
4815 -5 -7 20 10 -31 55 6 27 55 -14 -9 44 33 -29 19 -33 -24 5 0 3 18 -26 10 -12 -3 0 -25 11 -9 -11 -39 -14 -12 -14 -45 -10 -19
4851 -19 8 -1 -27 33 31 -25 -42 73 27 -23 -19 63 9 -11 -21 18 4 21 62 32 -12 46 -22 36 -34 9 -6 -14 9 7 -17 -35
4883 -35 -15 -16 9 -45 10 20 -11 -28 10 17 -8 -8 44 -2 -6 -6 -18 18 -38 -47 -21 29 8 52 32 -5 32 21 3 -2 25 21 20 33 -44
4918d4O2k0K2P5q8k0L0l7RRM3k7j2k2L5j6Km0O6n1j4M6k9O2o5K2PK0l3j8K9ol6
4951c9P4l3K8l2k1L4j9J0J4Nr7N3L7m2K4Q5n9n8k3M3J2M1j00J0J8N5m0K7k5K5
4981GN1o2K2l2J0Om0k3P7%oL3%qk6l3M5m5N9n3J5L5n1P8k9n1O3l9k7j0L7j1j3
5014b1J1P0n5l7j7L2oJ9K6k0J0j0J3mn0K8J6M0q4J5n7N7P7q0kP6j8q3M8j4j7K6
5046a1j4M6k3J9ql1K2k1k7RK7J3p0Q6j2k6Q7n8K5j5L6r8P4m4L4J5k6Qm6K3J3K6
5078C3n0Pl7N3O3m7JnJ3Oq9P6l2lj2J9pl9M5m6N4Rn9L3K9oPl9K6k3mM2j0k2j3
5113b7L6n9K5L3K0k0J6k8N9n2m0j2j6kL8PK1J0k8J3qO%N1j7m7n9N2J7nl1O1J3
5146B7Jm5K6k2L4m5kO4l0L6p2L1j9J3l6J9KMj2k2oK2Pj4M3k5J7K4m6K9j0J4n3
$$ plain form
4918 -44 18 -2 20 95 7 -13 17 -20 -11 -2 41 14 2 -20 15 -1 1 -39 27 -24 -38 8 -21 41 -24 -2 5 25 -8 -26 3 -3 -39
4951 -39 35 2 30 -2 -23 11 -8 2 16 21 -76 -23 14 -28 -4 81 22 -36 -59 -16 -4 37 -63 -53 -35 20 -20 7 -18 7
4981 7 58 -4 18 -14 -4 2 -38 -61 16 16 10 43 43 35 9 -24 21 -24 35 -18 -3 32 -19 59 30 -21 42 3 -24 -34 3 -8 -21
5014 -21 -10 60 5 -32 -49 -17 -23 -4 22 2 12 2 15 11 -39 -11 5 45 -39 -24 -81 -24 53 -27 -29 47 29 -54 -6 -20 -37 -11
5046 -11 -25 21 -2 17 9 -22 0 -21 -48 -39 -12 1 -69 17 5 -21 66 8 33 18 54 -44 30 -14 20 35 9 17 -29 -6 7 33
5078 33 -17 -10 -47 6 69 22 23 18 31 37 -52 24 -8 -11 -23 -4 -11 -50 -5 -51 3 12 -47 -14 15 9 16 -23 3 -20 -24 18 8 -14 -27
5113 -27 9 -50 -25 8 28 8 24 -4 55 3 -37 -49 -65 -67 -29 -22 -1 9 -19 -6 -14 -8 -8 43 26 -21 -80 -28 -11 -16 -47 14 27
5146 27 28 -17 9 -13 21 -24 -26 38 8 44 -28 3 -16 -3 -39 -20 -18 -14 -26 -48 -54 -32 -25 -39 4 -21 -4 20 -26 3 -7 7 -46
5179d6oJ2L7K0pOOj3m4LL1rpKjk4N5JK6Ko5J3k0L8nM4l8k6m4OJ1Q5p6N6J5%j6
5216B2j3K4j5mK4k8oL5m6L9o2NM8Jo6J1K8J7J6l4K6l4J0l7M3J7l8PnM9m3o8R1
5249A4J0K3p9K4n2KQ3n0K5pM7m2nJ9n7M7MkKl2mM6o7K8K5j9L2K3n1j8K2J1n8R0
5283C4k4K2kl8k8j1M5J5k3n4R6r6O8M9q9R8o8mK7j0pK5%p2N9Kl2K4L6l6m2M7j5
5316dJ1L1r9Q0k9O0n8Q5q1J5L1k9jn0L4L0km5M7j7k3Ol7L5K6r7O1L4k1JJ7K6n0
5349a3PK2k7l2P0l2k1J2kJ0OM9p1N6n0oqNP7p0J7pM4k9j4J4K9J0q0K0k8J1O9L
5383D1l4l6Kl5O6nN4o9kk7K6M0k5j8MJJ0J7J2J8mr9Q1l3M7n8O1n1K4m3O5k8j7
5416a5K0m1O4j2j6l6R0o5kP7r2J1l7R0n2K7j9M9j12L8L4j4j1K0k9pl4P0J5m0M4
$$ plain form
5179 -46 -52 -40 -3 17 10 16 22 9 -35 -32 -1 -10 -17 -15 -16 -40 15 16 42 44 -21 -8 -28 10 5 49 11 -15 -59 -53 -42 43 -33 23 38 38 22
5216 22 9 33 18 14 38 10 4 39 -7 32 -30 -25 23 24 -42 -31 -3 14 30 -4 22 -12 -2 -39 4 21 -17 -10 -15 34 -9 -77 14
5249 14 24 47 -32 -8 -60 -58 25 -25 0 -7 40 -2 -7 12 -45 2 6 4 6 -26 -30 16 -51 -23 2 -17 15 38 -13 -31 -9 2 -56 34
5283 34 10 32 30 -8 -36 -47 -2 13 -10 -64 32 -64 4 53 -36 62 -6 -10 17 7 0 25 25 -47 12 14 -18 6 42 6 -36 11 -4
5316 -4 7 38 -61 19 -10 50 -8 77 -4 11 42 13 12 -38 -4 26 24 -21 26 9 -14 -8 -45 -10 16 -81 -20 14 -7 -6 11 37 -13
5349 -13 -6 16 -11 -43 27 -5 -26 -14 -16 -6 0 49 -22 34 -16 -22 -30 -25 52 -18 -1 -8 36 7 -7 7 36 46 -34 -14 -42 -31 38 41
5383 41 7 -29 -27 -62 4 -1 53 -16 -18 -45 -19 21 -4 -22 -18 -17 -7 10 22 40 36 -63 18 -15 32 -26 35 -16 8 -35 30 2 -15
5416 -15 5 -36 28 16 0 -36 54 -11 -13 64 -28 -17 -54 36 -16 11 -8 41 -71 -33 1 -13 -24 -4 -33 -40 -74 -4 11 -29 15
5447A5L2pp6M0m2J6M3k9J0N9j00M0rk4J8K6l9K8l3k1K1M5Lo0J6J8k7K9l1J6QK9
5479A4rKJ1j4qK4m1L9Po8J1O7p0j5R3l5n6P4l2J7nk9l3N9n4O3L4k8N9j32P5o7
5511d7K3N9l2M9j10N1k1M6K9Kp0J7k6N0JK6l6%L7n5K4q2L8RLKQ0o7PM0j14N5J3
5544Aj2%rk9J2P9l7j5oO1m2J9j7o1P0K4Jk1qMj4KJ9Jq2P0J0Rl5L6m7MJmj6M5K6
5581C9j7n6nO7J4Jro0l7R8M8r2j9L6nnl0j5P6p0J04r1L6k0j0J03q4m2PJ8jM7j3
5614A3j4L4n7K0O0r0R0m0k1L6n5M7k6j7j1N9%n3J4qK0p5P4m2L6mJK5l7M3K3o7
5646b2M8n8j9P1lpk2K5m2pK2J3lK4m3n9J13On9K2j0j0K0K8p3P0K9o5k0J0P6n3
5678Bl4M1l2M1l9J7J6n3J2J5OM0j6J2Jn6M7K9j9J6o1lJ1Qj4j3O1m7J0P8j00MM8
$$ plain form
5447 15 47 40 -36 4 -38 -22 21 -8 2 61 -39 1 -8 -32 -14 12 -27 1 -32 -53 -32 13 16 -44 -28 -10 -37 -8 -39 -23 -15 14
5479 14 5 7 18 4 -4 20 -21 18 25 -43 -32 35 -35 -50 43 8 -48 26 -6 11 6 -23 -56 3 -51 12 46 18 77 -55 20 -47
5511 -47 -24 35 3 52 -58 -7 -28 18 47 49 -21 -4 -30 20 21 47 11 11 48 -7 17 -65 -27 -18 -15 -13 67 0 7 47 -67 -12 1
5544 1 -11 -11 -20 -49 -37 42 5 -10 -16 45 3 22 5 -56 14 38 39 18 10 14 0 2 21 22 -60 10 20 29 -6 30 -17 -13 -12 -16 -32 13 39
5581 39 22 -34 -39 28 42 43 34 -26 -63 35 83 -9 -28 8 3 -2 -32 -47 29 -41 63 -28 8 -12 -22 81 -3 -45 -38 -20 -21 26 13
5614 13 -1 33 -24 -4 56 -34 56 16 -5 31 -24 23 -3 -20 -31 28 28 -25 -11 -19 1 -74 0 -42 -6 -10 -9 16 -21 22 45 -22
5646 -22 26 -32 -51 20 17 10 -12 13 -29 -36 -14 -1 -4 20 -23 -82 31 37 -22 0 -10 -20 0 28 -45 25 54 -11 -31 -21 55 2
5678 2 -32 9 -23 18 -21 -4 12 -41 -29 -14 -8 32 16 28 29 -27 20 49 30 46 -15 -18 -7 1 -13 -26 35 -12 -2 76 -24 -20 28
5711B8o6N3l7O0m2n5M7mn3O0mL6J4p1K9mK8l8RJ9j0K6k7m2L4K0M7n0J8m2P7j5
5743D5k6J8n3O0Opo0m4J38j02LO5r4P1n8JL8l2pO5Lmo7M9K1m3Kj4N8n4M8l8K2
5776A0qJ7j2N8l3l0J2j9J1kM4m7l9N9l3OMm4N0l0J7lL6n9MN8m6M2p6L2qjJ0nM9
5811B4PJ0n4k4M5k4J5L1Jl1J8n6J7Ml3O1l6M3jrk6lMk8P1Nm9P0j03N7J6m1J5l0
5845c4J2jJ7N0l1J8l5M2l6mkj0J5MjN6n8n6M9J3k0J7j6%J8kL6m6k0J3ok1N6k7
5879a0K6nl1Pl5P0N1n8k5N9m3qJ2M7o2R3j08L3pp9J03k1k3J6nM2p1J06p3QK0j04
5911g5R5oOj9M5Jk6o7P1Qn0j8M2Qj8j8k4K2L5j9K8K3l0K1o5J9K0J6L4k1J6p5J
5944b0O1l5MJ0l0M1j1k1J1l9Rl2R7p2MK1k9J9j1J8K2j6J3J4n5J1m7O0N0l0mJ8
$$ plain form
5711 28 -38 15 -22 38 -4 -59 -12 -16 -69 -9 -13 23 37 -34 -5 -9 19 -19 -10 9 -1 25 -2 -44 -10 10 57 7 25 -17 60 45
5743 45 19 37 -16 44 50 43 -17 -61 77 -25 -22 43 -51 20 -38 -37 1 -31 -38 27 30 26 -41 8 29 -14 -12 -26 32 -22 26 -12 10
5776 10 2 19 7 65 32 2 14 -5 6 4 48 1 -38 21 -12 -6 -2 -46 4 -26 -9 -12 24 -35 -31 27 -19 23 -53 -21 -29 -30 -20 -25 24
5811 24 31 41 -13 -37 8 -16 -1 30 31 0 18 -38 -21 -17 -50 11 -25 18 17 8 -18 -21 -17 -45 26 31 -18 52 -51 6 22 -19 -4 -34
5845 -34 -22 -23 -6 44 13 31 -4 38 2 -2 -4 -14 1 5 4 60 2 -54 -5 8 -12 5 -11 -11 7 5 41 -5 -25 -12 -18 -39 17 -10
5879 -10 16 11 -20 -13 -48 22 73 15 -10 49 6 -2 10 57 -5 88 -20 13 6 -73 30 9 -14 2 -3 39 -32 74 1 9 29 -75
5911 -75 20 14 20 1 46 47 21 -46 25 33 -17 -35 7 15 -3 -21 -45 -23 12 -7 21 44 14 35 -30 -11 9 25 59 38 54 -21 -20
5944 -20 41 6 10 20 -10 31 20 -1 10 -29 -20 -52 45 -27 -23 -2 -31 -12 -23 -5 17 1 14 28 -27 -16 -63 -3 47 17 13 31
5976C1n1j1K9N1p1J5K3m3R2o2k0N9j9K7o4jK4j5J2Nl1K4k5J2K3j1j4j1KL5j3N
6008GL9l8l4O3n5k5M5m0L3L8m2j4KK2Jj1L7l1k5Q5J1j6p3O2l6K1m9K9o5J07m7
6039AL1l8k5Q2n5LL9n1l2J5N7j8n0J01o2M9m7l0O1kMq7P5l8K8k2M6k3L7k9o8K4
6071b4Q0p3M7l4J2m7M7J7k1rj2L5j5j2k1J1rL7mk9K6N1n5rK7k6O3m6QM7o3K9m8
6104b0L1k5L4j3j8M1Ml1J3J9n5j4%R7q7K3N0l7MKkpoJ9j3J9p0L0l3N0j4j8lN2
6138B2Qo3K5M0J0Mn3k6M7k1KLN4m4j6J5J0ll3M8Rl6J7k2OJ0m5K0%KN1l8K5n3k
6173b7N6%n7L5j1m1L9L5k7Qj8J8Prj4PO1q4J4K2O4n0j8L1rn0n4Q8k3k1j4J9O2
6206C9k4j3N7o6J9j4nJ6rjj0LkM3o7K4K0j2j2j5Q2p1N1p0K5O5l2M4p9M9m1J6K1
$$ plain form
5976 31 -20 -31 -2 49 -22 -7 16 -27 65 3 -17 42 23 50 -14 -15 9 -6 6 11 -20 4 -21 -9 14 3 -11 -22 -20 15 2 7
6008 7 46 8 -26 37 -18 -43 2 -38 -5 33 -9 -23 -21 1 2 -9 28 -3 -28 57 68 52 -21 41 5 26 -23 6 -59 48 1
6039 1 32 -6 -31 51 -4 -1 38 -13 -45 -30 27 9 -41 60 -2 47 0 -30 31 29 33 -54 21 -17 11 -11 35 12 49 20 -48 -24
6071 -24 56 -17 30 -4 8 -39 8 25 4 -5 -17 18 3 -9 -30 -19 -28 9 5 -24 2 53 -2 -11 16 -10 53 7 15 62 -1 28 -20
6104 -20 11 -14 20 7 -11 30 34 3 16 35 -20 -34 -34 63 -24 -1 49 12 16 18 16 9 3 22 9 28 -42 -12 -45 5 -9 -27 -30 22
6138 22 30 -33 -8 32 42 46 -7 -33 14 -7 -5 -2 52 8 -8 7 17 14 -19 29 38 2 19 -3 3 13 -32 -12 -12 -10 41 3 28 -25 -27
6173 -27 29 29 -28 7 -4 -45 -6 29 2 10 -8 10 17 8 -6 1 62 -22 -8 14 78 28 10 41 32 -18 -72 16 -7 -28 -42 -23 39
6206 39 15 2 59 -7 12 -2 -7 9 0 -1 -11 -8 -10 33 -34 -10 10 -2 -14 -29 53 -18 33 -37 -12 53 21 65 -14 35 -6 10 31
6239C1l9k9O5Jk3k8M0%Pk3r3O3QJ6J9LOk9J5o1KO3q1M8J7l7L0M8o4J9L5jM0j29
6273f1K4P0K6o5n9J15l2Pj8J8m1N9j9o7R4j06L7qM4m9P1l1j9PJ6Ll2M9l2J1m9
6304c7L5MK5Lk6j0o5N9M1q1N1Ll4P5o7kL0N4o5L7lQoJ1k7L1p0k3L7k5M8n5J6O2
6338C4j5J2K2k1q1L1J8j2Jj3O6k0j2MJ1J5l8qL9m3k2M3l2O3l8JKk4K7Nj0j6N8
6371D7p9K2N1l6K1J5j1k0m8J4K4j8K0L4K2q9L7j0M5r4N7l5O7p6K5LpP5j7m4Ol2
6403c1N5j3k7L6J6l9J5j8J7m6L7Jk8pM2K4n4Q0r9K4K4j6k3Ql6J34r3j0k0J5N0
6434A8m1L6j9mk9O8k1j2J3k0m2P6Mp0O6k4qN7l7l1pK6Oj4M4l6kk4KO2No1K1j2
6468a0j07J12N6n7Kk8LpJj7Q0k1Qo8J06q6L9mK4k2K3j0Mj4k4NqK1j0j7J5N2l3
$$ plain form
6239 31 -8 -37 28 29 6 -22 18 18 25 2 -91 -28 -20 -4 15 18 24 -5 10 -51 -49 14 -67 -19 -2 -39 -9 39 -25 -6 29 28 68 -61
6273 -61 -37 33 59 -6 -65 50 18 25 7 25 -16 43 24 -43 51 -55 -18 -26 18 -31 40 9 -10 -3 13 16 -16 33 1 12 -37
6304 -37 -2 2 27 30 4 -6 -71 -12 29 -52 -1 2 -32 43 -24 -26 4 58 -7 30 27 35 29 40 13 44 -26 -49 -12 -37 11 -44 -28 34
6338 34 19 31 53 32 -49 -18 0 -12 -11 -24 42 22 10 14 25 40 2 -6 33 -10 -32 11 -21 42 4 5 7 -17 10 15 5 -11 47
6371 47 -32 -10 41 5 26 41 30 10 -38 -24 0 -18 2 36 58 -31 6 -4 41 -53 4 -31 36 -40 -15 -12 -19 56 39 -5 1 -31
6403 -31 24 11 -16 20 36 -3 12 -6 11 -35 2 3 -25 -32 10 34 -20 60 -39 -15 9 -7 -30 -22 -58 76 -17 -27 -47 -32 18
6434 18 -23 13 -6 -10 -39 29 8 -4 9 -11 -53 23 27 -43 23 -1 -9 48 11 -20 -27 -1 5 -9 35 -1 -3 -27 -25 37 42 -19 2 -10
6468 -10 -117 -5 51 -6 -4 -32 -29 -36 -35 -52 28 7 15 -53 53 -33 6 2 26 4 27 17 21 7 -17 -12 -20 1 -9 -26 -11 41 8
6501Hrm0O0K7j1o7N1m6M1L7n8O1n1O3Ko0QL4p7M5J8J3j28J08j3j0K0j1j0M2k4
6532B3j3Qk0k9M0k4J7j3j9J4K1lNk1Nj0j0k3O9k3jJ5m9L3qJ6j5K0J1J5nL1Np4
6566a2n6Q9j0L0k5J3L3k6jn5N9j3m2l7P9n6O4Nl8O5j14L3O9k9l0k3M0pl4N6m3
6597a6M6p5K5J4NloK1jl4NK8K3k6jk3Mj2K0L2n4N1n5K0PRO0n6J6j0o1M7j6K0n3
6632d9M5m9J19j06L7Po9M1k1N4K8l3k0J4j1J9%j5jN2j8n8M8J4L0l4l7jK3o1O5
6663A3l5JM1m0M2N2r5LR0p9K5oo1O1mm4Q7p4lMM6o4K4O2p7J7j3L0j7KK4nj7N0
6697D0m4M8q9N9L0n6lj0L7kNqj4m1j2L7O6l8nl4L0m4K4Pj7oN0J2l6M4m6M2k3O1
6731F4k2k8rj9J0n7J25p4K3l5K0l4J3k8N0L0k9j4N0mm6L8o3L9K6nl3QK6l7L3k2
$$ plain form
6501 8 -1 -41 19 46 35 -32 19 -27 14 51 -7 54 3 66 68 8 16 50 -27 18 36 49 -79 29 16 6 26 15 5 47 23
6532 23 10 18 -2 -31 9 -15 2 -11 -30 -16 5 2 7 -14 -9 -19 -29 -52 17 -6 -7 8 -41 -8 -16 0 -15 5 16 31 26 57 62 -12
6566 -12 -68 21 11 41 16 29 62 36 35 -20 39 26 -16 -53 26 -30 34 39 1 66 -48 -15 54 25 -5 -28 12 5 -29 27 -16
6597 -16 30 -45 -20 -6 -1 -4 -10 11 10 -24 -19 9 32 6 5 -18 -14 -26 -6 26 -28 23 -32 -12 -5 4 64 8 24 14 -47 0 -16 4 -49
6632 -49 -4 -53 66 -40 -3 4 -65 -24 -45 9 37 4 -16 -2 -13 6 6 -9 -10 42 24 -34 14 28 58 24 -13 -14 9 -52 13
6663 13 -22 -21 20 -20 22 74 -21 -18 72 -7 18 12 -49 12 8 -36 51 -23 -26 -22 24 -40 -16 46 -31 -14 -27 3 -14 -12 12 7 -10 40
6697 40 -4 44 -45 14 44 -12 -15 -25 12 10 15 7 -7 -48 -60 -23 43 5 0 -34 -4 -48 -24 -17 -34 -40 10 22 -14 30 -16 26 3 64
6731 64 42 14 5 -14 -4 -61 64 -10 13 -22 -2 -36 -23 -51 -1 29 0 -14 36 32 -14 24 -39 0 26 21 -12 -4 22 -15 18 -4
6763dQ2n0k7J6L1k6nn3M0K1l0M1Rk8m6M0MK%ml3J7K2m2L6M7k9Ommo8M3KL7o1Q
6799a0L6k3L4j5k5%o3Q0M1q6m9P1k8K2K2j2L0l9oLJ3K3l3L1Km3O4l2rpM8np6J03
6833F2q2mj1K6k0M2k3k6L8m4K7K6J1l8L6j2m7M1q0P5nJ7l0L9J0p5K2K3J6K5o2
6864b3R4q1L6l0L9o2K1m3M8N9j1n2l9M1pJ4Mpl0O2p9R1k7Ro5RM7j9o4R1m5Kkk3
6898d2K2L8j1j0K7l9L0oJJ6o3O1Km4N0lqm8N0k4nj1Jk3QN7j6l1L6m4Q5o2m9Q0
6932B5K0n3J6J4nJ3j0k8J7Ln7J0M9K1k4Oq8J00k6J2l7N7m7qJ1K7J5p0L6K3J6k
6964C6k5k6QM6j5k5k7L1j0j6QqL1J0o2M8J9n7NRK7j7M2o8K9K0m5kL1J1O0p5J0
6997Cj5K4m1mK9l1NN2Kk0K2q2N8o5O5J7J0Jq9N2J8m4J2KM8l4lO1j4K3o5m1J05
$$ plain form
6763 -4 78 28 1 17 48 22 17 -36 4 25 -5 36 45 17 -29 11 15 17 17 13 -20 -3 19 -23 13 60 31 37 33 29 -39 4 6 43 -18 -10
6799 -10 26 3 37 22 -3 -3 -66 14 55 -31 -80 -9 -37 -15 7 -5 25 -14 -20 -17 -4 19 -14 17 19 -24 40 8 -1 -8 40 35 -41 62
6833 62 -20 -24 -35 -9 -29 13 -10 -36 2 -42 -15 11 22 -16 20 8 -39 2 -78 -3 -8 9 -21 18 28 -47 -25 -2 14 39 -23
6864 -23 71 -10 26 -4 35 -27 -6 -49 -1 58 47 -5 -44 -3 -10 4 8 1 -29 33 -46 45 18 27 -38 -29 18 -1 -65 26 -19 -17 -19 -42
6898 -42 -20 18 7 -3 24 -15 15 9 10 26 -37 24 26 -18 32 29 21 -27 23 -1 -6 -17 -16 -39 -31 26 10 -21 15 -29 56 -6 -55 25
6932 25 45 -8 8 22 17 30 20 -8 9 12 -45 -35 14 35 11 17 -71 29 3 15 -22 35 -12 -20 -9 18 33 -37 -1 22 38 36
6964 36 11 -15 -7 39 24 -1 -28 3 -7 -23 -15 -23 8 18 -44 4 23 -34 -29 -20 7 -10 32 -36 -7 13 -32 -34 -3 8 68 -7 3
6997 3 -12 12 -29 -33 -4 -35 -30 22 24 4 26 -56 2 -63 2 19 29 30 -59 -7 11 -33 -21 -19 29 -5 -8 53 39 62 -3 -44 61
7030F1q3N2lJ9l1lL6j5J8m4Lk1K5l0M2j2Nl6L8L6m7o4N1K0J1K1k1j5Lj3P3q1O
7063Ak8K8Nl7P0J6j9n6LN4nn4koK6L5q2M9J2l2O0l8nM2p9J8L8Kl9rN0LK9rk3j4
7099Drl6J0J0K6k3L4J9l5J6j8L2o6O2l5Lk7L9m2K6K4m3K8n4P1j4k%m2N3Lj0k0
7132a6K2n2L0L2m3J4J4kK4j1Ml3k0N5J8L1o3L6k0M3j01M7m5kK2J5k8nK3N5Ll9
7164HnJ5J6n8P4k7n2M1nj0k1lm0N8LJ7o5L9L2rl4JJ6k4Q1l0j3n3M5j5K2o6L7N4
7198B9j9K4n1L9n9P7m0J3Rk5L8k7P0j45J65j21mO6k9J9k5o%j7Onk7J0J4P3j5j0
7230B7j4rKN1q4N0n9oL7k7N9Pl8Ln6M2J8l5N8n3j0K6M0Rm7N7p9J0P1q2PM1J1N
7264C2o1N9p2L0K7K7j15P4%m3J8L3km2N4l9L9j9j4L0p6P4%k8J1j6M6q3M1J3mj
$$ plain form
7030 61 -22 30 27 46 15 12 48 33 51 7 10 -11 14 -16 26 14 19 -17 21 57 10 -54 -3 17 28 49 28 13 16 3 76 -5 1
7063 1 -27 1 6 -31 39 55 36 -20 -17 37 32 -22 -24 -30 -4 31 -51 -2 10 -22 38 0 -5 37 -42 -24 14 16 -23 -32 18 21 50 41 18 4
7099 4 -5 -41 -31 -21 5 -18 16 35 0 16 -2 30 -36 26 -9 -6 -33 6 -36 -10 14 -29 -1 -55 16 2 0 0 -42 11 14 4 -16
7132 -16 6 -46 -16 16 -27 -13 1 -1 23 12 16 -17 -37 18 36 67 4 40 20 63 -38 9 -36 -38 -16 -1 -29 -34 -11 44 47 8
7164 8 3 18 34 -24 50 23 -29 12 7 -3 -24 -27 -67 -9 -6 11 -54 -15 17 8 -26 -25 -9 -33 48 18 5 -48 -3 -18 4 -62 -25 29
7198 29 10 34 -17 22 -37 40 0 13 22 -3 35 8 78 -67 98 -23 -27 39 10 29 4 -2 -2 -19 -13 -18 -45 -35 -21 52 37 27
7230 27 13 4 6 57 -27 23 -36 -42 -5 -32 27 34 -4 -1 -57 -15 3 -32 26 -27 -37 -11 29 38 -9 48 -31 -21 50 -32 -25 16 27 32
7264 32 -29 30 -42 -12 15 42 -73 1 1 -42 -24 9 7 -35 19 -20 19 0 -14 16 -60 14 14 -14 -3 -19 27 -56 -15 -2 -6 -7
7296gl6J2R2n5j5L8k7n8O8j4M8O0j10MRj0J6k0L0l5l4nK2L2J5l3K1J1jl2oL8K1
7329C9k6Ol6J6k6L0M9n9j%N0n4M8o0L9j4l6J24j19K7k6nL9l5L6oQK3p3L6J3m3
7361c6P1j0l5k6L1K1l2J2M4q2O5n3RJ0K6j3K4K7j07P0oj1lqkM7o1K5j8j3R5q2
7393b1N7p4QO5j4K2o4l9M5M0rn3j3L2L6j3pO5l8m5j8P5jj9j7l5kK4l9J01o0N9
7425D8o8jQ9q6JM1n3PO4K2j04P6j3p9K5k8Q3l7k0J54r4j6Qo0N0jJ9n1Mk8N8k7
7457a7O5o3K1qJ0o2N8M8j2m1nQk5L1k4j1N5j0k2op4J14n6J5QM1l1l1Q6n7pJ8K0
7490C6n0Q1n0k5K3mL5%j8or9N0J1MK2o0L4K4m8M3N8l5K0J6o3Ql2J9L5o0M6l9P4
7523E0q7K6K%J0k3O6l0qj9N0j8ql9qK9k5N1m8j2O7j8j0oJ7L0n7%J8J6m5J8J2K3
$$ plain form
7296 -7 -43 -31 61 6 -9 29 2 -56 12 -2 46 106 -4 0 9 -1 15 -5 25 -10 -44 -49 -27 5 20 -13 8 19 18 -14 -20 18 39
7329 39 13 19 -17 -1 -27 3 52 -7 -8 -8 42 -12 36 -24 15 1 -35 89 -30 -3 -29 -34 5 -30 6 0 8 31 -42 -6 7 -36
7361 -36 35 25 -10 -36 -5 16 -16 -4 40 -42 23 -30 -21 -11 15 2 26 53 -54 16 10 -1 -4 -12 -14 33 -28 -3 -21 -34 61 -21
7393 -21 36 -38 -30 35 21 43 -21 -60 -15 25 16 -37 -50 -18 18 5 -2 63 25 -20 -38 37 36 17 0 -35 -37 -13 -52 49 -11 48
7425 48 -20 -21 68 -18 -17 24 -29 -22 42 64 -40 36 23 -56 -31 -59 24 -13 -33 121 27 11 19 -41 9 8 27 -24 -20 -48 10 -17
7457 -17 48 -15 6 -2 8 -54 4 52 40 -1 -6 2 -23 8 -16 -27 28 18 -4 -10 -84 30 -26 -11 -3 38 7 -24 62 5 -2 16 36
7490 36 -14 67 17 -8 15 11 46 46 28 22 -77 -27 -16 -12 10 -50 -16 8 -40 3 61 26 46 62 -1 7 -25 -6 29 -31 15 -24 50
7523 50 -37 -11 -9 -9 1 -22 44 14 6 -13 37 19 11 -28 -36 -7 -32 19 -29 -41 26 8 -2 -8 9 39 -18 -18 0 16 -29 -11 1 24
7557B4l5M7j2k8m5L7k0J6J6L3jm9MNM3m0N9m7j4l0O9l1j0K2J3%lk3N1l8J3p3J2
7590c5M2l4LM0j6JJ2j7K8j7J7l8j2k9N0j0M1q1O7l6lO3p1P1j8n0K6k1L3NK1k8
7622DPRk0m9O5l1K2j2j2J0K0K0K9l7m3oM0k7P1m8LK4k1k0ok7K5nNK3l2L4l9O6
7656D2n8L0l5K8l3K6pJo0M6L4JJ9q6P7n1N3j3l7J9K0l8Rj9PN4o4LM9l4Kj6NN3
7690B7j11J23K6o1M2j6n3M5nqM6l6k4J5NK5j8QK0l5J6p6N2o0M0M6j6k8L4K0J1
7721E4j6j06N8K0k3J3J2j0K9p3L0k4K7K4o9lN3RM5k6j4k9M0m6O3n2J2L9q3J8L3
7752Ek2J1L8k5OM1r5O3L9j20J09o4j3Mj1lmO2l1plM5l1J8k1J2NRn1J2M7p4L9P5
7786F5k7n1OjL1j6%k1N3j2l8O7j10P1j1JNl0L3j3K5o8K7k2K0R4j01MN2o4pM8k4
$$ plain form
7557 24 -11 36 24 -4 -49 -12 -32 -16 0 33 32 -17 -13 -8 35 -5 54 7 -7 -37 32 1 -9 13 26 26 23 0 51 13 26 -47 -35
7590 -35 7 -27 -24 16 0 1 13 -4 24 7 24 -14 -26 -55 -5 -15 26 -55 12 -24 -27 36 -35 36 18 -32 -6 -27 6 11 32 4
7622 4 11 20 0 -49 16 -15 7 -5 -17 -7 13 33 62 25 -18 -24 16 -11 60 12 15 39 18 -2 -8 -35 -10 -15 -10 13 -19 15 -24 42
7656 42 -16 14 -21 7 -26 0 -7 -6 -66 -20 14 15 34 -52 25 -26 27 14 -23 -4 16 -22 -13 -32 -25 29 -35 -32 17 -17 -15 -31 -26 27
7690 27 -84 39 65 4 46 30 -23 22 17 9 55 19 -5 10 15 40 22 30 50 15 31 -45 7 -53 -13 33 17 -11 23 43 54
7721 54 38 -68 -10 10 -13 0 12 2 31 -42 -12 -36 -9 15 -54 -57 -4 5 50 24 10 -19 21 -25 38 -14 -2 37 -46 -28 5
7752 5 -17 -6 32 7 13 54 -41 22 61 -59 50 -14 -27 -23 -34 -37 -41 21 -10 -17 -20 25 -6 12 -9 3 8 17 -34 -22 25 -49 -10 65
7786 65 38 -13 -7 -8 23 7 7 -14 39 27 -11 56 -54 17 6 7 12 -18 15 2 27 -41 -14 -36 -16 78 -23 -19 33 -31 -38 10 -14
7819a4l8L5j6OK1M5n8O2j7p0J0J2JJ1N2l3K8Rq3RR2oq9l9O1j1L2%n1K7LJ4L5o1
7853b1L8p2N8k1j7P1o3L9J6k2kk7QM9n0L8%J5q2M3mj7Q5m2nJ2k0k1qoJ4K7m3J3
7887a7jjM3o6jOL0L1l2k3M8j7k5K9nKJ2m7K3Lk5nJ09n7j2oL4lo2N3o8K3L3j0M9
7922D5o9P4k4n1M3Nj1K7k3k8J8n%k3J1Mk0NN3k9k8L6j1n1L4M9l1k0jM6rn7QJ9
7956a4M7o9N2j1j7J2Mk2J0nL3n5Pk8J1L4K3j6j4R7p4l1M1j7L0m8M5NM7o5M0o1
7988ij5M7n0M6mk5J3J8l3L0J6k3L7j5mk0K0l1K2l7M4J6o6M3nm2j7nP9l9N6j4k8
8021Ej4k0P8r4M1l5L7L3QJ4m1K8o2M2j0Ml8J5N2n2o0R9lOj2nl2L4Jk3k4j0%M8
8055A0k6J8J3nk4J9jm6O6n1O4k8Om0P3n5L6p8J13m3qJ9k8L0l0jl6k0Q9n6jL4k1
$$ plain form
7819 -14 -52 -17 -33 -27 -6 39 -19 43 26 -44 -34 -22 -21 -10 42 9 37 46 -37 -28 64 58 -31 -70 -9 -20 12 12 -39 -12 -9 5 40 -21
7853 -21 17 -55 3 -18 -35 36 -27 12 28 6 4 -23 -15 34 -16 22 22 37 -45 -2 -6 -23 62 20 15 27 7 -14 -22 -28 -14 13 -30 -17
7887 -17 -18 -19 24 -42 -43 -37 -7 24 -8 -31 17 0 -25 4 -1 1 13 -34 -11 -8 -33 -38 71 14 2 -4 30 27 -35 18 -50 -27 6 -4 45
7922 45 -24 50 26 -25 18 23 12 39 16 -12 6 1 1 -22 -11 -7 -27 -22 31 2 -26 10 -1 -52 -18 31 0 -20 -21 25 16 -41 -33 -14
7956 -14 33 -36 16 5 -12 0 4 -18 -8 -13 20 -35 -28 -56 -45 -11 12 -4 -18 79 5 -26 15 -2 28 -20 25 30 77 12 52 -9
7988 -9 -24 23 -27 19 15 -10 3 21 -12 18 34 11 48 33 29 9 29 -2 20 -17 27 43 -23 20 15 -27 -44 -49 30 -9 47 33 5
8021 5 -9 -29 49 -45 -4 -39 -2 31 39 53 12 40 -22 20 10 14 -24 -9 43 -9 -69 30 27 33 21 16 -16 18 19 -4 -28 -38 -38 10
8055 10 -16 2 15 10 -14 5 4 -42 24 -27 37 9 15 -25 48 -7 29 -49 64 21 13 32 4 34 4 3 -33 -53 36 -20 -21 13 -8
8088hJ5kJ5n6RK9o8K7O3l7L4k9l2N5k0jrJ8jJ6Lnl9M5j9Rj6j7K4NJ6%%o0j5N3
8124BJ1J2K8r9L6L7m0Ok3O3k3j8j0J0k5J7K7m9K2O3p5M5l3J0jN1K3n9J2j2K4o7
8156c5J04q7LK9J4k3pM1q6M6qJ3N1p5m2R9j6m1oN4k7J0l5J6l4M9p0K7pM0J7J9
8188C3J6o8N
$$ plain form
8088 -8 7 5 20 -36 -27 2 -66 -39 24 -13 21 -8 -40 15 -5 -6 -15 3 2 18 21 16 -23 22 3 12 -4 -21 3 8 24 24 24 -36 -51 2
8124 2 13 25 53 -46 -10 27 -13 -7 -30 33 10 -8 -18 -8 -33 -16 11 -38 -16 47 -28 17 -16 -6 -7 44 67 8 20 8 32 -35
8156 -35 69 -18 -15 14 28 5 -2 39 -47 -1 -9 4 55 -20 -62 37 21 -20 -26 28 1 11 -24 -8 -42 7 -63 -36 -43 -3 14 33
8188 33 49 -19 -14
8191a4
$$ Imaginary data points
##PAGE= N=2
##DATA TABLE= (X++(I..I)), XYDATA
0@%%%%%%%%%%%%%%qJ6j6J6j6J6k4L2l3M1m9N7p2Q0q8J04j20J36j53J77k01K25
36A20k56K88l21L56l96M42m90N40n96O60p29Q03q83R72j073J183j303J437j588
55h34J756j946K164k417K715l067L497m033M718n634O925q890J2256j9517O0339
70D8032l1518n7724J14986q9864M177N0798o0562O765L0586m1137K7957l673k0549
83b1726L1482j8964J0639j856j7783M0428m2068J5848K6998n1081L3736J9659
95B5312m3229K5443J0080l2188L1363j3494k0506L3833l4190J3568J5832l1620
107a9796K0399O595p216L70O120k195n545N976l550n025m707J0523q770K160N462
122H01j1927K4916j4684k161K1481k1370N964R953j1724p303J2652m821q734R896
$$ plain form
0 0 0 0 0 0 0 0 0 0 0 0 0 0 0 0 -8 8 -8 8 -8 8 -16 16 -17 24 -25 32 -40 40 -48 56 -64 72 -81 96 -105 120
36 120 -136 152 -169 187 -209 233 -257 283 -313 347 -382 421 -462 510 -563 620 -683 754 -834
55 -834 922 -1024 1140 -1277 1438 -1629 1868 -2165 2553 -3081 3844 -5046 7210 -12307 48032
70 48032 16514 -41210 73776 -16088 -11911 38887 -21675 -14910 15676 -25461 2496 -1177 -21726
83 -21726 9756 -9208 1431 -425 -18208 22220 -19848 -4000 22998 -28083 5653 25312
95 25312 -17917 7526 17606 -14582 16781 3287 -17219 16614 -17576 -4008 11824 -19796
107 -19796 603 7198 -18 352 6472 4277 -1268 4708 1158 -3867 -8574 1949 -6821 -4661 801
122 801 -11126 13790 -894 -3055 18426 -2944 3020 12973 1249 -6054 6598 1777 -6957 2939
136B939p764L312k354K334j901n361R463j2486J2644m190j0312K2584r957l026
150d075J5248m211q152J6441p314j0419J5475j7843P101O7j5064J7029j0320j209
164g246R678n706n10O884k760j577N695j0305J1905o299o844J7525j7877Q287
178H50N866j2229R785l152l497N491l695o413J2253r910k273J5481j7900J1736
192B393K170r425J1939r020K871K082n852J518K167m787J552N391q565J0083m002
207E15j83Q463j2184J0940m195n307P334p061M27Q11j012k498M488m372J422M219
223A807q810R534n578m20N266o427O489l719K936J009j393K930j632J823l014
238H01L013m582J530j11n118O975p593M707O89l626O084m006L404j977J482p07
$$ plain form
136 2939 -4825 -1513 -3867 -1533 -3434 -8795 668 -11818 826 -3364 -13676 8908 -1049 -4075
150 -4075 11173 6962 -1190 15251 7937 -2482 12993 -4850 2251 2318 -12746 4283 -6037 -7246
164 -7246 2432 -3274 -3784 3100 340 -1237 4458 -5847 6058 -241 -7085 10440 -7437 850
178 850 6716 -5513 4272 1120 -2377 3114 -581 -6994 5259 -4651 -6924 8557 -9343 2393
192 2393 4563 -4862 7077 -1943 928 3010 -2842 -1324 843 -3944 -2392 2999 -5566 4517 515
207 515 332 8795 -3389 7551 3356 -1951 5383 -1678 -1251 -440 -1452 -3950 538 -3834 -2412 1807
223 1807 -7003 2531 -3047 -3467 1799 -4628 1861 -1858 1078 2087 694 3624 1992 3815 801
238 801 3814 -768 762 651 -4467 2508 -5085 -378 311 -3315 2769 -1237 2167 190 1672 965
254I65j280J951l514L818m236L585j317j331M590o256N855l933J41K225m582L884
270E65l228K017j405J746m5j005M218m975N232l210kK304m480M524m394L013r47
287g2o18K886l203L743k838K258j727J74J068m079N041n476L062Q2k618M189l673
304a801L288k396J780r17j366K729m522M177l391J625N92j882L903l993M356k534
320c52O22J384l080L385l682K829k272R74J010k490M380m104L584j362n24K132
336B434l227L272l602K654j741l66K330l899M095l363J564l89j389J767k999L150
352B91l681K743m59j396M012l585M008j792J387O51j799K711l517K684k934J026
368C50k00k204L325m181L800k417M57K143l432L755k239J399p15J365k60j396
$$ plain form
254 965 -315 1636 -1878 1940 -2296 1289 -28 -1359 3231 -3025 2830 -1103 -962 1263 -3319 565
270 565 -2663 -646 -2051 -305 -350 -1355 2863 -2112 3120 -90 -92 2212 -2268 2256 -2138 875 -72
287 -72 -690 2196 -1007 2736 -102 2156 429 603 1671 -2408 2633 -2843 219 301 -2317 1872 -1801
304 -1801 1487 -909 871 -46 -1412 1317 -3205 972 -2419 -794 -202 -2084 1819 -2174 2182 -352
320 -352 270 1654 -1426 1959 -1723 1106 -1166 -192 818 -1672 2708 -1396 2188 826 302 2434
336 2434 -793 2479 -1123 1531 -210 -576 1754 -2145 1950 -1413 151 -238 -1627 140 -2859 291
352 291 -3390 -647 -1106 -2502 1510 -2075 1933 141 1528 2179 380 3091 -426 2258 -676 350
368 350 150 -2054 1271 -2910 890 -1527 -1070 1073 -2359 1396 -843 556 -159 1206 946 -450
384d50M245n094M260j904j518L440m990K902j692l60l94K73K03j658L500l480
400b717L695j774k57L828n893N252k098j534K677k299J256o68J110j352K859k520
416d35Q59L672o537O132k530j602L356l837K806k362L39J97l86j326L15J811m855
433d383M616k195l73K519k820M703l390K102J691j620J142r47K212l842K281r14
449G82k029J346k630L025l584J230J370j088P17p57M207m820L377J727m125M335
465C083k672J901m55j900J952l30k006k12L278o411L680Q96m660N029m667M051
481E57j85l958N927k670j402K855J66m114L854j009j970M182o353O123r30m699
497c626P943m550l42L396r02j859J493r9j096J988n069M740j937m018O566n167
$$ plain form
384 -450 3795 -1299 2961 1057 -461 2979 -2011 891 -801 -1161 -1555 -1282 -1079 -2737 763 -2717
400 -2717 978 -796 -1053 2775 -3118 2134 36 -1498 1179 -1120 136 -532 578 -774 2085 -435
416 -435 424 4096 -2441 3691 1161 -441 2915 -922 1884 -478 -139 58 -328 -1654 -1339 472 -4383
433 -4383 233 -1962 -2335 184 -2636 2067 -1323 779 2470 850 1992 1045 3257 -585 1696 782
449 782 -1247 99 -2531 494 -3090 -1860 -490 -1578 -861 -1618 2589 -2231 1146 2873 -1252 3083
465 3083 411 2312 1857 -43 1909 1579 -427 -639 2639 -3772 -92 804 -3856 1173 -3494 557
481 557 372 -3586 2341 -329 -1731 1124 1290 -2824 1030 21 -1949 2233 -4120 2003 1073 -3626
497 -3626 4317 -233 -575 2821 1919 60 1553 1454 358 2346 -2723 2017 80 -3938 2628 -2539
513b539L23J582j96j8j160J978n5J116k440M424j624l064O939n188J27J308j625
530a12J064k590L93L29j25k786M403j725l697Q069m865R34K264k244L623k879
546E6Q58J716j773j353M010k714l423O336n140J639K84k943M853m905J860K172
562A533l660Q93L019k222j995M592l833J898k17k462M542n054K425K053l463J187
578g64K025j46k458L872j958K98J250k529L235l908J263J642l046J35R12M38k971
595b710L239j578j52J856k711M520l711O61L711l770J289J073p69j301K190k329
611d92M39O26l489N080m936M21L913m855K930K7n93P36L92j56R78m51j431M401
629C540m732J465K645m899L858j872J14P44j736J695o21m79l51K331l131J301
$$ plain form
513 -2539 -2216 -634 -830 -848 -2008 -30 -85 1031 -1409 3015 1391 -1673 5266 78 205 1513 -112
530 -112 952 -1638 -1245 -916 -1041 -3827 576 -1149 -4846 3223 -1642 -708 1556 -688 2935 56
546 56 914 2630 857 -496 3514 800 -2623 3713 -1427 212 496 -2447 2406 -2499 -639 1533
562 1533 -2127 -1234 1785 -437 -2432 2160 -1673 225 8 -2454 2088 -2966 -541 1512 -1951 -764
578 -764 1261 1115 -1343 2529 571 869 2119 -410 2825 -1083 180 1822 -1224 -1089 -177 261 -2710
595 -2710 529 -1049 -1201 655 -2056 2464 -1247 -586 3125 -645 644 1717 948 -353 1837 -492
611 -492 -53 573 -2916 2164 -2772 -2351 1562 -3293 -363 -336 -929 -193 199 43 1021 570 -861 3540
629 3540 -1192 273 2918 -1981 1877 5 119 863 -873 822 201 -278 -629 1702 -1429 -128
645a28J638l603L478k401R49O22k343K321j197Q8m88J624j623R9K399k951K508
662I92j258O10Q43j886K177j615P13p03R24r97p87K311k988K431j376j81J924
679A134k356K121r32K15p2Q49l92j157K306k499J951j243m79J665k793K666j818
696h34j75P82o48N90q94J281j355J763q16k69J776k543K868j517o6Q90j274J533
714A092j445J126j126O95J86q90J487k151K049j115R9O03j525J997j831J399q52
731b02j32J053j456J642j874J269m72k14P48j621J909j756J360m71o48J462j629
748a032J842j594J022r0o20J510j902J678j118P82p8o61J294j849K082j414L47
765A99M39j181J599j687J338j112M53M85j328J753j854J441q01p0O75j378J622
$$ plain form
645 -128 1510 -2093 1385 -1016 -67 555 -1788 533 -664 -576 -1064 560 -1063 -964 1435 -1516 992
662 992 -266 344 1187 -699 1478 -137 576 -127 797 -200 -987 1324 -1664 767 -609 -790 1134
679 1134 -1222 899 -33 182 110 959 567 -590 1716 -783 1168 -75 -554 1111 -1682 984 -834
696 -834 -1009 -227 -875 -285 -1179 102 -1253 510 -306 -575 1201 -1342 1526 9 -57 833 -441 1092
714 1092 -353 773 -353 342 528 -362 1125 -1026 1023 -92 7 610 -915 1082 -749 650 -202
731 -202 -334 719 -737 905 -969 300 -172 -386 362 -1259 650 -1106 254 -217 -865 597 -1032
748 -1032 810 -784 238 148 -472 1038 -864 814 -304 478 400 -261 1033 -816 1266 -148 199
765 199 638 -543 1056 -631 707 -405 48 533 -795 958 -896 545 -256 -326 349 -1029 593
782E93j621J255p33p1R47j380J797j654J177k34m02J103j501J655j470J035l23
799A73o50J321j742J688j316O83p7n04J289j754J820j136N33L96r25J325j484
816c60J479j251L11L82j349J438j601R44q51L16J84j040J820j962J637l51m01
833f55J213j120J362j134J296p74J0R09j670J827j744R16j64p74J056j352J330
850E32j198Q99j73m45J050j324J635j520J015L9j305J850j823J081n61k7J91m58
868e42P78j242J843j834R67P68j897K251j520N26J0l38M29p53Q22j154J359j364
886h91N22J047k045K364j364O77L36o77J254r90O40l93O65j179M99N08k260K379
904A092k109M69O11j815J882j128P9M79M52r54Q51J095k230K603j451K30R28j828
$$ plain form
782 593 -1028 227 -506 -577 370 -1010 787 -867 310 76 -326 777 -724 931 -539 496 173
799 173 -477 844 -898 790 -526 157 80 -424 865 -889 931 -205 328 724 -201 1124 -360
816 -360 1119 -132 179 561 -788 650 -951 -7 -858 -542 -358 -1398 422 -1540 97 -254 -655
833 -655 558 -562 800 -334 962 188 198 1107 -563 1264 -480 436 272 -502 554 -798 532
850 532 -666 233 60 -385 665 -659 976 -544 471 510 -795 1055 -768 313 -248 -275 -84 -542
868 -542 236 -1006 837 -997 -30 738 -1159 1092 -428 98 108 -230 199 -554 268 -886 473 -891
886 -891 -369 678 -1367 997 -367 310 646 -31 1223 233 873 480 1145 -34 465 973 -1287 1092
904 1092 -1017 -548 63 -1752 130 -998 -919 -440 12 -942 -91 1004 -1226 1377 -74 156 1084 -744
922g44K099j636K12M26k93m16O4Q98j796J802j094M69O37j870K795j891J10J260
940A032r97n0K26N67j752J813j326J26J175k418K717j426m72J626r81NJ09P73
958G47j526J249p15j36J027k517K813j500q74K123j574N05J56M18m51P78m70N31
976E84Q26k450L373j982j000K784k784R76Qp28K75r8q10R17L83k587L496j693
994e10j068L188k679J346pm27Q69q55R7N66j56j581K514j754o78K337k594J938
1012E46q35m28J889k049P87R70q09q54K274j626n81K379k770K000q38p99K100
1029A356k302Q21P57p88o02J660r38p71K029k178J733j037o13K254k898J458M14
1046C55j166K82P19n69l84J303j580J928j238k97K609l133J796N37j530R11N2
$$ plain form
922 -744 1355 -281 -69 357 64 -352 -288 610 -1186 616 -478 -9 628 -1242 1553 -338 -228 1032
940 1032 35 -15 211 778 -974 839 -487 -361 814 -1604 1113 -313 -785 841 -140 -135 -26 747
958 747 -779 470 -245 -381 646 -1871 942 -558 -1432 691 -883 -378 -222 196 -255 523 53 584
976 584 1410 -1040 2333 351 -649 2135 -649 327 335 -393 -118 -216 -1026 -109 274 -2313 1183 -510
994 -510 -1578 1610 -1069 277 270 -157 712 -143 -46 520 364 -1217 1297 -457 -1135 1202 -1392 546
1012 546 -289 -717 1172 -877 -90 880 71 -783 1491 -135 -716 1663 -1107 893 55 -744 1356
1029 1356 -946 -125 632 -156 -758 902 -36 -807 1222 -956 777 -260 -873 1381 -1517 -59 355
1046 355 -811 -529 190 -379 -763 540 -1040 888 -350 -647 1962 -1171 625 1162 -368 543 595
1063E95l36l37P58j365J442j055o81K404k902J483M30j114Q23l54O01p35N65m59
1081b37O80n84m97J865k398J452Q7j278J274r78P43l62o2j15P67m73p58K273k461
1100a062J254O84j639J573r17M89m0l05n7N70m23p52J983k292J094N95j754J855
1118H56j538Q28K29r84P21m6k47k01J101j723J092J90j258J967k150J288L49j436
1136i62J462p43M1K51L70r59P08K19r35J689j975J268J17j066J471j329O13j55
1154H5J78j22k65L76o63J185j377P17P0q28J462j364O78l68J83L14p51O10p71
1173f51J004q78M27J38r72J556j126M59q0n0N58m41P20j043J143n41q7O84j326
1192e06J225p82K39k04l70O88q88R09r14M24O8q9O63j145J272q35O02J61r05R88
$$ plain form
1063 595 259 -78 680 -685 757 -298 -979 1425 -1477 6 436 -678 145 -209 392 -343 222 -237
1081 -237 443 -141 -638 1227 -1171 281 368 -910 364 -614 129 -233 -295 -410 357 -116 -874 1399 -1062
1100 -1062 192 876 -763 810 -107 382 342 37 -20 550 127 -625 1358 -934 160 755 -999 856
1118 856 -682 146 375 -609 112 66 -181 -382 719 -1004 88 278 -980 987 -1163 125 474 -962
1136 -962 500 -243 -202 49 419 -540 168 387 -548 1141 -834 434 551 -515 956 -373 240 85
1154 85 263 141 -124 252 -411 774 -603 114 184 -644 818 -546 132 -236 -53 261 -490 120 -651
1173 -651 353 -525 -98 40 -932 624 -502 -43 -123 -173 385 -56 664 -379 764 223 136 820 -506
1192 -506 719 -63 176 -28 -398 290 -598 311 -603 -179 -111 -200 463 -682 590 -245 357 518 -387 601
1212F01q80P68o41Q2j06k65P93j369J129p37K61N33q86R64p21Q54l56J20K84o51
1232b23J228j200O77k88k37O05q80Q61j022P46j38l41O70r31R43o56M94l52k34
1251b78P72j121J057r83J93L13n63O25p35P40o13O05O3n37J122r51R32m51R3K80
1271E63n42Q01j097P42o09PL24q36P75q42Q13m44N7N87q60J268r17O39q1j30M95
1292G13p00O92r46O78m53m09O85j072Q14o08L31j12k19P18q20J022o57M08K53
1311C18m73P41q52Q85o30J88K00o45P42q24O55m01J68R0l31Q53j087J002m37j94
1331c2O24r59P76o96L26l16j2J92o45R90j113Q79j96l45R56q24R15n23K55J14
1351C66k37L51n49O44r26N86k80m66Q23j182R51m83k1N82n53N91k73O61o79O71
$$ plain form
1212 601 -279 489 -152 -70 -176 -441 352 -1017 112 -625 -364 169 -717 247 -474 380 24 144 428 -223
1232 -223 1005 -195 482 194 -43 562 -318 543 -479 267 129 -212 458 -473 470 -186 308 -44 -278
1251 -278 494 -627 430 -553 -360 -47 -610 15 -720 20 -593 12 75 -462 660 -291 641 190 283 563
1271 563 21 822 -275 467 -142 -135 189 -647 128 -714 99 -345 -288 299 -561 707 -210 429 348 218 713
1292 713 13 705 -241 437 -16 -425 260 -812 2 -606 -275 -387 -606 112 -708 314 -343 65 318
1311 318 -155 586 -266 619 -11 177 377 -268 474 -350 305 -96 72 162 -169 684 -403 599 162 -32
1331 -32 592 -367 409 -287 39 -277 -289 -97 -742 248 -865 14 -182 -527 429 -395 520 -3 252 366
1351 366 129 480 -69 575 -351 235 -45 -511 312 -870 81 -402 -423 159 -394 197 -76 585 -94 577
1371E77k2o08J057j192P77l80n13O94p74K68k87L49o07M20J07o91J198j073R02
1390B02j83n15J158j013M80M1j8l17L12P3o33R72j136R80k72p20J502j192N05
1409B26J96l36J22J1mk88N91j062Q37k96q56J559j421M88K95n38N42k88L51k37
1429a08M06m51N43j29o86J340j493N91K76p43O12o54L49n1O2l59O68j27p49J649
1449I46j321N01N62r09R64p13J60J61j92l33N69k84q94J572j404L66O12j176J296
1468D83r81K64N30o57J44N29l97m16J282j308M94M46j145J490j374N01O97j160
1486e78P15J10l49j54Q43q98N45J76q95J430j421N30O19j272Q99j72k11NK96m41
1506b23J76J80n81J066j222N09O58j225R93l94j06N6J28j17oJ62o62J214j129
$$ plain form
1371 577 555 -53 1004 -188 589 209 -304 390 -384 -116 -403 -54 -661 -241 -134 -825 373 -700 202
1390 202 19 -496 662 -351 129 170 152 -165 147 220 -413 559 -577 403 131 -589 913 -279 226
1409 226 422 86 208 219 215 -73 518 -544 293 -3 -859 700 -721 -233 62 -476 66 -222 129 -108
1429 -108 298 -153 390 261 -425 915 -578 13 289 -454 158 -496 -147 -198 -136 -495 173 46 -703 946
1449 946 -375 126 688 -221 743 30 190 351 159 -174 395 111 -783 789 -615 -249 363 -813 483
1468 483 -498 -234 296 -361 -217 312 -85 -501 781 -527 -33 413 -732 758 -616 -115 582 -578
1486 -578 137 247 -102 -256 587 -311 234 410 -485 945 -476 54 673 -599 300 128 -83 -78 218 -223
1506 -223 -47 133 -448 618 -604 -95 563 -662 331 -63 -169 -113 15 -102 -108 54 -608 606 -523
1525e23L00R18j433J008j92k34L02p0j0R0J12n83J118j088K13R02j517J214m94
1544C3k83O03o32L20Q1k59j41P53r91M08O33j374J357o80m7O69r19P63k79k25
1564b10J41L05n77K47L84r78J032o27J01N22q74R39m18OJ58Q9j16j24O00q75P82
1585E07m68p7N13r61Q07m13j14J51j00j6j02M53p08Q03l79j96Q41j142R15k28
1605H6l52M98k99k6N5K93p06O62l59j28P77j081R32l19j80O67o39L89j59N4j47
1626A8J94j71j40M72q34P48m58o8N86p43O30m27K10J75k58J80k03M01n27M90l52
1647g7k41N76p69O40n52J80J58k00L26l84O20m15L68L7l44O21n21M49k73k5J42
1668C16l16K60m85M11m31K10J3m77O91o18N10j45k29N89m52M31m17L16k25J00
$$ plain form
1525 -523 -223 695 -738 270 78 -156 146 76 66 156 268 -315 803 -285 -72 830 -687 527 33
1544 33 -250 353 -279 41 122 -137 -278 475 -516 -108 525 -849 508 -172 -219 450 -469 294 15 -210
1564 -210 -69 236 -341 -94 290 -688 344 -283 -182 340 -534 405 -13 -7 151 240 124 0 600 -275 507
1585 507 39 -38 475 -486 321 -92 -206 -55 -155 -171 -273 180 -528 275 -104 -300 541 -601 314 86
1605 86 -266 232 -67 -93 -38 255 -451 211 -148 -276 501 -580 352 33 -147 520 -119 270 111 165 18
1626 18 212 41 -99 373 -461 287 -171 -239 347 -396 234 -193 17 192 -66 114 -89 312 -215 275 -77
1647 -77 -318 258 -511 129 -423 -243 -85 -285 41 -343 277 -138 230 267 -77 544 23 472 199 174 316
1668 316 0 260 -225 186 -245 -35 -22 -499 192 -426 84 -61 -290 299 -153 278 -139 177 -48 52
1688E2J91n50N73o26M17j74k17N23o20N91l30J51J18j37L36m42N20m74K97j0l59
1709a70M76n99N52l92N3J90m36O39n10N27l39J20J45k93M06m79L94k87MJ18m76
1730c57M45n36L66k41j20M08m63N71m22L96K6p8L99m51N29l61K21j54q9K41n77
1751b47O10n34J29R1m08N11n04L97k06J31J24j92M32m71M37l23O0Q5l26M91o38
1772c51L94k26l0K70m06L64k58L15k91J21L25m65N43m59L43j18j63L12l93L88
1792B15m21K47r1j33L47m79O26l42J96J42l46M09m04L13l22J70qk84L39n81N35
1813A28m23J06J67m86N70l82K29k4R3M9l5L07n07N89l76M4L06o63O09m49J11L4
1835cj58J36j37L31m53M58k71Q5L89o43P18m82J14J60l61L32k89J99l38L14k39
$$ plain form
1688 52 243 -307 266 -360 57 -117 -334 189 -431 160 -170 -19 99 -38 298 -144 376 -98 199 189 -170
1709 -170 306 -293 259 -133 -80 110 -326 313 -197 330 -9 111 256 -37 369 -110 284 -3 1 119 -357
1730 -357 88 -448 -82 -323 -443 -35 -498 73 -349 47 73 -5 394 -57 472 111 332 178 89 330 -247
1751 -247 363 -171 -42 49 -359 152 -352 45 -161 -30 94 -98 334 -137 300 -23 37 122 -204 287 -351
1772 -351 43 -183 -213 57 -349 15 -243 72 -219 -98 227 -238 305 -154 189 71 -92 220 -173 215
1792 215 -206 41 -50 -183 164 -315 311 -31 165 307 -39 370 -34 279 -43 127 119 -165 174 -407 128
1813 128 -295 -189 -22 -508 62 -320 -91 -115 -22 27 -8 299 -208 381 5 49 355 -308 301 -148 -37 -3
1835 -3 -161 -25 -162 169 -284 174 -97 -12 377 -266 452 -30 84 244 -117 215 -74 125 -213 101 -138
1856a38o6L86o28O63m25KM49m88L84k14J04j20K61j91j54M51p16P18l96j84N72
1877B70n61M55j56N1Q2J3k1l3K87n61O81m88j38N96q72N59k24j37K16j96O3m8
1899a62J40m07O94m04j26O82p88O18k31j43M74m69K38o2J7l12L96k19j96N43o68
1920c85O91l28j70N11n49L82k1j06n2K79k14j95O20q23N94j88l31N99o94L94N7
1941G1k10J9K19j37k01N45p17O06k22l25P60q56M53K3k79K63Kq2n6L75n41N16
1963B26j90k46Q29r44N59O4n25N40l13K7n5J39k57L17j92k74O92q22N94k1n32
1984c84O08l10N7l4J01j56J85p5k61O52p77M50J00n44O31m32J71M6m5O0ppk51
2007b22O11p27M81J22o06P37n32J62J56j94J79m1j46j04M40o50M20R8n88P83o54
$$ plain form
1856 -138 -204 182 -446 217 -208 -206 243 -245 139 -75 29 -91 170 -21 -175 276 -440 278 -118 -302 270
1877 270 -291 164 8 59 141 154 133 100 387 -174 507 19 -119 477 -395 164 -60 -197 19 -177 -114 -162
1899 -162 -22 -429 265 -139 -265 417 -371 247 16 -127 347 -122 116 54 71 -241 155 -64 -260 283 -385
1920 -385 306 -22 -192 319 -230 152 131 25 -27 252 38 -157 463 -360 234 46 -285 314 -380 14 71
1941 71 -139 -120 99 -38 -239 306 -411 195 -27 -352 408 -448 5 28 -251 12 14 -68 -124 251 -290 226
1963 226 36 -210 619 -325 234 298 -227 313 0 27 -28 111 -146 171 -21 -295 397 -425 169 148 -384
1984 -384 224 -86 -29 -63 38 -118 67 -8 -269 383 -394 56 156 -388 243 -189 -18 28 -17 43 36 29 -222
2007 -222 389 -338 143 265 -341 396 -136 26 182 -12 167 126 -20 -124 316 -334 86 184 -404 379 -275
2028b75K88J62m51L84j85L2q6K93l70J99J70n86P94o77L76R5m98O30l94L4J40
2049G5k9j72K15J17m23O51n73K71J92n57O08n02J89M1j20Rl5J10l75M97m20J84
2071d7K26n08N51l86J31O1o2J11j79J62l57M58l70J17K76n11O21m67J99J45k74
2092a03K82j81J97k16K58k10K9K06n22N74l87nK77m11L61l16J89r2J15j16q8L77
2114B18m54M63l15N1J90l71L96m01K17o7o1J06j79L27l89L89k47JL62m89M73k66
2136d6J20N0j26J81k00L23m56K91n9j95L34m37L51k39N9Q0j07J84k76L34k82J97
2158H1l4j95L20m21M39l72P9J48k76L20l01K28j22Q1R4k07L80l62L23k04K0K27
2180B46l48L09k65J52q2r3J56k39K79k96K55p4p5J96k98M61k99R9K8k23L72l82
$$ plain form
2028 -275 13 175 -276 108 -77 -45 -131 162 -208 -9 161 -425 369 -308 68 163 -335 295 -99 -65 75
2049 75 46 -126 89 206 -217 434 -139 132 324 -233 375 -127 62 103 -17 -8 -43 67 -308 189 -231 -47
2071 -47 179 -329 222 -164 -33 28 -34 77 -102 60 -297 161 -209 -92 184 -327 294 -173 26 171 -103
2092 -103 179 -2 195 -21 237 27 56 262 -260 314 -73 -78 199 -212 149 -167 22 -70 45 -71 -159 218
2114 218 -236 227 -88 -37 153 -218 178 -223 -6 -73 -134 -28 -207 120 -269 120 -127 -126 236 -253 220 -46
2136 -46 74 124 -2 179 -21 302 -154 137 78 -117 217 -220 131 -108 -49 31 -76 108 -168 166 -116 81
2158 81 47 -148 172 -249 190 -182 -103 45 -231 89 -212 16 -106 -25 69 -138 242 -120 203 -1 19 246
2180 246 -102 207 -58 94 12 -81 75 -164 115 -181 74 0 -75 121 -177 284 -15 84 112 -111 261 -121
2202a21K69l02P1J21k19K09l33L14j77J26j0j01L40l70L54k28J20J31k56L23l59
2223i8K55j64K3J09k45K52k22K28j13m8K16l44L67k74K35j14j44K50l56L13k74
2244a48J49k8j28J84l17L44k78J82j7j27L67l87L28j31O7O2j75K83l53L38l07
2265i2J19M0k77M24l56K59j41m6K25k43K58k54J72l1lJ02k67L55m29K59q2j50
2287a58K61l65K83k15J41n0lJ38k46L37l23K79L4k54L66l34K97k04n0J14o2J30
2309A16k63K77k37K31L8l11M27m81L35J4j67J31j73K09j77J34k47J31J34l50M01
2330A72m50K75L8j94K74l12K71k01K14j57J0J56k78L63l81J94R7k29L20l53K11
2351D0p5J04q9K2J55l20M60m30J88J49l99M59l33J06oq5J6NJ08l01M34m19J51
$$ plain form
2202 -121 148 -154 -83 38 -181 28 -305 9 -168 -42 -52 -153 187 -183 171 -57 63 194 -62 261 -98
2223 -98 157 -7 16 125 -120 132 -90 138 25 -23 193 -151 216 -58 177 63 -81 169 -187 126 -148
2244 -148 1 -27 -155 29 -288 56 -222 -40 -57 -184 183 -204 124 -7 60 122 -53 230 -123 215 -92
2265 -92 27 67 -210 214 -142 117 -24 -70 155 -88 170 -84 88 57 54 156 -111 244 -185 74 -8 -158
2287 -158 103 -262 21 -194 -53 -103 -106 32 -214 123 -200 79 113 -141 225 -109 188 -16 -66 48 -14 116
2309 116 -147 130 -107 124 162 -149 278 -203 132 146 -21 110 -63 146 -31 103 -144 -13 121 -229 172
2330 172 -278 -3 35 -159 115 -197 74 -127 87 -70 -60 96 -182 181 -200 -6 91 -138 182 -171 40
2351 40 -35 69 -20 2 157 -163 297 -133 55 204 -195 264 -69 37 31 -54 -38 -33 75 -226 208 -211 -60
2374f0K11l74M11l38R0J68j98Q8J0k0j26L23l18J33J97m80N02l08K9K45l52L06
2396A39j09j5m3J92j59L4J79m48N13l80R2K22m51L58j66k5Q1Pj34Q1J51l59M72
2419B32l90R3K58m89M57k41K2J23j17L2j6J03k63L64l13O5K57m50N03k29j5J94
2441A80k34J09m5J08j79K70k69O6K72n61N04k23j30L02l13J03J1J4m9J98k25K1
2463g0K20m20M34k00p5L42m24K43j35N6L2O1j12J3J94m45M72j96j23M10m59K70
2485H8k6j14J57r2N1j23K80l87L32k12p9M01n62L87j03j06J64j41P6n6Q2j78K71
2508A10j27n8K91m79M00j36j49L38k72O7m7N2p5J46r3n2L04m11L86j86j17L13
2530B05k95K69j29m4k4Q3n4o3J87l44L52k06j48K99l10L20j85L8P2r6J37j42K22
$$ plain form
2374 -60 151 -223 188 -150 -60 108 -90 -2 8 -12 -138 185 -133 0 197 -283 219 -89 -60 185 -167 139
2396 139 30 15 -28 164 5 39 218 -230 283 -97 -5 217 -234 124 -42 -67 14 21 -113 -32 119 -240 232
2419 232 -158 -65 193 -296 161 -80 -58 65 -52 -20 -36 67 -196 168 -145 -80 177 -273 230 1 -14 180
2441 180 -54 55 10 118 -61 209 -60 6 278 -283 221 -2 -132 170 -143 -40 -29 -15 -64 134 -91 -70
2463 -70 150 -270 164 -36 -111 231 -193 50 -85 -29 3 64 -48 -35 159 -286 186 -10 -133 277 -182 88
2485 88 62 -52 105 13 64 -59 221 -166 166 -46 -125 276 -286 101 -2 -108 56 -85 -9 -65 17 -161 110
2508 110 -17 -75 216 -263 137 1 -148 190 -82 -15 -62 -10 -85 61 -32 -84 220 -191 195 9 -108 205
2530 205 -90 179 50 6 -18 65 11 -52 135 -209 143 -63 -211 88 -222 98 -87 -49 23 -73 64 -78 144
2553A44l11J72N4k04K92l36K54p2n7J16j00Q2r3J68j76K07k6k40M07m28K41mj14
2576b4J77j99O9p0J44k59J75J8k09L54l65K08L8j97K15j83J88j53P3k4JM0j91
2599a74K53k44J77m0k00L54l01K26%m7M1o7P6j10K62k83J24P8k05K40k40R3K7
2622D0r4J06j58K12k21J92j43M6R0j99K63k61J83n1q3J61j89J52j28Q5r8NK10
2645A20k40K45j82J00M6j25J79j95J96j60J12m5j14K17k50K32j49J9N4j33J34
2666F1j55J53m6o8J36k20K76k39J32j3j0O5k09K26k24J80n9n4O9r8J98j87J27
2689D1r0M1J01j89K51j78J04mq3J06j39J61k14J17J5j19K08k31J78j33N8R3j84
2712i0K53k38J43r6mK2r2J60j84J53n6j6P0j51K05k34J58J4l6N2j07J27n0J28
$$ plain form
2553 144 -167 5 59 -145 147 -189 65 -7 -64 52 -48 34 -59 109 -67 140 114 -126 281 -147 94 90 -24
2576 -24 153 -46 23 -47 97 -162 13 31 -178 176 -189 19 57 -140 75 -108 80 -73 0 -24 -23 17 -174
2599 -174 79 -165 12 -28 -228 126 -175 51 51 4 45 -22 54 -56 206 -77 47 125 -80 160 -80 13 40
2622 40 -54 52 -106 106 -115 77 -66 -20 70 -129 134 -127 56 5 -78 83 -106 46 -82 3 -95 -90 120
2645 120 -120 125 -57 43 89 -36 143 -52 144 -16 96 51 -63 154 -96 136 -13 6 60 -73 61
2666 61 -94 59 13 -55 81 -139 137 -102 30 17 7 72 -137 89 -135 45 -14 -68 1 -97 101 -86 41
2689 41 -49 -8 93 -96 155 -23 81 77 -6 100 -39 122 -92 25 40 -79 129 -102 76 -57 1 94 -90
2712 -90 163 -75 68 -28 -32 -10 -102 58 -126 27 -29 -45 25 -126 79 -155 3 17 -19 33 -74 53 3 131
2736A31j36L3R0k27K78j89J8Q7j53J39j50K11j71M7On2J56j97J91j72R0l5n5R8
2760C8j69J25o6J08Mj80K61k66K15j35oJ28k14J94q3Q1o2K1M4j09J60j47J44l3
2784E3j06K17k84J82r1M9N6r7P1j15J88j78K29j78m5K02k54J53j06K2P3j41J50
2807E0j24R8j89J93o3p5K31l32K43m4j9J39j57R7p2R3q6O3J7j27K08k68K03p1
2831Hn9J98k68J97j37K4K1L8mk7J27k29J64p9p0J56k16K03o3p3R2l6M3j16J82
2856G6k36J99k7j80L48l13J98m0r4J82j99Q7j5N1j50J39j3j14K42k95K29pj58
2879i0K10j35N2m3M7k3KK8j58K36k67J62K9k31K54j54J14k0l4l0P5Mj15J88k23
2904a22J92qj49K66k71O5P1o2K5j1J3p8K27k44J69kk24L33k98J60K9j50K52k32
$$ plain form
2736 131 -5 28 118 -109 169 -20 -2 85 -68 71 -79 132 -39 8 14 -38 118 -79 112 -60 30 -5 -60 38
2760 38 -131 -6 -72 36 40 -140 121 -145 70 -65 -71 57 -157 37 -46 35 -27 -6 38 -71 89 -58 86 53
2784 53 -53 164 -120 62 -29 20 76 -21 50 -65 123 -55 174 -4 -49 153 -101 52 -54 -32 41 -100 50
2807 50 -74 24 -165 28 -35 -110 121 -211 32 -12 -31 108 -49 48 -24 69 -17 46 63 -64 144 -124 79 8
2831 8 -51 147 -121 76 -61 -37 -16 22 18 -9 118 -111 53 -26 -96 60 -156 47 -16 -89 3 -33 10 -106 76
2856 76 -160 39 12 -168 180 -133 65 25 -69 113 -86 1 -14 37 -113 26 13 -101 141 -154 75 68 -90
2879 -90 120 -15 37 -6 41 18 20 48 -110 126 -141 21 50 -181 73 -81 33 13 -21 -51 24 28 -87 101 -122
2904 -122 70 62 -87 179 -92 -27 44 -18 7 -4 9 -69 158 -86 83 81 -143 190 -108 52 81 -69 183 -49
2928d9M7m5P0j15N1N8j89L01k54Q9J13j90J95j08O3m5K0l2N1L8j48J86k02J31
2952C6N5k00K66k31M8Q4q0Q7o7P2j83K76j93L7Q3k14K07j81J30k8j11J17n7L8
2976ij19J49j25L7J85k73K94j78J15p3m6Q4n0L0j08K17k03P2Q3k02J76r5M1Q4
3000H6j32J12o3R5j16J03j09M1O8j91K43j60n5J60k20J47o0J6J2L2l0L5N4j11
3024d3J58j45j2J43j88J81j64K9J0NN2r5P0j13J77j03PJ23j60J76j63O7L8o5J07
3049I2j02N5n8L7j0k9J17k48K09j26N2N0j00Q7p8R7q4J7N0n8R4j59N8k8L5P6j38
3076i2J11o3P1m9oO2k6J05j78J21l6k7M7j22K27j23j8J5m8R3j24J56j29O9o3m5
3102g2J39j28P4p5M2M5o1R0j71J98p0Lk8j17J88j46J24l9k0L1n1J24j44O1%L6
$$ plain form
2928 -49 -2 -47 23 -92 -41 17 -172 129 -125 -36 77 -113 82 -26 37 -8 12 -20 31 69 -79 107 -95 36
2952 36 91 -109 157 -74 -26 58 -22 65 -2 70 -113 163 -30 7 90 -124 83 -98 32 4 -107 10 -47 -9
2976 -9 -128 21 -104 -67 118 -155 139 -39 76 3 -43 41 -9 21 -87 130 -73 -1 82 -120 56 -39 2 86
3000 86 -46 66 3 98 -18 85 -24 17 85 -106 137 -23 -78 82 -138 9 -51 -35 -23 9 -21 14 68 -43
3024 -43 115 -30 -42 101 -87 94 -70 -41 -31 -26 26 -69 1 -112 65 -38 -31 92 -68 108 -55 12 50 -15 92
3049 92 -10 45 -13 24 14 -15 102 -146 63 -63 -11 39 -61 26 -52 45 -39 -22 28 -30 64 -95 -37 -65 -30 46 -92
3076 -92 19 -44 27 -22 -28 34 8 113 -65 56 20 -7 40 -82 145 22 4 19 -29 64 -60 96 -33 36 -27 -72
3102 -72 67 -61 13 -62 -20 25 -36 54 -117 81 11 14 -14 -131 57 -89 35 -4 -24 7 -44 80 -64 -3 -3 33
3128C3Qj16J65j32M2m4j2J55j42P6p2N6l6N2k0q1J22j33R1L6j06J52j13N6j07
3153g0J07J9j67J60j85J22j8l4Ol3J30j15J02nq5O0l8J29j15O6q6L2N9j16J56
3178H1j01P0j03kP0j07K19j65P6j8k4M6j44J37j16J21j0r7J62j53Q5r3L3O2j53
3203a24J38o2Q6q1L7Ql4R8m8J8m2nN4p2M4m5R1p2M8j2j23J72j43J24n8K1K3r8
3231e7J14j33J24o1m1J25j70J39j51J41J9j17Q7j46J10oP9j38N2P2j02J24j52
3254h8J17k2n8J13j09O2o6P1k6J4M6j28J31j15P5L0j41J58j82K13l2j24L7NJ23
3279A04k20J80j13K9M9j40J67j32P8Mo2M3J8K6r5R9r8N4O5j14J67j46N3K9q8J33
3305I0j18J21q4J0m0L4O8j48J25j12M4O8j56K09j44O4k2n2L7k1O5j65J73q8m4
$$ plain form
3128 33 41 -75 90 -42 0 -44 -56 99 -43 33 -39 17 -19 33 13 -68 54 -79 12 48 -58 94 -19 37 -70
3153 -70 37 56 -111 49 -136 -14 -32 -66 -60 -93 37 -78 24 19 -66 -6 -44 85 -30 36 -50 -18 41 -75 81
3178 81 -20 50 -53 -55 15 -92 127 -38 38 20 -4 42 -102 35 -81 40 30 -67 95 -58 27 -66 -33 29 -124
3203 -124 14 -48 38 -43 -6 2 -32 66 18 36 -6 -11 43 -29 15 -30 61 -11 37 25 -98 74 -69 55 -3 18 41 -57
3231 -57 57 -76 48 -13 -54 71 -99 40 -111 30 49 -68 19 -127 -17 -23 56 -82 -30 42 -60 64 -88
3254 -88 29 7 -51 62 -47 15 -51 20 -6 8 54 -74 57 -58 17 47 -94 64 -118 95 63 -61 -24 -19 104
3279 104 -116 64 -49 -20 29 -111 56 -76 2 6 -56 -13 5 31 -64 35 -63 -9 56 -58 109 -37 16 45 -43 90
3305 90 -28 93 9 19 -21 13 81 -67 58 -54 -10 58 -98 111 -33 31 9 -43 -6 -27 38 -127 46 -42 -86
3330h6J16j74K27j33M7%o8Q6n4O7j05J71j33PJ36k20J45q7K8k8L1rJ3M9o6M5j7
3357a2RO0j30J89j41L6M7j54J40o1k1N6Q4j57oP6q6R6n3MJ15j82J35p9P4m9J3
3384Cm1L8O1j27J33j05mJ10j79J92r0L4M4j17N2qk4l1M3J5k6Lj07K00o9j28J50
3411B2r9J01q6L4j3P6o8OJ30j54J07Pj48J00p9N3k8N6q9J02o6J2J14j63J07rK4
3438D9Ro2Rl1K1n9J05m9j4J00j74J57o2r6J44j15Q5On5N2k3n2K8P0j09J30p8m6
3466f0J67k06J33J2r1J4pO4j5J4K9j6j6o0J08j23J07n3m5J00j10M2M3Pl9JK9p2
3494d3J52j95Q6j2n0J25j22P3j32J09J6k8K5j12J50j34J08K0p6J14j60J03pK7
3518C7L2p2PL5K4q8P6m0q8O5p2J56k1o6K1m7M8m7J18j07K5Rq7J64j53R7m4m4J14
$$ plain form
3330 -86 30 -144 83 -50 -3 -3 -71 15 -39 28 -77 94 -39 -32 104 -116 29 -58 -30 -58 -27 -36 -23 26 -40 5 -12
3357 -12 -3 57 -73 116 -25 11 58 -96 44 -17 -38 18 102 -55 -61 15 -71 25 -28 -24 91 -91 44 -35 39 -10 3
3384 3 -38 0 61 -66 67 -38 -42 68 -111 81 -9 25 69 -48 4 -4 -28 -59 -16 -1 -27 -24 -131 69 0 -128 22
3411 22 -77 24 -62 -28 -41 35 -33 -27 103 -51 56 63 -85 15 -64 -11 -39 17 -72 30 -36 -24 90 -73 34 25 49
3438 49 58 -4 5 -26 -5 -64 41 -8 -22 78 -96 61 -1 -97 47 -68 17 23 -32 20 -3 -55 -27 43 -66 64 -14 -60
3466 -60 107 -99 34 46 -45 -31 -38 26 11 25 54 38 22 -38 70 -53 54 1 -44 56 -54 -12 31 38 -1 0 29 -43
3494 -43 109 -86 0 -12 -62 63 -59 14 -118 -9 7 -21 4 -108 42 -92 16 36 -40 74 -86 17 10 37
3518 37 69 -3 4 39 63 -25 51 11 -77 -12 -84 72 51 -15 6 -41 7 -40 78 -29 -4 5 -82 82 -71 26 -18 -62 52
3547E2j08M9m1O6o7L4j4j2J10j03L9L8o7P0r8J42j31N6K7k8M2j11P7m8P0n2p4
3574h2J06o7K5N6n1J1m3J28p6J1m8lMn3J17o3j6M4n0N8p1J09r8N7K0j6J8q5J40
3603H2j20N3k3K7P7j01ql6M5K6j5O3j18R5j9m5O1k8K3r0N5o8J9J7n9J25j00N6
3631fj1nL7l3N7q9J4J7L0J7l0P5l2rl8N1k4k6R8o9J0l7LLJ9L4j23J07n2l6P7m1
3663a2P3j65Q0N0r8J04q5N1j8l5M2m4N4k6J01o4lMm3J04j20Q9jj6nk3Nn4J09k3
3693C1n8P7p9M5k3k5RM3j5l0O2r3O8m1KL6m4Q4q1J7m8J3N8m1N5o9N4k4J2RJ5K1
3725D0p9N4Rn0P1Np3J9M8j2n3O7o9jJ8K2l4j0N7o0K8L3m6M9p4O2n7J20j21JJ29
3756I3j48N6k1j3J7RJ9j4J7K5Mr4L8L7m9J8R%o2lQ4j7Jl9M1k2k4N7q8Q0M0q2O3
$$ plain form
3547 52 -56 -7 -48 18 -49 -15 -29 -41 69 -34 5 43 -24 46 -52 90 -41 15 42 14 56 -55 22 -26 44 -8 -82
3574 -82 24 -43 -18 38 -13 -2 -45 83 7 18 -30 -33 -29 -82 35 -28 -44 0 -50 8 -63 46 -52 5 25 9 27 -58 82
3603 82 -38 15 -8 19 96 -5 -13 -49 -4 22 7 70 -48 47 28 -17 44 16 39 -51 4 -64 -45 -28 -87 38 -62 -6
3631 -6 -17 -22 15 -18 39 -50 -36 -19 11 28 -2 73 41 32 -6 45 21 -5 93 24 34 -3 0 3 22 56 -67 40 -12 -48 29 -12
3663 -12 61 -104 -24 26 -72 32 -53 -2 -20 -55 -13 -57 -3 -29 72 8 5 9 -34 70 -50 39 38 22 17 -6 -1 -55 54 31
3693 31 -27 50 -29 16 -7 -32 -23 20 5 -25 37 -56 12 -29 -27 9 -35 49 -32 -15 -63 -50 8 -33 22 -47 7 -17 -5 4 19 40
3725 40 -39 15 24 -26 45 50 -23 -4 44 32 -21 46 -23 -24 -6 16 -18 -28 29 -31 -3 30 -16 33 -41 21 -36 84 -37 -36 93
3756 93 -55 1 -20 -33 -16 -7 12 -2 15 40 44 -50 -12 25 -24 -6 3 3 -59 -62 22 5 6 -33 8 -14 -38 19 -69 11 51 -31 32
3789C2m9L1pNj0n6N2k1Pm4Q5l8n6P5p6O9o3qM6R5J4j18J07j42R5m6N4L2j3l1k
3820A9m0K8r4J48l5n9k2O9l5o3R5m6M0Ok5K9k0L0n0N9n9L7j4RR7k12J02Pl6R5
3850F0j29R6kl1L4jn6j4N4o8%J1N3K8l1J1n2L6J5PN0n7L7q4P1k8l8R0j85Q4L8
3881aj4L7n1L9J5o7NL9K4q1J25r9J0J9jj6k9nQ5l1L3m0K6o5O0k1K7k8n6J05m3
3912AK5j0q4M0O8l4p1J43j29L4m5L3M3n4P1n5L2Ro0J1M7lk1j7J0j1K5m6Q5n4P
3943a0Q2q6Q7j05O1Pkk2j1Pl3L4K8l5rM3L0r4J6KkR9r0K9n5L3m2N2Mo6J13l0j7
3976A8m3j4M4J7J8J5m2k1m9J02l6k5N2m9P2j39J18q9J00o5j3K5j5N2o2M2rl8j4
4005d8O1rj2N2n9L4k4j7L7o2N5kn4Q3k2Lk8k6J1%L6j7L3o4O9j1k4M9n0npM9l9
$$ plain form
3789 32 -17 14 7 12 2 -54 -2 -23 -16 -60 25 -13 -69 6 -70 -1 -64 -72 -26 69 83 -35 72 -70 25 -21 33 65 52 21 19
3820 19 -21 7 -87 61 26 -33 -55 14 -21 -84 11 -35 5 11 -14 15 -5 25 -25 34 -25 12 -2 7 104 -108 -6 1 -35 60
3850 60 -69 27 25 -6 28 27 -29 -43 11 -57 -57 -46 7 35 4 15 -37 -1 14 21 71 14 51 -33 38 10 -28 62 -123 -39 -1
3881 -1 -15 22 -29 10 25 -42 -37 2 26 -55 70 -29 -19 0 -1 -17 -46 -51 34 3 36 -4 22 -43 17 -4 23 -5 -61 44 1
3912 1 26 16 -68 -28 40 6 -65 78 -51 -17 -62 -29 14 -40 31 -24 8 17 -43 -32 15 12 -9 -26 -16 -27 -2 -48 37 -17 -10
3943 -10 72 -14 73 -32 29 36 34 12 1 8 -25 9 37 2 -7 36 66 -28 -12 -10 -12 87 -3 26 -29 4 -38 14 18 -48 65 35 18
3976 18 -25 -39 5 22 40 55 13 -8 -57 45 9 -16 36 -13 59 -80 38 -51 49 -16 -29 -4 -19 33 -29 13 4 -34 -48
4005 -48 13 4 -8 44 -15 19 -5 -22 15 -47 8 6 -48 35 13 16 -12 -38 -27 -27 9 -8 25 -39 30 19 -5 44 -6 -11 -18 31 -8
4038hkK7j2J4Lo3O1p9Q7o6K8rL2mrK9p2P6m3o6R8l9J3k0J6NK8M1q2k4P0l3J1L7
4072D5j0m9L2K2p0j4K2L5qK9j8k4o5N8O5r4P7n5J6J6nj9m2J2K9L7j1n7R2j12J17
4103E1r7R0j9m4j0J7m6L7L1j3l8K3J0M6o6L3M5j05P8l9j7J6RL4rM4n3j6N0k5k0
4134cOm2M6n2M7Pk6K2J7n4L9j8j0N1l3%M2p4O9o8N4j7Kp1J05Ln1N7l7K8k7lJ4
4167B3m2k9N9m8N2k9pQj2k5P2l3k6RJ0J9Nl7K7MM7n5Rj2K4k2jM3l6N5n5kNP%l2
4203b5M8l5O0op9P8m2QJ7rjo5O2m7N0k0pL5l6M3n3oK0J2M9j9o6L3j6L9l7k3oO4
4237B0l3%Nl3Q8o6jK9J5Qkj4l3j1Mj8K2j9M0n4J14n6k7N3Lmm9M3o2M6j9m8Q4p8
4271e3M9L7m9M4q3J1J1L5L8n7Oj6M8j6qJ8k3J1p2Q2pl4K7j2L2m1N5o2O8m8O6j7
$$ plain form
4038 -8 -10 17 5 19 22 -41 20 -59 28 -38 -10 -19 13 9 0 29 -43 33 -10 -76 22 -17 -4 -24 -8 -3 25 66 -16 -40 30 -3 8 45
4072 45 35 -14 18 40 -30 -44 -22 13 5 34 16 -8 -73 -15 50 -44 33 -22 -6 10 5 -14 -56 -44 -15 22 11 -46 46 -66 51
4103 51 -46 44 25 -19 -29 -12 -58 -21 10 -3 -41 -18 -8 38 -28 5 50 -55 23 -16 -33 -17 -8 26 17 61 8 -8 42 17 -3
4134 -3 3 -39 7 -45 2 9 -17 5 22 -32 7 -11 -21 30 -3 -3 39 -35 34 -34 20 3 5 -66 39 42 -9 48 11 39 12 9 23
4167 23 -19 -48 11 -37 15 -14 -21 -13 -25 -50 22 -11 -37 -28 -18 1 6 -31 -4 0 47 -8 1 -11 13 -9 -10 33 -3 52 -3 -5 0 7 7 -25
4203 -25 23 -12 48 42 -37 41 -1 7 24 15 14 -51 11 -36 14 -6 -13 22 -14 29 -24 -30 -10 2 51 32 -34 -1 -17 22 -15 -38 -44 20
4237 20 -13 -13 -8 -41 47 -19 -20 9 24 32 30 16 -17 -28 -24 -42 -20 -39 1 -53 61 5 -22 31 34 30 -19 24 -38 8 -11 -59 25 -53
4271 -53 -4 33 -16 28 -55 -44 -33 2 40 -17 -11 -27 21 5 -3 15 -8 3 -69 13 6 -28 -1 -13 19 -22 33 -29 39 -9 57 40
4303D0q4N0lj7K9K0Kj0k1k5K7ln8J0L5jk0lk0K0mj2ML6oP2o4RK7j9qk6j0K6L6
4338B9l5k7oJ1K0L2k8K3j3j5J0J8r8J00%k0rk3J2oQ1J2m4J4l9Q0j25O6j9J9j6
4369Dj8Qm2P6j9rJjO7o4m1M9j0L5m0K4k3N5k3j0j5k8N9k7l1K5L2m8RLK4K2m1j7
4403a4O1p9N0n4N7J0n7Q2o9K6rqM4l1J3k8j2k0M4k7k3L7JK7l6k1j4N9J2n5qL7
4435eK5m2RL8pjn0K9L1m9L4m5M4m7J3J1j5O0n8mP2j2l4J7j8k1L1K0JK0p0PJ9l
4469@Jm0N9o1M9J1m7N5j14J23l9J7J0o5P9q4M1jJ7k7L5k4J1j9j3M0k2j1O8o4K9
4500A4j6J7L2p8L4j7N6q3RM7r4Q8Km5J8K4m1j7M3k7J2k5L4j0k8P0p6O1K3k7Q2
4531H2j39M7kk4K5j3K3J0o4N4jkNmj4nJj7O2k0M2n6J8m0L9Ql0Pj2k3M1l1N6k7
$$ plain form
4303 40 -44 6 3 -14 15 35 37 27 6 -19 8 5 -53 -43 -8 -9 -29 -32 -52 -32 -36 -48 -44 -8 -14 58 -6 3 30 11 3 -23 -33 -7 29
4338 29 -6 -33 -39 -28 -8 24 -4 19 6 -9 1 19 -79 21 21 1 -8 -31 -19 -25 56 68 24 38 -1 79 -46 20 1 20 4
4369 4 -14 -6 -48 28 9 0 1 0 67 3 -38 11 1 36 -4 20 -3 52 29 19 4 -24 35 8 -23 2 34 -14 -5 -2 22 44 3 -14
4403 -14 47 -32 18 -36 21 31 -26 56 -13 13 4 -4 40 9 22 -6 -18 -38 6 -21 -44 -7 -6 21 -15 -36 -50 9 21 -34 -42 -5
4435 -5 20 -22 -13 25 18 17 -33 -4 27 -22 12 -33 11 -36 -23 -12 -27 33 -25 -29 43 31 -3 14 -4 -25 6 26 27 47 -23 -16 3 0
4469 0 1 -39 20 -41 8 19 -28 27 -87 36 -3 14 24 -41 38 -46 -5 -6 11 -16 19 -5 6 -13 -26 14 -8 -19 49 -15 14
4500 14 -2 15 47 -31 3 -14 42 -41 -32 15 -79 9 11 -34 -16 8 -33 -50 -7 -34 -22 -47 -13 -23 -51 19 -57 4 27 0 82
4531 82 -57 -10 -12 -36 -11 -24 -1 9 -55 -1 -2 -4 1 -3 -17 -22 -21 -38 24 4 46 -10 8 -32 7 15 -15 -8 -20 -43 -2 -33 23 -4
4565dM2l3J2J5oo2J6M9o3M0J5m9K5j4j5M0OJ7n5%K7j5K2kJ5o0RN0n9O7n7j9%M0
4599fK4mo8L8Kl4N3l2L9m0N7k9k7OpK7M9r9L2K5K3l9k1J4jK6K9J3m8jpl9M4kJ9
4634A6J6m8kK3K4o0P4p8J3L4l2J6m5M2jK3n3rN6m4N1J0m5K7k8N5q5L8N6rJ9m5
4666IKl7O2p2J6QRj1K1j2Ok2M8j5J2j8n2O7Rl4K5Ol4P8l7jl3o4R8n3pNP5k6m1
4701a3o0R5kj5Om4k7L5L5K0l2K1m3L9MJ8j2m1P4q1j9Q8p4pJ7k4Q2o4K6l1N4l8
4733a3L6K4p2OJ9j7oJ4J9Lj0oON5j15N5k1J0k7K5j8PJ8Rk0K7ml0l2L7J8lM9m8
4767eK2l4Pj4j9O3l4n6O3kK0k5M3m3J0J3p8P0j9K1n8M7JL9m8L%M3Ko4M5j8l8N5
4801A2j7K1n7M9RRl0k0M5o0J4J0K2o8N3J8m9Q2n6J7MJ5m3KJ3j7NN6r3J1Q3m8k2
$$ plain form
4565 -4 38 5 17 32 26 -36 -20 29 -34 6 21 -28 -3 -17 -32 8 14 31 -24 -24 3 -12 10 8 23 -37 -28 22 -37 30 -27 -46 -46 -6
4599 -6 18 14 -54 -16 -14 -48 5 -27 12 -28 29 0 -27 -21 -28 -1 48 -51 -19 6 29 -10 -31 -17 -18 8 37 50 2 1 -6 -45 -1 -3 16
4634 16 32 -16 -18 5 29 -31 43 -35 -22 12 -20 -4 -49 -7 -8 15 -38 -47 9 -35 16 26 -19 8 -20 35 -50 -12 44 35 54 9
4666 9 11 -26 36 -36 -20 -12 -3 -14 7 -5 1 -21 27 12 24 6 -46 21 30 -4 21 27 -7 71 34 33 0 -64 34 -19 -26 -21 54 28 -13
4701 -13 -73 22 20 5 11 -33 -60 -25 10 30 -2 19 -24 15 19 37 25 -16 58 -23 -42 46 -28 -35 -18 -42 40 -24 2 -29 25 -13
4733 -13 23 47 -25 -19 0 -17 -23 -9 10 13 3 -3 3 58 -57 -2 -23 -13 -40 -15 -33 -26 -8 1 -19 8 4 -26 -58 -21 -3 -6 43 -5
4767 -5 17 -17 -10 -24 -43 20 -14 -70 -7 -9 11 -14 29 -14 -4 9 -69 1 -18 3 -55 -8 -7 32 -16 -13 -13 30 32 -32 13 -5 -43 12
4801 12 -5 16 -41 8 17 26 -4 -24 21 -39 -25 -15 7 -61 -8 10 -39 43 -13 4 8 23 -20 -18 -5 -22 -17 39 -54 -43 40 -8 -30
4834c0JM9j9k2L5l4J9k9%J6p2J02l3L1jj3m9M2j6k7J21p3N0q9O0n5M8k2L4l5n3
4865f4N9k6L5n3N5j1OK7m9j0Q1n0J3k0L4l8k3N2L7mk7l9mN9q0L0J6m5Opk5K3M0
4898bLm3M3ll9R1m1J9m3NNK5k2l7ON0M7k3o7j5O5Pj5l6L5k0J4p1N1m5O1RPn0K3
4933fJ0P9j03k5kQ2o9J2j7ORkJM6m1O2p6M5l4K4M9p0k8L7O0p2L9m4J5J0K3rj1
4966@o8M1mL4n3%K4NM2j5Ll3m3N3k2NM8j9k9Qj3K3N0k3J6n2LO1o6J9j0qL3JK3
5001C4l8L6o1N8n8M8k0l7P8k3l6lpj4R9j06L9k2L7J1o8K1nnL5MK4k5K5J4l9N3
5033D9Mpj8kl2J5j1k9QN6o9K6NL2l0K1o5oP8n3n0K9K4J4j3M8k2J3n0K7j2NJ2m1
5067d4O5o9O8K5k0kl6nnM0%l2PL9j5j0LOl7j7R6m0o4L7Mp3O4K1jL3j8L9Pj02Q
$$ plain form
4834 -30 -29 20 1 -21 14 -20 -1 -30 -30 -14 -86 16 -17 14 13 0 -49 -7 -23 -50 71 -2 48 -41 19 -36 12 -10 24 -11 -64
4865 -64 -5 -31 4 -49 6 -5 1 28 -21 -31 50 0 13 -7 27 -11 -34 18 55 51 24 -15 -19 40 -40 -10 6 -39 -33 -40 -65 -42 -2
4898 -2 1 -42 1 -2 -41 50 9 28 -15 -10 -5 20 -2 -39 -33 17 64 41 -26 -41 24 31 16 -20 15 -5 9 -62 -11 -56 5 14 21 -29 -6
4933 -6 4 83 -20 -45 -47 35 -34 -22 -39 -33 -24 -26 -25 21 -20 42 -34 11 -23 1 50 -20 -48 -11 49 -23 16 -28 -13 -3 20 11 0
4966 0 -68 -27 -31 3 -50 -50 -26 -21 21 6 9 -24 -67 -14 -36 -31 17 -2 -31 -23 -36 -13 37 14 30 -22 -19 42 -24 -5 -15 -23 10 11 34
5001 34 -4 32 -29 29 -29 19 -1 -38 40 17 -19 -22 -29 -43 56 -50 -11 -33 4 15 -53 -32 -37 -42 -7 -3 21 -4 21 35 -4 49
5033 49 53 46 28 26 -6 9 -2 -31 -23 33 -36 -10 -5 27 -3 18 -47 -53 25 -28 -78 -49 -25 -11 -24 24 2 15 -35 -8 -20 -15 -3 -44
5067 -44 21 -48 20 45 25 23 -13 -18 -23 17 17 -15 -8 31 16 6 9 15 -22 -39 57 17 -47 -10 -6 -79 -15 6 5 38 20 59 66 -36 -28
5102b8M5rj4J0l6K0J4l6N8l5N7q6M3j4J8j9O6l9k7J7k0P1j21M2K7J2M8k1om4%
5133gj6J6J6o4O3j1J5j4Rl1jM2Rm9N2N0j11L0n1L0Lk9oL4LL5k9n9P1m4Q6m5n0
5166e3N4n6K9LQKn1L6J8OM7p7M3J6po5R5j3j02R5l4L9j6m0JrL1M4k1K7o6RK7n0
5200c0L4J4n8j4K9oJ2k6J11l6m9l8K2j5L6K0kJ5m3k9O0J0l6K7L2j4j3qm1P4j5
5231B3n1O3Jj4l5j9M1pkn4j1P3l0L3qpJ7M1o1j0P4qlo1j3J1rK8K8k9j7K3j5L0
5265B2k6kJ6j8l2M0L6r7O1j2%j0lJ9L8ll3R%J2k4K2o2M1j8J8k1L2K0Lj8n3N1M5
5299E3q4ROL0rk4L8o9K5oM4j8%Qj3l3K4J7Kkj3j6%O3m2K4qj9P%Kk7O9p4M9lj4
5336dmk3K8Q6j05j0L8pL1n1l6P1K1Nl8m1N6n1Q0o1J8k2K1k4K5M3l6n5P9Ln7P3
$$ plain form
5102 -28 17 8 -6 4 -32 -12 2 -34 24 -11 46 -40 3 -11 7 -12 54 15 -12 5 -15 56 -65 -23 4 16 64 43 37 -7 -7
5133 -7 -23 -7 9 -55 8 -3 12 -2 7 -24 -25 17 26 -23 29 79 -32 -2 -53 -23 -20 -49 -55 -21 -18 17 -12 -71 0 -44 42 -3 -53
5166 -53 1 -55 -26 -23 -15 -13 -64 -28 -10 -4 43 -34 9 25 18 -47 48 35 -67 28 -6 33 17 -23 -22 -31 0 44 23 50 -16 -7 20 -30
5200 -30 4 18 -40 -54 -25 -31 -19 -45 66 30 -19 -57 -35 -50 -14 6 4 19 -24 -53 7 17 -19 8 40 26 13 5 -36 38 23
5231 23 -28 35 36 22 -13 -32 9 2 0 -54 -65 8 -22 11 3 -4 13 54 -7 -17 57 49 46 -15 -28 -17 -26 2 30 1 -16 7 -8 22
5265 22 -4 -6 10 -8 -40 0 36 -61 0 -12 -12 -22 -25 -6 32 29 -4 5 5 17 -7 15 -47 -6 -24 -6 -27 5 25 28 10 -43 8 53
5299 53 -31 -22 -16 14 5 -19 19 -50 -25 -31 13 -5 -5 3 -10 -43 -19 -2 0 -2 -15 -31 -31 32 -10 14 6 -13 -6 -6 -4 -31 38 -36 13 10 -4
5336 -4 -8 -31 -3 83 -22 -32 6 -1 30 -21 -57 14 35 40 2 -39 17 -34 46 -15 3 -19 2 -22 3 46 10 -45 34 37 -20 53
5368E3j3m7k8J6mJ1lM5Op0L3M4j9k0k3j0Q2l9j8K2m1L5pL0l0J6l8%N2o8R3j5n2
5401gKj7M7mK4o3L8l4mL0j4j1Om8K4N7k2l6j8N8J0om3M0j9k6O5o2M6K0m8J2L3
5434C0j8l0N8n8N9l8n1O9l8K6k7M%K0J3m0L7j1J5Mk1L2l6RK1j2JLm2K6n6M6K7
5467B2Km7J3k1O4jkj5m6R5n6L2m1J7N0j22Q7o0O9q3J2N6m0L0kmK7l8qK1Jn5L9
5500dJnO8q1J5l4N1k9N8rk1J7j3J3k0J1qo5M2j1J8Mn7QMO1M9p8N3k5l4l2N3J2
5534A2mj8P1p1j2L3k5j7N3n9K3oJ6m0J3J9k0K0o6O3L5o2Q1k0j0j5j4N2o8P0m0
5565fk0M9j5o1RN7l3J3L2Kl4n6M5j1K8pj0N0JLp5M5k9LMN5p8j1J00k5l8%J8l7
5599c2K8Mj2l3kL2M0p7L8PqL5L1l0m1O9o6K3mm1N4l8M6j6P4p2L1J8p3J0j2oK6
$$ plain form
5368 53 40 -7 -35 -19 -23 -12 -15 30 36 -34 -1 43 24 4 -19 -29 53 14 -4 18 -23 12 5 35 5 21 -17 -17 35 -33 60 45 -7
5401 -7 -5 -22 25 21 45 -18 20 -14 -18 12 -2 -13 -7 -55 -31 26 4 -32 -50 8 18 12 -31 9 -10 -36 29 -33 13 33 -15 -3 30
5434 30 12 -18 40 -18 41 3 -48 21 -17 9 -18 -14 -14 6 19 -21 16 5 20 24 3 35 -1 8 29 17 18 21 -21 5 -51 -5 22
5467 22 24 -23 -10 -31 33 32 30 15 -31 64 8 40 -1 16 66 -56 31 -29 40 -43 -31 25 -15 15 13 9 36 -2 -10 11 12 -43 -4
5500 -4 -3 -8 60 -21 -6 -40 11 -18 40 31 10 27 14 27 7 18 10 -55 -13 -24 -6 -2 -59 -51 -47 14 63 -15 38 13 -21 -53 0 12
5534 12 8 -10 61 -10 -22 11 -14 -31 22 -37 -14 -20 -4 -44 -31 -12 -32 -12 -78 -15 20 -42 39 19 9 -6 -20 32 -36 34 -6
5565 -6 -26 23 8 -53 -44 13 -20 -7 25 27 -7 -63 -18 -29 -1 -8 -18 32 33 36 -39 6 -23 -20 -16 39 -39 -50 50 25 -13 -13 5 -32
5599 -32 -4 0 -12 -45 -47 -15 25 -52 -14 -7 -15 20 51 21 -20 49 -17 6 2 -39 15 -23 23 7 81 9 40 58 -15 -5 -17 -23 3
5632CK7k4l8J8n0M7O7k9lk2L4o7J3L0K2n4k2R9j03N6QJ6j8k8J0RKj1mK1k4pJ2
5665a0K1j0k2m6N0K3j0M1o8L5j1omQ1l8p1L6j2M5J6n9%K0k5K6J6k5j4K1M1n7N5
5697C9k5m7P5p6P0l2j5N4l2rPQnn7O2k0o3R0l0k3k3P6j3L0l3j9l8K0K2o8O3k4
5729c6L1n7J7P9l9p0P6K6o9N9Oo5J3L1k0%O5o9%j9N3l4J4n8P7k5L3j3l6nK2J7
5761Dj7J6M6q5K3K8k1Pj3M3Jl6L3m3mrj7J7J6N5n2J0k4J9K2Ml2k0J9QOpPl3J8
5796a1j0P0n3j8P0q4N1j7n4R9n7M4k3L4Nmj11N1M4m1RM1NJk1K4m9pL2k8O6n9M2
5829D1q7M4Q2j03M7j1r%J0K2l7J1K7o2L8j1J4j4l4J5O3k9r4N1N3q3Q2m9M3n2O0
5860B8Nl6K0lk1J1M7n4pK6Om4Rkk4J9j1M2l7K5K3l3L3l8K7J5j0n5L9ppK8l2J9
$$ plain form
5632 3 30 6 -32 -14 -64 -17 50 21 18 -4 30 -37 -24 6 28 -26 -48 51 -52 4 12 28 10 -18 -8 1 3 -8 -12 9 -15 -22 -10
5665 -10 11 1 -21 -67 -17 6 -4 37 -31 4 -7 -13 -17 64 26 -45 -9 -21 24 40 -19 -19 1 -24 2 18 -7 -21 0 41 -16 39
5697 39 14 -33 42 -34 36 4 -11 43 11 2 9 17 12 -45 17 -3 -66 24 -6 -29 -52 24 11 41 8 -11 -49 -29 -7 -75 -12 -36
5729 -36 -5 -62 -45 34 -5 -75 1 27 -42 17 23 -42 -29 2 -18 -18 47 -22 -22 -41 12 -22 -8 -66 11 -14 19 6 -30 -35 -13 4
5761 4 -13 3 49 -36 -13 15 -6 1 -12 31 32 -4 29 -14 -18 -27 -44 -27 -11 44 -8 2 -22 -3 19 23 -9 -29 -10 -2 4 -3 4 -29 -11
5796 -11 -21 49 -4 -22 48 -36 15 -2 -56 43 -14 30 7 41 46 42 -69 -18 26 -15 -6 35 40 41 20 44 -5 -12 20 -8 58 -1 41
5829 41 -46 -2 80 -23 24 13 4 4 14 36 -1 10 37 -25 13 2 16 2 -32 -17 46 17 -77 -26 27 -56 26 -23 20 -32 28
5860 28 33 -3 17 14 -7 4 51 -3 -10 16 22 -22 -13 -15 -39 -20 -31 11 -26 -1 22 -11 22 -16 11 26 16 -39 0 -7 -14 14 -18 1
5894AK5r6J08l6J%Rk6mK8J5n5M4M1q8N5l1po4O4L4k5k0M7Ol2K9K0K4k1k1n2ql0
5928f5K3J05j8l7J4n0O5m1P1o5Oj6J7K2j1J0j9K1j2rQ4p1n1M1o6O9n1O3l6K2L
5959A8L7m8O0j08l7O3pj9N8k5L8l1K7q0L7j4Rj2M6j6J8lj0p2Q0l8L1K7jK2m4l2
5991b6lK0M2K3rq0M2rPo4P4M5j01M9K8mJ0q4L7j7j4R6n7qJ2m4j3O4o4L1K9pJ1
6024A6J3l5J9m3N7J2k2m7K1j2K6J2ML4r0P6j9k4On9K3K2j7O8p1L2k9L5jj4K4o4
6056d7J9L6l3M7kk7j2jK4L1q4K3M0p0N5OK1m6NP1m4k1OOj0k9N0j1J2mk8JL3j4
6090CK5kk3m0N1lO4j00kO5n1P2r1N2l5OJ5j6RJ9Mr2L7L8J0j1k6N0Rj7M5j2m3m4
6124c4kQ3Jl6l3M3k9Jnk2O5j8j6nmj0l7N3K6j4j6l2N8o4L2jO1l1nM8q0k9O0k8
$$ plain form
5894 1 26 -70 38 2 3 3 12 -14 -18 10 25 -30 14 55 -33 22 -9 -16 -80 -16 18 -7 -27 20 26 -6 23 43 67 46 25 -27 -35 -65
5928 -65 -42 63 45 8 22 -28 37 -4 67 2 8 -8 9 31 20 30 11 32 20 11 95 24 -27 14 -52 17 -34 29 -7 15 18
5959 18 55 7 67 -41 -78 -15 -22 -41 17 -8 30 -1 26 -54 -17 -31 -22 -34 12 -4 14 11 1 -71 9 -29 2 29 28 50 6 -26
5991 -26 -29 -9 33 56 47 -33 9 0 7 -57 17 62 -39 10 38 34 44 -40 -3 -20 -34 62 5 -3 9 -35 -48 16 -48 -17 12 5 16
6024 16 29 -6 13 -30 27 39 17 -30 -9 -21 5 17 21 55 -35 41 22 -2 4 -55 -32 -10 -27 41 -30 2 -27 8 7 -7 17 -47
6056 -47 -28 8 -25 22 20 -7 -19 -20 4 35 -49 -26 14 -56 -1 5 26 -20 -15 56 12 -9 -3 3 -7 -36 14 3 15 11 -17 -16 17 3
6090 3 28 26 3 -37 14 11 75 -25 -27 38 -13 59 -32 20 -15 -9 6 -10 -1 18 22 -70 -33 5 15 4 -22 28 37 20 65 53 10 -34
6124 -34 -36 47 48 12 -21 22 -7 -6 -11 -33 32 14 -2 -7 -11 -21 -58 -5 21 7 -9 -41 17 -47 -15 -16 45 14 9 57 -23 -52 8 -20
6158b0L8j6rk3K7j6K2n6M8k9O5j0m6J4M8l9J7J6o9M0RMLK0k8l5O5k2ol1K5p1P0
6191Ej0ON4k6n4M5pm5N3r8Q3j4j7K2k3N7m2k4%O2l4rK6k0J1Lm3P3op2N7kJ9q9
6225e9M1NJ0nJJ5jM1j08jQ3j3jjon0L1L0j5L6j6l5K1k7L2qK8q2P3J5k4j5m8Q5
6259C2n8O3m5L2n4j6L4M3p4M5%J0K2o0Pm1R8qk8nK6o9O1kl0L4j8kk2J6J8k3K5
6292A1Lo5Q7k0j1j8KO5n0j8L0J9Oq8P2Qmj7j3J3kmn2j9Q9M0p1N2j02O8Ol6oLm
6327b6K2pJ6n1R3q0J2J6j0k5M3k1j0P5k7M7j05M9J3k1k5M1J8q1O6J1r1N5K1Nn
6358A8m1L5nJJ9L0j07L0N6l8mn6K3N8kl4J3N1k4j9j1L2o0J8Nj3K0K0j6qJ9k6L4
6391A8M1n3J7Lr4M8K8j3L2j9L9m2mk0NM2l7QpmooL7l0O6o4k3O7p1K5J2J4l7J9
$$ plain form
6158 -20 18 2 -7 -30 -3 -19 3 -53 -5 -34 31 21 -25 -11 37 -2 15 31 -38 2 11 15 18 38 10 -25 40 18 12 -19 6 -65 5
6191 5 -5 1 55 29 -25 20 13 -32 21 -77 6 -8 -25 -3 -26 31 -11 -35 -35 27 -7 -16 10 -10 1 4 -39 34 28 -44 13 11 30 -59
6225 -59 -18 -13 -3 -8 -7 8 7 48 -60 -61 22 9 8 7 1 -49 -18 12 -3 33 17 -18 3 -24 8 0 28 -54 19 34 10 -5 -53 32
6259 32 -26 37 -8 24 -30 -46 -12 31 -43 2 2 12 34 -26 -19 -60 38 30 2 -3 23 -46 15 13 -17 17 -1 -3 -25 -9 9 -14 11
6292 11 14 -51 36 16 5 -13 -11 54 4 -14 16 35 41 -47 25 33 29 12 -1 12 10 6 -46 -65 24 64 -7 45 -57 11 17 -19 -25 -22 -26
6327 -26 -4 -11 5 -46 47 -33 -21 -5 -15 -40 3 -18 -28 47 20 67 -38 11 24 3 -22 19 37 -44 22 33 -58 -3 18 23 18
6358 18 -23 12 7 8 27 57 -50 -20 36 -2 -6 -62 -39 19 17 -17 -4 47 23 4 -7 25 -35 -17 -12 -25 -5 15 -1 -9 10 -16 18
6391 18 59 6 23 26 -68 -20 8 -5 27 8 47 5 1 -19 -14 28 -9 -1 -8 -12 -18 -24 13 -17 49 -15 -38 29 -42 -17 -5 9 -28 -9
6425il2k8R2Lqp4J1M3m3O4mk2mJK4l5O2n0M4q3R4n6K9p7N9K6j2o6N6n5N5j7K7
6458A5n1K1M8j4M6l1p9M8m4M0j5j1L8k0K7q9J19q1Q1o7Q4l9jPl0J2k2j6j7M5j
6489CrJ7J7qQn3Q3m7j7qJ1qj8N4l0j9K0O4n1J8l5Rn2K7M3m6M5m2k2K8K1k7M4m9
6523b9k2O5J6m5K8l7P0o7P6m4p4N3KN6r4O7j9k2j5K2K7m7kJ3kL6m1N2m0K0N1l0
6555B4k3L3k7l1lM3l3P3n2m7R8jM5j03j6N0j00R9j6l2O6m8J9n1O8pkk4L9o1MK4
6587Hj6k1N4K5j1q8O1o0P2k1jp0K9mQ1n1L3N9p5j6j8L6j9J4J7m2P0l0J2l4K7K
6619B3j4l1QM9l5m5O3ll2K0K5j2qo1K0M0Om9N8J4n7L4M0l1k1l6N9o9M7Lj8N8n6
6652a1jj2MJ9j6M5l0pJ7rRl0K0n6N1Q9j4q8L7k0m1K2L3K3n3N2r3R4m5L2j0kL6
$$ plain form
6425 -9 -41 -69 23 26 18 -56 -45 -2 -45 19 15 -7 -11 -10 14 -21 41 -9 35 -48 46 -10 19 -58 1 27 15 -51 5 -50 5 -12 15
6458 15 -36 -15 33 19 65 34 -45 3 -41 -1 -16 -27 11 -9 18 -71 48 -33 48 -19 65 26 25 32 2 14 -8 -24 -41 4 3
6489 3 -6 11 28 20 28 -25 58 11 -6 -14 -3 -11 -29 25 -5 -24 -4 60 9 27 -8 1 -51 -24 19 -27 18 -24 -46 -18 3 -24 20 -29
6523 -29 -51 14 30 -15 13 -24 46 -21 55 11 -63 -10 -8 48 -46 21 2 -20 -35 -13 14 -33 -35 -22 -24 12 -29 23 -17 3 54 24
6555 24 1 34 7 -24 -27 16 -17 56 4 -43 55 54 99 -4 -20 30 -70 29 13 -19 47 -1 18 -33 35 28 26 2 41 -20 -16 8
6587 8 -8 -29 25 50 39 -49 12 -48 24 3 2 -68 -39 -43 38 -13 20 79 4 -12 -30 6 -13 1 18 -24 46 16 28 -6 21 23
6619 23 9 -22 -14 35 0 -45 18 15 -17 3 28 16 8 -53 -33 7 13 -36 22 36 -21 13 53 22 1 -35 24 -45 2 5 -13 45 -11
6652 -11 -12 -24 -20 -1 -17 28 -2 -9 8 -1 8 -22 -2 -58 -7 82 68 -20 17 -3 -44 -22 11 34 -19 33 -60 34 -11 21 11 9 45
6685D5m7P2r0%N3m9jkK0oMM1Mp4j4N8j7K6oqJ6k9L6k8J5k2J4%j4K5k3J2l9L4k7
6720b1M0J9o0MK5l4K4J0mj0J7J2k0K1n2L8J4l9k4L6j3KN2j8%l7M7k8JJ1LJm0O8
6754D5j7l1M1l7J7k7km5K9N0k4k4pN0n4J1L5m1j5N0m8L4Qj3J01q5Nn4N6oNk3N
6787a1j0K6K6l6N0m5J4%jk7m3N5mk7K7k4J5J5Jl4L9l4L7l7N8K7q7L7J4p0L6N4
6819D1q5N2m2L8NL0k2J6k9L1K3o0K6n7KQ0j8p0L9Pk2NO8j41N3Q5m1o%j1l9N2j3
6852cN2j4k8j8L5M2n4l0NkK1Ll2j3N0pj2l1k2N1lj8M2j2ML4J9o2M5n0qrJ3l0r
6887e1O1pl6RmL6j5K6k0j9K1lkok3Q9n9qOql8K7O4l7M1m7k4M2j4j0pN5p2RK9k0
6923a5N1l8ol4N8k6N7l9l5QL9n1OrM3K8n4J0M1l9J2k3J0LPl1L2M6o8K4J4n3K7
$$ plain form
6685 45 -2 70 -20 -20 33 -16 -17 -19 1 -5 -1 40 44 -30 -44 14 -3 23 17 9 25 -4 32 4 19 -3 11 11 -3 22 -1 11 -28 6 -21
6720 -21 19 38 -22 -18 7 -27 -3 7 3 -7 10 22 2 23 -29 9 23 -16 -40 -4 -17 -15 37 19 19 -18 29 1 2 13 16 17 -23 45
6754 45 28 -3 38 1 18 -9 -11 -56 -27 23 -1 -25 -32 18 -36 -25 10 -31 -46 4 -44 -10 -2 -15 86 1 6 -48 8 2 7 -16 -11
6787 -11 -21 5 31 -5 45 0 14 14 13 -14 -57 -2 -6 -33 -6 -30 -15 0 1 -33 6 -28 9 -28 30 57 -30 7 21 -49 -13 41
6819 41 -44 8 -34 4 9 39 17 33 4 35 58 -2 24 -33 -31 49 31 -39 0 7 -15 -10 58 -83 -30 55 14 8 8 -3 -42 10 -3
6852 -3 49 35 7 -11 24 66 12 -18 -13 -15 6 9 -23 -36 14 7 -5 -36 -58 -7 -10 -28 14 2 6 40 59 -3 42 -8 -16 -25 -12 -42 -51
6887 -51 10 3 -33 -24 -28 8 -7 19 -1 -20 1 -2 -4 -10 -33 56 -3 -11 -5 -13 -51 -24 40 3 44 -3 -27 15 1 -9 -16 39 -33 -24 5 -15
6923 -15 36 -2 -8 -42 16 -10 47 8 -27 -19 20 -31 -25 -34 9 37 -17 -7 34 -5 7 -16 -6 -3 4 -27 5 51 -17 7 21 -32 -5
$$ [...]
8191G
##END NTUPLES=NMR FID
##END=
