##TITLE=1H_26-2021
 CDCl3,8 sc, 
 2.04.2021
##JCAMPDX= 6.0         $$ Bruker NMR JCAMP-DX V2.0
##DATA TYPE= NMR FID
##DATA CLASS= NTUPLES
##ORIGIN= UXNMR, Bruker Analytische Messtechnik GmbH
##OWNER= root
$$ XWIN-NMR		Version 3.5
$$ Fri Apr  2 12:43:52 2021 Russian Standard Time (UT+4h)  she@DPX200
##.OBSERVE FREQUENCY= 200.131506
##.OBSERVE NUCLEUS= ^1H
##.DELAY= (6, 6)
##.ACQUISITION MODE= SIMULTANEOUS
##.ACQUISITION SCHEME= undefined
##.AVERAGES= 8
##.DIGITISER RES= 18
##SPECTROMETER/DATA SYSTEM= spect
##.PULSE SEQUENCE= zg30
##.SOLVENT NAME= CDCl3
##.SHIFT REFERENCE= (INTERNAL, CDCl3, 0, 15.7039)
##AUDIT TRAIL= $$ (NUMBER, WHEN, WHO, WHERE, WHAT)
$$ ##TITLE= Audit trail, XWIN-NMR		Version 3.5
$$ ##JCAMPDX= 5.01
$$ ##ORIGIN= Bruker BioSpin GmbH
$$ ##OWNER= she
$$ F:/spectra/data/she/nmr/H-F/1/audita.txt
$$ ##AUDIT TRAIL=  $$ (NUMBER, WHEN, WHO, WHERE, WHAT)
(   1,<2021-04-02 12:42:21.17 +0400>,<she>,<DPX200>,
      <created by zg, POWCHK disabled, PULCHK disabled
       configuration hash MD5:
       00 E9 B6 7A A2 85 ED C7 34 08 36 98 17 FE 4E 26
       data hash MD5: 16K
       15 A7 50 73 7F E2 35 2F C8 58 D6 B6 29 BA 38 8F>)
$$ ##END=
$$ 
$$ hash MD5
$$ 4E 15 22 81 51 C7 7B 7A 07 62 1A 8B 38 59 76 C4
##$RELAX= 
##$RELAX= 
##$RELAX= 
##$RELAX= 
##$RELAX= 
##$RELAX= 
$$ Bruker specific parameters
$$ --------------------------
##$DU= <F:/spectra>
##$EXPNO= 1
##$NAME= <H-F>
##$PROCNO= 1
##$TYPE= <nmr>
##$USER= <she>
##$AMP= (0..31)
100 100 100 100 100 100 100 100 100 100 100 100 100 100 100 100 100 100 
100 100 100 100 100 100 100 100 100 100 100 100 100 100 
##$AQSEQ= 0
##$AQ_mod= 1
##$AUNM= <au_zg>
##$AUTOPOS= <>
##$BF1= 200.13
##$BF2= 200.13
##$BF3= 200.13
##$BF4= 200.13
##$BF5= 200.13
##$BF6= 200.13
##$BF7= 200.13
##$BF8= 200.13
##$BYTORDA= 1
##$CFDGTYP= 0
##$CFRGTYP= 5
##$CHEMSTR= <none>
##$CNST= (0..31)
1 1 145 1 1 1 1 1 1 1 1 1 1 1 1 1 1 1 1 1 1 1 1 1 1 1 1 1 1 1 1 1 
##$CPDPRG= <>
##$CPDPRG1= <>
##$CPDPRG2= <>
##$CPDPRG3= <>
##$CPDPRG4= <mlev>
##$CPDPRG5= <mlev>
##$CPDPRG6= <mlev>
##$CPDPRG7= <mlev>
##$CPDPRG8= <mlev>
##$CPDPRGB= <>
##$CPDPRGT= <>
##$D= (0..31)
0 1.2 0 0 0 0 0 0 0 0.06 0 0.03 0 0 0 0 0.0002 0 0 0 0 0 0 0 0 0 0 0 0 
0 0 0 
##$DATE= 1617352940
##$DBL= (0..7)
120 120 120 120 120 120 120 120 
##$DBP= (0..7)
150 150 150 150 150 150 150 150 
##$DBP07= 0
##$DBPNAM0= <>
##$DBPNAM1= <>
##$DBPNAM2= <>
##$DBPNAM3= <>
##$DBPNAM4= <>
##$DBPNAM5= <>
##$DBPNAM6= <>
##$DBPNAM7= <>
##$DBPOAL= (0..7)
0.5 0.5 0.5 0.5 0.5 0.5 0.5 0.5 
##$DBPOFFS= (0..7)
0 0 0 0 0 0 0 0 
##$DE= 6
##$DECBNUC= <off>
##$DECIM= 32
##$DECNUC= <off>
##$DECSTAT= 4
##$DIGMOD= 1
##$DIGTYP= 9
##$DL= (0..7)
0 120 120 120 120 120 120 120 
##$DP= (0..7)
150 150 150 150 150 150 150 150 
##$DP07= 0
##$DPNAME0= <>
##$DPNAME1= <>
##$DPNAME2= <>
##$DPNAME3= <>
##$DPNAME4= <>
##$DPNAME5= <>
##$DPNAME6= <>
##$DPNAME7= <>
##$DPOAL= (0..7)
0.5 0.5 0.5 0.5 0.5 0.5 0.5 0.5 
##$DPOFFS= (0..7)
0 0 0 0 0 0 0 0 
##$DQDMODE= 0
##$DR= 18
##$DS= 0
##$DSLIST= <SSSSSSSSSSSSSSS>
$$ [...]
##$SUBNAM2= <"">
##$SUBNAM3= <"">
##$SUBNAM4= <"">
##$SUBNAM5= <"">
##$SUBNAM6= <"">
##$SUBNAM7= <"">
##$SUBNAM8= <"">
##$SUBNAM9= <"">
##$SW= 16.9725357007746
##$SWIBOX= (0..15)
0 0 2 0 0 0 0 0 0 0 0 0 0 0 0 0 
##$SW_h= 3396.73913043478
##$TD= 16384
##$TD0= 1
##$TE= 0
##$TE2= 300
##$TE3= 300
##$TEG= 300
##$TL= (0..7)
0 120 120 120 120 120 120 120 
##$TP= (0..7)
150 150 150 150 150 150 150 150 
##$TP07= 0
##$TPNAME0= <>
##$TPNAME1= <>
##$TPNAME2= <>
##$TPNAME3= <>
##$TPNAME4= <>
##$TPNAME5= <>
##$TPNAME6= <>
##$TPNAME7= <>
##$TPOAL= (0..7)
0.5 0.5 0.5 0.5 0.5 0.5 0.5 0.5 
##$TPOFFS= (0..7)
0 0 0 0 0 0 0 0 
##$TUNHIN= 0
##$TUNHOUT= 0
##$TUNXOUT= 0
##$USERA1= <user>
##$USERA2= <user>
##$USERA3= <user>
##$USERA4= <user>
##$USERA5= <user>
##$V9= 5
##$VALIST= <valist>
##$VCLIST= <CCCCCCCCCCCCCCC>
##$VD= 0
##$VDLIST= <DDDDDDDDDDDDDDD>
##$VPLIST= <PPPPPPPPPPPPPPP>
##$VTLIST= <TTTTTTTTTTTTTTT>
##$WBST= 1024
##$WBSW= 4
##$XGAIN= (0..3)
0 0 0 0 
##$XL= 0
##$YL= 0
##$YMAX_a= 101557
##$YMIN_a= -105830
##$ZGOPTNS= <>
##$ZL1= 120
##$ZL2= 120
##$ZL3= 120
##$ZL4= 120
##$ABSF1= 10
##$ABSF2= 0
##$ABSG= 5
##$ABSL= 3
##$ALPHA= 0
##$AQORDER= 0
##$ASSFAC= 0
##$ASSFACI= 0
##$ASSFACX= 0
##$ASSWID= 0
##$AUNMP= <proc_1d>
##$AZFE= 0.1
##$AZFW= 0.1
##$BCFW= 1
##$BC_mod= 2
##$BYTORDP= 1
##$COROFFS= 0
##$CY= 11.3945322036743
##$DATMOD= 1
##$DC= 2
##$DFILT= <>
##$DTYPP= 0
##$F1P= 15.9154993809931
##$F2P= -4.1035820241983
##$FCOR= 0.5
##$FTSIZE= 0
##$FT_mod= 4
##$GAMMA= 1
##$GB= 0.15
##$INTBC= 1
##$INTSCL= 1
##$ISEN= 128
##$LB= 0.24
##$LEV0= 0
##$LPBIN= 0
##$MAXI= 10000
##$MC2= 0
##$MEAN= 0
##$ME_mod= 0
##$MI= 1.114404
##$NCOEF= 0
##$NC_proc= 0
##$NLEV= 6
##$NOISF1= 3.799351
##$NOISF2= 2.8
##$NSP= 1
##$NTH_PI= 0
##$NZP= 0
##$OFFSET= 15.70392
##$PC= 1
##$PHC0= -11048.66
##$PHC1= 32.00092
##$PH_mod= 1
##$PKNL= yes
##$PPARMOD= 0
##$PSCAL= 0
##$PSIGN= 0
##$REVERSE= no
##$SF= 200.130013532006
##$SI= 16384
##$SIGF1= 3
##$SIGF2= 2
##$SINO= 400
##$SIOLD= 16384
##$SREGLST= <1H.CDCl3>
##$SSB= 0
##$STSI= 0
##$STSR= 0
##$SW_p= 3612.71676300578
##$SYMM= 0
##$S_DEV= 0
##$TDeff= 0
##$TDoff= 0
##$TI= <>
##$TILT= no
##$TM1= 0
##$TM2= 0
##$TOPLEV= 0
##$USERP1= <user>
##$USERP2= <user>
##$USERP3= <user>
##$USERP4= <user>
##$USERP5= <user>
##$WDW= 1
##$XDIM= 8192
##$YMAX_p= 0
##$YMIN_p= 0
$$ End of Bruker specific parameters
$$ ---------------------------------
##NTUPLES= NMR FID
##VAR_NAME=  TIME,          FID/REAL,        FID/IMAG
##SYMBOL=    X,             R,               I
##VAR_TYPE=  INDEPENDENT,   DEPENDENT,       DEPENDENT
##VAR_FORM=  AFFN,          ASDF,            ASDF
##VAR_DIM=   8192,          8192,            8192
##UNITS=     SECONDS,       ARBITRARY UNITS, ARBITRARY UNITS
##FACTOR=    0.0002944,     1,               1
##FIRST=     0,             0,               0
##LAST=      2.4114304,     0,               0
##MIN=       0,             -105830,         0
##MAX=       2.4114304,     101557,          0
$$ Real data points
##PAGE= N=1
##DATA TABLE= (X++(R..R)), XYDATA
$$ [...]
1026B148p953R919j414p748P593m969M632O94r469R237j573p83l35m407Q652l332
1042H92l062K149k039O287m363m231O906l413L568l385n044J1685o205j447J994
1057B92l417Q538o154l299O205k640L075l698l293Q720l854j066q36r27Q493q193
1073b054o43M283k599N384p293m03P847n072J118k130j236R026p453k293N133
1088A615k059M214o377l67O557l294L17l340J925M911m780j107N00K550K590p767
1104c912K347M171k729K172o330M073M808o886K260j967K543M021q451J901M507
1119B528k198J031m941K798N379o343R37o49K214K810o522J304K628R75j262m379
1135c690L714L160l456j062n66L658R27n511K242M64K218p55n589N009J401j743
$$ y = [2148, -5805, 4114, 2700, -5048, 2545, -2424, 2208, 2902, -6567, 2670, 1097, 314, -21, -4428, 4224, 892, -2170, -21, -2060, 4227, -136, -4367, 2539, -874, 2694, -691, -5735, 5950, -255, -1702, 292, -3125, 5413, -741, -4040, 2165, -475, 2600, -1098, -4391, 4329, 475, -591, -1427, -2354, 6139, -2054, -2697, 1586, -1013, 4371, -2922, -3325, 4522, -550, 568, -1562, -2798, 6228, -1225, -3518, 1615, -444, 3770, -2607, -2974, 3583, 289, 606, -2734, -809, 4102, -678, -1785, -1285, 1265, 3855, -3912, -1565, 2606, -123, 2049, -4281, -208, 4600, -2286, -26, -1993, 550, 4571, -3880, -1979, 2528, 330, 1361, -3580, -782, 4597, -1746, -809, -1458, 756, 3566, -2956, -1652, 976, 1951, 689, -3690, 24, 3184, -272, -1334, -1900, 1758, 2685, -2826, -584, -120, 2098, 1343, -4246, 763, 2164, 421]
1151D21j351j745N061R0n144K059P92J394p2n234M205J505j558q87k435N164o5
1168B200m146O46J668J637j566l110K716J742j259j121j874M191J91l200k00J153
1184c32L039k943k013K231J332l06k269m00K971L3k031n45K53L719k481k516K387
1201A29N97P41k907j80L096n65j436m90M24K277q97k903J840J253L10k376n40
1218a627K975l88j166j267J698J019j006j050j19J930K99k174n17K415p2q48j580
1235a478J457J798k247J18k66J180O22j812k67J181Q64j071j235Q41J863j645
1251i7o33L12R24L75j723O64r6J110m93j561J124P77j74j302J01J369K3j623Q14
1270a09P5L59J66j653J433k38M65o27j084K057l59j038K14L95L79k15j066J194
$$ y = [421, -930, -2675, 2386, 2476, -2668, -609, 183, 1577, 1505, -3729, 476, 1981, 423, -464, -2899, 2265, 2200, -1946, -1300, 368, 2005, 439, -2671, 45, 1787, 528, -593, -2467, 1724, 1915, -1285, -1485, -332, 2707, -236, -2249, -18, 1314, 1008, -1261, -1661, 1310, 1343, -688, -1233, -980, 2739, 258, -2258, 129, 726, 1467, -1440, -1620, 1476, 911, -525, -1015, -591, 1686, 789, -2114, -274, 979, 1289, -1087, -1627, 1348, 960, -206, -1473, 225, 1244, 238, -812, -931, 999, 1298, -876, -1393, 1022, 950, 102, -1478, -21, 1777, -470, -352, -618, 562, 1184, -628, -895, 286, 1150, 79, -1156, -315, 1548, -97, -730, -418, 506, 881, -842, -178, -274, 836, 343, -1218, -94, 683, 509, -793, -692, 677, 700, -923, -109, -34, 325, 491, -1162, 271, 33, 498, -129, -1213, 844, 485, -553, -339, 56, 435, 220, -846, 348]
1288C48k72m4L88j517J748m02k78k33k30J572j396j42P94m34L79j47p47J262q62
1307b13L44L19j693K574j443m98J272j210J288r49k82J247j141M35M82j435J531
1324F28m50n19P62j225J904j559M0J269j661J461q61j80R95j222J028k14j371
1341a175K361j543k51J554k119K222j460k08J732k356J997o39j168J963j240J74
1357a56N30j325K065j497k88J892k443K119j054n53J792k134J891j051o94K311
1373A405k154N61Q93j670K146j735k7K072l059K755j309j032K931k894J516j74
1389B25j083K330k369N19J623k383J979j060m96K213k831K156r51o97K569l232
1405a488J834J94j406K049k348J235J186k903K697j295o21K652l625K552l97j405
$$ y = [348, 76, 32, 420, -1097, 651, 249, -29, -262, -492, 1080, -316, -458, 336, -98, 281, 134, -613, 649, -213, 131, 450, -1243, 1331, -112, -610, 662, -548, 740, -209, -491, 756, -385, 50, 532, -903, 628, 178, -341, 421, -804, 1100, -459, -419, 850, -811, 650, -211, -391, 604, -618, 410, 196, -1175, 1186, -357, -608, 946, -1173, 1049, -411, -619, 1113, -1243, 754, 115, -1053, 910, -330, -156, 374, -951, 1114, -383, -671, 1221, -1222, 897, -157, -710, 1082, -1052, 839, -212, -906, 1405, -749, -188, 705, -965, 1181, -554, -581, 1491, -1568, 1187, -122, -1154, 1777, -1117, 399, 225, -858, 1472, -897, -378, 1245, -1138, 841, -219, -715, 1498, -1333, 823, -128, -825, 1744, -1488, 346, 540, -866, 1183, -1165, 70, 1256, -1647, 1050, -245, -866, 1786, -1839, 713, 316, -1089]
1421a089K754l429K218O04k609K538j596N29J191k804K613q38r46K367l333K663
1437H33j60j962K551k640K245j66k495L069j589Q2J161k553K782q92j340K409
1453A335k930K823o66k418L469k428J423k80k108L708k237m65J873k565K819j000
1469C53k131L371k536J733m75k324M097k471m8P77j311K559k075m24J833j608
1485f80J801j550r99L322k707J202p73q65L872m096Q54J618k021K561k470l29
1501a260L117k640R88m25j103L675l257m8J568r06J754l044J204J649j760J131
1517F43j886J032K142l093J007N2j43K508m430J695K333k785J834k268J199K132
1533A972l018P41J14M35J165k749O72J707o64l2k239K704O19k591J609j743K340
$$ y = [-1089, 1665, -1764, 454, 1058, -1551, 987, -609, -80, 1111, -1693, 920, 82, -864, 1503, -1830, 833, 673, -1289, 1262, -1378, 867, 701, -1794, 1275, -314, -232, 929, -1624, 1158, 266, -1074, 1335, -1595, 1228, 562, -1856, 1613, -815, 608, 328, -1780, 1928, -309, -774, 1099, -1466, 1353, 353, -1778, 1593, -943, 790, 315, -2009, 2088, -383, -431, 346, -965, 1594, -481, -905, 928, -680, 1121, -429, -1428, 1894, -813, 389, -384, -1249, 2623, -1473, -619, 999, -1022, 1539, -931, -1260, 1857, -783, 205, -220, -1323, 2352, -905, -953, 615, -291, 1463, -1581, -377, 1272, -488, 643, -1243, -211, 1931, -1162, -155, -103, -246, 2262, -2168, -473, 1860, -925, 909, -1359, -160, 1972, -1046, -305, -191, 244, 1409, -1340, -668, 1039, 375, 343, -1896, 808, 1427, -1164, 445, -1298, 1042]
1550A042M05l644K573l6r1P52l358K693J904l689J360m47J075R44l336J651P05
1567E03J62n50j786K100O65j000r90k45K809r54k591K133l22J031n42k778L413
1584A058k55r69r9j220K926k67k752R85J289K84j153j422K254Q9m50r76o51L166
1602A837j511j148M22O3K336k278j823L147k03j012o9j136K817l78k429R64N27
1619A26J262j478j337J408J471r29k136J275J561r12o62o59Q85K009k462q39J993
1636E76l10R77k514j79L320j521j295M02N71J190j086j650J648Q08m80j392l8
1653i73K129l39j154j121J988R68k299NP08P42J90j962J63K109n50r82p33J040
1671g1J743k022p47J054J106n85j536O60Q90M58j213q93J389J088j501o20L14
$$ y = [1042, 1447, -2197, 376, 340, 249, 1001, -2357, 336, 2240, -1449, -89, -536, 539, 1483, -1853, -202, 503, 665, 115, -1671, 429, 1094, 94, -896, -1141, 1668, 714, -1877, 256, -66, 965, 423, -2355, 1058, 803, -166, -265, -1485, 1441, 1174, -1578, -593, 696, 980, -173, -1595, 659, 748, 298, -678, -1329, 1837, 326, -822, -400, -337, 1999, -279, -2102, 1045, 842, -170, -239, -1375, 1442, 1064, -1365, -401, 126, 1388, -90, -1427, -19, 1452, 523, -1613, -338, 1223, 311, -351, -1010, -125, 1884, -578, -1417, 576, 266, 1243, -1271, -1450, 1870, 349, -946, -544, 27, 1217, 131, -1519, 129, 937, 457, -935, -973, 1156, 817, -337, -1458, 530, 1498, -801, -796, -88, 654, 844, -1118, -955, 1154, 604, -378, -1111, -71, 1672, -350, -1097, -43, 1063, 478, -1058, -398, 492, 950, -263, -1156, 233, 1321, -180, -800, -486]
1688d86J336K17k641J301J097m76l11j062J100R39q98j112P61R36P0j573k8J584
1706G54J31j232p07J605j10l14o22l07J869o36j091J18P27O36q42j249J409Q55
1724I94j320o7j30J222k25j010Q9N36Q60j224m38O05O99k55j199M20J312o35p18
1743d84L57j01J101j049n11R44p6L90j163L3J227k77q94K09N20L25o20m10O92
1762B13j2L30r68Q9Q68k88j38q69J095L59j105K63J40K02K21r13L00P28p27N91
1782C79r33L06J168j367L53K9L25O0p45L87K61k01Q0m54K02O53p19K52m51O32
1802B17L17j353J144l43K3K22p86Q01o1m32N44o38K77P06j248P08n5j1K94r74
1822f48J082m55j01L74o02N82j30k47L34n29N70J98j182J268n29j79P25j169J192
$$ y = [-486, 850, 1067, -1574, -273, 824, 348, 37, -1025, 75, 1014, 116, -996, -235, 701, 771, -802, -830, 754, 885, -347, -1054, 551, 441, 127, -495, -802, 1067, 431, -660, -542, 185, 821, -21, -1270, 139, 994, -326, -393, -523, 699, 474, -536, -447, 89, 949, -275, -713, -108, 591, 336, -863, -443, 869, 234, -484, -127, -228, 873, -176, -687, 257, 181, 571, -592, -559, 668, 391, -503, -294, 226, 551, -69, -479, 213, 201, 531, -437, -348, 520, 232, 94, -775, 320, 679, -426, -163, -23, 179, 400, -513, -213, 515, -212, 379, -554, -248, 920, -447, -94, -65, 260, 320, -425, -38, 223, 22, 102, -352, -150, 503, -216, 36, -415, 217, 534, -819, 325, -18, 5, 227, -559, 242, 181, -251, 293, -345, -68, 638, -610, 98, 43, 32, 326, -648, 434, -21, -122, 252, -350, 232, 102, -145, 189, -340, 230, 428, -754, 514, -15, -194, 531, -638, 554]
1841E54o19k19Q72j130O92K79q93O62j79o9M02r24R81l78l41P93r78Q26l78JK69
1862B23p60J036m29n83R26o12J86L14r25J177p68n2R37j626J473l15q04J051p78
1881c29N47j02p11J043m92k97Q39j040P78p0n34P02q63J093o02m62J005p14L73
1900A64k24j97P35p52K19M42j087J358o59n58J233j175J006o37m16J494j429M14
1918f9M78q87Q78l45m19P98p89P24l78n58J358j129L69p7m4N98j075P60m6m91
1938c44Q18p53k4Q69j012P11m61j55J329j855R43L85r31R14q56L90L95p48N78
1957A93l61o7R13j221M13L71l88N70j224J141k8q74J007q21M79K82q34N27o6J
1977A3M16j190R74L42j046O99n84Q40l13p07J021p71N89pr84J048Kn84M07p37
$$ y = [554, -65, -284, 588, -542, 150, 429, -464, 198, 19, -50, 352, -572, 409, 31, -310, 483, -495, 331, -47, -46, 223, -537, 499, 70, -513, 413, -199, -13, 301, -624, 553, -215, -267, 670, -956, 517, 202, -602, 449, -329, 218, 116, -595, 448, -44, -341, 498, -542, 236, 166, -368, 334, -529, 564, -38, -500, 505, -209, 164, -60, -257, 478, -274, -55, 387, -700, 658, -1, -559, 674, -501, 505, -132, -548, 946, -483, -69, 409, -478, 400, 55, -364, 434, -355, 369, -9, -567, 791, -338, 31, -46, -90, 508, -567, 193, 147, -344, 474, -279, -303, 566, -446, 265, -196, -351, 978, -877, 66, 451, -480, 434, -422, -32, 363, -385, 193, -168, -235, 678, -543, -130, 241, -147, 423, -801, 340, 312, -562, 445, -376, 103, 385, -449, 78, 12, 13, 429, -761, 213, 555, -491, 208, -376, 464, 151, -556, 465, -306, 283, 276, -708, 340, 342, -242, 165, -572]
1997e72J142j37j427J552o15J01K13q46R24j63j52k06j85Q73k46p97M85J51L79
2016D74p27l61J346j004M31j92o84J579q88l91M00j00P27p52p25J484l76m87J62
2035h4l04J032o99k06J09Q4Q65j232p4Q05qj15p81L22J243j208j67N50l80J041
2055G93j117k98J002j25K3r80N08R48o07o73K81O37J50r99J13O02j14M50j474
2074h80O79J091r93m5m47R46M82j477J18R75k11r9o34J50J075o16l30m32R90M42
2094G84j402J91M30O68o10q83Q43N57n78j58m09P04P89j470K9N22O25l88j171
2113i27R15N70k57p53m2R08L9o61k47K47R12l30j458J135M93k53n47n80J525j44
2133E45r47M7L42N14j75j002L37R93k43p42m35J335j2q25k04L52J004r49m49M28
$$ y = [-572, 570, 433, -994, 558, -57, 44, 257, -589, 335, 172, 20, -186, -371, 502, 256, -541, -56, 95, 474, -253, -614, 732, -272, 159, -33, -717, 862, -26, -417, -17, -117, 610, -142, -867, 617, 241, -246, -84, -388, 644, -55, -261, -152, -68, 797, -435, -509, 296, 288, 173, -608, -286, 957, -251, -418, 132, -248, 793, -324, -622, 380, 255, 278, -702, -194, 754, 147, -526, -245, 392, 542, -457, -344, 258, 144, 594, -880, -201, 890, -103, -148, -595, 351, 833, -644, -526, 449, 238, 139, -495, -345, 730, 114, -216, -648, 342, 784, -618, -427, 3, 671, 61, -822, 21, 578, 0, -158, -567, 137, 926, -544, -515, 7, 632, 244, -927, -12, 558, 301, -452, -494, 414, 453, -208, -455, -208, 704, 374, -1084, 51, 544, 291, -256, -836, 689, 545, -402, -355, -13, 501, 326, -676, -339, 654, 411, -331, -766, 569, 557, -268, -472, -120, 884, -65, -514, -86]
2153h6L64K88q40n16J226K78j076j26L28R58p06q02O15M02K18r79LO16L36l97
2173A04q96O31J004p67p35N15L70M02j109r4J084l32l9o81K38J014m53q90L02
2192c32P66mp44l16J009N7m80m78M12O32m29k66m72J094J76j105J10M57M62m59
2212I0p43O13O69p46K1k69M54O92j204Q1L95M17k55q65N74O30l86n92K52L44K54
2233D26o03j73L21N04k74q32O62K08J19o63k21J033l02m56R5P5L50J1q43N09K95
2254B41j12j61n91J021q9n56l8K47M61m62j93J51K35J03l44l81P25K3l70r6r1
2275b77Q98o99k69M66r5K04l56r1L35Q2j87j41j04O44l19m17L68m1M01o82J41
2296a39L62l25L25m27L6M76k25k09M6O1M25n92r9O20m54L01l80R3L34l36K37l53
$$ y = [-86, 278, 566, -274, -790, 436, 714, -362, -488, -160, 798, 92, -710, -95, 307, 525, -454, -451, 165, 501, 104, -792, -161, 843, 76, -659, -144, 226, 628, -481, -575, 509, 177, 138, -543, -305, 709, 256, -634, -332, 434, 430, -314, -630, 379, 436, -44, -522, -110, 522, 93, -173, -645, 449, 625, -480, -370, 87, 549, 90, -653, -40, 629, -117, -96, -365, 89, 781, -423, -342, 53, 470, 215, -650, -76, 554, 168, -424, -172, 172, 426, -177, -350, -29, 475, 201, -631, 31, 239, 358, -305, -526, 507, 205, -251, -156, -81, 269, 280, -563, -54, 241, 129, -32, -623, 398, 309, -247, -285, -38, 423, -39, -232, -81, 154, 257, -87, -468, 257, 280, -90, -186, -277, 621, -78, -347, 119, 24, 228, -128, -219, 116, 198, 11, -130, -234, 410, 91, -326, 42, 1, 402, -280, -139, 223, -102, 223, -204, -168, 308, 83, -126, -80, -19, 406, -186, -285, 335, -119, 182, -198, -105, 229, -107, 130, -223]
2318b23J58L60m23p6L32j26J08k96N4M62n83M01k71pM07l87J35j89K84M2l96J91
2340d3K30k75J49j33M3K71m78N02m61J12M84p46L84J6l7J37l10J84J41l77L19
2361A12j32j88N24m89K51j92J62K43o33M54k3j29P1j09R4N6j32J95k70P5M49p58
2383c69M35l7p1K80n97N85j64k39L92l46K6L66m17J00J04n9K71o06M47M1k73K15
2405H4k64L03j59M7P6l38M06Pm87L99K7j59K17n61P21k66l43O17n88L56J29m79
2427b55L07j4j0R7m00M18J32n90M40j86J56l2k12K90l18L99k44j70L65j09o7q2
2449h5l2M31l72j79N65n73M26j17l99O83n00K59j06k60O27l85l19N90k61m2J36
2470H7k99M63l42R9M4k54M64l30k5J0J79O0m81L08K36l32J30n5q5M42n72K74L1
$$ y = [-223, -65, 295, -128, -204, 128, 2, 110, -186, -132, 330, -253, 148, -123, -130, 277, -110, 25, -164, 120, 162, -234, -43, 187, -88, 61, -72, -29, 242, -236, 266, -195, -83, 401, -345, 39, 55, 18, 155, -155, 29, 170, -207, 112, -20, -208, 316, -173, 78, -114, 48, 291, -342, 112, 89, -40, 31, -78, 16, 72, -60, 135, -135, -60, 389, -369, 66, 29, -42, 238, -359, 226, 62, -177, 215, -131, -105, 261, -156, -56, 48, -11, 260, -346, 101, 142, -131, 84, -180, 123, -36, 11, 87, -251, 155, 162, -325, 74, 101, -58, 159, -402, 319, 53, -290, 327, -261, 95, 224, -255, 52, 38, 28, 125, -275, 143, 275, -315, 125, -61, 95, 63, -149, 141, -177, 222, -22, -192, 173, 64, -3, -85, -117, 314, -58, -237, 328, -245, 181, 64, -335, 348, -152, 107, 1, -259, 368, -17, -336, 254, -7, -49, 87, -212, 251, -91, 8, 52, -202, 262, -68, -93, -83, 96, 156, -325, -17, 219, -113, 17, -38, -123, 319, -253, 21, 52]
2493E2k33N90p78K53M54m44P3r0J86K05m87J92K02l28M59n36J12L97l19J14l42
2514b68M47J41n77J74J81j5l8j84J13J94j65M0l48N00O1n10K67k17N82l42m92
2535d56P45k23j38J77m15L77L24q13M36n1J70J44q14O73K20l54j65R3K08j08l9
2556ij97J78L68l19l25L99L0J12m16k95J089o69j53K44k19N28l16m62M49K21j58
2577H0j44l64P45l9n05M9K11M45o84M4K40k2L12o31p7O87j18m09K6NO93n78m67
2600e01P29l4l7l40J5L11R7k42m90O37J95m06j39O0L66J76r51L81O10n64L48o81
2622d60L97P16q75j12L51N4J94m91k22Q94j81n91J41K15K01j52k87j86Q51j99
2642B58o28K99j1M88l86p12R13K99q58L55k33L97L78j085L98K16J54j79n38N56
$$ y = [52, -181, 409, -369, -116, 338, -106, -33, -123, 63, 268, -219, -27, 175, -153, 306, -230, -118, 279, -40, 74, -268, 179, 320, -257, -83, 98, 83, 45, -139, -26, 168, 3, 43, -305, 195, 256, -254, 13, -204, 378, 36, -456, 289, 66, -72, 105, -310, 67, 391, -422, 14, -37, 133, 277, -537, 136, 356, 2, -163, -70, 138, 30, -9, -206, -28, 340, 21, -304, 95, 125, 237, -179, -474, 615, -54, -207, 37, -182, 346, 30, -432, 17, 238, 80, -64, -428, 317, 278, -227, -178, 33, 478, -206, -162, 78, 56, 368, -263, -340, 347, 229, -180, -154, -149, 544, -34, -501, 228, 194, 157, -183, -168, 143, 240, -2, -492, 145, 340, -66, -205, -145, 221, 397, -554, -173, 437, -127, 221, -460, -63, 653, -222, -334, 17, 71, 265, -226, -448, 446, 265, -326, -185, 30, 231, 79, -208, -394, 457, 258, -370, -71, -82, 406, 20, -692, 221, 520, -338, 17, -216, 181, 559, -526, -128, 88, 242, 63, -475, 81]
2662H1M03m80l52K67L26k1m93R2L39J09j89o01O55J94k66k94l6O51j80m90O3L95
2684A73R8k98l23L26L29k00l46j25Q18l33l16j7J51O15p31k17N48km7k02l31P86
2706C56n1o89L14K3L92l00n02N14K41k25l56K09J40K28l97l01N48K06m52j40K05
2727c7J53K72q35K87N66n01J72l22J41N60m89l38N02n4J33k84l71Q38k42l12L1
2748a30J41K28k11j82m3N00j77l54J07J89J48k00l76M01L35o23K89j50J59L15
2768C66p05K59K20o5ok89J35M04l51j94K42L2J51l76Q5J22J01o8l60L91JNk26
2791a26m6L90m9l47J49R5k4J29n01M02K3j05O9l57M84l6k88J13K3J36p6k49K03
2814A2J32k15J58l01L05Q0k77P7o9L47k52j49J97k4R3j63o8K67j22k9M3k08L83
$$ y = [81, 484, 4, -348, -81, 245, 224, -269, -177, 162, 271, 82, -519, 136, 330, 64, -230, -266, 385, 205, -285, -222, 173, 271, -27, -350, -24, 305, 105, -241, -366, 452, 119, -197, -214, -63, 552, -179, -396, 152, 150, 103, -99, -430, 356, 305, -384, -70, -47, 345, 45, -457, 57, 298, 73, -283, -74, 66, 294, -103, -404, 144, 350, -102, -242, -37, 116, 388, -447, -160, 406, -95, 77, -245, -104, 456, -33, -371, 131, 77, 210, -74, -445, 393, 151, -161, -130, 11, 239, 28, -154, -197, 303, 126, -228, -121, 68, 216, 16, -360, 41, 376, -247, 42, -108, 51, 366, -339, -80, 140, 75, 69, -220, -85, 319, -32, -226, 16, 48, 199, -177, -92, 30, 131, 63, -297, 94, 95, 100, -126, -172, 218, 169, -178, -29, 66, 42, 171, -330, 72, 95, -10, 59, -298, 186, 150, -138, -25, -2, 134, 58, -191, 12, 144, -71, 87, -214, 91, 171, -106, -29, -98, 249, -3, -152, 45, 21, 114, -49, -117, 150, 28, -1, 42, -166, 217]
2837B17j27l13L16k08K60k16j03L10j49KM5j55J97M1k72K02j17J94j27j60L26
2858A63k63J80j62lJ85j49P5m1j03K63r3k51L24j75J34p3j72L59l13J97r4p7K03
2881A14j37J6k6KJ98k30q8L37l00J98p6j83M28l68K29j35j17L90l31KJ27m7P9
2904H2j13r4L30k87Q7L5j91L83l57J28k4K9J53l31J89O8q5K0p9k0K57l28J98q7
2928c7j02M61n97K87O9j69K10k84J81J35k75J23Mj18L37l50N7K02k00K46m21L13
2950G2O4k67K01j61J78k3j47Q1K8l9J64l74K56J23k85K47l06L96j66k32L98l32
2972a24K30o0k04K77m4j63K24l44L46O1n53N83k72N1J09l13K86n0m9opM3P5j92
2996i6N5M9J43k45o3M18m91L46j44k00N40n07J26J83k77L72j70l50N79k45j82
$$ y = [217, 90, -223, 93, -115, 145, -71, -174, 136, -13, -11, 34, -121, 76, 117, -155, 47, -70, 124, -3, -163, 163, -100, 80, -82, -85, 100, -49, 26, -15, -118, 145, 52, -199, 125, -50, 84, 11, -161, 198, -115, 82, -12, -89, 114, -23, -7, -33, -31, 167, -63, -151, 186, -114, 84, 8, -175, 253, -115, 114, -21, -138, 252, -79, -77, 50, 3, 82, -31, -125, 205, -82, 5, 40, -151, 232, -125, 3, -21, 8, 161, -170, 19, 87, 2, 22, -57, -77, 180, -148, 50, -37, -139, 322, -275, 12, 81, -88, 122, -162, 19, 154, -121, 2, 6, -112, 225, -125, -68, 134, -66, 180, -241, 72, 136, -131, 70, -91, 87, 64, -83, -2, 26, -13, 151, -223, 33, 156, -129, 118, -188, 208, 42, -190, 208, -124, 106, 46, -158, 119, 75, -88, 136, -208, 138, 199, -354, 229, -43, 8, 117, -196, 90, 40, -9, -15, -22, 21, 96, -96, -41, 8, 151, -94, -157, 261, -230, 116, -28, -228, 312, -195, -69, 114, -163, 209, 39, -311, 268, 23, -159]
3017a59K81k94L93k61m0J17n8J78k98J30M1K8j5k05J54K96m59J10J92k70M28m60
3039a71Q2K76k66K06k36O0K20j53j69J41J24l3k39J80P6j36K46m92L83J43m79
3060b37L81l32K63K11o13K62L71m44J90q9j22M71m37jJ21R1pj86K0M4L54n25J5
3083a99M54k74k5Q5k64M40l5n89O09k45R2J43o49O12J00m61J40R0J8J18l11M7
3105a04K81q3p3k56L33M5q8k13k7N79m86q1K05k3J56j75k85M22R5k76K6k03N11
3128B80j56l71J83J25J85m63J07J90KJ0k56J1M45k12l12L01j88M35l72l66P17
3149B95k67k5l7j23L01N2m11J8L38n4j05k16K56J68r5m77L89K81m83K98l36K46
3171A3L97o12NL74j33J43l38k08Q60n65j47K94j76L34j50m01L89K47l29j31R7
$$ y = [-159, 122, -172, 221, -40, -80, 37, -21, 157, -141, -11, 30, 58, 43, -162, -8, 288, -171, -61, 131, -139, 289, -171, -89, 187, -79, 127, -109, -49, 171, 18, -151, -10, 114, 81, -158, 22, 98, -38, 208, -284, 99, 242, -237, 144, -188, 75, 286, -327, -65, 306, -138, 52, -37, -159, 312, -125, -126, -5, 86, 79, -107, -87, -43, 311, -214, -199, 255, -19, -44, 41, -223, 217, 182, -407, 202, -43, 49, 192, -457, 155, 255, -206, -66, 24, 42, 160, -151, -104, 177, 94, 21, -235, 98, 143, 55, -158, -185, 394, -92, -173, 32, 9, 165, -10, -295, 127, 222, -54, -28, -231, 280, 124, -247, -64, 61, 246, -217, -110, 80, 82, 92, -164, -153, 292, 80, -232, 69, -119, 316, -56, -422, 295, 28, 3, -34, -157, 144, 196, -215, -197, 141, 87, -18, -234, 22, 190, 95, -382, 7, 288, -195, 103, -233, 13, 410, -202, -197, 177, 44, 187, -151, -359, 501, -64, -211, 83, -93, 241, 91, -310, 79, 326, -3, -134, -37]
3192c7N8K99m43j61M19O5m20K93k08J85M10q84M06J66j43J02k26J20K83m86k0
3213b22L77j86J76l14P6K61Op2k84L71Lj08m4k22N36l03k52J59K57l11K07m36
3235c25L18K65m90K34l27N70k21j05L1N6J79j88j70J76J04j29Or6L62j55l55M30
3257A70j78J73j53l13N70l26m0o6Q1R1J62k47j36J81J74j95j82M16k16J18j89
3278a05j22M19j70j83J93oJ55Q7n37M57jm9j72k06M59k82K3j79Q7K04j07J3k7
3301d9P3R7k15l8L36k43Q7j96N1L12m20L16j44J6L22m53p3L72j36j36J07j20L74
3324B40k28p8J38j57L05l44J16q5K13p4k42J31J06q7J2O9r9L34l53K06r1j15K35
3347A52l43J89J34k68K75j96J52j4j60K6P7r7K10k22nK16j71N8r0J47j16J02q3
$$ y = [-37, 21, 320, -123, -284, 135, 200, -220, 73, -135, 50, 460, -424, -18, 148, 5, 107, -119, 1, 284, -202, -222, 155, -31, 145, -169, -93, 168, 174, 102, -182, 189, 192, 84, 40, -182, 354, 51, -201, -42, 215, -96, 111, -325, -7, 258, -232, 2, -325, 245, 24, -81, -50, 6, 185, -3, -173, 3, 107, -22, -16, -112, 250, 95, -260, 170, -8, 165, 12, -301, 269, -57, -97, -163, -82, 9, 171, -76, -212, -31, 143, -52, -234, 182, -34, 84, -105, -227, 192, 22, -161, 32, 26, 181, 268, -269, 188, 187, 138, -34, -240, 219, -63, -40, -219, -132, 72, -35, -22, -49, 24, 121, -94, -132, 204, -39, 48, -148, -97, 215, -205, 111, -33, -17, 305, -148, -221, 151, 15, -121, -14, -134, 240, 12, -66, 72, -85, 220, -124, -8, -93, 120, 46, -196, -65, 41, -46, -34, 35, -64, 270, -83, 123, 32, -83, 152, -191, -2, 132, -136, 139, -57, 95, 81, -79, -53, 24, -73, 137, -85, -90, 126, -45, 13, -77, 70, -46, 56, -27]
3370b7q5K19j53p3K05j82J27Lj65J02J44k01K47l58L27n5j88K45j43q3J23j37
3392a08K36j49lK8j14K9K22j50M7j96J54J07j80J98k16K10k60RK42k22J34q0j24
3415a86L67j20k09L05k58J70o9k11N05k77J06r2j73L05r4j77J08k4R1m3j36J54
3437D2n5ok9l3K07l00K41k00R1J86k42M0J54j24Q2j60l2L87l23P3K9k40L40k05
3461g7J3K7kJ66k28O9K77k61j8N3j78L74j65j08R7j97K54k23pL31k81Q6o7J96
3485A31j15j57R8P8j48J70j02nN7n6J44j50J53J52l26O7K9j9k8p4J97O8k50J85
3509I9j61N8J78k56J38j20K69j37k64L03j06j4J5j2L1j7n6J82l22K96J4m25M23
3532A16j35j3O9j43J78j04QR4q3j8N0j51K46r7q7J98j98K96k45l8R2q5J43j57
$$ y = [-27, -112, 107, -46, -119, 86, -96, 31, 34, -131, -29, 115, -86, 161, -197, 130, 75, -113, 132, -11, -94, 29, -108, 128, -21, -24, 4, -110, -81, 141, -9, 38, -158, -4, 103, -77, 121, -95, 115, -145, -136, 106, -116, 18, -62, -186, 181, 61, -148, 157, -101, 69, 0, -211, 294, 17, 123, 31, -142, 163, 69, -108, 0, -24, 67, 24, -112, 42, -13, -19, -48, -81, 126, -174, 67, -133, -42, 144, -98, -58, 96, -28, 54, -106, -138, 249, -74, -1, 28, -212, 128, -77, -64, -37, -39, 127, -101, -32, 245, -16, -34, 19, -159, 215, 50, -58, 39, -158, 96, -127, -134, 197, -84, 2, -65, 131, 16, -141, -43, 35, -113, 57, -45, -50, 7, -49, 95, -55, 98, 250, -76, -9, 20, 1, -27, -101, 96, 164, -86, 99, -62, -4, 174, -82, 56, -64, 205, 68, -196, 107, 1, -13, 2, -10, 21, 4, -52, 130, -192, 104, 118, -307, 116, -19, -32, 37, -106, 72, -32, -24, 70, -13, -31, 19, -132, 114, 17, -70, 128, -70, 226, -19, -57, 35, -50, 93, -64]
3556f4oJ16m8%L5j40L18k24j08R3J9J57j70n5J36j62J12m0N3j0J49k62J38p1L25
3581B91j46l90L41j36J86k82P1K04k23J09L3n4J69k94J0J55m4Jq1J21J33k56J55
3604G3o6kJ02k53M1J41K9N2k81l1N43n13J30o6M8K68l66J03J79p1m4j26N4J9J45
3629A08k18Q8nJ47k76K01q7l2K25k99K2L56l28J92j61J74j8j76m9J83j3M0o2r1
3653g9J96j80Q4j16J61o0l6Ll1J36n9k54L18Rj29J10k84L03J1l41L01j72J53M9
3677I3k72J87M5kj27K8J38l4j04qq8K77p6k04K16j91J56j32o2J98n1L0j07Q2J38
3702A30r5j92J12J53K3k03q2J98L1O4k92O9L29m76K13L1o2K22k47K4J12l6qr8
3726h0j79N88m17k05L28M4m2k05k2J88J48r3k37L32O1j78k4j64L14m9k52J15K5
$$ y = [-64, -70, 46, -2, -2, 33, -107, 211, -13, -121, -28, -9, 148, -22, -77, 59, -103, 9, -31, 22, 12, 161, -101, 37, -34, 291, 145, -245, 96, -40, 146, -136, -65, 139, -84, 25, 58, 4, 173, -121, -111, 44, 0, 1, -80, 41, 174, -82, 73, 7, 5, 107, -146, -105, 36, 65, 117, -164, -195, 348, -165, -35, -101, -53, 215, -151, -48, 131, 60, 16, -110, -56, -37, 108, -110, -22, -27, 120, -156, 45, -42, -74, 151, -148, -126, 230, -98, 94, -67, 107, 89, -87, -136, 47, 34, 74, 12, -79, 117, -63, 21, -95, 66, 6, -30, -27, -58, 78, 19, -235, 83, 92, -37, 73, -211, 92, 103, -238, 63, -109, 44, 93, -179, 8, 53, 51, -76, -48, 90, 56, -48, -56, -144, 133, 57, -147, 69, -122, 34, -98, -160, 38, -13, 17, -90, -8, 130, 35, -157, -45, 108, 131, -72, -154, 44, 75, 139, -153, -84, 245, -231, -18, 13, -49, 173, -74, -50, 62, 26, 18, -80, -259, 329, -88, -293, 35, 79, 37, -168, -190, -2, 146, 53, -184, 148, 209, 31, 7, -157, 157, 108, -144, -29, -4]
3749dl0J32k86K38Jk5j21n3R4K90l24l6J80k75K66j49J19K72k93j02n8K79l3o9
3773A3q1r4J56J64l95K63Q3j09m0kOP1k52K88L5J58j96j88J47J55k27K72k07M0
3797F0J95l74R7l6J38k31J3J37o6J29k97L07Q5k22M7K4kK18k07k59K94j25R8n4
3821c1j89L97j65j18J50j36J98j39J03j88J35O8j86R5J37l29K29j38M3K49k70
3842h5J72j06q7L67n03L18p2K8R3l60L26K3k64L75k42r1K93l76J59R5j42K09k89
3865a59J78L3r5P2J0j41K26q3l6J7m2J46k31J80r4M6Nj70K10j00l2J20j47J23
3889C6O7k43J89j8j06K41l34K37Jj94K66k15M4J03j07J6K3l0J14j97J25N0j57
3912h9J50j58J41p7rJ06k00K12k5j29J22l1j4M0j45J56k2j23K25k52K07l4j56
$$ y = [-4, -34, 98, -188, 50, 51, 26, -95, -148, -54, 236, -88, -124, 56, -219, 47, -102, 17, 289, -4, -106, -164, 115, 82, 13, -68, -162, -6, 158, -237, 26, 109, 0, -40, -42, -36, 35, -217, 71, 106, 264, 68, -120, 27, 182, -45, 227, 20, 60, 255, -119, -22, -58, 80, -151, -138, -1, -67, 62, -235, 72, 157, -65, -18, 6, 4, 222, 15, -244, 50, -75, 23, -31, -220, 177, 12, -106, 44, -92, 106, -33, 70, -118, 17, 85, -101, -6, 131, -198, 31, -107, -64, 185, -85, 87, -19, -106, 261, -242, 76, 4, 32, 125, -235, 91, 114, -150, 225, -17, -108, 185, -191, -32, 63, -79, 130, -159, 19, 52, -43, 29, 39, -102, 124, 41, 5, 22, -20, 126, -105, 75, -19, 27, 32, -138, 72, -28, -60, 60, -87, 36, 103, -140, 49, 31, -75, 166, -168, 69, 70, -124, 142, -73, -29, 74, -33, -17, 6, -24, 90, -107, 18, 68, -89, 61, -97, 44, -33, -42, 64, -136, 76, 51, -78, 44, 13, -1, 39, -106, 50, 28, -95, 130, -122, 85, 51, -105]
3935a05J86j65J50m2j49K00k9j04J02j05R4M0j62J86j88J52l7j54K10o2L5q9J6
3958b0J03q7l3P8j18J01J6j76K23j51J25k3j84L03j97j3P7m3P9j6q9Q5n8N3K7
3983F2j76K35j35J9Pn8J62j92Q6J9m7j5M3j74K19j03J8K1j02K61k41N5R7q7M8
4008B2o7M1M9o5L9j9o6J22j17J9P4j17J47r2L6J07j98J37j38O4J7J12j32m1p4
4033a40J85k17O6K50j27Ko2J43M0k07O7k04J61J64k76L10k6M5j20r2J4J54j23
4056Gk8m8J06l3j34J23J0J1k6O5R7j49J9rj1K8N0r9R3j47l3J14j12J56k3j33J28
4083B2ml7J41k41Q7J51j88J34q2R3l9n4K9k8R7n5j9K0l2M4n7n4J37n0q4J92k05
4110h2J21qj49J84o5J7l1mL2L3o3j0P9J6r4l3J09j01J27q8o8K01j73R6r2oJ74
$$ y = [-105, 81, -84, 66, 24, -125, 75, 46, -58, 44, -61, 33, 73, -89, 97, -91, 61, 24, -130, 80, 18, 53, -36, -20, 83, -4, -37, 41, -77, 24, 40, -136, 87, -64, 61, 38, -146, 157, -40, -53, 24, -19, 60, 44, -45, 40, -18, 35, 62, -114, 121, -14, 5, 12, -46, 116, -76, 10, 29, -18, -33, 10, -164, 55, -48, -30, -9, -111, 150, -91, -36, 61, -26, 22, -45, -4, 45, -20, 19, 0, -66, 56, -61, -42, 32, -85, 62, -30, 6, 113, -85, 52, -86, -22, -5, 107, -25, -66, -140, 45, -172, -106, 144, 17, 19, -43, 100, 140, -67, 0, -204, -43, 121, -155, 155, 129, 174, 54, -38, -24, 130, 7, -21, -69, 37, 4, -130, -7, 3, 14, -12, 53, 150, 1, 20, 11, 0, 28, 78, -21, 72, -75, -108, 6, -106, 50, 27, -106, 22, 18, -19, 122, -119, -32, 119, -69, 65, -17, 76, 37, -17, 12, -16, 81, 26, 7, 27, -5, 39, -18, -72, 65, 15, -69, 123, -82, 39, 31, -118, 66, 1, 18, -13, -17, 15, 48, -15, -25, 54, 70, -24, -57, 52, -49, 78, -10, -78, 123, -50, 46, -46, -52, 122]
4137A22j34o6J06k3k5N0q6Q8l1rk5K6J00j61J20j23J07L2k03J50O1j34P6o7j0
4162e9K24k36M4P0r2J82k37O2J01on7k1O0k9L8j06K7Q5j5j05J09n7O0M7k59K77
4188A07o0j01Q4j10J28K9j80R4O6q9P1j39J05O4r4J8o8J73j13l1L3l9J64j57J5
4213c0O4k5K7n5q6J98p4j23J56j18J71j50n0J80q1J8o7j4J07Lq6QMJ15r2q8J51
4240F3p5Q9j26L4J32j55Q5j06M9J34j49l6J07m7P6j19k1J88j63P4j03M0J45j92
4264g6Q6n5R7Kj16L6Q0o7L4o6K7J48k19J17m1j2J33k48J46lMJ0p9R1N5j21M0k3
4292b0M0P4k06J73j05N4R2k74K71n4j00P8p5O8N0j29P2M4r7J30j97J22O2q5jp7
4318i0J86j26N0mp7J54r9n0J01n5J6P7k65L05j15j07K13k14J90q6r2J39m8j7M6
$$ y = [122, -12, -78, 28, 5, -20, 30, -56, 32, 1, -8, -33, -7, 93, -68, 52, -71, 36, 68, -135, 15, 76, -58, 18, -49, -59, 165, -71, -27, 43, -49, 133, -104, -42, 59, 53, -4, -25, 35, 6, 44, -62, -35, 50, 35, -70, 39, -18, 42, 89, -170, 107, 47, -54, 30, -80, 48, 77, -103, -9, 57, -32, 39, -100, 5, 69, -25, -7, -75, 98, -15, -46, -13, -52, 112, -45, -30, 34, 9, 36, -19, -105, 93, 19, -104, 52, -66, 105, -45, -95, 85, 4, 22, -45, -59, 48, 51, -35, -27, -23, 92, 0, -88, 63, -12, 77, -49, -15, 117, -38, 47, -59, -10, 124, -25, -61, 46, -1, 75, -44, -65, 123, -40, 34, -69, -29, 116, -76, 10, -45, 52, 54, -62, -26, 54, -13, 21, -45, -18, 130, -89, 28, -13, -25, 108, -140, 6, 3, 7, 17, -62, 29, 84, -37, 3, -20, 20, 94, -112, 61, -44, 10, 102, -172, 99, 45, -55, 23, -52, 16, 66, -63, 9, 53, -44, 86, -111, 11, 73, -12, -13, -90, 96, -30, 20, 16, -61, 93, -6, -56, 45, -10, 6, 83, -182, 123, 8, -99, 114, -100, 90, 4, -88, 51, 3, -14, 32]
4343C2r4Q1L8j14O5o1J21p8m3R4j09J56j57N5O8j10J02o0n7J55o2q9R7j07J40
4368F3p2q2J82j50J14o2k9R9j02M4pl4Q3n4j02J81j32O8k7m2J12j24J33p7k8J14
4394F9r5J8J4j9M9k8n2J14j13P9m1n5J70j77R1m0rR7j50P9N4q0L7j4m3J21j11
4421c5N3np2J50j36K8M4l5L8p9M3M8n0Lmn0J22q5L0Pn9J18j65J01K3p7O4o9O7
4450A8K6o0K3Ol8Q8j06K0P3q1R2j36J04Rn2J8k7J8L2n8LO2n3L5p7N2Q1j13O7o5
4480c9P4j7o8R8n6L2Nn6J2P6q3M9l1J3L2j15J03l4Rj8k0L7J8K2o0K1J6Pr4Q9j3
4511Ik7M8j03J19o3K4J1o1P8k6l8J7lkO0r0Q7k2n6P2o4P4n1j0J5KO5j05%M0lj3
4543a6J0n3J03l6l2M6q0J21o1m6P8n3K0k0lN4l6l6P3p8O7Jp4P3p0P8p7M0P0q4
$$ y = [32, -62, 19, 57, -57, 8, -53, 68, -10, -53, 41, -68, 88, -69, -14, 54, -56, 46, -14, -71, 84, 22, -67, 30, -77, 63, -9, -91, 91, -59, 55, -7, -36, 63, -39, 5, -2, -36, 47, -7, -109, 72, -60, 8, -19, -61, 51, -73, 60, -17, -45, 69, -26, -8, 6, -13, 36, 8, -44, 70, -43, 36, -5, -60, 110, -67, 24, -16, -25, 72, -78, 1, 55, -25, 12, -2, -45, 76, -35, 18, 13, -59, 91, -45, -17, 27, -8, 30, -49, -6, 42, -8, -5, -9, -59, 63, -22, 8, 15, -44, 74, -91, 10, 33, -44, 20, -49, 18, 44, -16, 7, 13, -25, 63, -43, -23, 50, -31, 61, -75, 29, 38, -14, 4, -23, -5, 27, -31, -28, 34, -19, 16, -61, -9, 72, -41, 26, -39, 35, 18, -50, 48, -8, 24, 29, -27, -15, 61, -22, 27, -4, 9, 41, -74, 29, -5, 4, -14, -34, 3, 21, 43, -17, 4, 20, 27, -67, 22, 9, -18, 30, -73, 46, -17, 7, 18, -43, 35, 9, -29, -12, -15, -17, 43, -47, 40, 18, -38, 34, -30, 44, -7, -17, -2, 0, 65, -40, -40, 0, -3, -16, -6, -59, 44, 8, -24, 22, -58, 63, 2, -44, 34, -19, 1, -19, -22, 32, -4, -40, 33, -45, 22, 23, -51, 22, -48, 30, -47, -7, 63, -21]
4573b1O3n2JO2n9j6L2k1K4j7o9J23q9M6m8M7K0o3O0l3RM0q3O2J8p5O6o6L2O5j14
4604e6Q4nm3O8r6M4NKk2K6j1K4k4j6L5j2k4k3R4q0L7J3j19J48m7n1N0pJ1mk5N2
4636B8j7o7Q7o2P7n8j1M7k4L5n9L7lnJ9l7RM8q4M3J4n4J12p9o2J27q1Q5r8K2N8
4667D7o4J6k3L5j6Qm7P1m3Q2j26M1J02j42Q9r2J03jr5Q1l0k2N6m5JO1n8K4n5P4
4697C2J9r7O6m9P7l1o3P4k5NJ1p7O4M5j19J08o0M1M4j62J47k2m5L7n6P3k3j6j8
4726b0j4N7kq4J05k8J8l5q9J79j13M8lj04J48l1r7R6n0J4J1r9J30l1k3M9r4J19
4754E7q2J3nPR7j22J6L7n0O2n0m9J66j48N1M9j21J83j38l2J20o9R1j13j2P1m5
4781a6j9N5l2L5n2k3P1m5Q1r9M9M3q4Q2j19O9P6j24O8jp2J21r5kJ18j07O5r6Q1
$$ y = [-21, 42, -10, -9, 53, -6, -22, 10, -11, 13, -4, -73, 50, -39, 7, -41, 6, 26, -37, 23, -10, -1, 39, -44, 18, 36, -39, 27, -39, -7, 58, -56, 28, 23, -20, 48, -48, -4, 1, 3, -19, 7, -4, 20, -4, -20, 15, 3, -21, -44, 50, -30, 7, 20, -99, 49, 2, -49, 1, -6, 5, 1, -24, 28, 11, -56, 31, -31, 46, -12, -23, 24, 0, 35, -24, 13, 10, 5, 24, -13, -4, 44, -40, 3, 17, -37, 75, -4, -66, 61, -20, 65, -33, -11, 47, -17, -1, -24, 11, -5, 3, -44, 27, -16, 66, -60, -19, 83, -59, 30, -62, 41, 40, -55, 26, -4, -26, 30, -15, -14, 47, -11, 13, -42, 32, 51, -46, 20, -29, 48, 17, -46, 28, 3, 8, 19, -58, 6, 51, -68, 40, -20, 21, 65, -97, 50, 28, -17, 20, -36, 37, 14, -2, -20, -34, 23, 21, -63, 42, 14, 32, -3, -92, 87, -26, 22, 19, -85, 63, 32, -65, 31, -19, -5, 6, -93, 37, 6, -17, 32, -62, 57, -25, -12, -17, -10, 87, -35, -19, 18, -32, 30, -20, -69, 97, -51, 0, 49, -72, 111, -27, -59, 61, -8, 83, -30, -42, 29, -16, -35, 20, -12, 23, -29, -52, 19, -26, 55, -44, 5, 48, -36, 46, -73, -4, 72, -52, 16, 15, -57, 64, -31, -33, 85, -22, 43, -53, 28]
4810B8M2j55R9m4L6J8p5NN5l2O9r1MJ03j20Q2m0K6L4j27J04mj9K4l5J2L7o2M8
4839B2o3K1R0j54J39q1M0J8q3J02n5J8J1m4J8O7j05M5KJ0L1j27J17k8l0K5q1J20
4867D5k9j3prN9k7q4Q0J4l7L1q7J11k2j7M1r3P0l0l5N9rnQn0O6K3p3M2n1M6j1
4899Fj3K6q2R0l8k2M8Mk9j6K3LMl6P8p4M1Pn0P8o2N9p3jO9l2l5L1J0Qnn9N2n0
4933d0Q0m4k0Q4q4N5n3LO0o3PK6k8J4lj5O1o3M0m9OQ0r1J8K0Opk0K8lJQkj4L1
4968B9m8J9j3k2P2p0N9Jm2J1Mk5J8L1k0m0RP9j21L8O1n1Q3j63P1K9j7N2n4j3N9
4999B6ql4L3j6K7m1K3L4m9K5m7O7n0J3K3n3N1Mn9J1L8l5L3n3N7j3k1K6l7J6J0
5030AqJJ1J2rl9L1jj6K5l7K4K2m6M6p4P0Pn0M3K3n1J7J8j4%l6N9m0mkk5N6j8M8
$$ y = [28, 70, -85, 14, -30, 6, 24, -51, -46, 9, -23, 46, -45, -41, 62, -58, 24, -16, 10, 44, -83, 21, 17, -2, 22, -13, -1, 36, -26, 22, -41, -20, 70, -84, 55, -26, 14, 32, -51, 51, -4, 14, 25, -19, -1, 66, -39, 6, 8, 18, 49, -78, 39, 11, -19, 6, -75, 45, 16, 3, -4, -13, 46, 19, -65, 15, 29, -8, 23, -64, 47, 25, 8, 49, -44, 26, -4, -39, 20, 11, 6, 14, -36, 30, 53, -20, 22, -29, 17, 6, -7, 19, -63, 27, -11, -33, 15, 19, -10, -26, -3, 0, 4, -32, 46, -28, 13, 20, -30, 48, -14, 45, -28, -29, 40, 8, -27, 4, 14, 22, 17, -42, 10, -40, 40, -4, -24, 60, -24, 31, -22, -19, 41, -22, -15, 11, -17, -3, -6, -21, 40, -23, 17, -32, -26, 54, -37, -19, 1, 7, 0, -20, 8, 5, 6, 14, 12, -2, 29, -19, 0, -13, -35, 37, -33, 26, 27, -15, -4, 0, -25, -7, 24, 4, -36, -27, 52, -69, -31, 30, -21, 62, -101, -30, -1, -18, 34, -20, -33, 26, 18, -16, 17, 1, 28, -13, 10, 44, -5, 20, -27, 40, -10, 3, 26, -27, 24, 28, -31, -20, 18, -17, 16, -37, 20, 7, -14, 12, -25, -9, 1, -7, -6, 5, 17, 8, -31, 0, -1, -17, 8, -29, -5, 17, -29, 17, -57, 13, 20, -30, 13, 36, -15, 2, 20, 6, 6, -30, 29, -11, -15, -17, -42, 14, -4, 44]
5065D4l9n4P4l9NJ6j0J7J7l7M2n4L2No6J06n7J2m4J9N9o8L7K2m7NL7o3N5j5Np
5097In3Q6n7J4nJ2j4m2P5n4J5J1k2%M1k0pJ5k4N7r0P5J2j03R2n1L9Lk0J1j4JL3
5130B5l8k3P9m0J8k8K3l2j1P9j00P1%k3K6j3j1K9q1Q9J2r9R8q4N6k3j8O7q8L2
5160hL0k8K1J6l8Q%K9k3p2J36q8J4J3m5P0p4N7l0k5R9j00k0Q4j7Qj1j5O2j01P3
5191B5%o5Q8o2K7oj4N5p9L7M5j06O3J0m0Q8j11O2kn1R4r4QM2l6K4l6L7Qm6L8J5
5223A8m4M8m0L4k0JN0r5P1J8r2P4j5MLk5L5j4l6Q4r4L8O5q9N9p3P7k4k7N7o5J0
5255gK8l2LOj7N4q3N9K9q5P4o6N6j5l2O3o1KN7m1M1Lp0Q8n9L5j5o1J28q3RJ5p0
5288d7O3l9KK7l8O3j1n9N9k1qK4m7P0n9RK5m4Q2n8qJ4lPj2j9N2n0L2K1o2Q0o0
$$ y = [44, 5, -49, 25, -14, -9, 7, -3, 14, 31, -6, 36, -18, 14, 19, -47, 59, 2, 14, -30, -11, 48, -20, 17, 39, -8, -3, 34, -29, 26, 11, 16, 9, -44, 42, -15, -1, -6, 6, -8, -50, 25, -29, -14, -3, -25, -25, 16, -4, -11, 4, -20, 37, -53, 22, 34, -69, 23, -28, 11, 14, -6, 5, -9, -8, 25, -13, -36, 43, 3, 21, -7, 16, -16, -27, 52, -48, 23, 23, 0, 26, 13, 2, 31, -50, 39, 51, -48, 50, -34, 22, -1, -19, 48, -40, -8, 22, -6, 15, 31, -7, 1, 1, 30, 7, -65, 71, -17, -3, 10, -35, 35, -39, 18, -12, -37, 62, -38, -58, 26, 9, 17, 6, -9, 53, -48, 25, 25, -40, 48, -14, 13, 7, -7, 48, -31, 6, 51, -55, 8, 18, -22, 66, -45, 17, 15, -36, 58, -36, -28, 14, -22, 2, -34, 3, 11, -35, 3, 18, -26, 22, -18, 16, -4, -3, 47, -48, 23, 41, -51, 23, 8, 12, 15, -10, 25, 11, -25, 59, -35, 3, 68, -21, 38, -35, 42, 18, -9, 48, -17, -7, 21, -11, -8, -2, -19, 35, -48, 11, 40, -45, 29, -37, 19, 4, -28, 35, -26, -24, 33, -8, 33, 36, -34, 54, -5, 30, 15, -46, 82, -1, 8, 23, -47, 16, -23, -21, 6, -32, 31, 20, -39, 20, -1, -9, 15, -32, 38, -21, -12, 13, -31, 51, -7, -15, -1, -4, 3, -9, -28, 24, -26, 6, 27, -35, 45, -15]
5321a5K6K3n2R1o6j8N3p6L6J0m8O1o3oL8m1O0k7J5pj4M4l5%M1m2j0N0k7J4mk3
5353a2K0m9R8n5kJ8k1jJ3QJ9l9K2Ql6K1j1k7M7n9O7p2O7j3o3M0qqM3l6RL9p0N1
5387Hk7J4m0L2RJ7rK3l8L2Jpl3K3kJ3l3M3m7K7K7q7Q6m0K1j3l7M6L%j4Jm1M3j3
5422a2J3pPj7j9M6klJ1j3J9l1JK9k3MJ5n1L0M3n7K1m4N8j9j5L1k8M1l2J0pQMJ3
5457B4l4L0k1l4O3n3M5l8L0pk2J8k1L6orLpJ3L%o1Q3m2j3J7J5K4l5K2n9QLM4l0
5492a1j7K3j0L8Mok5K4l5QL7n6L7j3J1l3LK7L1o2L9k0LM1p1M7j7j5L4m3M2lNk3
5526fK5jkkOK8n7m1L9J1O6o4pM4k4j9NK7M3n1n5L7L1n0L2k2k3qJ08o4K0q3J23
5559F6M4n9j1j0n4J83j50R4o5j13K44k41K96k23J3N8j50J84j10n4Q9r0Q8m9J9
$$ y = [-15, 11, 34, -18, 73, 7, -11, 42, -34, 2, 12, -36, 25, -38, -44, -6, -47, 13, -14, 1, -6, -20, 24, -11, -11, 30, -12, -22, 28, 1, 15, 11, -12, 8, -41, 57, 2, 0, 18, -3, -4, 9, 17, 36, -3, 19, 27, -9, 12, 1, -26, 21, -38, 29, -43, 24, 11, -52, -12, -20, -28, 15, -21, -12, 27, -43, 8, -19, -5, -45, -13, -4, 13, 4, 27, -11, 21, 22, 15, -18, 5, 3, 16, -17, 26, -21, 6, 33, -54, 32, -8, 13, 0, -37, 9, 12, 12, -2, -1, -42, 1, -12, 1, -6, 1, -16, -35, 11, 9, 6, 17, 4, 23, -8, -7, 22, -1, 3, 18, -33, -3, 40, -17, 4, -40, 18, -1, -16, 15, -13, 28, -4, 6, -1, 7, 11, 24, -10, 20, -1, -35, 28, -25, 20, -18, 12, 5, -17, 1, -20, 16, 10, 1, 4, -3, 10, 13, 13, -48, 35, -7, -20, -3, 12, 36, 1, 23, -36, -28, -25, 19, -11, -28, -5, -15, 23, 27, 21, -4, 20, -15, -7, 30, -26, 11, -2, 9, -24, -21, 6, 37, -25, 14, -6, -3, 38, -33, 14, -3, -18, 16, -27, 15, 12, 17, -6, 19, 18, 16, 14, 20, 48, -9, -50, -11, 0, 66, 2, -5, 39, 15, -4, 1, 28, 71, 20, -35, 2, 33, -17, 15, -7, -30, -38, 70, 6, 26, -57, 66, 110, 51, 40, 30, -24, 159, 9, 103, 38, -75, 169, -72, 224, 1, 14, 72, -78, 106, -4, -58, 31, -59, 29, -20, -1]
5584aK9j5l5M7l2M6m5J5L9m8N0l4j3K3l5J7J8k7LllM9p4P3p5L1K8p1N8l0pL2j7
5617gJ2Kk2L4j8kK4m5K6k7L4L0p8Q2o1QL2q3R9n1nM9k4j6K8o6Q6Jo5Q7j05N4l3
5650b0NJ0m0L2Qj3K4mkJ3l7O3m3j7P0j15J16m8j0L3n1L5Kj1%k4J4M7n4K8k9NN3
5683D0m8L9n9J2N9r1O6j1m0O8m8k3O1n1M8j1m0N5n4L1Rl0P3n7J1OqJ7j1j0K2o8
5715d3Q6k8l0Q3q4K7n8K8O7o3M0j7j7M3m6mM2n8M7k3j4O2p6M2j9j6M1l9N1l0R
5746Cj7qK4K1l2K2rrJ4k5N3j5n3Q1o8K2J9k5J7k8M2pk6K0j8k3N5p7P1l6NPm1N6
5780A5ll1oL2J8k4j6K0%m4O7o4M3j4l6Q1p6O8j0j7Jj7PL4m7L3Qo0O2m6M6l6j1
5813b3M4l9J2L0l4K8k5k2M5l2L6J1p4Q6n8j5L4l2M3lk0ROnnk3L4rK7Ll7L0k9K6
$$ y = [-1, 28, 13, -22, 25, -7, 39, -6, 9, 48, 0, 50, 16, 3, 26, -9, 8, 26, -1, 2, -1, -4, 45, -29, 44, -31, 0, 28, -43, 15, -15, -22, 10, -7, 5, 7, -15, 19, 1, -1, 23, -22, 4, -23, 11, 41, -37, 45, -16, -8, 24, -59, 40, -11, -16, 33, 9, -7, 21, -45, 41, 42, -23, 64, -41, 13, -20, -15, -5, -45, -13, -5, -18, 6, 2, 0, 13, -24, 39, -4, -21, 49, -66, 50, 2, -8, 25, -26, 9, 11, 0, 0, -24, -10, 37, -17, 11, -18, -13, 40, -8, 31, -28, -16, 43, -48, 18, 7, -33, 35, -13, -36, 25, -26, 22, 11, -29, 26, -28, 3, 12, -18, 55, -2, 9, 15, 7, 24, 13, 3, 25, -43, 43, 15, -15, 68, -16, 11, -47, -19, 48, -15, 25, 8, -9, 34, -12, -16, 26, -32, 15, -8, -22, 40, -36, 6, -13, -29, 12, -27, 24, -6, 3, -14, -22, 2, 23, -9, 13, 4, -5, 9, -16, 37, 22, -31, 50, -18, 4, 23, -2, 15, -13, 29, 22, -4, 16, -2, -25, 30, -47, 24, -12, -7, 0, -41, 15, 12, -19, -25, 7, 25, 1, -15, 5, 5, -39, 28, -36, 7, -7, -43, 38, -38, 30, 20, 3, 4, -13, -6, 28, -19, 14, 22, -38, 24, -22, 24, -12, -23, 21, -18, -6, 24, -10, 18, -7, -29, 16, -16, 20, 31, -43, 43, -15, -30, 4, -28, 15, 12, -8, 1, 7, 2, -3, -26, 8, -1, 26, 29, -8, 22, -7, 19]
5847A9k4j6O1n5J9nl4M6lj7OMj4L5l1L4j4Npl7P2o7K0K1J2j6j3l8O2m2KL3j5J2
5881A5k7mK2j4M8m4K1j0pj3RJ8J3k6QJ3o7N1k2NJ8l9N9k9J7J7m0k4L9j1J4K3n1
5914a8L3l7M0orK8p1N4k0J1j8m1O4Mk0qQNK4m4L5rQjk1J1j2K2j3ML8l3J3j5j0
5949doK9n4P5m1J5Qj9L1m0M1j9j7JJlj4mK4J1l7P2o2mJ4j0J3j5J8kJ4Pk5K1qq
5985Cj0Mk1L9m8M0k0j3K7jJ6Nj5K4l6kL5l4j2K5j2J2l1M4l4j2J2rL9j8j5L6k1
6018cNqj8L3J0j3J9k7j1N5q6O5l3K5J6l6L0k3J3j8J5Kk9JJ4qKN2p4N5n6K2K4k1
6052fK4k4j6J7J1%j3k9L9oj1nkM7l9J3J7k6N3o6RK8l9L2J8k7J7k5j1K2m1N3j5
6085ak8L4k3M0m0J1J4k1J5jj8N9n1K6po0P7m9L4Pm4L1l2K2K2j2J6ml9K9j3KK2
$$ y = [19, -5, -21, 40, -15, 4, -1, -35, 11, 8, -9, -3, 1, -13, 22, -9, 25, 11, 16, 9, -28, 44, -23, -3, 18, 30, 14, 1, -37, 25, -17, -15, 18, 3, 15, -12, -16, 6, -8, 40, -4, 17, 7, 0, -13, -4, 14, 27, 1, 9, 22, -45, 6, -16, -11, 7, -32, 27, -2, 15, 32, -8, -32, 7, -4, 10, 33, -18, 15, -22, 18, 12, 3, 31, -40, 14, -6, 5, -13, -54, 10, 14, -6, -14, -6, -1, 23, -21, 14, 5, 13, 12, -9, 2, -10, 12, -1, 3, 41, 8, 21, 6, -4, -10, 19, -35, 40, -1, 14, 22, 3, 34, -6, 35, 16, -1, 0, 1, -2, -16, -20, 4, 15, -22, 50, -12, -16, -2, -12, 1, -14, 4, 2, 16, 23, -2, 19, 11, 3, -7, -3, -24, 15, -33, 7, -13, -26, 1, 0, 16, 21, 6, 30, -6, -8, 27, -7, -19, 6, -6, 6, -25, 19, -15, -27, -15, -24, 15, -3, -18, 18, -3, 2, -6, -24, 9, 19, 6, 25, -2, -13, 42, -44, 21, -12, 13, 29, -7, 23, 0, 13, -5, 10, 12, -17, -16, -2, -10, -8, 44, -30, 25, -31, -9, 15, -6, 18, -6, -22, -5, 6, 6, -7, -36, 3, -3, -14, -19, -21, 26, -13, 0, 17, -9, 44, -22, -13, 15, -24, 8, 26, -1, 16, -9, -20, 2, -39, 14, -1, -29, 5, -18, 22, -18, -7, 7, -14, 1, 0, -18, 41, -10, 16, 9, -51, 26, -23, 11, 18, -26, 5, -27, -5, 17, 5, 21, 17, -22, 7, -6, -4, 18]
6118A8k9N5o6J3K2l4M4m9M1rm9L2J6MJ0k2j3L9n1N3n6L9K0o8O5k9L8j9k4J7K9
6149C7l4jj8jM9l6K0k9K4pj6N2n7lRlj3N1l0Om8L6L2l9M2l9J4L3o0M5l5JK4k3
6183a7N7l1k6K6%nJ7n0L4l6L2Qm7M9k3kK0j9K9j7j9J0K8oK7n8L8j5PK0p1N8l2
6216a4j4L9j4l0K8J3k3J7k2M5m1K5J1l1L3k7K8l5K6J8l9J5J2k4K1l7J1J4oJ5l2
6247a8j8M1m0O8m2K7j2Nk6NJPK9n4L4m7M5LmK2j4J0j3mJ4k0J1k1J4J3m1PL5j7
6281@qK5k7L7l9J0Rj7jJ6lNl6QL4k3K0qK8j4j8L1l5RROQl1MjJ1lklkKJ5pl2N4
6321C1l3L1j7k4JJ7J1k1j7M1l8kL2j8kK0l3J8PJ4l1j8L4NJkjQoqJ2k8J8Jj9Qk9
6358c7L7JMrJ7j9JK6k1K%J3k7J1nm8N9lknKRqJ3k1J3K5j1m2L9k7J9J8k0J8l7K4
$$ y = [18, -11, 44, -22, -9, 13, -21, 23, -26, 15, 6, -43, -11, 5, 9, 19, -3, -16, 23, -28, 25, -31, 8, 28, -40, 25, -4, 34, 15, -9, 8, 37, 3, 2, -16, -17, 32, -4, 16, -13, 11, 4, -12, 40, -17, -20, -11, -14, -27, 24, -6, 0, -48, -12, 20, -19, 23, -16, -2, 31, -29, 16, -19, -18, 6, -17, 40, 9, -17, 9, 9, 4, 21, -29, 5, -31, 1, 9, -38, 11, -12, -14, 6, -13, 16, -1, -20, -10, 18, 12, 39, -19, 19, 4, 11, 31, -40, 18, -14, -28, 11, -3, -33, -5, 8, -15, 2, -20, 25, -16, 9, 20, -11, 22, -5, 23, -12, 14, 32, -7, 8, 20, -4, 17, -20, -9, 5, -1, 14, -18, -36, 5, -35, 33, -9, 18, 6, 11, -15, -10, -9, -2, 27, -27, 7, -40, 5, 8, 4, 26, 12, 22, 9, 5, 19, -1, 10, -11, 3, 16, -25, -18, 17, 0, -8, 17, -10, 27, -12, -2, 7, -10, -11, 5, 2, 7, -29, -21, 13, -10, 10, 2, 30, 16, -2, 29, -6, 3, 12, 18, 26, -5, -1, -2, 9, 6, 4, 1, -1, 1, 16, 9, -23, 31, -2, 29, 12, -12, -11, 6, 17, -4, -21, 20, -18, -20, 12, -6, -8, 12, -21, -3, 4, 18, -13, -31, 3, 8, 9, 7, 6, 14, 8, 0, 12, -16, 2, 3, -16, -8, -37, 0, 1, 5, -4, 13, -6, -5, 21, 0, 2, 2, 15, -12, -1, -6, -54, 5, 2, 0, -5, -3, 6, -2, 11, -10, 3, 28, 17, -25, 14, -13, 6, 24, 4, 22, -15, 9]
6395Ij1Mqj8J9mK6l4K7k1K2k3kORJ6m5OK6j6K3l3K3KNl4J2OJ6k0K0J3n0L8m6J8
6431a9L3%L5n8K1Pm6L9j3J6k5Pj1Plok3L2K5m0LJK8k9RK3jk2KPpJ3%J5l7N6l1
6468Hl6L3Oj3mRpoJ0qlM0qk7L5m7K7l5K7K5o1J4%J0nllL8Pk7Jk6P1p1JJ2L0J3
6506B7l7L4j7j3qJ2mJ9K3l4Lj8M5m1J0K2l0K0m7N9J8n4J7kl7L6kl5K3k3O5m6K4
6539I%j0%j6K5k1MJ9l8L9Nj6pL1n1L8k2K2ml8J7M7J4o7j9L1J7k1K7m2N7l8J1R
6573A2l3J4K9m5M0m6L0M3o6L2L1n7L7l2J8njK9rj9L2n1K2j5M6n8J2K8j5l6J7J2
6605dkRj6nK5kJ1k8J4J1k3NkL1j5jj9kLJj2K6L0j7Pj5K4l8k4J7MM6k6mJ1l0J8
6642HJ5n2M1k3RJ8l1N1n9K4lj8L4KrL7m1k7L7l7M2Kn1M8qK5j9Jkk0J7m4M1L3J8
$$ y = [9, -2, 2, -6, -24, -5, -9, 17, -17, 10, -11, 11, -12, -14, -8, 1, 17, -28, -22, 4, -12, 11, -22, 1, 3, 8, -26, -14, -8, 8, -12, 8, 21, -29, 9, -37, -19, 14, 14, 49, -9, 12, 19, -27, 12, -1, 15, -10, -3, -14, -7, -10, -16, -39, -7, 18, -22, -19, -18, 10, -19, -10, 13, 12, -10, -8, -1, -8, 5, 5, 20, -17, 39, 8, -28, 5, 11, -2, -6, 3, -4, -10, 0, -8, -11, 29, 21, -6, 29, -18, 9, -26, 1, 26, -35, -21, -21, -11, -16, -19, -22, 16, 23, -4, -3, -29, 42, -29, -28, -16, 14, 27, -10, 24, 7, -6, -14, -2, -6, 13, 36, 2, 5, -13, 32, -9, 1, 23, -7, 13, -34, 25, 43, -11, 6, 4, -33, 3, 1, -34, -11, -34, 31, -15, 9, 9, -1, -1, -17, 8, -13, -9, 10, -28, 11, 16, 0, -7, 24, -27, 11, -11, 11, 7, -31, -14, 33, 47, -20, -39, -8, 9, -12, 15, -27, 30, -8, 3, 12, -21, -7, 22, -23, 17, -29, 1, 44, -22, 10, 41, -16, 21, -11, 7, 2, 1, 30, 21, 2, 34, -17, 5, -10, 36, -22, -10, 18, 3, -33, -16, -4, -6, 3, -13, -18, 7, 5, 16, -12, 2, 13, -10, -5, -7, 24, 9, 8, -11, -13, -10, -9, -21, 5, 35, 18, 25, 10, 34, -4, -28, -11, -7, 39, 13, 9, 20, -10, 8, 23, -29, 12, -11, -2, 16, -15, 36, -23, 1, -2, -20, 14, 16, 7, 44, 3, -24, 13, -24, 18, 20, -31, 17, 9, 34, 15, 16, 14, -6, 11, -33, 8, 41, 59]
6677E9r0M6mK0l2mL7p7O4Kl3N7q5pQOO0P7k11K72j63o3j2J11j51J21l4O9Q8k55
6707a24K83j88N1R2m7k56K03J64j77j24R6J6q6J07q9R6K0j03M5l7J61n1j75P9
6731d4rJ41j27J42k7k53K65j09N9k9mlj4J4J4l2J6K5k3M8k5m0M8m7N5n1M7l8n2
6760e3L5nK0%k0K7ll1M2k0PL7n2J9k7L6k0kJ4j6L0j9L0k2mJ0Jk2J9Jk5K8pMPk5
6796fRrJ6j2Mo%KlnkmqK6Oj2j3J4J0k3L0k6J5Nj2J6k8J4KNnJ6k6M0l0k4L1pRJ
6836A0j0J2qpQKlJ4k2J5j8%K3n4M9j6J8k9M1Rm0K8l0MMJ4j8JL5j8j7mJ0NrKPj
6874Gj4J9j3k2L5m5ML7j6K8Kk2j2qK0pkM2j3k7J4mj4M5l6PJ0j3J1j7K2mj0j0K7
6909B1J2m4rN5j6j8j1rJ6%J3j9kN5r4M9Mrj4mL1olRmj4K9k6nlK8J5m4J2KlJ4L
$$ y = [59, -31, 15, 11, 31, -1, -5, 32, -45, 19, 21, -12, 45, -40, -47, -39, -33, 27, 104, -107, 165, 2, -61, -73, 38, -113, 8, -26, 43, 131, -124, 159, -29, 22, 114, 67, -189, 14, 178, 1, -123, -27, -11, -97, 10, -79, 17, 37, -66, -21, -58, 103, 52, -123, -44, -53, 88, -39, 103, 76, -177, 88, -21, 38, 9, 5, 2, -12, 2, 16, -16, 0, 25, 2, 50, 25, -15, 33, -14, 41, -10, 37, -1, -53, -18, -23, -3, -3, -23, 4, 1, -30, 12, -8, -1, 36, -16, 3, -24, 12, -8, -10, 4, -12, 18, -1, 29, 7, 3, 13, 14, -8, 11, 12, -13, 15, 8, 12, 19, -6, 3, -6, 10, -2, 2, -4, -4, -2, -5, -10, -12, -16, -24, 2, 8, -4, -17, -3, 7, -16, 14, -12, 3, 8, -4, 12, -16, -2, 0, 5, 0, 16, -10, 30, 0, -24, 7, 0, 9, 10, 0, 12, 4, -3, 5, 7, 4, 18, -4, 11, -7, -7, 16, -38, 11, -5, 13, -16, 25, 34, -6, 22, -8, -4, 0, 14, -4, -3, 32, 14, -3, -7, 3, 8, -1, 1, 8, 7, -7, 12, -1, -23, 12, -33, -29, 8, -8, 20, 22, 0, -12, -20, 0, -7, -9, 33, 20, -7, 7, 3, -11, 34, -2, 5, 15, 2, 13, -4, 18, 14, 4, -6, 21, 33, -11, -20, 35, 19, 1, -10, -19, -3, -3, 10, -9, -11, 44, -50, -1, 3, -6, -20, -24, 7, 1, -2, 7, 3, -11, 18, -8, -13, -16, 12, 27, -17, -5, -3, -6, 8, 11]
6947A1J3n6R0r2mj13J40J50j63L5j12J52R2j47J10j52J68np3k9k3K7m4M3Lk3K1
6974A9j4k6L1k2K7j3J6m5K9K4nl4L1Jk9L9k3MNk3K8l7K6j1PNr%K1k8J8%j4L2m0
7009a0mJ3J2j2j7%L4k0L5k7Qk2lM7k6j6K1k0K7oj4mJ5k1j1QJ2l7K2K1mK0k2J1
7043A0j6J5lMm2M7k6Qj1J8J8l7K7l3OK3j0oJ3J2j4K1l1L5j5m8M6Qmnj3j4J2K2
7077A7k9oL4l6J1L0k1Mj2L0ql9N0l5jmJ5J5Kl1L3m1lL2k2K3jRKj8J6kmJqoj1L7
7115B3l7oL5j0OjKoMk9K9roJ4j6J2kj3J5J2Jk5QPmk0L3m0L8m3K7J7j4L6l0k0J6
7152DJ2j5Mk5K9j4KJ9l6NJ0MlQJ1Rj2rpLL0l4LMj8L6j6K5k3Rj9J0j7J2%%KPmk8
7192b2L1qJ4j0lJ2k7K8Jj2qQRm6N1j5NrMl5K7K0l2K9k2K2k1j3N2rqMj1j2PLJ4
$$ y = [11, 24, -32, 58, -34, -38, -151, -11, 139, -24, 11, -101, 51, 143, -4, 106, -46, 122, 117, 44, 15, -8, 19, -25, 18, 21, -2, 19, 5, -21, 10, -12, 15, 2, 18, -27, 2, 26, 21, -13, 18, 19, -10, 29, 6, 10, 15, -8, 20, -17, 9, -2, 5, 10, 1, 1, 22, -6, 12, 12, -2, 30, -10, -14, -1, 11, -1, -18, -18, 16, -4, 31, 4, 12, -10, -13, 34, 8, -8, 13, -7, 20, 14, 0, -4, 11, -10, -21, -13, -1, -38, -16, 5, 1, 21, -1, 10, -6, 9, 6, 10, -32, 15, -11, -3, -14, 4, 22, -15, 12, -21, -15, 8, -2, -8, 5, 17, 3, 24, -7, 28, 13, -35, 11, 19, 15, 10, -3, -17, -5, 17, -12, -18, 16, -20, -9, 21, 0, 4, -8, 22, 14, -25, 25, -10, -11, -15, 0, 15, 17, -14, 19, -22, -25, 7, -15, 8, 7, 16, 18, 0, 16, 14, 10, 11, 3, -3, -14, 23, -14, -20, 15, 5, 11, 10, 12, 6, 10, -19, 10, 1, -5, 9, -7, 5, 3, -10, 5, 17, 18, -7, 1, 8, 4, -16, 17, -23, 15, -28, -1, 16, 2, 38, 8, -12, 4, 16, 1, 5, -20, 9, -5, -3, 16, -20, -15, -5, -1, -4, 4, 15, 24, 12, 3, -4, -1, 29, -5, -2, 2, -16, 20, 4, 29, 6, 15, -4, 6, -11, 1, 1, 1, 3, 10, 6, -22, 9, 1, 15, 5, 2, 14, -13, 15, 16, 4, -4, 4, 13, -33, 18, 3, 8, -1, 3, -32, -5, 15, -17, 12, -10, 12, -9, -22, 30, 21, 13, 17, 6, -6, 1, 4, 18]
7229A8npJ6k7K6jj6Lj7L0j1LPj9L4j8l5K4k9K9Pl3N3m9J2J9qj3rL0j7nJ4J6m7
7264b5M6k4Okj9J8Kj1L3k9RK2nk6L1k2qm6M7j0Llj1K4k0K2JOJ5j0j8nM7k2Mj0
7300A0k1K3MJk8J8oj4L1k4J1l4K0J3Rj4LoLJJ6ll4L7k3j0K6pj3L0j9J0k5K6rM
7336Fk8K7J0jj5K7m9M2Ql9N2l0mRjOk6j0L5l9kL3j2Rk4K0qKJ9k3J0j3K0l1K9J6
7372B5l0J9oQj6J9j5J9j7Nj8K2J3j7rpK2j4J3j3LJj4K4m1K8J6l3J5k1L7j9j9L1
7406A1oj5K2Mj3KmK5k5JMj5L2kj3j0L4k5k3LK7lk7M5oj8j8K9J3l3J3k2kK4Ql7
7442b0L0j8QlkmJ3LJompKOJ6j9J2j0JknK2j5j5J4L8l1l4L9mjnJ9l0K3j1j2J4O
7481Ij7j2L8k1k5K7qPk3J5QJ0j5K6l5jK3J1j7RL0n3QRJKJ0jj9J0qJ1j1nj%oK4
$$ y = [18, 13, 6, 22, -5, 21, 20, 4, 7, -10, 20, 9, 12, 19, 0, 34, 16, -19, 5, -24, 5, 12, -21, 32, -17, -5, 14, 6, -7, -16, 14, -3, -8, 6, 22, -25, 21, -3, 3, 1, -18, 0, 2, -9, 24, -5, 4, 26, 21, -5, 26, 4, -4, -50, -3, -13, -10, -13, -24, 0, -20, 2, 3, 9, 24, 14, -4, -9, 38, 16, 20, 10, -11, 12, 16, 17, -11, 7, 1, -13, 18, -6, 5, -29, -9, 4, 13, -1, 2, -4, -1, 0, 16, 13, -21, 16, -7, -17, 9, 2, -11, 19, 0, 10, -15, 11, 2, 6, -22, 5, 15, 14, -1, 26, -23, 19, 27, -12, 40, 10, 6, 15, 14, 20, -6, -16, 19, -20, -22, 11, -1, 8, -16, 4, -4, -2, 17, -6, 4, -9, 11, -20, 9, 25, -5, 14, 8, 16, 0, 19, 4, 23, 6, 11, -7, 15, 28, 11, 2, -5, 17, 3, 16, 3, 6, 7, -7, 17, -24, 4, 20, -13, 2, -19, 18, -1, -20, 11, 5, -10, 12, 16, 3, 5, 1, 26, 1, 2, 6, -9, 23, 21, 8, -2, 32, 7, -16, -13, 14, 11, -16, 29, 23, 5, -13, 16, 29, -4, 9, -13, -15, 9, 17, -20, 10, -8, 0, -3, -5, -9, 4, 7, 8, 2, -2, -9, -7, -1, 15, -4, 8, -2, -1, -3, -8, 14, -1, -16, -2, 36, 5, -29, 10, 6, 5, 0, 19, -11, 12, 1, -11, 3, 9, -8, -20, 18, -3, -28, -1, -9, -2, -25, -10, -2, 8, -7, 19, -16, -17, 6, 17, 0, 9, 39, -14, -6, 3, 4, 6, 16, 15, -4, 6, -2, 9, -2, -7, -8, -8, -14, 10]
7519A0J2m4M5k2J0Mm1M2rMorJ6k0qL5pl1M4m8N1l6NJ9oj0MpJ0j6J4k0OJ8lmlK
7557Aj7M3o6N5k9N4j4Lqnj9J6k6K9k1J8J0k0QPnK1ok3Kj0M0m9J9JJ2j9j0J0J5
7592A7n3M6j6j1Rj4L9l9L5j2qJ8j2j4J8jRqj1K2k2j7L3OmoK4l1pM3j4k8qJ3OJ7
7628A9l9L8j7J2nl8M5k4j8M2j5K1m2J9kJ1LmQk7lj5Q0o4N0l2K9k7K3lj4J8k8K8
7662B9pk6k4K3lpL4k6L5k2j2Qk7J5J7krQj7K7j5L7pl7Pj4JmL9J3l5J2j1NJ5qj1
7699ANj9J2J1JJ9k5PJ5o8M3j1K2j4lJ8oj0J1pk4K5J2ll7K1J7J6l9mnM9k5rPj5
7735a2J1Pj5L0n0M3j4%J8k4j4L3oMj0lj2K7kj2J1kj9MnK6Kkl2JM4%j3OK%k2jL0
7774B9j0j8J0l0K1J6qomOoJ5j2mnJ4Kj7Rj9J4m3M6mlJ6k3J4j1Pj3J6J2j3j1K5
$$ y = [10, 22, -22, 23, 1, 11, 15, -26, 16, 7, 11, 5, -4, 12, -8, -16, 19, 12, -19, 25, -23, 28, -8, -3, 16, 10, 0, 4, -3, 7, -9, 5, -15, -9, 9, 6, 2, -1, 1, -16, 27, -39, 16, -13, 41, 27, 30, 22, 17, -2, 14, -12, 17, -4, 14, 24, 4, 12, 19, 14, 35, 29, 6, 8, -2, 38, -11, 8, 9, 21, 2, -8, 2, 17, -36, 10, -6, -17, -8, -22, 17, -22, 13, 1, -7, 11, -1, -15, 3, 2, 11, 3, -8, 14, -8, -25, 8, 14, 10, 4, 28, -3, -10, 33, 19, -9, -17, -4, 2, 19, -20, 18, 1, 13, 8, -30, 15, -9, -27, 15, 0, 21, -21, -2, -4, 7, 10, 6, 14, -13, -16, -31, 49, -15, 35, 3, 32, 5, 28, 25, 11, 29, 1, 29, 22, -4, -28, -5, -8, -15, 19, -7, 28, 6, -6, 2, -25, -10, 7, 5, -4, 4, -13, 14, -1, 36, 29, -8, -1, -15, -14, -18, 21, 34, -1, 11, 0, 5, 20, 12, 1, 6, -13, -1, 10, 11, 30, 5, 12, 27, -41, 2, -9, 13, -1, -4, 14, 8, -2, 9, 2, -22, 3, 15, 12, -25, -4, 13, 29, -10, -14, -19, 30, 5, -4, 3, -12, -1, 6, -9, 21, -29, 14, 0, 0, 18, -6, -20, 13, 7, 11, 1, -2, -14, 13, 11, -1, 10, 8, -11, -7, -12, 14, 16, 14, -18, -17, 27, 27, 14, 20, 22, 22, 0, -1, 29, 19, 1, 11, -19, 2, 18, 10, 4, 0, 6, 0, 15, 3, -1, -6, 8, 10, -7, 2, -17, -3, -46, 0, -4, -7, 9, -14, 0, -11, -4, -17, -1, 11, -2, -13, 12]
7810A2Lk7M0j5j0O%J0k7J0Rj1nj0L7k4NJ4l2j2M7l2J7Kj8Nk2J9Jk7O4l0%K9Jp5
7846d6O7l1J3oMKk3M6nJ1k6ROjj5jJ2k1J3LJ1l2J2Rj5J3kk3OJ9J0j7Mj5Nj1L7
7883B2oj8rK7o%%J3l1jj1K0nOj6K9kRj5J0lpJ5l9L5j9L0m2jPRk2kKL4j2oMk7J4
7923a4KjL3l9N4k9k8K7Kj7mJ0J1jk1M4l3LmrK1J7m6M9j7K1j7j3PjqMj3Qj3J3P
7960Ej5K1k6RMj9J4K8l0J3%J1j0k4L0J5k4J3mj5L2k0Kk6jkJ5J5Kk2J7ml7M0mN
7996Hk9L5jPl8OJ2J4Lk3k4L1J2pnloM0m2K2J0k7M1l0J0k3MpJ8QLk2J1jR%k8K3
8034A1pO%j3nPJ6k1K5j7mJ9Rk1K2j4k2M3n1JJ8kK8k3OPMPl5K6pj6Nj8j6N6j9j2
8072gJ8k0KoJ3J%kK3m3L5ok6N3l2K4jj2j3LK9o0M2k5JQK7l1K0k3J2J8m0L5k0L8
$$ y = [12, 15, -12, 28, 13, 3, 9, 9, 19, -8, 2, 11, 0, -5, -15, 22, -2, 3, 17, -15, -27, 20, -12, 5, 7, -11, -6, -28, -9, -8, -35, 29, -1, -1, 28, 29, -46, 21, -10, 3, -3, 1, 3, -20, 26, 21, 32, 6, 15, 21, 20, 5, 4, 16, -5, 8, 11, 22, -10, 2, 11, -4, 9, 7, -16, -10, 9, 19, 2, 6, -9, -4, -15, 22, 16, -2, -11, 16, 10, 10, 10, 23, -8, -9, -20, 0, -5, 1, -15, 14, 12, 21, 6, 16, 13, 6, 21, -18, 17, -2, 28, -14, -15, -8, 1, -21, -23, -21, 13, 1, -5, -1, -28, -14, -12, -13, 20, -19, 35, 6, -22, 5, 7, -10, -14, -4, 7, 6, -15, 29, -4, -1, -5, -14, 7, 24, -22, 27, 10, 31, 14, 1, 8, 7, -1, 3, -10, -2, -15, -2, 5, -10, 11, -15, -6, -2, -21, -7, 21, -9, 4, 4, 15, 5, -19, 11, 26, 2, 15, 11, -4, 28, 8, 10, -16, -17, -19, -4, 11, 13, -9, 8, 4, -33, 7, 3, 8, -21, 14, 13, 20, -18, -12, 0, 14, 17, -6, -30, 1, 13, 6, 1, -2, -8, 32, -10, 12, 22, -5, 36, 6, 16, -7, -3, -10, 8, 16, 19, -3, 8, 7, 16, 16, -12, 11, 4, 10, 10, -3, -8, -1, 15, -6, 19, 2, -2, 17, 26, 5, 27, 13, -9, 34, -17, -16, 2, 0, 28, 5, 11, 18, 22, 29, -6, 20, 13, -3, 2, -16, -32, 24, 5, -7, 11, -9, -7, -13, 0, 1, 1, -1, 22, -21, 14, 8, -18, 35, 3, 27, 26, 14, 1, 4, 33, -27, 15, -10, -9, -1, 26, -5, 15, -8, 4, 22, -18, 17, -3, 35]
8108C5k9j5J8k1j8M6Pl6RKK3jj1J0k4J5jj6J8J0k3J5j7L0k1JJ5ml4QJ7kl3M9l0
8143h%K7m5J8k4L6Jk4L0rk8K3PLPj0J4l0j1K6j0M2k7j1kj1J5KnJ2k5L8J3m2L8
8178C0k9kL2l4K5j8k6K3J3l2K0KP
$$ y = [35, 6, -9, 9, -12, -30, 16, 23, -13, -4, -2, 21, 20, 9, 19, -5, 10, 9, -7, 11, 21, -2, 13, -4, 26, 5, 6, 21, 17, -17, -9, 8, 6, -27, 22, -8, -8, 19, -26, -8, -32, 4, 5, -19, 11, 2, -26, -3, 4, 7, 14, 4, 18, -12, -23, 3, -7, 35, 8, -3, -5, -16, -1, 1, -4, 8, -17, 21, 34, -8, 30, 1, -1, 31, -3, 22, 4, -22, 1, 14, -18, 2, 4, 11]
8191A1
$$ Imaginary data points
##PAGE= N=2
##DATA TABLE= (X++(I..I)), XYDATA
0@%%%%%%%%%%%%%Qj6J6j6J6j9K7l2M0m8N3o1P2q6R7j10J26j45J66j87K12k40K70
36A43l03L39l77M19m68N20n75O37p04P76q57R43j038J145j259J386j528J686j863
55i78K062k289K551k857L219l652M181m850N723o906Q601j1238J5878k6204Q3551
70F6792j3778j58844J70089r2083K8867N5238j32248R3372J7987o6195O1800o7362
82c6365K7607O4534p1086k6137N2319L5274p4506J3793L2705m1471P0221o8861
94b1973j7484R1998p6596L9325j0710o9438J43784p9073o6032J13954o4763L3515
106A6507j0143n5732R1565m4957l323J1999m0417P1146k6906l9568K9846p56L6366
119C5627n8951q426P4270n6976K0561q661k6148O8132m6414m911J1822j1888M8936
$$ y = [0, 0, 0, 0, 0, 0, 0, 0, 0, 0, 0, 0, 0, 0, 8, -8, 8, -8, 8, -11, 16, -16, 24, -24, 29, -32, 40, -46, 51, -59, 67, -78, 88, -99, 113, -127, 143, -160, 179, -198, 221, -247, 273, -302, 335, -369, 407, -450, 493, -545, 600, -659, 727, -801, 885, -978, 1084, -1205, 1346, -1511, 1708, -1944, 2237, -2613, 3110, -3796, 4805, -6433, 9445, -16759, 66792, 53014, -105830, 64259, -27824, 1043, 56281, -75967, 17405, 35392, -30803, 30997, -36365, -8758, 55776, -15310, -41447, 10872, 46146, -28360, -14567, 18138, -23333, 46888, -21973, -39457, 52541, -24055, 15270, 4560, -64878, 78906, -167, -66199, 47755, -17008, 16507, 6364, -49368, 42197, -2760, -6083, 5916, -34501, 36645, 9739, -29829, 17, -739, 35627, -23324, -31750, 42520, -14456, 6105, -2556, -28704, 39428, -6986, -11897, -75, -11963, 36973]
132C6973n1039j5967N3343j7397j907k4669J7148L2564m8196K8656k0641r86N5577
145D3459p1751J9577K2783k3376L9226o0555J5595O1973p1152K0813J1911k6809
157a8306M9179m1771n815K9769j5029J6869l0865M830L1374j6796j1131o491K7670
170A3487j408k9841K4090j1904O329K0895m9026K9930J0586k1306K2007l8921
182b5082L0397K1080n1166K5853M016q863J6602k6892J0680J3888j3995R609k0303
195a4176J5139J4800k4505M882j109J6712q531j9202K3219o188j191N480j8300
208a2970J6967M754j4779Q019j1880J8656J146k7700K2254j91l549k54q459J3674
222E688l142m567L450p707J0676L008j5842P626K420M505p411q727J9502r088
$$ y = [36973, -14066, -30033, 23310, 5913, 4006, -20663, -3515, 29049, -19147, 9509, -11132, -12118, 43459, -28292, -8715, 14068, -9308, 29918, -30637, -15042, 46931, -24221, -3408, 8503, -18306, 30873, -10898, -16713, 13056, -1973, 14896, -15969, -11139, 20235, 3439, -7692, -14183, 13487, 12079, -17762, 6328, -5576, 753, 21648, -27378, 2552, 13138, -8168, 13839, -25082, 5315, 26395, -24771, 1082, 5098, -3765, 12837, -14055, -3375, 10513, -3482, 6127, -14176, 963, 15763, -8742, -3860, -4969, 11743, 3212, -15990, 7229, 1041, -150, 5330, -12970, 3997, 8751, -6028, 1991, -9889, 8767, 9913, -17787, 4467, 4276, 727, 473, -7986, 5688, 2546, -2021, 1429, -6278, 4398, 7406, -8436, -810, 1610, 6115, -1296, -10023, 9479, 391]
236C91k885L946n273P856k598l378J152j298P564l465j1691J4093j3p228J455
251a372n38P186p554J080K630m064N010p06m963J215N901k369n237J189Q046o113
267f59l205O019k806J428j987K154k246k5N184n463j790N269J383o981K755L094
283B124j486k617J857K340m841L638J85k238q97M697j507n389N924j1k370j494
299b085M202j241l002L248L11k768J83M900n420J99L077j7l062j25N428n423N49
316a046K691j141k170K111J774l971O42L096n32n454N945k25m022K661j51J000
332A208l701L601M97m530L150K490m804L59M268k962l46j028M809l834k238O713
348C652n405Q84J867q23j068j73L120j874l800N955o0o738O521j981K40r42q82
$$ y = [391, -2494, 1452, -3821, 4035, 1437, -1941, -789, -2087, 5477, 2012, -9679, 4414, 4401, -2827, -1372, -1910, 5276, -2278, -1198, 1432, -2632, 2378, 1672, -3291, -2076, 3825, 1456, -3781, -2592, 5454, -659, -3864, 2155, -651, 777, -1210, 944, -1302, -1327, 3857, -1606, -3396, 1873, 3256, -3725, -970, 2124, 638, -1979, -122, 2218, -2623, 1015, 1200, -1038, -1935, 2762, 1255, -4134, 1790, 1779, -591, -2085, 2117, 876, -2126, 1122, 1433, -1335, -1152, 3748, -1672, -1473, 1604, 1587, -1475, -1600, 3828, -1595, -1046, 1645, 504, -1666, 445, 2219, -1752, -1110, 1986, 1454, -4000, 1945, 1720, -2302, 359, 208, 1208, -2493, 1108, 1605, -2925, 225, 2715, -2089, -1730, 2538, -424, -770, -1798, 3011, -823, -3061, 3652, -1753, -869, 998, 175, -893, -1066, 2054, 180, -3620, 2335, 2275, -4463, 2058, 77, 317, -625, -1507]
365a507N340p517M618J767o596N252P84l943J643l61L364l323m053J0547p883
380a868K26M553n722N683m492K371L72n087R119n333n156J0194m946p58J168l343
396c019R501j0594K861N984j0587J0759n300l567P125m151L516n404m74J1068
410G718j1230P29O016o302Q058r366L565M801r655J2923j2109K79J4114j4484
424d943M495M21k486J1027j5991N215J0182j5062J2809q402k229J3668j3274O247
438A677m778J954J0765j7927O949N994o586O308j1371P810O277j4092J2785j1460
452e695M459J3129k2415J1828j58j032P019j9319J5801L627j4092J1794j1344
465f398Q092P452j9744J5409q093M275J0026k8236K3006J370j4486J3775j6306
$$ y = [-1507, 3833, -3684, 934, 2701, -3895, 1357, 2141, -1802, -159, -520, 2844, -479, -4532, 6015, -1868, -1642, 2911, -2811, 2872, -1620, 751, 1123, -3964, 5155, -178, -5334, 4860, -86, -844, 324, -3019, 6482, -4112, -1251, 4733, -5854, 4905, -395, -3962, 3163, -988, 2528, -2876, -3350, 7718, -3512, -2783, 3233, -3069, 4989, -4377, -812, 3989, -5666, 7257, -4852, -4573, 9541, -4943, -448, -27, -2513, 8514, -7477, -2262, 7920, -7142, 5667, -2735, -4964, 8704, -4570, 1677, -3101, -1147, 9618, -8309, -1360, 4634, -1952, 4356, -7015, 795, 7072, -7020, 5765, -5695, -1236, 11893, -10522, 1306, 1148, 116, 7135, -12184, 3617, 7244, -6848, 4946, -6398, 1694, 9146, -10598, 4811, -3282, 993, 11019, -17217, 5789, 7159, -7327, 6448, -9858]
478i858J3784O115k2781J7013m579j507J1635k1762J2214O391p673J172r484J7829
492H509n906q180P094q026J7460j1711j0857K1839j6676J1844J66k7069L8547
505A7034j3724j6322K3838k3720K3023k498k7893L1664j0545m083J0585k0616
517a3257J8107M314j6103N281j599J2550r208q284J1106m252J1415j7371o68K0978
531A3009j9290J1324o860j1125L2843k3791p259K0567j6879J9297j4411j3075
543a5650L2545k0311K473J986j1183K4097j4932o454R053l856J4077j8509l244
556i908K1401j3883N941r210j282K3055k2995M441L123n713J9266k1790r67J6705
570H184q230M191j2678M851J6746j8552M716k735K551J4194k4605R986M621n098
$$ y = [-9858, 3926, 10041, -12740, 4273, -306, -1813, 9822, -11940, 274, 6665, -1008, 164, -9320, 8509, 2603, -5577, 1517, -6509, 10951, -760, -11617, 10222, -6454, 5390, 5556, -21513, 17034, 3310, -13012, 10826, -12894, 10129, 7631, -20262, 11402, 857, -3226, 7359, -13257, 4850, 9164, -6939, -1658, -3257, 9293, 85, -8199, 2907, -1345, 10070, -7301, -7969, 13009, -6281, 5043, -1817, -12942, 19901, -3890, -11149, 9418, -7461, 11836, -2575, -15650, 16895, -3416, -943, 1043, -10140, 13957, -975, -7429, 1624, -2232, 11845, -6664, -9908, 11493, -2390, 3551, -5659, -6941, 16114, -6881, -2440, 683, -5030, 14236, -7554, -8521, 8184, -46, 4145, -8533, -3682, 13064, -5488, -772, -3507, -956, 13238, -11367, -1381, 3240, -1858]
584a858J2962k5431J2006J7239k2857R108m983J612J7037k5853P333R886q847
597b646J1145j8243O032J4509j2401N68o102J1287M823j7269P239R59L522K757
611F180j8322J4438L473p978O771j6486J6744O041k1309J1280k228M960K734j7856
625a1558J3090M159p083L632j0838J1797M837j4054N155k798J0440l016j4778
638a1015J4172r92l39j420r413J4546r02r198M773n278J1292j460j5592J3181
652B355l06L62k417q589J4271k293o287J823k369Q734k468r203O049J890K790
667D342n829n724J2649l512k408j798j359J0999p964k979L940j546P144p227n896
682g168J2317l226k673k55l485J1386o123n794O248j381L636l847m249N916K361
$$ y = [-1858, 11104, -14327, -2321, 14918, -7939, 1169, -3814, -2202, 14835, -11018, -3685, 6201, -2646, 8499, -9744, -3712, 10797, -1604, -1036, -7138, 4149, 8972, -8297, -1058, -99, 3423, 6180, -12142, 2296, 5769, -2209, 4562, -11924, 4820, 10861, -10448, 832, -1396, 3564, 6298, -11558, 1532, 5691, -1392, 2240, -8598, 3199, 8036, -6018, -863, -3661, 6779, 3763, -11015, 3157, 2165, 1826, 406, -9007, 5539, 4637, -4561, 212, -5066, 6226, 4766, -10826, 2355, 2049, 2411, -6, -8595, 5676, 3383, -2904, -1081, -3450, 5284, 2816, -6387, -338, 1552, 4342, -1487, -7211, 5438, 1926, -482, -2280, -3639, 7360, -604, -3583, 357, -1189, 5955, -1272, -7168, 5149, 1923, -750, -1005, -4490, 6896, 773, -5021, 1227, -154, 3482, -365, -4614, 1302, 3663]
697C663l570l492K101N283k977l593Q74K707L322p576J408L456j680L376p207
712c905J541P244m999j923J149O37L986m959k679O416j885j28j870n80M117p60
728A402k624j571M565K77l369k89J390K184j160l431K085K888k956J104k399J524
744c80L848m888k58K078J024r91j654P0K864n85k711J416K86J007q57j326J32
761i25K866j224k744K557l62J064j638r75K414k36j188pL45Q9J359k571N15J608
779I47m74p52p23J693m97K13j486J137P59j325Q60j037O18Q84r49r95J786o10
797D9o4j04q37K231j979O60Q7n23J062q50J67k47N87m0m69l29J384j176L17L30
817B56r95J844k112J622n40r60K251k076N88O39q56P87l87o62J915k241J166P05
$$ y = [3663, 93, -3399, -1298, 3985, 1008, -2585, -1711, 996, 4318, -3258, -1850, 1606, -74, 3302, -3905, -2364, 4880, -119, -2042, -893, -256, 3730, -1229, -3908, 2508, 623, 495, -1375, -1955, 2162, 1402, -1222, -2793, 1772, 2049, -1320, -1609, -219, 1965, 805, -2626, -541, 2347, -609, 495, -1904, -380, 3468, -1420, -1678, 400, 1424, 433, -1221, -1151, 1713, 1128, -1583, -167, 119, 1126, 269, -1057, -925, 1941, 717, -2027, 530, 168, 1232, -406, -1381, 1033, 797, -391, -398, -53, 36, 1395, -1176, -661, 947, 473, -279, -1002, 691, 194, 407, -1079, 58, 817, -508, 352, -685, -67, 817, -132, -1127, 659, 49, -15, -119, -956, 1275, -704, -44, 43, -480, 582, -268, -101, -348, 239, 199, -270, -599, 785, -391, -74, 256, -739, 1105, -1007, 615, 75, -885, 1366, -710, -122, 517, -339, 448, 61, -601, 1314, -927, 239, 944]
835I44k574L345k408O72P17j801K607k231K81J630j878P71L90j473K232j928Q58
852A54N76k475L824l213P42J562k534K712k317O48J744k983K274k89k118L744
868B051l392J004J686l464M469m052J185K813m955M086j711p98K913l764K290
883C61P91l234M531l920P40L399n285M308k439L85K430n024M696j797j128L016
899A830l917L161J6l040M348m306K413K069o814P288l849j49M009p212O763j901
915G09l524O049n503K621K462o682O015j906j209L304n900O193k232k274L824
930A947m355M890k673j925M509m569M130j457m655Q573n780J45L787p130R296
945D733n604k877Q349q192N731j149n720Q985n018m96K799m962P221m200k883
$$ y = [944, -1630, 1715, -693, -21, 696, -1105, 1502, -729, -448, 1182, -696, 75, 465, -1008, 1224, -704, 154, 730, -1745, 2079, -1134, -392, 1170, -1364, 1348, -969, -321, 1423, -1560, 714, 425, -1693, 2051, -1341, -337, 1349, -2115, 2354, -1698, -513, 2300, -2655, 1431, -280, -1078, 1835, -1929, 361, 1152, -2082, 2449, -1471, -731, 2668, -2617, 1691, -748, -363, 2067, -2957, 1739, -58, -1186, 1830, -2087, 1074, 1090, -1950, 2398, -1908, 505, 2574, -4240, 3048, -801, -950, 3059, -4153, 2610, 709, -2815, 3234, -2269, 352, 2814, -3868, 2147, 241, -968, 2336, -3564, 2629, 397, -1877, 1947, -2408, 2482, -191, -2116, 2393, -2176, 1954, 497, -4158, 4415, -1365, -1220, 2567, -4563, 4733, -871, -3748, 4601, -3591, 2140, 991, -4729, 4256, -762, -1258, 1541, -3421, 3800, -400, -3283]
960c283O330n238M774l611j799O737o111L783k546j652P742p473J087K893l785
975b152O484p102K80P425q209N851m066j364R059r834L816L58k659P697r623K123
991a916O567p506N470m607n40Q887j0170M030K30k452P504r454K480M348l560
1006f89K539n384L489L960o337L010k584K565L838r635O448r80o32M699j1393
1021g086Q980K289q241O450n731L946M834j1513O832P87k916N569r920N956M165
1036D401o833L153m078N689Q33p337M636r49K469k58p034P423m07k393K112o916
1052e489R488q50q170O778l499M647j082p588Q261j053j479O18m971P709o74n883
1068c237L478k082O101l735n984Q631l267J764k032m516R613l731l361K761l020
$$ y = [-3283, 3047, -2191, 2583, -1028, -2827, 3910, -2201, 1582, -964, -2616, 5126, -2347, -1260, 1633, -2152, 4332, -2770, -2490, 4935, -3274, 2577, -1489, -2853, 6206, -3628, 188, 546, -2113, 5584, -4039, -1916, 4651, -2855, 2615, -1992, -2532, 6355, -3815, 215, 445, -2007, 5497, -3957, -1477, 2871, -689, 1850, -3534, -45, 3915, -2422, 588, -1996, 569, 4407, -5228, 1220, 240, -392, 4307, -7086, 1894, 4183, -4058, 2392, -3339, 607, 5441, -6072, 760, 1547, -1369, 4200, -5720, 236, 4401, -2432, 721, -3357, 2332, 3165, -4172, 464, -485, 1984, 1726, -5308, 2115, 1708, -685, 1427, -5489, 3999, 3149, -5021, 1757, -1742, 2905, 1823, -5765, 2496, 1443, -36, 582, -4389, 3320, 2646, -3237, 241, -1841, 4260, 525, -5459, 3172, -95, 1669, -363, -4879, 4734, 1003, -2358, 403, -2617]
1083b617O961l196p038Q399j727L80j646l933Q452l000k544L95k78N405m243k901
1099c131L240Q31K000n500p79P463m229J07j768k81P585p380l57K832j233M621
1115D021o509j178P592l381r91j149k76O787n875j874L600p60L237n423m75N030
1131B376j039j078l148K430M252m188j798J640J748J663n514J100L298r71O97
1146A468n066L451L753m266m32o20L277J383n808J417L173j134N93m128K351L925
1162C337m006n2j229L239J577n371R42K661M51j378k653K174K747k534q73o91
1178a659K634J526m433N30J657J859j949k928L074J330j101j810j43K696L24k824
1194a217J26P91K191j043l866L476Q46o56j551r43L561n30k180J06Q56J325l50
$$ y = [-2617, 4344, 1148, -5890, 2509, 782, 1162, -484, -4417, 4035, 1035, -1509, -1114, -1392, 4013, -230, -3131, 109, 940, 2940, -2560, -3339, 4124, -105, 2, -1766, -2047, 5538, -1842, -2199, 633, -600, 4021, -2488, -3666, 3926, 545, -446, -1595, -1871, 4916, -959, -2833, 767, 7, 3244, -2179, -2654, 2376, 1337, 259, -2889, -459, 3793, -395, -2193, -553, 1195, 2858, -2656, -1556, 1742, 771, 1468, -3598, -147, 3606, -660, -1092, -1712, 1565, 2948, -2860, -1443, 1730, 596, 1189, -2939, -588, 3337, -669, -721, -1950, 1289, 2866, -2505, -1563, 1098, 1549, 171, -2482, -308, 2439, -95, -968, -1659, 975, 2501, -1932, -1402, 255, 2114, 165, -2763, 311, 1641, 540, -1270, -1413, 1283, 1607, -1217, -1091, -300, 1891, 848, -3018, 458, 1304, 648, -903, -1846, 1715, 1185, -995, -889, -33, 1292, 942]
1211I42k996J671J994r44j389r81L183k63j961l57J242J419j685p66K56J576J88
1228A129j980n84K462J49j733m64O66K275k342o42J103K01Q61j880k07J394O16
1245A024j168j000Q34J679j238j431J308L53M76j687K91R10j6J65j756J163R63
1262H70n48j050P5J387k2j547L34J093o04N01j457R30P90q73L06j263J704K71
1280H97j665M35O43L2j74q13O46O78j054Q62j217Q75P26j438O35n19J318p38r73
1299h44J322l15j71K21p49Q43O3r04J222j627J444K75k171K168r93L07K06j126
1317h29J450o31n14J122j196N36P91j542J233q70P26Q4j524K190j532M29N26j251
1335h02J413q46L7Q15j614J496J11j952K399j578N07P34k055K575j791L03J238
$$ y = [942, -2054, -383, 1611, 667, -722, -1703, 1480, 1217, -744, -1101, 141, 1560, -125, -891, -635, 941, 1129, -851, -1435, 1027, 1176, -557, -1021, -355, 1920, -422, -1064, 39, 240, 1101, -779, -986, 408, 1024, -144, -1144, -310, 1369, 131, -1300, 8, 361, 837, -850, -559, 351, 335, 500, -1256, -93, 870, 322, -728, -653, 734, 712, -835, -501, 592, -12, 489, -968, -38, 752, -121, 185, -1078, 626, 897, -768, -333, 310, 342, 168, -645, 1, 679, -375, 487, -730, 145, 871, -567, 68, -451, 867, 129, -844, 478, 163, -8, 213, -536, 307, 370, -534, 688, -939, 505, 780, -1391, 777, -216, 91, 297, -829, 621, -10, -524, 598, -598, -62, 729, -813, 420, -450, 276, 360, -1164, 1026, -506, -77, 449, -802, 611, -235, -198, 617, -997, 499, 610, -1342, 1057, -521, -14, 720, -1335, 1240, -551, -248, 990]
1352I90k223J869k43j137J390j239R48K23j913K579j700K21J200k285K422j465
1368c63K08R28k031K397j061j116K140j700Q33K77j908K949k255M14J486k987
1384a789L240j607o99J994k206J926q34j259K675k060L30J114k157K612j789o0
1400e69J652k567K874j920m19K367k533J685p28p37K516k791J008J258k681L095
1416A510k200j39K544l311K757j608m75K884l473J714M15j552K252k362Q60J529
1432A345k816K655j748o3K477l538K482q72m04K081l411K409K88k052K231j942
1448h78R04J375l067K637j316l0K103l933L165m52j372K049k906K730j05k699
1464a795K988j761N21J451l564L170o06j263K103l303L245l41k559K616j624J462
$$ y = [990, -1233, 636, 393, -744, 646, -593, 355, 578, -1335, 1244, -456, -235, 965, -1320, 1102, -363, -155, 773, -1258, 1139, 78, -1038, 1102, -598, 235, 512, -1396, 1553, -702, -288, 1198, -1789, 1451, -156, -855, 1139, -1067, 859, 25, -1234, 1441, -619, -289, 825, -1332, 1280, -509, -569, 1083, -1484, 1390, -530, -949, 1418, -1115, 570, -158, -895, 1621, -1170, -162, 1096, -1585, 1510, -690, -829, 1715, -1596, 1161, -447, -922, 1962, -1511, 203, 618, -934, 1318, -1044, -184, 1345, -1471, 1184, -564, -627, 1850, -1688, 794, -78, -482, 1599, -1812, 597, 885, -1167, 1064, -878, 26, 1401, -1666, 971, -345, -375, 1728, -2205, 960, 508, -864, 1185, -1721, 1009, 904, -1795, 1193, -568, -47, 1404, -2160, 1010, 404, -859, 1244, -2059, 1186, 845, -1714, 902, -722, 740]
1480G40l93k011K717j159JO01k294L311j259j363J894k254L347j996j920L909
1496A871k570J134j63k140L677j674j200J846k005K795j239k405L430j491Q22
1511F88j216p55L191k322K72n7n40K668k502o10K139j436J978k359r30M469l379
1528g01M45K67r93L162k882m47J797o46J008j800m51K714j209m37r19J027K196
1545B131l565J199K46j05J966l896J564J935j941J110k014P62L336l994J42J813
1561F89q53J589k944O74K228j240r7j439J568J281j767n63K20J863l8l181J952
1578e8J070r96O67k673K415J388k798Q17o83J701O66l176Q74J992n23r20j198
1595a435J892Q55j716pp13K558m16k740J671P4J278j144k475L197O79k393M82
$$ y = [740, 347, -1664, 1053, -106, -105, 496, -1798, 1513, 254, -1109, 785, -1469, 1878, -118, -2038, 1871, -699, 435, 272, -1868, 1809, 135, -1065, 781, -1224, 1571, 332, -2073, 1357, -134, 688, -528, -1283, 1908, -414, -142, -199, -739, 1929, -573, -1183, 956, -480, 1498, -861, -1791, 2678, -701, -256, 11, -982, 2180, -702, -1149, 648, 2, 1010, -790, -1241, 1473, 264, -173, -1092, -65, 2131, -1434, -235, 11, -94, 1872, -2024, -460, 1475, -466, 644, -1370, -608, 2728, -1266, -1124, 689, -164, 1425, -1519, -845, 1383, 143, 46, -1393, 175, 1456, -311, -874, -654, 1209, 1171, -2010, -58, 1012, 16, 683, -1990, 425, 1813, -985, -168, -851, 850, 1516, -1660, -786, 1206, 683, -237, -1435, 457, 1312, -404, -411, -1124, 1434, 1018, -1722, -51, 23, 1301, 157, -2318, 879, 1558, -835, -353]
1612c53l10J399P77l201J184J183J89q60j609J798J152j007j850J047K009j286
1628B62j101K55N89J449j533j983K920l51k03r10j119L549j117k160J198O27M78
1645H50p38j641J564J270j179q71j86K151m15j625k46J353J432k549j95J456J93
1662F24p3j349j49K180m62j465J14M10J722j725j396J897P57p12j482P71J076
1679G38p9r45p88J309J045j441r20J041P15K97k241N22K114j245l66n14P92J032
1697A066j113j031R38J015m42j101k23J726q0j206n68J441M20j273J7k60J491
1714H17k10j597N95Q52J65p12j012J177J154j673j69N04N53R4j308M28O06N78
1732H42j043o12R95M69l92r97M90J198o73r79O69J02M74m02j195J535j06k00m44
$$ y = [-353, -663, 736, 1513, -1688, -504, 679, 868, 8, -1601, 197, 1349, 342, -1508, -461, 1548, 262, -839, -584, 5, 1454, -79, -2062, 858, 507, 304, -606, -1725, 1824, 707, -1453, -255, 372, 850, 112, -1529, 35, 1305, 126, -745, -931, 1220, 805, -820, -1066, 287, 1719, -830, -1025, 431, 624, 551, -798, -947, 1233, 771, -694, -580, -170, 1552, -173, -1569, 328, 1085, 373, -1109, -338, 738, 659, -286, -1074, 235, 1280, -161, -1081, -40, 675, 972, -1269, -747, 1367, 122, -244, -758, 34, 1066, -47, -1078, -140, 875, 433, -668, -891, 835, 755, -451, -1019, 422, 842, -431, -414, -674, 817, 607, -990, -395, 457, 622, -90, -1102, 75, 1229, -444, -613, -109, 444, 538, -770, -342, 264, 842, -201, -813, 182, 651, 259, -738, -248, 950, 277, -702, -33, 69, 543, 141, -1054, 481, 375, 175, -269]
1751b69l87J464l40j050L15N93J03m23o89R29J33k83l57k43J200n73k67k91M41
1770FQ67j360L5P13j51J22m55k99J154o77q6M7m03J406j177k59Q00k39L10p35
1790c81J35O13l35j88N4j33P34n76j79K46r0Q02j423O41N76q01O22p13M24M13
1810D41p27L98o9l24R33r34j8Q12p31O09q39N48L31q48P63n40K19K54n14L65j83
1831e4k9O09j106O07N03j143J134q96L95M22j090J173p65%Q21r83L10M18n66N27
1851B87n97K68M88j041J028o67Q6N21p60O98o71M94K53j038R17p2n52P71q05M89
1871I7K84j067J393j145K99R35j615J160k79k00N43r32P65J43r45J008n47j21
1889b24Q08j080P71m13J88L91j162J175l64k63L83n26O63k99m13Q81r04M64N09
$$ y = [-269, -656, 808, 468, -582, -267, 326, 429, 6, -683, 246, 379, 96, -261, -504, 696, 123, -144, -435, 6, 873, -487, -452, 261, 110, 232, -223, -522, 632, -45, -131, -84, -487, 919, -258, -517, 283, 44, 354, -381, -246, 367, 32, -156, -102, -235, 499, -77, -256, -10, -100, 702, -721, -80, 496, -305, 317, -396, 28, 441, -286, 112, 43, -281, 652, -282, -300, 512, -219, 390, -449, 99, 430, -418, 345, -195, 24, 278, -236, 129, -54, -83, 526, -580, 27, 530, -613, 521, -375, 20, 442, -648, 525, -240, -240, 581, -402, -92, 326, -240, 287, -310, -42, 446, -595, 433, -234, -148, 373, -387, 311, -360, 134, 387, -651, 266, 194, -358, 413, -392, 97, 381, -686, 707, -438, -139, 796, -819, 341, 62, -138, 405, -527, 238, 381, -564, 444, -103, -224, 584, -496, 275, -138, 50, 441, -721, 454, 90, -173, 210, -316, 347, 48, -365, 516, -388, 76, 585]
1908E85j481J501o80p8N90j257J577p78o04J237r49L47L61r45R13l29j93N54j075
1927g04J261m72n71Q11n88P04p90J29P05q92O19j43n83J058o51j46O01r21J337
1946G64j079l20J560j452O67j20l57Q79q33K16K61n37Q82o43m20J125q32M57n50
1965c32J96R51j493Q91j46k84P48q86K50M18m44M44o78J66J050j381M81J41p4
1984A8M70j210J042k08k53N88j058O98N02r84L89j49K12O38j683J123M03r51P55
2003C42q65O30L36o85J37j61N72L6r32M49M70j86j86o75J319m05o22P54r63J223
2023E88k21j127R34q3J85k19r08J264K42j271O00j70N89j46q33O79j66O62p61
2042a62n50J216j96l40l68J44J080p65q27J138l88L63k50r50J396j96l30m43J08
$$ y = [585, -896, 605, -75, -153, 437, -820, 757, -21, -625, 612, -337, 10, 371, -574, 339, 10, -183, 371, -704, 557, 85, -486, 325, -263, 441, -349, -220, 485, -407, 212, 69, -514, 544, -107, -253, 348, -573, 764, -315, -635, 925, -527, 140, 20, -337, 542, -291, -75, 186, -351, 531, -112, -532, 593, -239, 218, -332, -136, 815, -678, 213, 67, -217, 531, -355, -105, 313, -131, 313, -365, -199, 851, -530, -49, 92, 18, 488, -722, 320, 112, -141, 447, -611, 87, 589, -395, -6, -155, 57, 695, -988, 135, 538, -413, 342, -523, 107, 443, -242, -105, -266, 306, 342, -590, -141, 329, 143, -43, -718, 601, 196, -426, 328, -635, 588, 367, -760, 174, 91, 276, 57, -851, 413, 655, -616, -16, -186, 403, 257, -576, 103, -63, 599, -162, -712, 504, 308, -32, -400, -256, 824, 59, -768, 370, -18, 345, 95, -855, 541, 345, 15, -428, -320]
2061c20J095o20p75M33O46o2p92j47R92l55J07o40j55J665j163l77K57L47O43
2080G79j349j41J293k38n16j26q0J088n41o85J92M98O76j467P8Q84J28l45r52
2099h24Q30P31p84l17J18K68Q43j259l39J119N5j84j136Q02Q65o80n61L2R36l7
2119D78p60j60M77M97j18j396Q04J114r57k15m03J101K99j385K62N20L11k53q21
2138f05K21J125l85q06j47J075K56j259J43L50P51o84q35Q58K41P7o37m60J035
2157C14N30j314j01O30N42l74j121R04M39j33o45k26R47K0l99o79N33R29o77r26
2177h07P49M69k3o66m71J396l20m82j45k5J061m57r05L37Q55j97p08k03R01K00
2197E59p68j98L00P23n79l44k3O02M65j296J22P43J49m42o22N16P97p68l18L51
$$ y = [-320, 775, 155, -620, -187, 459, 397, -395, -542, 450, 95, 202, -438, -593, 1072, -91, -468, -211, 136, 779, -570, -711, 582, 344, -172, -298, -378, 710, 169, -516, -324, 174, 850, -617, -539, 345, 473, 128, -824, 6, 737, -47, -364, -246, 22, 865, -394, -733, 386, 441, 257, -879, -77, 788, 108, -453, -421, 515, 478, -282, -442, 35, 532, 414, -982, -178, 936, -21, -236, -639, 462, 761, -624, -362, 158, 469, 216, -605, -384, 741, 356, -450, -597, 478, 734, -525, -382, -32, 719, 35, -800, 58, 299, 376, -261, -721, 314, 844, -470, -571, 59, 601, 227, -894, 10, 449, 316, -329, -555, 392, 412, 13, -666, -133, 796, 119, -807, -58, 411, 388, -278, -749, 647, 327, -155, -300, -325, 736, 279, -626, -289, 566, 369, -339, -542, 359, 559, -209, -407, -107, 616, 37, -307, -330, 272, 737, -559, -437, 306, 455, 13, -609, -93, 704, -64, -382, -31]
2217c1J1P11j015k21Q28N4j89p85N08P48m98o32L62M26jm06l06N29K24j23q03
2238f09N42N26l98k41l53J023j16q14L05K16J26K3o63K47O99n22j3m36O69L49
2258E60r52J78K53L63m05l16L31J73Lk60l17N35L11p05J33m5N69k33p42P96j28
2279A02K8j87j96M29N5k84j07K7M19l6p07N26O4N3k63k79P37m32P9r1j70N52k05
2302A14l50J73J25J46k40m12P78l26j03J21k74N37l87J10n0j17M71l76k35M35
2322A40l5j44J6k06N77m60j2L19m57N48l28m4Q3L1K14m44Q1L61k72m9J83k40M25
2345B87m34J48J17m17P31o09QM20l01J34j71J9K76l14M4K60m49N13k22k20K76
2366I6k00L56n20K37K82l95J81p7L1J00j46O2Pk21N40n06l3N21n27L92l92J70
$$ y = [-31, -20, 691, -324, -545, 283, 337, 148, -637, -129, 619, 121, -511, -149, 277, 276, -130, -436, 93, 317, 194, -609, -67, 459, 61, -180, -533, 490, 374, -440, -135, 81, 207, 230, -433, -186, 513, -9, -22, -458, 211, 560, -392, -214, 39, 402, -3, -319, 12, 185, 188, -72, -389, 146, 457, -248, -115, -160, 409, 176, -566, 230, 102, 130, -57, -253, 176, 231, -53, -160, -133, 286, 250, -457, 69, 133, 186, -77, -356, 381, -51, 28, -63, -233, 319, 114, -236, -63, 62, 208, -32, -444, 334, 8, -95, 26, -248, 289, -98, 12, -38, -155, 316, -60, -295, 140, 105, -39, -23, -229, 348, -112, -124, 195, -262, 286, -42, -86, -3, 28, 242, -202, -121, 240, -32, -81, 102, -138, 287, -147, 1, 118, -299, 432, -177, -169, 251, -50, 84, -87, -68, 208, -106, -62, 198, -251, 262, 40, -180, 96, -104, 252, -268, -31, 251, -144, 37, -40, -9, 91, -55, 7, 14, -207, 333, -173, -206, 315, -212, 180, -212, -42]
2388d2L03n55L94j05j86M23k69j94L88k22K39l72O9M99o26L05j07R0R3k77K93
2409A41k72J80J93n14K30L26m34K77k98J99L13p82P06l03j19N23o45K13K50k05
2429b1N9j68J05L58n99K47J72k15K25l63L33j49M8O6m01M70p1j92M7J4K21j27
2451E9m13O36k96j61M81o99O16j61k54L69m62N14j02n06N47%l68K90k59K80J8
2472A29l60L98l42L38j27k59K60J7J47m40J62L84l88m8K76k19L06k58j74N03n13
2493b08M92l79k29Q13n67p1J54KK20l55n8M70l66J62n8l31O54m00Nl2L3M33o69
2516b85J29L66j29j18o9O4K45k17j6r6J11M14p45K97R5P1P0p46P47J09n69L27
2538E5j87M3N14p66J12M37l01L78o78K75N51n57p8J35K61j26j14j61K20K44k16
$$ y = [-42, 261, -294, 100, -5, -191, 232, -37, -231, 157, -65, 174, -198, -129, 370, -256, 49, -58, 32, 125, -152, 141, -131, 49, 242, -272, -42, 284, -150, 127, -171, 28, 341, -441, 265, -38, -157, 366, -279, -66, 184, -21, 38, -130, -25, 333, -266, -19, 153, -62, 163, -200, 133, -16, 32, 98, -303, 167, 96, -96, -49, -35, 186, 59, -354, 282, -14, -175, 306, -393, 223, 62, -192, 177, -285, 229, 127, -379, 168, 168, -200, 90, -169, 111, 129, -231, 167, -175, 163, 36, -223, 37, 54, 201, -239, -77, 307, -81, -129, 147, -72, 234, -24, -198, 305, -208, 284, -95, -324, 489, -78, -149, 5, 7, 227, -128, -186, 284, -82, 80, 22, -309, 345, -55, -50, -82, -49, 384, -285, -156, 210, 81, -37, -106, -42, 203, -14, -30, -126, -15, 399, -346, -49, 46, 117, 187, -559, 188, 297, -272, 55, -132, -89, 425, -341, -229, 208, -93, 285, -393, -118, 433, -124, -202, -67, 194, 68, -46, -207, 13, 257, 41]
2559D1l77L70K10j91m3m77R54k26p37N81j92K89o5n27M17K85k93j24j50M46K09
2580D00p75K13K47K94m69k93N99k06J77l51k22P34j23n31J56J28L31j89p23Q32
2600B29O0l17r2r9M32J7k70l96N42L12n80j20J87L12J06p34O2R74o98K8L5k23
2622b33Q48p03m41O73n2m9k04l44Q09J47r35L68J33L55l68l20N1N96J3q85N28
2643a3J89M9j47o08O64M27p75J6K60j24N57p94j82R90n17J5l60L26N37n64l87
2664d41L75L81j32m30QM97j03j17m59M31M43n71r5m4O23j16o14J77M16J9l51j89
2686b92K82L73l20k67m3O62j31o94L58R8L59m41m58P30N6l25n0j57M45K57q70
2707d28K94K86M2p4n99N24L31l43l49K46K40J0k23l36N24K25m39k44L87J07K3
$$ y = [41, -336, 34, 244, 53, 10, -467, 487, 261, -476, 105, -87, 202, 137, -390, 27, 312, 19, -105, -255, 191, 400, -375, -162, 85, 379, -90, -383, 216, 10, 187, -164, -386, 348, 225, -306, -150, -22, 309, 120, -603, 229, 289, -28, -120, -219, 213, 230, -40, -436, 106, 418, -162, -282, -95, 217, 323, -411, -349, 625, -73, -45, -10, -233, 615, -88, -529, 144, 92, 43, -161, -505, 304, 451, -484, -116, 17, 372, 4, -316, -265, 331, 344, -541, -13, 176, 225, 78, -530, 134, 561, -214, -198, 62, -62, 495, -299, -481, 509, -8, 7, -353, -27, 510, -54, -441, -66, 315, 183, -247, -239, 258, 155, 38, -421, 10, 453, -118, -213, -257, 366, 250, -364, -187, 229, 248, -103, -292, -10, 363, 43, -224, -267, 395, 264, -430, -72, 26, 385, -56, -514, 216, 272, -53, -103, -260, 185, 442, -428, -134, 152, 194, 120, -479, 45, 376, 33, -316, -70, 170, 180, -43, -379, 145, 370, -69, -313, 74, 181, 204]
2728B04m46j17R19n72j26J13j06N61l93m84N72J51k49o2l80P02N2o87K75J14J76
2749B17k72j44O2L59m0n04K26K18L4j88k39K06M98o03m4L24j89M02n68J3M87k18
2771C7k5j64N3L88k58l96M47J4kj85j31L77j16Ql00K67K09k56l0j18L57j1l89
2794b24J29K71j74J21l14J01L53l89J68k41K69J91m71J46J58lm0j78R7K45k74
2815e9Q2j01L1K90m41J23M2J25n7k51K65nk5j06k7J24P6j86J38j18J04J55m80
2838c01M24j15l4J30l18M02j32j16O0p9R0J24k88J48M7m1J18l75L99j08j02J47
2860H0k35K84j52k8N7o1J09N4l14K75K2j71J89l12L56j57p5J88k72K99j11r0Q4
2883A9m5J33q4j72L01j30j12K32l53M01j88j07K30l17L93k04j61K69j01m0Q8j76
$$ y = [204, -242, -359, 560, -12, -138, -25, -131, 430, 37, -447, 125, 276, 27, -35, -415, 287, 339, -348, -73, 41, 217, -55, -199, -137, 222, 182, -322, -96, 122, 156, -32, -271, -65, 433, -170, -214, 110, -79, 323, -245, -232, 255, 37, 12, -152, -99, 289, 31, -365, 82, 96, 94, -91, -222, 155, 39, 47, -253, 14, 223, -33, -63, -181, 176, 165, -224, -95, 176, 2, 123, -191, -90, 263, -126, 42, -199, 70, 261, -210, -64, 94, 91, 51, -127, -30, 215, -59, 23, -78, -47, 243, -198, -75, -33, 92, 35, -216, 49, 44, 19, -87, -114, 10, 86, -100, 38, -80, 24, 179, -301, 123, 8, -26, 104, -214, 188, 56, -60, 0, -79, 11, 135, -153, -5, 42, 1, 119, -256, 143, 35, -67, 80, -155, 129, -23, -51, 6, -55, 54, 108, -206, 69, 91, -80, 109, -203, 153, -4, -79, 109, -163, 136, 25, -65, 19, -26, 107, 23, -149, 152, 22, -90, 142, -211, 190, 2, -105, 125, -192, 201, -3, -164, 105, 4, -36, 52, -124]
2905a24K15m8k04K87l29L21j03j95K86j94K17k45K9K29j73JL0p6K10j45r0K38
2927A37l16M21l05j07M48m00K08j47nK78l13M0J74k28K48j35j99M11k82J52j37
2948e7m7L79m59J91%oJ38k40P2J13j14J19j29m1L51m19J97q6N4J97m69M08j55
2971co3K08l25K19J23l19K64j65l4M15o37L54J29l54L37l06J89Q0k09P9QL9J0
2994C9r4m1J42k1m4j96M40k50j04L19m64N26k52k27M31l20J45J08m24M02Q1m71
3016b75M16j83J09K5k96L22j35J20j79k3J95r4N7j72M7L14l08j39M25l39K14n8
3038D3k90N46l53N6oj07L12k06j51J67J40j22j72R4K34k87J69j73k4M79o12K84
3060B1J8j57M18n41K3N43l97r5K95l19L93j93k44L28p2O6k38J09O3J55k32k58
$$ y = [-124, 91, 43, -161, 126, -203, 118, 15, -180, 106, -88, 129, -116, -87, 142, -31, -30, 0, -76, 134, -11, -101, 137, -179, 242, -63, -170, 278, -122, 86, -61, -66, 212, -101, -61, 113, -115, 133, -2, -201, 210, -72, 80, -57, -104, 275, -184, 7, 7, 1, 139, -101, -29, 84, -30, 89, -40, -81, 270, -149, 48, -38, 16, 213, -256, 152, -3, -66, 142, -183, 36, 159, -160, 104, -61, -95, 320, -317, 37, 166, -188, 149, -157, 32, 112, -97, -18, -10, 29, 39, -55, -96, 46, 25, -19, -215, 225, -25, -129, 190, -274, 252, 0, -227, 204, -116, 29, 137, -287, 115, 196, -275, 141, -42, 67, 92, -204, 118, -17, 103, -76, -99, 96, 2, 59, -113, -66, 248, -60, -199, 226, -113, 101, 43, -247, 299, -54, 2, -4, -111, 201, -5, -156, 11, 151, 29, -143, -49, 185, -102, 67, -106, -130, 349, -263, 21, 39, -118, 300, -241, -218, 325, -72, -167, 128, -191, 202, 9, -235, 93, 21, 87, -151, -42, 21, 176, -56, -314]
3082c14N82j85k39K24j84J46K81o89M05K11m00M15n72L28L96o46J08K41p1L3j51
3103h1j01M10j49j47p3J82J54k65Lq7M76k81l58M36j04Q1r8k19K68K25l98Q7j8
3126e7J65J22n65L08J47N4l23q5L96j26%j95m7M50j24m55L72kQ3l6n28P40j08
3149A86m17K48p5J11Q4l42j4M43j10j92o2J21K22j57l59K38M86o19J98k0j29O04
3171D45n82r3M45j39q5l6k66O27j60o17O04j38R1M7l67J92L11k66l20L82N3K3
3193A51k66o2L61L0n16J80J66j20L68n36KN71m28O0j69J06L67k86l45M54Ok22
3215a28J41k30L39o2j56j19K69J47m84J10P5L79j46m02K02K02j04r8r9J66K85
3236B87o06J76J05J58J00m59J09L23j54j31l2K85Q9l51M2q0K62P7m32K10Q7j1
$$ y = [-314, 268, 83, -156, 68, -116, 30, 311, -378, 27, 238, -162, 253, -319, 9, 405, -241, -133, 108, 37, 70, -81, -182, 228, 79, -68, -141, 41, 195, -70, -67, -154, 322, 41, -317, 119, 15, 96, -2, -221, 47, 272, -126, -39, -57, 108, 230, -335, -27, 120, 174, -149, -234, 162, 36, 36, -159, -206, 244, 120, -335, 37, 35, 118, 82, -446, 294, 186, -231, 17, -58, 53, 137, -205, -219, 224, 114, -78, -140, -19, 203, 46, -313, -75, 411, -208, -10, -30, -159, 445, -137, -230, 215, 76, -9, -45, -311, 316, 156, -461, 143, 5, 96, 143, -224, -32, 279, 13, -307, 75, 128, 151, -115, -177, 184, 214, -302, -122, 44, -76, 292, -244, -242, 329, -99, -39, -208, -102, 265, -21, -366, 88, 94, -128, 13, -217, 122, 60, -96, -215, 54, 201, -283, -173, -98, 281, 135, -267, -65, 137, 33, -65, -164, 2, 287, -319, -143, -38, 120, 220, -239, -130, 193, 39, -92, -124, 161, 250, -101, -59, -139, 123, 200, -232, -22, 65, 54]
3258E4m1r9K13N3k44l2R8J16k2j90r7J57J23L5l58L76q7p3m9j19N38n03l8J40
3282d9m6J96p8l03L22J41l01K53l00M20k10k49K17l5K48l34m5R3N6J25l05J56
3304b8J39p4Qp9N7L59l54k01K60j86K30k87M4L93k25o9J53k27K90j93k01L49j59
3327aL5j39l2K89p2J2k05Q7J32j58N9j03k0K52k08L3p6k9K39o3j40L96m03J75
3351F0j01j12K50k02J1J60p3Npn9K07j92P5j32O6R4k08K84k04J06J04l53K56m5
3375a0r9J95k18Q4K70l65K03j45o3L84n00L92L6k79R3j31J35O8O5l0j49l7J98
3398I7k71K94j66J31L6k14K35p1j39J49k57K77n2j09K08l28J90J4k77L19L9k62
3420a57L00m69N04j69q9L38l66J64Q5k50R7P7j23J23j61K21pj62J46k93K35m7
$$ y = [54, 13, -86, 127, 180, -64, -96, 2, 118, 96, -94, -191, -34, 89, 124, -234, 142, 55, -18, -67, -186, 352, -151, -189, -49, -95, 101, 23, -280, 42, 183, -118, 135, -165, 255, 45, -204, 13, -22, 226, -108, -153, -60, -4, 121, -184, -28, 111, 37, 45, -34, 23, 382, 28, -173, 87, -99, 131, -156, -112, 281, 56, -13, 140, -87, 203, 10, -191, 158, -1, 34, -105, -137, 152, 80, 92, -113, -26, 106, -52, 7, -96, -116, 136, -72, -39, -115, -144, 95, 32, -108, 288, -115, 60, -41, -153, 97, -105, -94, 66, -7, -2, -9, -68, 139, -53, 22, -110, -44, 50, -158, 126, -78, 28, 132, -221, 35, -10, -109, 86, -132, -48, 222, -143, 60, -85, -148, 236, -264, 128, 164, -115, -22, -153, -18, 50, 115, 85, -64, -101, 97, -174, 120, -46, 85, 121, -93, 142, 71, -68, 81, -176, 101, 49, -60, 148, -180, 10, 24, -253, 66, 105, -157, 143, -326, 178, 9, -80, 258, -108, 56, 141, -109, -12, 65, -58, 65, -96, 125, 118, -44, 102, -191, 44, -3]
3442cl2N0j60L28j28j76K00p7o1J29k51L43j31k32M59m32K86l4j22J97k81K04
3464G6j01k3J54j15j15J49r1J86j72j08L20l42K58j55rK40j41rj11L8K30k09J4
3487c6J64k66K45m2j02J82k25J21n0j38L96l23J0J59j42J35k13O1K19l14L31j62
3509A0j83L50l57J51J2K6Q1k22K51j10m3p5M5M2K8j06R1P9j58K35l36J94J05k59
3533a49K16j51J82k7j67J35J00k46J33q3K1J40j30J27k80L12j09j55K44k67J88
3554C4m4r1J16%k6Nk7M7J64k62J96n1m3k0j58K50j11M2o8j5J39j51MJ50o1OO6
3581I1l30L07j35Q6O6l8J20n2k58J72q7M9L6j50K99n5j63Q4j22J81j08K0Q8j54
3605e3K79l89K3K61o6k7p5m7L76k51k09K71j50K14j25k53K64p0O6k41J71J38j64
$$ y = [-3, -35, 15, -145, 183, 55, -121, 79, 2, -59, 70, -181, 162, 31, -201, 258, -174, 112, 78, -44, 153, -128, 76, -25, -48, 106, -9, -124, 25, -66, 120, -52, -160, 160, -182, 76, -79, -88, 152, 11, 2, -109, -71, 159, -50, -36, 128, -138, 107, 65, -37, 145, -80, 41, -9, -147, 249, -74, -64, 95, -47, 88, -125, -64, 155, -159, 172, 10, -173, 177, -180, -29, -17, 9, 90, -132, 119, 9, -34, -109, -64, -22, 6, -100, -9, 70, -88, 147, -189, 5, 110, -149, 67, -84, 98, 71, -96, 39, 139, -107, 26, -57, -36, 104, -26, 101, -179, 133, 24, -131, 113, -154, 34, -10, -101, 15, 15, -11, -6, -33, 14, 178, -84, 112, 61, 18, -2, -160, 90, -21, 21, -47, -62, 77, -74, -70, 80, 19, 25, 91, -239, 68, -67, 19, 85, 47, 167, 115, -143, 29, -58, -9, 27, -123, 176, 121, -42, 42, -80, 101, -7, 13, 101, -53, 226, -163, -140, 121, 55, 28, -47, -94, 282, 31, -178, 93, -57, 157, 32, -221, 43, -27, 39, -202, -31, 107, -57]
3628e7Q5j40K23p1j80ML75k08P9p4j41L05k70J08j98J27K07k71j07L64J6j56M9
3651F9j11K07j78m6j16K56ok38J61p6J81k3k82K75L3k22P0q4J48J74l60Q0J54
3674F6o9J10l41K47P3m7q3p7K38p4j27P7L4j3Rj81J00R2l2J3l05M97j01l05J14
3699h5Q5J31p0j78Q0J33q5J6j01K16j49J2p5l8M37l41p2K30k07J39j49r0K76m4
3723G1j65J21k36L40j13j16J72n4l8o8q6O4K56n9j59K19j88J00k22M4J63L27n44
3746a71J57K29l03J72k00J96K06n62L03l03K61J10q8j28L18k58r9n4NN31m14l9
3768a31n0K19j06J1Q6j35J32p3j46J00J86j02J88k33L9J96m38M17j14O8k2k10
3790a18J60Mj59L3P6n3K30l50O5MJ95J32k74N7N6N7r5k78L05j49O6jj33K47o8
$$ y = [-57, 28, -112, 111, 40, -140, -136, 239, 31, 110, 36, -105, 200, -70, 38, -160, -33, 174, -97, -204, 160, 176, 20, 69, -42, 165, -13, -59, -175, 81, 75, -163, -2, -78, 103, 80, -202, 73, 106, -116, -46, -130, 18, 192, -168, -88, 66, -3, 107, -234, 13, 86, 39, -44, -121, 117, 43, -84, -7, 27, 14, 23, -158, -58, 34, 2, 15, -290, 207, 106, -199, -85, 0, 131, 61, -117, -37, 96, 11, 27, -74, 142, -7, 5, -70, -108, 329, -12, -84, 146, -61, 78, -71, -161, 115, 71, -94, 27, -209, 131, 18, -98, 74, 20, -18, -86, -172, -108, 148, 89, -70, 149, -39, 61, -161, -117, 46, 373, -171, -14, 215, -88, 84, -116, 80, 286, -276, 27, -276, -15, 95, 7, -121, 197, -61, -160, -214, -209, 322, -92, -131, -181, 38, -68, -57, 29, -106, 26, -47, -193, -93, 93, -9, 179, -54, -15, 181, -257, 160, 46, 114, 92, -118, 42, 46, -113, -80, -4, -57, 173, -177, -112, -108, 87, 219, -55, 2, 58, 115, 20, -258, 47, -102, -36, -37, -170, 77, 9]
3815Ik29K54j2k12K32k07L42j69p9J52J00oj18p5K9J44k67N6o8K52r9%J13l40
3839a98L33k07N1P2o8J05l6j11K81k80J34j31p4K88k51L4K00m35M66j03k69L87
3861A88k08p9j05J99J5n1Q0k0r6J15P1j90J37j31O5j05J03J58k46J53j29O7Q3
3884G4j62J47q5l2K16k46j7K12k60K87k26QK56l22K14p7j04J96j23l7J13l4N7
3907E5p6m3J68j66J09q2K3J22j94J58j22M6J28k38J22N1p0P0j24N3J18k21J87
3930G4r5n3K17k88J81m2pQ5j45Q5P5j50J03jr3J81k08R7J6q7J77k48J45K7q0M8
3956A4r4J37m6q6J00j5n0J44k31J68k9m7J06k11K19l9j46J21n6K0N6q5O7J2p0
3981d1J21j81J46L7j78J65j45J43p0o1J54j36rN0pN6Oj44K12j97J59J8l39L27
$$ y = [9, -220, 34, 22, -190, 42, -165, 177, 8, -71, 81, 181, 175, 57, -18, 11, 155, -112, -56, -124, 128, 29, 29, 142, -198, 135, -72, -21, 51, -17, 88, 52, -59, 222, -58, 76, -55, -129, 159, -92, -58, 142, -293, 173, 70, -199, 188, -20, -99, -204, -5, 10, -41, 39, 19, -77, 38, 109, -81, 56, -75, -10, -115, -12, 146, -100, 53, -76, -9, 74, -88, 59, -26, -58, 158, -88, -105, 107, -153, 134, -92, -84, 172, -150, 64, -13, -117, 79, -44, -81, 32, -2, 55, -21, -64, 104, -62, 47, -35, -12, 110, -84, 74, -48, -2, 126, -112, 10, 61, -9, 61, -63, -10, 108, -113, 74, -21, -74, 143, -145, 36, -6, -13, 72, -73, 12, 87, -63, 40, 39, -54, 127, -81, 16, 32, -55, 122, -126, 19, 46, -34, 14, -80, 57, 11, -75, 25, 10, -40, 104, -127, 41, 12, -35, 71, -140, 79, 40, -106, 15, -41, -21, 35, -50, 17, 29, -41, 80, -101, 45, 82, -96, 69, -76, 67, -3, -64, 90, -46, -55, -5, -12, 44, 50, -94, 118, -79, 80, 98, -241, 86]
4005H6j02L8k6nP7q5L2%o7J04Jj28P0r9J75o7j49K72j59L9K7q0R2j9m7q6O7j1
4033e0J16j72P8J1k8J3J6K94l84K06j18l0N2j41J09J46j06oM1j56K20j96k7K76
4057A64j98M3l1L3k3MJ31r6l4k1n8Q8M6q8J02j11J8J85l16K43j43N0J05o5j13
4082h5J25N8m9L5p0J18k04QK2L4J12j53J60j62N2O0j58J45m4j08R1l2N0P8j80
4107i7J89q6n1J77k47J66po4M4q4J25k7m0NK9K7p6m8J38p6qP0j92K53j04p8P4
4134A2p0J46r5r4J49L1j18O3o8O4M8r1M1k5J02j57O1J2k9J42k44Q4J79j80L9K6
4160B8j18J93p7j55K43j65J05m4r7J71n6q1KJ02n3Qm8K0Q3k6r6O3R0j30J31k29
4186a36J60J29k67J58o2M6N6j67L9J32q1J9o0j2J86k03K2J6N8K3j67J55m3L6m4
$$ y = [86, -16, 22, -4, -9, 68, -17, 15, 15, -52, 52, 53, -75, -5, -104, 71, 4, -145, 127, -32, 7, 34, -46, 46, 27, -20, -106, -39, -50, 66, -106, -28, -17, -45, -32, -16, 278, -106, 100, -18, -48, 4, -137, -28, 118, 12, 6, 47, -109, 111, -85, -112, 164, -34, 9, -22, 11, -12, -8, 123, 27, -7, -28, -86, 2, 48, -40, 62, -49, -31, 154, -162, 81, -62, -12, 93, 28, -85, 40, 98, 49, 84, 14, 132, -72, -64, -42, -8, 104, -49, 111, -51, 1, 61, -97, 48, 4, -104, -13, -45, 5, 83, -97, 92, 6, -45, 132, -115, 51, 44, -20, 24, -60, 65, 38, -2, 3, 32, 59, -17, -65, 73, -3, -11, 59, -133, 120, 16, -62, 12, -58, 88, -7, -101, 48, 79, -39, 24, -44, 20, 68, -23, 18, -7, 95, -62, -1, 11, -18, 124, -120, -36, 143, -37, 2, 28, -90, 103, 26, -129, 114, -51, 54, 10, -87, 84, 28, -53, -51, 51, -2, 6, -42, -22, 61, 35, -61, 2, 92, -38, 93, -136, 24, 153, -114, 44, -18, 28, 84, -83, -44, 88, 7, 26, -34, -46, 140, -63, -41, -25, 33, 56, -111, 44, 1, 37, -7]
4211gq2J39l4k3j1m9R8P0k10J76m6k9O7j99K18n5n5J0m3J44l5p8L8M4k0jj50K11
4239H8o6j0Mj13K53j72RPm6J18j13l3Q1M9o8J3j04K17j15n6R7r5J96j79LO7n0
4266a8Q8j29L0J37j07mL0p0J56j76K4J19j45J64j73J6J24l3nr4N1O6j09J6Q9n3
4292fQ1j64P2P2j31K07k33J04J27k23J26m3J1J16j82K5J68j74R2q9j2J88j73O7
4316B6p3O5K0q3Q4p5P0rr4J13k7o4J29k06J47J04k94K42r9J7J04k34J82Lr5O3
4342A6m7oJ22j29L8nL0L8j61J73q5P2l3j06J66j23L4M2j16J22J3j40J45o9J6M7
4368E4j46K12j23l8R6j37J23k8o4O8m1O7k2j11J51m9n5J03j23J43q7j1O3j18J58
4393H5p4n3O5JRk3m4R2n5l8J11j86J67o8j7M2p2J14j00KO0l3oL0m3P1k9n8Q8j06
$$ y = [-7, -89, 50, 16, -7, -18, -67, 31, 101, -109, 67, 21, -8, 59, -140, 78, 23, -32, -22, -65, 79, 44, -34, 4, 48, 28, 27, -123, 88, 22, 12, 16, -97, 156, -16, -7, 0, -46, 72, -41, -74, 7, 56, -12, 1, -103, 114, -1, -57, 40, -55, 141, -38, -35, 32, -18, 70, -59, -29, 108, 1, -3, 27, -43, 113, -63, -39, 80, -65, 99, -74, -58, 66, 33, 28, -66, -15, 51, -58, -42, 47, -6, 75, -89, -17, 55, -76, 131, -102, 2, 129, -94, 32, -11, 0, 116, -66, -41, 127, -47, 45, -44, -56, 132, -41, 26, -47, 18, 38, -45, 39, -36, 34, 25, -69, 44, 17, -47, 82, -124, 23, 127, -167, 75, -24, -7, 97, -137, 45, 48, -47, 16, -31, -37, 85, -44, -6, -11, 19, 57, -104, 69, -16, 56, 23, -83, 83, -40, -6, 36, -80, 42, 55, -85, 60, -9, 7, 54, -92, 120, -3, -41, 55, -82, 41, 13, -51, 17, -24, 43, 21, -90, 61, 12, -43, 60, -63, 80, -7, -18, 45, -73, 85, 11, -42, 23, 24, 33, 10, -34, 58, 3, -35, 76, -110, 57, -11, -28, 14, -58, 56, -44, -42, 18, -15, -21, 9, -34, 37, 8, -50, 38, -68]
4423f8J31p6n9J29q2O1p5L6M6o4QM4o8O5pr2J31r3P7q1kR3j15Q1j0k4P3q1KN0
4453C0l9L3k0p0J32r5N8k7l0J03j34J01o7J7M3m7%O9n9J1pm9J16j00K3K1m2Q5
4481E6j08P3Kl6J7qm8R8p7l3R3n3O5o7K4K4m4N6p4N5oK5k4l7N3j3o8M1M6p3Q2
4512D1q6O5L2j15R6p8O4L2q7K0K8j7K7k4j6O7j14O7k5J6K1l8L9j4L2p1K2N9k9
4541A4k4J7j0K0J5q4R0n9M4M9j54J55q7KJ6l2K8j5K7J8m1j5M3n3P2n5PJ5m2J03
4571F4r9J4M7n2OK5m5O4Rm2K6o8Q8l8k4M2m1O3q4N8Om0O1m1ON2o0J2Nn2R9q1k5
4604d5J43j47Q3p5RO3l2J6l2M6k5k8pN3j5j8j9O3j1o3R9j11R1J7j27J20k5j2L7
4633D8q5M7M3r2O5k5k2Q4j25P9m0N9m0m6R2o1K2l6mP0n7k0P1o0M9J5j17J36p8
$$ y = [-68, 63, -13, -72, 57, -25, 36, -39, -3, 43, -21, -13, 31, -37, 28, 21, -71, 60, -33, 44, -37, -39, 54, -61, 20, 10, -14, 59, -22, -20, 30, -9, 24, 4, -66, 66, -29, 29, 2, -28, 75, -59, 42, -25, -8, 35, -12, -12, 57, -2, 9, 2, -47, 69, -31, -8, 13, -29, 56, -52, 21, 23, -13, 4, -4, -52, 46, -31, -64, 29, -24, 41, -26, -2, 22, -22, 34, -40, 15, 9, 34, 10, -27, 26, 13, -55, -14, 32, -41, 41, -45, 20, 52, -63, 33, -45, 19, 51, -36, -16, 12, -5, 22, -2, -18, 49, -65, 2, -23, -7, 14, -24, 15, 1, 33, -38, -16, 43, 14, -10, 7, -3, 17, 32, -52, 38, -21, 23, 72, -82, 73, -14, -12, 4, -28, 0, -15, 12, 30, -11, -26, 17, -36, 36, -19, -12, 3, -39, 64, -35, -21, 26, -26, -20, 5, -40, 24, 33, -9, 17, -51, 37, -1, -25, 17, -24, 39, -45, 13, 19, -21, 40, -1, 5, 57, -3, 9, 14, -38, 61, -20, -45, 98, -49, 34, -41, -32, 31, -1, 15, -17, 29, 4, -24, -31, 22, 7, -11, -30, 33, 22, -41, 58, -53, 38, 55, -72, 48, 23, 11, 48, -37, 10, 53, -39, 26, 1, -21, 63, -62, 17, -23, 36, -4, -50, 42, -19, 3, -33, -37, 33, -24, -44, 27, -33, 16, 31, -86, 50, -28]
4662b8L0J1n5J31j00LK5l6M1j9l1L7oM5m1n3J44j37M2k3MJ07j40J8P2n9QLj8P3
4692D8l7l1M6l4Q9j24L9K4l5N5r7Q5k5j5L2o5L0Q4j17L9J6j1Q1j57R9L5j18Q2
4720A8q2Q6j6k3Oj0O2k3o8P2L0r8O2j07J10J2p1J10j66J29J5j24Q4%qK7p4L3J07
4749I3j57J08n4L9mp6P9o8J08o6n3J23o8k1L0p0J21o1r6J68j28O6M1j74J86o9
4775ck5M5o8R4j4p9N9jOJ4q1J05m5L0np9J28j05M9Mn7J17r0k4J00q9K5J2j32J73
4805F4o9k3O4j26J61j24RM5k0M3p2J2N4pJ8op7J15r8L3L3n6J30j42L7M3q6Q8n1
4834hlM8m1k5K3j7J00j43P4J9r6R3p4M0M7j03N3J8m9J07q5k4N9k6N3p2K8P3j14
4863d5Q6o1K8L0o9L5k3K0L2p4M1M7p6L2l7K9M5j05R3n8K9L8r8P4%Opl9K0N6r6
$$ y = [-28, 2, 13, -42, 89, -11, -8, 17, -19, 22, 3, -28, 9, 3, 48, 7, -46, 98, -39, 3, -20, -16, 91, -49, -31, 41, -18, -10, -7, -25, 48, 11, -20, 26, -8, 81, -43, -4, 20, -15, 40, -57, 28, 3, -12, 20, -45, -15, 69, -48, -9, 7, -4, 77, -80, 19, 54, -64, 18, -64, 22, 6, -17, -11, -21, 41, 18, -50, 22, 52, -46, 16, -91, 19, 31, -40, 70, -96, 33, 48, -76, 8, 8, 0, 27, -47, -14, 93, -64, 44, -10, 29, 25, -51, 28, -40, 68, 2, -51, 72, 4, -17, 13, -57, 64, 3, -93, 75, -53, 13, 54, -120, 66, -3, -28, 17, -51, 43, 29, -50, 9, 8, 14, 28, -53, 52, 7, 37, 32, -47, 81, -24, 25, 29, -28, 89, -1, -25, 75, -14, 11, 23, -109, 64, -5, -28, 36, -90, 71, -53, -44, 1, -19, 24, -48, -36, 18, 11, 29, 23, -54, 61, -37, -4, 29, -27, 103, -39, -2, 41, -45, 43, -8, -11, 37, -4, -29, -6, -23, 77, -66, 8, 27, -69, 24, -50, -10, 37, -66, -13, 5, -44, 63, -22, -46, 13, -13, 40, -32, -4, 69, -45, 41, -20, 8, 38, -31, 4, -19, 1, 33, -41, 0, 47, -29, 3, -34, -5, 40, -65, 28, -30, -1, 37, -61, 13, 13, 19, 12, -27, -7, 49, -47]
4894d7O7qj1K6p3P7n5M7J2p2L4J1ql0J9J8Qo8R3l5k7P5j15J07l9Qpp1Q5k6j9O
4926a8J0K7l0m2R9m6K5k6n3R5k6%lm2O2m7k4P0m6L3L0q3O6Kn2M1o8R3l7m9N7L
4958B1nj8j6QJ2Qj5k3K6%o4Q2m3N9o2J1M9k2m3LL9j8M2k3mn5JL2o5J11p3O0o3
4991d8M1J1k8K2oQj3L1p6O9j1J4k5m1J19j13N5k4J2K4k9N7n2J8nl1rP2l5k0M2
5022B9n0M4o3N0K0o1M8l2K9k8L0k3j3J8J4o6M6K3m1K5k4L6n6L5L6m6J2L5l4j9
5052b6K9POl4M6Ko1O0m5j0O0rrm7P7m2m3N2J4m6QNM3k2l0N8q1M6J4m1L5l5K6l5
5086b8kL8ml0L9k9NK5m5M5m4N4j4j1M3q5O5j9Pjm6N7%n1M8j6m4P7n7P1o8oR6j28
5120e8O3Kj8J4k7L9j5l9L8Oo1J16n6l2L9LLo9R1m5mM7o2O5o1L7K6q5M4P3j36M8
$$ y = [-47, 20, 12, 1, 27, -46, 31, -24, 23, 35, -37, -3, 8, 0, -30, -11, 7, 15, -53, 40, 5, -22, 53, -62, 45, 6, 14, 7, -64, 21, -5, -24, -18, -8, 19, -11, -53, 46, 0, 25, -1, -54, 41, 15, 15, 12, -30, 32, -15, -39, 31, -15, 18, 48, -35, 31, 33, -19, 22, -46, 47, 10, -39, 18, 21, 16, -2, -18, -10, 2, 10, -5, -28, -2, -2, -66, 16, -27, 32, -30, -19, 30, 8, -35, -32, 7, -11, 31, 8, 4, -51, -50, -18, -83, 28, -45, 15, -48, -7, 4, -24, -2, -8, 0, -13, 18, -58, 11, 0, 14, -11, -52, 67, -46, 9, -15, -3, 21, -8, 49, -3, 15, 10, -21, -30, 42, 7, -13, 29, -21, 23, -40, 10, 30, -31, 17, -15, 14, -14, 16, -7, -20, -2, 12, -54, -8, 15, -26, -1, -25, 11, -45, -10, 26, -20, -8, 27, -7, -26, 3, 10, 16, -18, 28, 30, -31, 29, -16, -26, 34, 25, 16, -31, 46, 4, -39, 13, 27, -19, -11, -6, 37, 15, -15, 43, -38, 8, 22, -19, 16, -19, 7, -28, -30, 8, 4, -26, 13, -16, -11, 14, -31, 14, -30, 24, 10, -1, 42, -43, 22, 3, 10, 9, -37, 20, 20, -31, 17, 1, -43, 34, -23, 48, -20, -26, 70, -58, 5, 7, -11, 3, -24, 15, 0, -39, -1, 5, -56, 60, 4, -28, 11, 14, 17, -52, 39, -6, -10, 37, -25, 40, -21, 16, 42, -43, 1, 74, -62, -14]
5152a4M2o8P8p7O1ml9L7l4J5J9n4K2L4j6%m6Q5o9JN6o0N8l2k5M5l3L8j5n0O6M
5184B5p1P2l8M9m5j0O2j05P9j6k1K6k1L5o7J2O1k4k1O9j05P6k7l7Q8j26J10J0
5212D0q5Q6m2J%pM3j8k5N3q5M4J3j9N5o6M6m9RM8q9N6J9p4M9k5rQ7r9Q7n0n1R6
5245C9q0M0k1nN4n0J8L6n2K9Pj8K4m5N8m4rP4j26Q8K4m6K4m1M5J0l5M6l9k5O3
5276D3n8K7Mk4L5o2N8k6n3J03n3QMj3O2q0L7K4n7N7Ko3P1p5O0m5J8L2q3M8KlJ1
5309A1Mj6rl0N4j0m2Q6r5N7Mm5P1p4K6mj1L7pm8M9k7J7npJ55j51J9qj6O8o2L5
5342B6j0m7N3j9l1N8k4LLk6L2n1L4J9n1M9l8K5k0K8l0nK3K0k9RK3m5M1q1P2ql8
5375c5Q4o6JJ7Nk2J8lK7j9j2M4n0J7N5l6k8K3j2m7N4Nrl8j1M5J1kl8L8l8M8n2
$$ y = [-14, 28, -40, 38, -39, 22, 18, -21, 16, -18, -3, 16, -38, -16, 18, 2, 2, -44, 41, -28, -27, 29, -31, 27, -5, -30, 15, -18, 20, 5, -45, 21, 25, -46, 26, -12, 37, -8, -18, 44, -61, 18, 2, -19, 7, -14, 21, -46, -34, 27, 3, -18, 51, -54, 22, -5, -42, 46, -80, 30, 40, -45, 41, -1, 0, 0, -7, 36, 18, -7, 46, -39, 5, 18, -1, 54, -12, 34, -15, -6, 42, -47, 9, 28, -46, 3, -22, -31, 56, -43, 44, -6, -57, 39, -41, -1, -22, -27, 27, -23, -5, 31, -21, 8, 15, -3, 21, -24, 34, -10, -19, 55, -71, 17, 41, -5, 19, -22, 23, 33, -2, 44, 5, -20, 43, -15, 12, 16, -8, 27, -35, 23, -3, -56, 47, -6, 2, 6, -7, 55, -25, 12, 36, -21, 36, 38, -25, 46, -29, 31, -14, 4, 36, -47, 1, 3, 0, 11, 15, -1, -10, -40, 14, 4, -38, 48, -47, 10, 14, -31, 40, -34, -8, -12, -23, 14, 7, -41, 8, -19, -2, -7, -14, 141, -10, 9, 1, -15, 53, -9, 26, 16, -31, 22, 3, -28, 30, 6, 9, 12, -14, 18, -33, 1, 20, -31, 18, -20, 5, -15, 13, -17, -22, 1, 21, -8, 1, 24, -21, 20, -61, 11, 3, -35, 49, -17, -16, 1, 6, -16, 2, -1, 26, 7, -5, 39, -11, 6, 61, 25, -3, 20, 8, -39, 15, 20, 11, -27, -38, 7, 18, 16, -22, 16, -22, 26, -26]
5408b6L3L9n6k%J7lj0JL1j4pj7K0J2k6NlL5pl2J5j7J5Nk3L5l3NM1l0k0M5l8Pj6
5444a9OL8m1K7k9N1k2j0mjNj9L1j0K8n3K1MmK7n8J01q4LL1k1L3k3l7J3M3j3k7
5477a3j6L4j0rJ9l8N4Km9N5j2J9l9k9L0K3k7kMQk1J1L1m3K9kk5J8oL5p1M2J4k2
5511fK3j9k5O3m8L1j0jK8o5kL2k4K9m3M4J2Ol4J5l8Qn7R1k0QKk0K0J6m8K4O1o6
5545a3M7m2J08p7n4M4j1J4Pj02pR2O9o9j37J02J04j00Np4J95j14J12k8k03J85
5571E3N5j30P6j1k6Km9j1M6O7k2n0j5M9p5P1m8J5nn1R7m7l1N2n0L2j5K7j7j2L2
5602Iqk3L1l1L3qk3N6p5M1L6n4M5m6K8jj1JL3m3K4nj4M1p0O2p7N3kk6K6j9MK4
5636A1k6j9K0j8N1l6J5%m8M3j2OJ1j9L2k9K1K3o5M5K0m4J9qL8lm9N9m1rL2q0R8
$$ y = [-26, 7, 46, -10, -12, -12, 5, 2, -8, -7, 24, 10, 3, -14, 6, 18, -8, -3, -6, 29, 22, -10, 5, -12, 3, 8, -15, 20, -13, -8, 33, 3, -17, 28, -10, -3, -19, -13, 25, -16, 11, -18, 33, 11, 1, -3, -4, 1, -18, 13, 3, 31, -22, -1, 3, -1, 26, -32, 69, -15, -12, 19, -2, 31, 8, -29, -16, 27, 14, -13, -29, 5, -5, -14, 5, -33, 21, 23, -26, 29, 17, 36, -3, -32, -2, 21, -6, -8, -4, 4, -17, -6, 25, -18, 11, 9, -16, 2, -4, 31, -40, 2, 16, -6, 17, -2, -27, 36, -12, 19, 9, 8, 36, -29, -31, 1, -23, 6, -37, 7, 19, 25, -9, 6, -32, -24, -81, 10, -10, -2, 0, -20, 0, 16, -32, -8, 53, -13, 34, -8, 100, 23, -31, 13, 2, 16, 23, -79, -86, 6, 75, 6, -131, -29, 75, -25, -20, -94, 101, -13, 99, 71, -132, 53, 108, -22, 54, 43, 17, 19, -30, -41, 5, 72, 50, 0, -15, 34, -41, 30, -18, -3, -8, -59, 38, -9, -40, 12, -38, -6, -21, 6, -11, -23, 9, 1, -22, 9, -22, 11, 3, -20, 36, -39, 2, 38, -16, 29, -17, 11, 10, -1, 0, 33, -10, 14, 9, -5, 36, -34, 28, -49, 4, 2, -24, 2, -17, -13, 11, -15, -34, -14, -32, 19, -17, -2, -2, -50, -7, -19, -13, -2, -21, 11, -18, 3, 26, -39, 6, 26, -18, 1, -7, 31, 28, -21, 38, -3, -12, 20, -60, 38]
5669C8m4JJ1l1L9Pm7L1l4K2L9o5L8k9L1K4o3P6m7kK3m1O1pn3P1r3M1M6p4Q0o3
5701a4NM1p4P4l5LMj5K0k6L2kj3KMm2P5o8%O2q9O9k7J3L0o0L0M1o2N9m4J8L4p9
5735c4P4n1J3J9m7N7m1NJ9pnJ3l0M1l0j2M5n5M9j8l4L8n8N3%jK4k5KJ2j9Pk4L
5769a7L5j8K3k3k7N5q0Q6j2Nln2N0j7j8M4j9lj2LK5m0lO7q1O5l7NK5n8L5j0rJ0
5803fK4l1M2m4J7K5k8K0l9L4Nk4L1k1J0l1MJ6kJ1j0kRJ6n7M1MrjqJ2j0J1Lj9N
5839bj2J5Nl6N0m5kM5n2K5J1j7J9j2K2k7K3%J0l4M5k2Kj1l3L5j0L3m8%L0l2OJ9
5873@lJ1J8k8K4k4ONm3N2l7K5%j5Nj3J7pJ1j8K3j9K9j1jJ1m2O0l7K9j0l7LPL2
5908B3j7K1m8J8j4K2JJ1k7k9Q1p1K7jnK5l9M1k7K5lm0J6M9o6PL9j5L5n5M5j5j7
$$ y = [38, -6, -5, 6, -25, 14, 21, -26, 5, -29, -7, 32, -33, 5, -24, 7, 31, -32, 44, -3, -5, 18, -23, 38, 31, -22, 49, -44, -3, 43, -31, 49, -14, -9, 32, -42, 32, -3, 0, 4, -11, 9, -17, 15, 13, 0, 2, 6, -36, 39, -29, -29, 33, -56, 13, -14, -1, 29, -31, -1, 40, -22, 37, -7, 11, 45, -34, 40, -11, 2, 21, -26, 31, -10, -5, 14, 7, 2, 15, -15, 26, -4, -16, 29, -26, 23, 5, -29, 9, -49, 4, 4, 3, 27, 2, 4, 16, -3, 4, -20, -17, 18, 0, 23, 0, -27, 28, -52, 34, 22, 27, 24, -28, 22, 5, -13, 31, 12, 9, -3, 0, 25, -15, -18, 49, -32, 33, -4, 1, 26, -32, 3, -7, -16, -6, 18, -13, 29, -15, 2, 27, -1, 19, -20, 14, 19, -5, 26, 5, 15, -16, -12, 4, 2, 13, 3, 1, 10, 26, -31, 10, 14, 5, 4, -4, 8, -2, 9, 12, -7, -2, -14, 1, 6, -30, 20, -25, -27, 18, -34, -9, 2, -15, 4, -8, 14, -13, 10, 10, 20, -14, 31, 9, 11, 0, -33, 2, -8, 25, -23, -23, 7, -25, -19, 0, -3, 8, 26, -2, 22, -2, 4, 9, -34, 18, -19, 6, 6, -9, -4, -17, 0, -7, 4, -14, 9, -10, 19, 8, 7, 18, -24, 36, -1, 28, 18, -19, -16, -9, 23, 6, 27, -21, -3, -17, 5, 6, 17, -10, -39, 42, -29, -2, -3, -8, 17, -22, 19, -8, 17, 14, -26, -10, 39, -27, -20, 19, 4, 39, -16, 29, 14, -3]
5941cL2l6J9Lk2j3J4k1M8k2K3k3k7N1n1L2j5k7L7k8L3j2pL3rk0J9j5J0J0l9K6
5973@lK7k1k7J8lJ5LOPj3j3j2%J6J2l2N7m4L9n1LK0k1oOJ8J3m4K5J7l4lM9k9L7
6009C2n2K8J4l3M2k7L0jk0J3k7rJ5j8jK7l9O1n3J8J3n5N2n0O5k1l2J6j1K5%j2
6041a0RK1l6N7p2L3Pj3L3o5O3rk7J9k5K2ok3J8J6qJ3l9J7Jk7O2n6J0K0l7P4n6
6074a4J3kk6J2J9m0P7m1RJ4j6J0n6N6J1j3mk4J2%l0R1n1k1O7q7M1km8Q6p0J4Q
6107ejK1roL2m6K3j5l4M3k0OK0k7N1m3J4k4RM5m6J2K5m0M6rl8P1o0J6j0k3O4l1
$$ y = [-3, 29, -7, 12, 15, -7, -20, -6, -27, 21, -1, 22, -1, -28, 23, -28, 4, -11, -38, -1, -29, 4, -8, -15, 18, 9, -11, 8, -7, 3, 13, -26, 0, -3, 24, 3, -24, -6, -9, 6, 9, 15, 22, 9, -4, -16, -16, 0, 12, -20, 37, -7, 32, -19, -16, 4, -17, -23, -17, 1, 14, -30, -5, 12, -22, -25, 24, -5, 32, -20, 8, 22, -11, 31, 4, 34, 33, 13, 26, -1, -10, 5, -13, -14, 13, -26, 35, -18, 0, 13, -42, 10, -40, 25, 4, -28, -12, -23, 2, 2, -10, -1, 20, -16, 41, -31, 2, 9, -4, 29, -36, 27, 18, -9, 10, -15, 7, 1, -22, -4, 12, 4, 17, -22, -5, -4, -31, 31, -25, -15, 5, -32, 42, -14, -1, -3, -29, -17, 2, -38, 39, -2, 7, 21, 5, 15, -41, 15, 26, 13, 9, -15, -3, -3, -33, 58, 7, -14, 53, -34, 7, 5, -43, 43, -27, -13, -5, -6, 15, 6, 0, 32, -14, 9, -6, -40, 3, -17, -11, 9, -18, 33, -10, 4, -20, -11, 34, -12, 0, 25, -15, 31, 22, -16, 55, -5, 11, 1, -22, 42, 11]
$$ [...]
8191I
##END NTUPLES=NMR FID
##END=
