##TITLE=1H_25-2021
 CDCl3,8 sc, 
 2.04.2021
##JCAMPDX= 6.0         $$ Bruker NMR JCAMP-DX V2.0
##DATA TYPE= NMR FID
##DATA CLASS= NTUPLES
##ORIGIN= UXNMR, Bruker Analytische Messtechnik GmbH
##OWNER= root
$$ XWIN-NMR		Version 3.5
$$ Fri Apr  2 12:14:05 2021 Russian Standard Time (UT+4h)  she@DPX200
##.OBSERVE FREQUENCY= 200.131506
##.OBSERVE NUCLEUS= ^1H
##.DELAY= (6, 6)
##.ACQUISITION MODE= SIMULTANEOUS
##.ACQUISITION SCHEME= undefined
##.AVERAGES= 8
##.DIGITISER RES= 18
##SPECTROMETER/DATA SYSTEM= spect
##.PULSE SEQUENCE= zg30
##.SOLVENT NAME= CDCl3
##.SHIFT REFERENCE= (INTERNAL, CDCl3, 0, 15.7039)
##AUDIT TRAIL= $$ (NUMBER, WHEN, WHO, WHERE, WHAT)
$$ ##TITLE= Audit trail, XWIN-NMR		Version 3.5
$$ ##JCAMPDX= 5.01
$$ ##ORIGIN= Bruker BioSpin GmbH
$$ ##OWNER= she
$$ F:/spectra/data/she/nmr/H-F/1/audita.txt
$$ ##AUDIT TRAIL=  $$ (NUMBER, WHEN, WHO, WHERE, WHAT)
(   1,<2021-04-02 12:12:55.39 +0400>,<she>,<DPX200>,
      <created by zg, POWCHK disabled, PULCHK disabled
       configuration hash MD5:
       00 E9 B6 7A A2 85 ED C7 34 08 36 98 17 FE 4E 26
       data hash MD5: 16K
       CC 84 FE 8B 0E 47 B9 04 9E 3F 1B D6 6E EC 5C 9E>)
$$ ##END=
$$ 
$$ hash MD5
$$ 4E 68 2A 5E 57 78 C5 F8 9C BF B4 63 2D 7A 62 9A
##$RELAX= 
##$RELAX= 
##$RELAX= 
##$RELAX= 
##$RELAX= 
##$RELAX= 
$$ Bruker specific parameters
$$ --------------------------
##$DU= <F:/spectra>
##$EXPNO= 1
##$NAME= <H-F>
##$PROCNO= 1
##$TYPE= <nmr>
##$USER= <she>
##$AMP= (0..31)
100 100 100 100 100 100 100 100 100 100 100 100 100 100 100 100 100 100 
100 100 100 100 100 100 100 100 100 100 100 100 100 100 
##$AQSEQ= 0
##$AQ_mod= 1
##$AUNM= <au_zg>
##$AUTOPOS= <>
##$BF1= 200.13
##$BF2= 200.13
##$BF3= 200.13
##$BF4= 200.13
##$BF5= 200.13
##$BF6= 200.13
##$BF7= 200.13
##$BF8= 200.13
##$BYTORDA= 1
##$CFDGTYP= 0
##$CFRGTYP= 5
##$CHEMSTR= <none>
##$CNST= (0..31)
1 1 145 1 1 1 1 1 1 1 1 1 1 1 1 1 1 1 1 1 1 1 1 1 1 1 1 1 1 1 1 1 
##$CPDPRG= <>
##$CPDPRG1= <>
##$CPDPRG2= <>
##$CPDPRG3= <>
##$CPDPRG4= <mlev>
##$CPDPRG5= <mlev>
##$CPDPRG6= <mlev>
##$CPDPRG7= <mlev>
##$CPDPRG8= <mlev>
##$CPDPRGB= <>
##$CPDPRGT= <>
##$D= (0..31)
0 1.2 0 0 0 0 0 0 0 0.06 0 0.03 0 0 0 0 0.0002 0 0 0 0 0 0 0 0 0 0 0 0 
0 0 0 
##$DATE= 1617351174
##$DBL= (0..7)
120 120 120 120 120 120 120 120 
##$DBP= (0..7)
150 150 150 150 150 150 150 150 
##$DBP07= 0
##$DBPNAM0= <>
##$DBPNAM1= <>
##$DBPNAM2= <>
##$DBPNAM3= <>
##$DBPNAM4= <>
##$DBPNAM5= <>
##$DBPNAM6= <>
##$DBPNAM7= <>
##$DBPOAL= (0..7)
0.5 0.5 0.5 0.5 0.5 0.5 0.5 0.5 
##$DBPOFFS= (0..7)
0 0 0 0 0 0 0 0 
##$DE= 6
##$DECBNUC= <off>
##$DECIM= 32
##$DECNUC= <off>
##$DECSTAT= 4
##$DIGMOD= 1
##$DIGTYP= 9
##$DL= (0..7)
0 120 120 120 120 120 120 120 
##$DP= (0..7)
150 150 150 150 150 150 150 150 
##$DP07= 0
##$DPNAME0= <>
##$DPNAME1= <>
##$DPNAME2= <>
##$DPNAME3= <>
##$DPNAME4= <>
##$DPNAME5= <>
##$DPNAME6= <>
##$DPNAME7= <>
##$DPOAL= (0..7)
0.5 0.5 0.5 0.5 0.5 0.5 0.5 0.5 
##$DPOFFS= (0..7)
0 0 0 0 0 0 0 0 
##$DQDMODE= 0
##$DR= 18
##$DS= 0
##$DSLIST= <SSSSSSSSSSSSSSS>
$$ [...]
##$SUBNAM2= <"">
##$SUBNAM3= <"">
##$SUBNAM4= <"">
##$SUBNAM5= <"">
##$SUBNAM6= <"">
##$SUBNAM7= <"">
##$SUBNAM8= <"">
##$SUBNAM9= <"">
##$SW= 16.9725357007746
##$SWIBOX= (0..15)
0 0 2 0 0 0 0 0 0 0 0 0 0 0 0 0 
##$SW_h= 3396.73913043478
##$TD= 16384
##$TD0= 1
##$TE= 0
##$TE2= 300
##$TE3= 300
##$TEG= 300
##$TL= (0..7)
0 120 120 120 120 120 120 120 
##$TP= (0..7)
150 150 150 150 150 150 150 150 
##$TP07= 0
##$TPNAME0= <>
##$TPNAME1= <>
##$TPNAME2= <>
##$TPNAME3= <>
##$TPNAME4= <>
##$TPNAME5= <>
##$TPNAME6= <>
##$TPNAME7= <>
##$TPOAL= (0..7)
0.5 0.5 0.5 0.5 0.5 0.5 0.5 0.5 
##$TPOFFS= (0..7)
0 0 0 0 0 0 0 0 
##$TUNHIN= 0
##$TUNHOUT= 0
##$TUNXOUT= 0
##$USERA1= <user>
##$USERA2= <user>
##$USERA3= <user>
##$USERA4= <user>
##$USERA5= <user>
##$V9= 5
##$VALIST= <valist>
##$VCLIST= <CCCCCCCCCCCCCCC>
##$VD= 0
##$VDLIST= <DDDDDDDDDDDDDDD>
##$VPLIST= <PPPPPPPPPPPPPPP>
##$VTLIST= <TTTTTTTTTTTTTTT>
##$WBST= 1024
##$WBSW= 4
##$XGAIN= (0..3)
0 0 0 0 
##$XL= 0
##$YL= 0
##$YMAX_a= 158037
##$YMIN_a= -150729
##$ZGOPTNS= <>
##$ZL1= 120
##$ZL2= 120
##$ZL3= 120
##$ZL4= 120
##$ABSF1= 10
##$ABSF2= 0
##$ABSG= 5
##$ABSL= 3
##$ALPHA= 0
##$AQORDER= 0
##$ASSFAC= 0
##$ASSFACI= 0
##$ASSFACX= 0
##$ASSWID= 0
##$AUNMP= <proc_1d>
##$AZFE= 0.1
##$AZFW= 0.1
##$BCFW= 1
##$BC_mod= 2
##$BYTORDP= 1
##$COROFFS= 0
##$CY= 11.3945322036743
##$DATMOD= 1
##$DC= 2
##$DFILT= <>
##$DTYPP= 0
##$F1P= 15.9154993809931
##$F2P= -4.1035820241983
##$FCOR= 0.5
##$FTSIZE= 0
##$FT_mod= 4
##$GAMMA= 1
##$GB= 0.15
##$INTBC= 1
##$INTSCL= 1
##$ISEN= 128
##$LB= 0.24
##$LEV0= 0
##$LPBIN= 0
##$MAXI= 10000
##$MC2= 0
##$MEAN= 0
##$ME_mod= 0
##$MI= 1.114404
##$NCOEF= 0
##$NC_proc= 0
##$NLEV= 6
##$NOISF1= 3.799351
##$NOISF2= 2.8
##$NSP= 1
##$NTH_PI= 0
##$NZP= 0
##$OFFSET= 15.70392
##$PC= 1
##$PHC0= -11036.56
##$PHC1= 15.60091
##$PH_mod= 1
##$PKNL= yes
##$PPARMOD= 0
##$PSCAL= 0
##$PSIGN= 0
##$REVERSE= no
##$SF= 200.130013532006
##$SI= 16384
##$SIGF1= 3
##$SIGF2= 2
##$SINO= 400
##$SIOLD= 16384
##$SREGLST= <1H.CDCl3>
##$SSB= 0
##$STSI= 0
##$STSR= 0
##$SW_p= 3612.71676300578
##$SYMM= 0
##$S_DEV= 0
##$TDeff= 0
##$TDoff= 0
##$TI= <>
##$TILT= no
##$TM1= 0
##$TM2= 0
##$TOPLEV= 0
##$USERP1= <user>
##$USERP2= <user>
##$USERP3= <user>
##$USERP4= <user>
##$USERP5= <user>
##$WDW= 1
##$XDIM= 8192
##$YMAX_p= 0
##$YMIN_p= 0
$$ End of Bruker specific parameters
$$ ---------------------------------
##NTUPLES= NMR FID
##VAR_NAME=  TIME,          FID/REAL,        FID/IMAG
##SYMBOL=    X,             R,               I
##VAR_TYPE=  INDEPENDENT,   DEPENDENT,       DEPENDENT
##VAR_FORM=  AFFN,          ASDF,            ASDF
##VAR_DIM=   8192,          8192,            8192
##UNITS=     SECONDS,       ARBITRARY UNITS, ARBITRARY UNITS
##FACTOR=    0.0002944,     1,               1
##FIRST=     0,             0,               0
##LAST=      2.4114304,     0,               0
##MIN=       0,             -150729,         0
##MAX=       2.4114304,     158037,          0
$$ Real data points
##PAGE= N=1
##DATA TABLE= (X++(R..R)), XYDATA
$$ [...]
1504c717N147j839k911J0566j2578M372N132p868P765q511M737N346j2297R963
1518C307m266L53N011j1701J1738l059n522Q542r376Q483j371q736J2098p670
1532b169K843R97p649J3077r326l75O179p620R826r295M4J1046j2554O380j499
1547i5k490R544j3471O776M136q571P938q288O266K563j1200J1065n619J379L607
1562C540j0902J2831m739n176Q982r310Q713k858p627J2656q350K742Mn011J1777
1577G272j1089J867N609p188Q583r484K577R414j3780P865j295k333P824j2735
1591f893Q659J850p774P463p487P033j85r082J1172o501K073K332r392J2919o401
1606b14m020Q655q525Q230m555m867J1616q898K952m83k622R235j1310L771M952
$$ plain form
1504 -3717 1430 -409 -3320 7246 -5332 -960 4172 -3696 4069 -4442 295 5641 -6656 3307
1518 3307 -959 -606 4405 -7296 4442 1383 -4139 4403 -4973 3510 2139 -6597 5501 -2169
1532 -2169 674 1671 -5978 7099 -2227 -2602 3577 -4043 5783 -3512 -3468 7578 -4976 1404 -95
1547 -95 -2585 6959 -6512 264 4400 -4171 3767 -4521 1745 4308 -6892 4173 -1446 -67 3540
1562 3540 -7362 5469 730 -4446 4536 -4774 3939 1081 -6546 6110 -2240 502 506 -4505 7272
1577 7272 -3817 -1950 3659 -3529 5054 -4430 -1853 7561 -6219 1646 351 -1982 5842 -6893
1591 -6893 1766 3616 -4158 3305 -4182 2851 2666 -6416 4756 -1745 328 2660 -6732 6187 -214
1606 -214 -4234 4421 -4104 4126 -429 -5296 6320 -2578 374 -109 -2731 6504 -4806 -1035 3917
1621C917p202P219q183L949O716j3039Q763j673j834N516j0414R184n33o297O778
1636B867o308O479j660p067J0511o566J927J564p256J1661p515k082P251p054
1650c248P029n636j630R394r060L372l07j470O757j0355N134L748p047O199o400
1665c520M482L399j0416Q747k487j013L412p617Q499k295m670O160n276N271k169
1680E07n103R231o231J630Q39m510Q956p501j00N503n441N037n172O88O620q356
1696c403L705P5j253M492q255N691J802n914N146m653M126P76p038P441k823m75
1712e60K008n043O858k989l105N202m310M089k420l023P203n436J409M23k281
1727a975N850o266J040L955m140L066l475J464M060o831L702J73j172K617n559
$$ plain form
1621 3917 -3285 3934 -4249 -300 6416 -6623 2140 467 -1367 4149 -6265 2919 2386 -3911 2867
1636 2867 -3441 3038 1378 -5689 4822 -1744 183 1747 -5509 6152 -1363 -3445 3806 -3248
1650 -3248 3781 -1855 -3485 5909 -3151 221 -86 -1556 5201 -5154 -20 3728 -3319 2880 -3520
1665 -3520 962 4361 -6055 2692 205 -808 2604 -5013 3486 1191 -3479 2681 -2595 2676 507
1680 507 -4596 4635 -1596 34 873 -3637 5319 -2182 -2282 3221 -2220 2817 -2355 -1667 4953 -3403
1696 -3403 302 377 -876 3616 -4639 1052 2854 -3060 2086 -2567 1559 2335 -4703 2738 -85 -560
1712 -560 1448 -3595 3263 274 -2831 2371 -1939 2150 -270 -3293 3910 -1526 -117 306 -1975
1727 -1975 3875 -2391 -1351 2604 -1536 1530 -1945 -481 3579 -3252 450 623 -549 2068 -3491
1742c491N071J85m198L835k835K781m09m092N446k409m04J376l074M830k918j587
1758a893L763l110K801k318r62M612m154J071L36p81K922m296J448K607l170J735
1774F11j767J459J742m547L135k4r12J053k698L358o85k339K427j330J224m67
1790B40j962L224j611l62Q47j472K631k037n44K039j485J170j415J20K143k248
1806g22K75O91k84R00k070J094J360k035P81l70Q64J18j899J765k3o79J52l52
1824d34J062m07r74J083k22m0Lo45J127n01l07L12k12O03n88k79O36R3m58m2J73
1845a7M46m17n99R80j34m31n6K35M45n97l14Q42k60m31L87k87O45o90q3Q99j011
1866d48O50k52k14O99q48N79Mp01J072q00rP56j069J138q39n0J192j731J257l34
$$ plain form
1742 -3491 1580 1765 -2433 1402 -1433 1348 939 -3153 2293 -116 -520 856 -2218 2612 -306 -1893
1758 -1893 1870 -1240 1561 -757 -1719 2893 -1261 -190 146 -635 2287 -2009 -561 2046 -1124 611
1774 611 -1156 303 2045 -2502 633 609 -303 750 -1948 1410 725 -1614 813 -517 707 240
1790 240 -1722 1502 -109 -471 376 -1096 1535 -502 -1046 993 -492 678 -737 -617 1526 -722
1806 -722 -447 244 -40 860 -1210 -116 1244 -791 -10 -380 484 602 -1297 468 445 -234 -82 -434
1824 -434 628 221 -753 330 108 68 71 -574 553 52 -255 57 -155 448 -140 -419 217 310 -148 -190 -17
1845 -17 429 12 -587 393 259 -172 -228 7 452 -145 -459 383 123 -308 79 -208 437 -253 -336 563 -448
1866 -448 202 -50 -264 435 -413 166 170 -531 541 -259 -268 488 -581 557 -282 -332 860 -871 386 52
1886E2m55J099j483J169m4j194J669j200K70O75j441J853j451O3J519k163J680
1903F18p77j63J345k306J904j39j432J822j607J142J03j899K746j845J95J123
1919H30k092K578j834o6J812k489K157j027p81K367k563J454qj482K822k891J068
1936a45J263k390K520k338J063J551l427K829r38m40J549k942L045o88k100K998
1952A410k483J758l01k241L917l009P32J071k428L433k735J50K257l015K731j721
1968d74n56L172l843K207j66j392L154m186K454J016l020K965k612J758R74l961
1984b510M010j466o63J797l260L949j768j923L772l315K396r53j880M326l843
1999a331J284Q96k411L747l456N26K598l521L008k255K02L209m863L135m79j134
$$ plain form
1886 52 -403 696 -787 382 338 -856 813 -387 -117 558 -883 970 -481 -418 1101 -1062 618
1903 618 -159 -322 1023 -1283 621 482 -950 872 -735 407 510 -1389 1357 -488 -293 830
1919 830 -1262 1316 -518 -584 1228 -1261 896 -131 -912 1455 -1108 346 338 -1144 1678 -1213 -145
1936 -145 1118 -1272 1248 -1090 -27 1524 -1903 926 -12 -452 1097 -1845 1200 512 -1588 1410
1952 1410 -1073 685 384 -1857 2060 -949 -217 854 -1574 1859 -876 -726 1531 -1484 1247 -474
1968 -474 -1030 2142 -1701 506 340 -1052 2102 -2084 370 1386 -1634 1331 -1281 477 1451 -2510
1984 -2510 1500 34 -629 1168 -2092 1857 89 -1834 1938 -1377 1019 66 -1814 2512 -1331
1999 -1331 -47 849 -1562 2185 -1271 -745 1853 -1668 1340 -915 -713 2496 -2367 768 289 -845
2015h45K772m507L622K74l421L551k631J916L03l773M881k446m20J829l164M404
2031B345k995r46L750l830K958j625j295M339m423J744P87k273L781m039J294
2046d28K405l765L151k618J289K183n094M150j006j007K331m147M169n96l446
2061b429M163k710J683j18l045N009l312K01J506k720M218l672Q7L313l971L116
2077A319j879p94M179m817K082O89j956L269m242K368J541l621L120k590J974
2092F42Q69m466M753j656j016K195l557M114j451k772M319l001J679n10k055M416
2108B503l692R49R83k172L674l746P41K844l815K940j918j61L480m885K647L84
2124G56j618K445l763L101L57l158L073k180J850k1l434M727k285p69K095l000
$$ plain form
2015 -845 1927 -2580 1042 1316 -2105 1446 -1185 731 1034 -2739 2142 -304 -724 1105 -2059 2345
2031 2345 -650 -1596 2154 -1676 1282 -343 -1638 2701 -1722 22 809 -1464 2317 -1722 -428
2046 -428 1977 -1788 1363 -1255 34 2217 -2877 1273 267 -740 1591 -2556 1613 1017 -2429
2061 -2429 1734 -976 707 589 -2456 2553 -759 -558 948 -1772 2446 -1226 -1139 2174 -1797 1319
2077 1319 -560 -1354 2825 -1992 90 779 -1177 2092 -2150 218 1759 -1862 1258 -1332 642
2092 642 1511 -2955 1798 142 -874 1321 -2236 1878 427 -2345 1974 -1027 652 142 -1913 2503
2108 2503 -1189 -240 743 -1429 2245 -1501 -760 2084 -1731 1209 -709 -870 2610 -2275 372 756
2124 756 -862 1583 -2180 921 1278 -1880 1193 -987 863 842 -2592 2135 -150 -919 1176 -1824
2140a824L759k155j528L729l117J906r81j091L550l581J289O37j646K968l531
2155a616J273K256l607K694j749N17K230m336L075j46j313J735k788L019n04k593
2171a853L091j935J283j83k383M007k512k48J682k322L056k334m53K762k718J746
2187F86j080m18K698l264J368O14j376K187k997J681J404l046K365j473R03Q91
2203A143l134L060p12j041J377j895K383r30j740K761j840R64k23j480L032k409
2219f84K97J055j557K195k087J85J878k140J315q21n7J927k800J395M60j083J415
2236H93k191J801L99k210J938j003O55J64j832K417r41p48J185j319J696j000
2252i6q99K077j666Q76l70o71J946j860M53N88q47J282j501L87J288j637Q38m47
$$ plain form
2140 -1824 1935 -220 -1748 1981 -1136 770 -211 -1302 2248 -1333 -44 593 -1053 1915 -1616
2155 -1616 -343 1913 -1694 1000 -749 -232 1998 -2338 737 591 -722 1013 -1775 1244 740 -1853
2171 -1853 1238 -697 586 403 -1980 2027 -485 -733 949 -1373 1683 -651 -1104 1658 -1060 686
2187 686 -394 -812 1886 -1378 -10 604 -772 1415 -1582 99 1503 -1543 822 -651 252 1143
2203 1143 -1991 1069 357 -684 693 -1202 1181 251 -1489 1272 -568 396 173 -1307 1725 -684
2219 -684 -387 668 -889 1306 -781 -596 1282 -858 457 -364 -421 1506 -1294 101 561 -522 893
2236 893 -1298 503 902 -1308 630 -373 282 446 -1386 1031 90 -658 527 -792 904 -96
2252 -96 -995 1082 -584 292 -78 -749 1197 -663 -210 378 -469 813 -688 -301 987 -650 188 -259
2270b59J90R87k047J411J87q51P49j114J320j77j273J372n86K06M9q92J521q35
2288d2l49Q17q56J028q22k64J133r67N15l23j57R87j125K32M66m13N03q81M80
2307c8O85j161N65r7J54J92r58R59q6m90L21k38M62k11n06P21k69q3J33l74O32
2328C13l89j25L08k70M19m03p2M67k49r8oQ5K65m31n5M92k57m8j13K65J05m82
2350b79K14K20j08j77P8J31L8k41M8K38k47J52j47M4J75k31J35n0m2J84k38QL03
2373B08l29K01j62N5L12o30M52J3k46K32l29M06j15l87N54l07m2K48l84N45m70
2394a75j1N61p37N57j99j39M54o76N56q0m63O97n52J88J85n54Q15o66J06N59q91
2415d65P98m42o3N86r04P91k22m93Q67p58L97P4o36J074r79K52O61j035R14o76
$$ plain form
2270 -259 -69 918 -1129 282 469 -382 367 -747 573 396 -877 495 -91 115 164 -728 793 -42
2288 -42 -391 426 -430 598 -224 -488 645 -322 193 -130 -287 700 -425 -193 273 -140 363 -518 -38
2307 -38 647 -514 51 -46 108 300 -658 301 215 -275 46 -192 270 59 -447 274 5 -78 55 -319 313
2328 313 -76 -201 107 -163 256 -147 -219 248 -1 -99 -105 -20 245 -186 -241 251 -6 -54 -167 98 203 -279
2350 -279 -65 155 47 -130 -52 79 117 -124 -76 162 -85 67 -80 -36 139 -92 43 -7 -49 135 -103 -95 208
2373 208 -121 80 -82 -27 285 -345 107 120 -126 106 -223 183 68 -319 235 -72 -114 134 -250 295 -175
2394 -175 -186 375 -362 195 -4 -143 311 -365 191 111 -352 345 -207 -19 166 -388 427 -239 -133 426 -465
2415 -465 333 -109 -172 414 -490 301 79 -414 453 -305 92 166 -470 604 -375 -123 538 -497 417 -259
2435b59J87N87j233J120l34m34Q28r38Q22j76p75J253j012M36K43r46J342j111
2453d00K81O15j176J294q38p7Q84j195J008m67m23J304j433P03K20p78J199j443
2471g22Q30M81j397J330q10K85M80j372J526o17n03J100j266J149m36p41J571
2488H88j497P94L5r46J611j422M88N03j180J520j195M6J171j545J195o40j86J354
2506I94j975J293J5q72J267j547J236R0j458J702j037K70M72j401J841j054l07
2523d71J240j590J533q32n10J617j768J170k78q22J748j675N57N54j165J554j499
2540f37M43J119j867J484q10Q9J029k083J843l80q70J317j464J299k04j310J905
2557I03j290L83L79j284J961j488J45R94j589J736j214j94J580j828J220m28n87
$$ plain form
2435 -259 -72 515 -718 402 68 -366 462 -476 346 170 -605 648 -364 72 315 -631 711 -400
2453 -400 -119 496 -680 614 -224 -301 583 -612 396 -71 -494 810 -623 80 300 -478 721 -722
2471 -722 108 589 -808 522 -288 -3 477 -895 631 14 -489 611 -655 494 58 -683 888
2488 888 -609 185 220 -726 885 -537 -49 454 -726 794 -401 -355 816 -729 466 -174 -360 994
2506 994 -981 312 327 -545 722 -825 411 501 -957 745 -292 -22 450 -951 890 -164 -471
2523 -471 769 -821 712 -120 -630 987 -781 389 111 -711 1037 -638 -81 473 -692 862 -637
2540 -637 -194 925 -942 542 -268 -179 850 -1233 610 230 -640 677 -787 512 308 -1002 903
2557 903 -387 -4 375 -909 1052 -436 -291 703 -886 850 -364 -558 1022 -806 414 -14 -601
2574f01J685j909Q25N13j116J378j552R50O17j870J760j014L10O61j810K056p76
2591A07q10J465j466J225l55j077J911j524O26J71j101J876j635M33P19j377J713
2608I01j369M3J447j872J196l84m13J466k039J233K86j098J235j443J221Q4j530
2625a036J827j108K85N25j500J907j005n49J432j474J249n90o98J640j516Q24
2641B13j19p17J607j644N59O01j139J389j296L23J169j840J195l06k37J033j806
2658a015J475j24r21J128j131J040j95j147J685j069K06M46j176J688j103k70
2674d83J167j344J216p30l19J304j379Q03k36m14J239j481O16N34j001J067j098
2691e39N51P02j594J271m58q3O17j280J354l73o92R75q90P80k32q00J389j039
$$ plain form
2574 -601 1084 -825 0 513 -603 775 -777 173 790 -1080 680 -334 -24 637 -1173 883 107
2591 107 -703 762 -704 521 166 -911 1000 -524 102 273 -828 1048 -587 -154 565 -812 901
2608 901 -468 -425 1022 -850 346 -38 -451 1015 -1024 209 495 -603 632 -811 410 494 -1036
2625 -1036 791 -317 -32 493 -1007 900 -105 -654 778 -696 553 -37 -735 905 -611 213
2641 213 94 -623 984 -660 -101 500 -639 750 -546 -223 946 -894 301 -5 -242 791 -1015
2658 -1015 460 336 -585 543 -588 452 257 -890 795 -274 -68 378 -798 890 -213 -483
2674 -483 684 -660 556 -174 -493 811 -568 235 -1 -415 824 -657 -41 493 -508 559 -539
2691 -539 12 714 -880 391 -67 -150 467 -813 541 168 -524 451 -439 341 109 -691 698 -341
2709c41L08L04q82J307r92M1P25r66R61p26o5R89j114N89j22k64Q58j213O72L50
2729D19q61Q26q03O20J98j113J151m89n2L62q03J014m59m51Q40p17N70j95m74
2748d17R71q70L72R5n22Q83q16J57M54o20O38n58O3O55q99M89k6k02N11q80O80
2769A58P2n86N90m98M43l6n89P76l98l9K71m99O34l76j79N80n61M20j96k34N94
2790C47n61K77l2k13M99n24R4L17l75L13l04J47L25o29L95mj23K09m45M79r7l29
2812b34L43j72J33m6k08L80j89j00K07k92L36j69r5K52k71K44j65q6L04k29L0
2833b7M3l9J34k12K1K46k32N3n6P8J08k86K22K5j24K6k5J16m7j22J14J1q3O8q4
2858g2J00j3q6J03j02P2j6l9M0N2l8rNK9N0k13J65pn7K4n5J66j03q7J49k1q4O2
$$ plain form
2709 -341 -33 271 -611 696 -296 -255 470 -496 465 -261 -326 663 -451 138 16 -248 610 -603 69 419
2729 419 -442 384 -419 201 399 -714 437 -52 -104 258 -545 469 10 -441 399 -318 252 57 -417
2748 -417 554 -316 56 151 -371 512 -304 -147 307 -313 325 -233 -170 485 -414 75 49 -153 358 -522 158
2769 158 230 -356 234 -264 179 143 -446 330 -68 -107 164 -335 299 -77 -256 324 -237 183 -13 -247 347
2790 347 -214 63 31 -182 317 -207 -113 204 -171 142 -162 -15 310 -319 76 72 -51 158 -287 192 95 -234
2812 -234 109 -63 70 24 -184 196 7 -93 114 -178 158 -11 -106 146 -125 119 -46 -132 172 -57 -27
2833 -27 16 -23 111 -101 -80 166 -66 -13 -69 9 117 -169 53 78 -46 -20 -45 71 24 -98 16 27 -56 12 -72
2858 -72 28 15 -71 32 -70 2 -14 -53 -13 39 1 -8 -3 26 76 -137 28 21 -36 -12 -67 99 -4 -91 58 37 -47 15
2886A5o7J25r7p3K25k29J43l1q1J57k00J69k7j68K06j06oJ25j71J82j64k0K88
2909A95l59K38p0p4K07l04K42%k36K72j65M2P3k83M05k45m6L17l89K89j64j1K81
2932B15m51L29k4k32L19k88J92Rk98M61l08l3K60l67M00k71KL07m79L98j23j27
2954a09K95l86L08j4l12N05m11N8K32l71M45l96R9L49n79M27j60m7K78m73M38
2975A76r1l55M98l89K22N8l93N88m88J30K58m98N34l77M8L27n39M89j84k24M76
2996B66m69L10n2l15O16o33K72J96m63N06m25J59K73o06N59k07j29L28m91N14
3016B09j90l10O27n99L27M2l96N90n20K36J99n67O30l70L4K79m92N10k79j74N75
3037C61o08L59q8k48N97p05L88J64m70N16m38K08J81n54O09l14j12L78n36N49
$$ plain form
2886 15 -52 73 -24 -97 128 -101 42 11 -70 87 -113 56 29 -139 67 -39 -45 80 -91 91 -73 -93 195
2909 195 -164 74 4 -70 137 -167 75 75 -161 111 -54 -12 61 -222 183 -62 -108 209 -180 109 -55 -66 215
2932 215 -236 93 69 -163 156 -132 60 69 -229 232 -76 -109 151 -216 184 -87 -85 222 -257 141 18 -109
2954 -109 186 -200 108 94 -218 287 -124 -66 166 -205 240 -156 -57 292 -287 140 -20 -67 211 -262 176
2975 176 85 -270 228 -161 61 119 -274 314 -174 -44 214 -284 250 -127 -79 248 -291 198 14 -210 266
2996 266 -203 107 55 -260 356 -277 -5 191 -272 234 -191 -32 241 -365 194 -13 -142 186 -305 209
3016 209 19 -291 336 -263 64 106 -290 300 -220 16 215 -352 278 -92 -58 221 -271 239 -40 -214 361
3037 361 -247 112 24 -224 373 -332 56 220 -250 266 -172 36 217 -337 272 -42 -154 224 -312 237
3057B37k70j91N54o66M32Ml74N72n14K77R7m89O45m24mL19m86N32l80l0N01o79
3079c37M67r1k17M49n98M17N9m65N68l75J58J56m83N92m14oL63n37M96k58q2M10
3101B72n93M87n7l99N53m07J83M8l73N81m41L7L31m17M36m10J08L68o25M70q4
3122F8k49M23m88L28M5m07N30m02J29J80l92M47l85J55K30n34M94j65j26L03m24
3143b40M23j45l28N47l57R4P5k68N09n21J33K68l73L41k95J01K41m54L89j23k16
3164a99M25m36K73J2k77M50m33J99J41l66L56k45J54P6m28M78j25j97K97k90L05
3185A70j72k29N22m04O8J19j90L63m26J62J69l09K56j43k0K18l44K82j15j19L75
3206B33m10K21L6j72K20l55K71J11l63K82r2L2M7k94M14j76j89L06j96J43j54
$$ plain form
3057 237 -33 -224 330 -336 96 100 -274 298 -216 61 158 -331 314 -110 -114 205 -281 251 -129 -159 342 -337
3079 -337 130 39 -178 271 -327 90 149 -316 252 -123 35 191 -292 300 -114 -120 243 -294 202 -56 -138 272
3101 272 -321 166 109 -290 263 -144 39 87 -286 295 -146 -109 222 -195 241 -169 -61 307 -318 152 68
3122 68 -181 242 -246 82 127 -280 250 -152 -23 157 -235 212 -173 -18 212 -322 172 7 -119 184 -240
3143 -240 183 38 -290 257 -100 -6 69 -199 310 -211 -78 190 -183 158 -137 -36 205 -249 140 17 -199
3164 -199 226 -210 63 75 -202 248 -185 14 155 -211 145 -100 54 130 -298 180 55 -142 155 -135 170
3185 170 -2 -231 291 -113 -45 74 -116 247 -179 -17 152 -157 99 -44 -64 154 -190 92 -23 -142 233
3206 233 -177 44 80 -92 128 -227 44 155 -208 74 -18 14 61 -233 181 5 -184 122 -74 69 -85
3227h5m6L65l52J08O5j69K13k17J01J14k28K40j43n1K03k15J68j39L5J92l53K05
3249A1J03j94J03j42K27j2l18K83Qj09Np3K90k20j18K84j63Q9j14J4J77k34Q6
3272a7P6j19J54j42J0R5j22J57j94M2J92k24O8%R8j7k14J79J10k06K0K7J01o4
3296A0k08L05m2j68N4J6J36j75K9J39j21j2K9k0R7j12J8N7j02J30j07n2J43l5
3320IK9j29R1J15j77j8J21Mq9p1J74M9k61J03J28n2p5j3J64p1j11P1N8k1p4OJ04
3347F4p8k6O1l6M0k0l6J6mO7q1j6J07rj28mJ42j8j25J2J88j04r9Q9Q5p9j00J16
3375B4O8j35l0J25J6j07KO7K1j21P2ml8N5oPn4O6J1j00lJ19k0j01M4R4j8j66J28
3404A6P9j27k5O6P3q3o8J65n2j33R1K6J2q2K1J28j75N0K6rJn1J28n0j18J48k0
$$ plain form
3227 -85 -131 234 -118 -10 55 -114 99 -118 -17 97 -131 109 -34 -85 118 -97 71 -68 -33 159 -194 11
3249 11 114 -80 23 -119 108 96 -222 61 69 -40 -35 -108 182 -38 -156 128 -35 54 -60 -46 131 -103 -17
3272 -17 59 -60 94 -48 -38 57 -65 92 -102 -60 132 -92 -24 -24 74 57 -157 22 132 -74 -54 -27 74 10
3296 10 -198 107 65 -103 -49 -33 103 -72 -43 96 -25 -37 -8 -28 69 -43 -25 32 -70 60 -47 -99 44 9
3320 9 38 -91 0 115 -62 -80 41 45 -44 -115 59 108 -153 -50 78 26 -49 -62 102 31 -80 -9 49 28 -46 -40 64
3347 64 -14 -40 21 -15 25 5 -31 -15 -19 48 -33 -49 58 49 -79 -83 59 41 -84 -72 116 12 -87 2 87 8 -92 24
3375 24 92 -43 -73 52 68 -39 -37 30 51 -70 2 -2 -40 15 9 16 -38 28 39 -61 -64 55 35 -66 -22 72 54 -112 16
3404 16 95 -32 -57 9 82 -1 -69 96 44 -89 2 28 40 -42 -21 107 -68 -18 8 -1 0 -51 77 27 -91 57 37
3431C7o5J3J6N9r6j2J41j63M1O0j9J6j43J92l5j22R9Pl8j9j6J18j21n2K02j58
3457e8L6qL6Q0k19J62Q7k14Q5OO3m8j11K09r6j01J68j21J19j34K0J32j74J09J1
3482C9r4R0p6O8k2q1K04j51o0J50o6N8j50P8J96l08J01Q9k9mj57J96K7k54K24
3507F8m7Kk8r3K36j48m1J20j40J23o5k9J30j66J24m2j44K63j13o9L9k7K07k89
3531a29K9K64k06J3m1J33J18m00K07J75k21M3j03K34k1l18L08r4nL1j60L15k21
3554d9j7J56j95K30r5j69K35j16N1n9r4L41k86p6J83l3J51l43J60L11m45R8O2
3577AQ4K3l87L68J17l32J45q4J90n2l23M18j51n6Q3k12L48j81j32J76j50K63j71
3600a5k07M23j71o0p4L6L82m91%L59j73L1k86K80K38n49K29J73q5K7l21L99J9
$$ plain form
3431 37 -28 -15 1 60 -36 -48 93 -70 -29 31 12 28 -115 77 42 -80 19 26 -12 -31 -47 71 -50 -102 100 -58
3457 -58 -22 -30 6 86 -133 29 116 -98 -13 -7 56 8 -103 106 10 -91 77 -44 75 -59 -39 93 -81 28 39
3482 39 -55 35 -41 27 5 -76 128 -23 -83 67 1 59 -91 -13 183 -125 -24 65 36 32 -125 71 98 -156 68
3507 68 21 23 -5 -98 138 -10 -51 69 -71 52 -13 -42 88 -78 46 4 -140 123 10 -59 -20 -47 160 -129
3531 -129 -100 164 -42 -29 -70 63 181 -219 -12 163 -58 -15 -118 116 95 -223 85 -9 -14 17 -143 172 -49
3554 -49 -66 90 -105 125 30 -139 96 -20 31 -28 -122 219 -67 -143 40 7 158 -185 -25 286 -159 -61 1
3577 1 85 108 -279 89 206 -126 19 -65 125 73 -250 168 17 -39 44 -168 180 -1 -133 43 -107 156 -15
3600 -15 -222 201 30 -30 -104 -68 314 -177 -177 182 9 40 -246 34 272 -277 -48 125 40 67 -254 145 164
3623A64l73K68j23J92q4k67L90j78oO9k45M12j81k34K71j18K05k67j55N81l24
3644cj33R4P6K35n64J95L95l63K0j18K97R8n84M05J29k26R9k55L80q2k80K94j66
3667e7J82j12k67M18j38m3%j62M74l10k58M24j21Q2l09L5N52n42n7K89OQ2m96
3690c28L68K76n04J26lJ79M1m96M61K6k39J46k45L79j05k95K93j32J93j20k89
3711b68M84j58j40L1k7L90m52j19N18k13o2j95K21L76o46J50K93j39k0l13M32
3732A43J13m91K31OQ7j8l51M38p1j76J24j97L79j58k71K84l9Q7j89j91N44k68
3754A6j99J66N3K30n15N9N05l31q7k5K48J26n70K66K78k45qj29L20j3l95K90l
3777C7L3m0k52L74p7j50P3j10L18j63l02L66j9o1j70N4M24l87j68K76O7j9l53
$$ plain form
3623 164 -209 59 -64 128 44 -223 167 -11 -17 52 -193 219 38 -196 75 -43 162 -105 -260 321 -3
3644 -3 -136 -42 34 269 -295 -100 295 -68 -48 -166 131 229 -355 50 179 -47 52 -203 177 95 -185 109 -57
3667 -57 125 13 -254 164 26 -17 -17 -179 295 -15 -273 151 30 112 -197 -162 390 -152 -209 80 86 168 -328
3690 -328 40 316 -188 -62 -65 114 155 -341 120 146 -93 53 -192 187 82 -213 80 -52 141 21 -268
3711 -268 216 58 -82 -51 -78 312 -140 -259 259 46 -16 -211 10 386 -260 -110 183 44 24 -289 143
3732 143 256 -235 -4 2 89 71 -280 158 87 -89 35 -162 217 59 -212 72 33 120 -69 -260 284 16
3754 16 -183 -17 36 266 -249 -190 315 -16 -103 -128 120 246 -324 -58 220 -25 -33 -162 158 145 -250 40 37
3777 37 70 30 -222 152 75 -75 -2 -112 206 43 -259 107 88 27 -143 -89 335 -52 -220 56 123 104 -249
3800b49K37L02m25MJ56R5l9l41L22R0k56J06p6K00l4k63K05RJ4q4j14K82o4j66
3824h9M8M7J68k23j73L62k1j90o6J90J84l76j8K79o0j37r8K60R8l41O6J75m6n5
3848a6j31K18Lj49P8l7J16l9j57R6Q6l2p6l3J94k8k30R9J23J1k21J1K81j08j96
3873a37P2J75n7j61K4K58j46j76J43Q9l8j45R2R2q3m2L1K1L4p1k9O4J4nq4L0J61
3900A26j38q2Q0N9Nj91R1J86j78p3J09Q8n1j88J99M3j54L1L1R7q3j21K08r3oJ2
3926Gm9Q9p2j4P3j03J35l1j24J71j05N4n0o3K50k33jJ47j07O9j19P8J55l06J43
3951fP8j24J22j84K08o5j72K76j74K1O4j03J80k10L0K12k84J95q2kJ26k72K77
3974A11m4j98K61k02J24k0j67K94k60P8J35k70K77j57K3J35k96L25j41j55K93
$$ plain form
3800 -249 -12 290 -135 -131 25 120 81 -260 62 152 -104 2 -74 126 92 -171 34 43 57 -27 -141 141 77 -89
3824 -89 -41 6 174 -49 -222 140 119 -71 -137 53 237 -139 -157 122 62 -75 -173 87 185 -156 -90 85 39 -16
3848 -16 -147 71 74 -75 3 -34 82 43 -114 -18 68 36 -40 -73 121 93 -137 -38 85 96 -125 -114 167 59 -137
3873 -137 -65 110 53 -108 -84 174 28 -148 -5 84 46 -99 -7 85 2 -40 -9 12 46 -25 -54 10 24 19 -65 -35 126
3900 126 -12 -94 -14 45 50 -141 -50 136 -42 -115 -6 82 31 -157 42 85 -69 -38 -7 90 7 -114 94 1 -5 7
3926 7 -42 47 -25 -39 34 -69 66 35 -89 82 -23 31 -19 -82 168 -65 -66 81 -26 43 -76 2 157 -149 -6
3951 -6 72 -52 70 -114 94 29 -143 133 -41 -20 44 -59 121 -89 -59 153 -131 64 -18 -20 106 -166 111
3974 111 67 -131 130 -72 52 32 -135 159 -101 -23 112 -158 119 -38 -15 120 -176 149 8 -147 146
3995A46k34J71j05r4L43l80R9J52j68J75k62J64J81m08K98q0%J37l74L93r0k26
4017a62L27l30K38j4k63L87k67J07Q5l47M75k67r0K46k71L49k81r9M54m14J42
4038En9j2L46n48K46K45l66K41k60K46J13n25M75j30j4R7l53M66j40k71L43l28
4060a83L32j19k94N40l32R4j1k63N87m27j03L23k34K94l92Q0M77n83J71%L9K94
4082B90o82M60J96m90L38k94L20M2n84N87j24p0R0l76N85k31l01M15l29L94k76
4103d0k74O84m87R5jj43N86o60L6M65l54K09l52K20M32p47K95R1pJ53o58O64M3
4126B50n20L72k52L73j11n29O72j99j15R8l11O21l63k57M66k91L35l97j03P18
4146D57n87O1M6m4M74p19J64M82m25J23k68L51K34p92M87N4n7O9n37P28j13n07
$$ plain form
3995 146 -88 83 -22 -116 227 -153 -54 98 -70 105 -157 7 188 -220 78 -2 -2 135 -239 154 64 -162
4017 -162 165 -165 73 59 -204 183 -84 23 108 -239 236 -31 -121 125 -146 203 -78 -177 277 -137 5
4038 5 -54 -66 280 -268 -22 223 -143 98 -162 84 197 -328 147 17 3 100 -253 213 73 -198 145 -183
4060 -183 149 30 -264 276 -56 38 27 -236 351 -76 -179 144 -90 204 -188 -108 369 -214 -43 -43 -4 290
4082 290 -392 68 264 -226 112 -182 138 180 -404 183 59 -11 79 -297 288 57 -244 171 -158 236 -40
4103 -40 -314 370 -117 -22 -23 -166 420 -240 -204 261 -93 116 -236 -16 416 -331 -36 55 48 201 -457 207 250
4126 250 -270 102 -150 223 112 -417 255 56 -59 39 -272 349 -14 -271 195 -96 239 -158 -261 457
4146 457 -130 -69 -23 -67 407 -312 -148 334 -91 32 -236 115 349 -443 44 98 41 110 -427 301 188 -319
4168c19M11j83K93j81m63P84l04j19R7j96N86n48j31M92k68K39m45R1O41o82R6
4189a09J38oK58p05M01M33o09J78j56M01Mo73O25k4j55j2k79O32k55m58N27j79
4211b3J98k44k77P80m40q9J02j07M96n83l8N24l09R8l42K39M76p79J96K17l4J09
4233A70o25N66K38o18K43n4L38j79n19O54p9k27M5j64N86l79l11N34k31J67k87
4254a32j14O61m80p5J49K1K76n75R9M92l41qj80L20K49p48L34K37j34n6l43N84
4276B36ln54L27L1J27j80l10N86j72k31J20m5L76l86j86M56j72O3k45M2M51m32
4298a01p4K17L4Q3m41J90M27m67K1J8K63Jn18M05J49k00q5j00M27j57l78L41K1
4321G6lj18j51M23j92j85J52mK35l54r2L91r9j07j40J48K87l80n2K77k6o7k71
$$ plain form
4168 -319 92 -91 202 21 -442 342 38 -81 16 -180 406 -142 -273 219 -49 190 -255 -164 477 -205 -109
4189 -109 29 23 281 -424 -23 410 -199 -21 -177 224 228 -445 180 156 1 -11 -290 342 87 -371 156 -23
4211 -23 175 -69 -346 434 -6 -95 7 -100 396 -187 -225 299 -10 88 -254 -15 461 -318 -122 95 61 170
4233 170 -455 111 349 -269 -26 -80 258 79 -440 214 135 -92 -47 -211 375 -4 -315 219 -12 155 -132
4254 -132 -246 415 -65 -140 9 30 306 -269 -170 322 -19 -27 -207 113 362 -386 -52 185 51 -5 -348 236
4276 236 233 -321 6 37 164 -16 -326 260 88 -143 -23 -68 308 -78 -264 192 20 83 -162 -120 331 -101
4298 -101 -175 42 76 159 -282 -92 335 -132 -111 -93 170 171 -347 58 207 7 -78 -178 249 92 -286 55 76
4321 76 73 -45 -196 227 35 -150 2 -2 233 -121 -213 178 79 -28 -168 -20 267 -113 -165 112 86 19 -252
4344b52K84K33m27M1J48J47j77k41L30Q3k62OQ5J81j85j94K66J6j12m7j1K63j62
4367A3j10P6Q0M1k03J6K33p3j42l0K01M9l19N6K56o3j92OK11K3k46M5J93m7j72
4392i8K1J40M7k34N1J44j1n2j05J33N4j29n1Q2Q5l9j66J22J37j37p6J9K08r9k29
4417a83K03O7p5j03K4K17j13j80J82J5n7n3jJ94j81k9J26r8R9j13J9J08j42J04
4441C0n9j6J61j79L2Q5p5R8k08J59J00k26J23n7Q1Lj97K38l4j55J50j12J34p1
4465Ej20K73k36O5O4j24J90j98R3Q7k32K45j11p1J64j79J88j19j02K87k65J35
4487C9j2j39K57k75J46R1k49K91j49l6J51k61K77j49j06L46l46J61k7q0K29l46
4509a87K45R5l12K59j87J37P3l59M09j40j65K40k48K79j47j54L70l35K17q1j41
$$ plain form
4344 -252 32 265 -162 -121 27 174 -3 -244 86 169 -93 -87 -2 179 -6 -200 66 82 -30 -77 -88 175 13
4367 13 -97 -21 59 100 -103 -87 146 73 -69 -99 102 151 -168 -112 144 81 -111 -105 106 129 -117 -72 121 74 -98
4392 -98 -77 63 110 -124 -73 71 60 8 -97 36 90 -39 -90 -8 77 38 -128 -6 131 -6 -82 -63 145 46 -183
4417 -183 20 87 12 -91 -67 150 37 -143 39 54 -3 -56 -57 137 -44 -73 53 -45 54 -59 -40 68 -74 30
4441 30 -29 -45 116 -63 -31 54 -21 77 -131 28 128 -98 25 -32 49 52 -145 93 59 -96 54 -58 76 5
4465 5 -115 158 -78 -13 51 -73 117 -81 12 99 -133 112 1 -70 94 -85 103 -16 -118 169 -96 39
4487 39 27 -112 145 -130 16 107 -142 149 0 -36 115 -146 131 -18 -124 222 -124 37 10 -70 159 -187
4509 -187 58 153 -159 100 -87 50 123 -236 173 33 -132 108 -140 139 -8 -162 208 -127 90 9 -132
4530a32L42l08P1J03k00L28l15JL21l62K68k15L3L38n55L12O5j70J94l57L46N0
4552A58m24M19j89Q8Pl47N67k91j20K59k93L93k93j44M46l52J94j48j02M97m75
4573a50O8J83j83L26m80J77L74n35K84j54J63J89o22M77M8k62J73k87M22r5m41
4594c25N19k33J06k0l49O44l91j09K83k80M14l70j05N04l74J50j66j1M99o68K06
4615g6K52k33K58n32M02K94o91L67n8R6J03n82N93n8l18K49k52M40k18m06O34
4636B64l47J25j6k91O60m67j29L25j90L17m65J2N83n08J01q2J16L78p91L83K62
4657B40l39J88m02M95J20p10M74J2mj9m28O35j62l29K94k12M71l78k71O44l64
4678d5Q3j35j09O29n64p4L83j78K12m78J82N02n86J23J7J55J31o90N24K07m17
$$ plain form
4530 -132 210 -98 -27 76 -124 204 -111 -110 211 -151 117 -98 -65 273 -282 30 95 -75 119 -238 108 158
4552 158 -266 153 -36 52 59 -288 279 -12 -132 127 -166 227 -66 -210 236 -116 78 -70 -172 325 -150
4573 -150 -82 101 -82 244 -236 -59 315 -220 64 -90 73 262 -360 117 165 -97 76 -211 211 116 -325
4594 -325 194 -39 67 47 -302 342 -49 -158 125 -155 259 -111 -216 288 -86 64 -102 -113 386 -282 -76
4615 -76 176 -57 201 -331 71 365 -326 41 -17 79 182 -400 193 135 -183 66 -186 254 36 -370 264
4636 264 -83 42 26 -265 395 -72 -201 124 -66 251 -214 -202 381 -127 -26 -108 8 386 -405 -22 240
4657 240 -99 89 -313 182 302 -408 66 78 74 55 -373 262 100 -229 65 -147 324 -54 -325 319 -45
4678 -45 38 -97 -206 423 -141 -215 168 -10 202 -276 -94 408 -178 -55 -38 117 248 -442 82 289 -128
4699a28J37k42M64k5o17N70q2n4Ql44O42k66k74K97j61L53m23j35O13l62k0q1
4721a30N0N10o81N1M40k55J15l86L42L56p06K17R8R5l0m67N53L2m12J91j23L84
4743B44j54m53N63j24r4l6j75N82l84k16L03j3J56m13KN68m25l9L1J32K61o53
4765c37K27M01l22lj92L58J25n87L33J14n9n0k72M74n1l86K38p3K49k30k58N14
4787B13j32j14q7K1M07l82j67L55n8J9l06J76M12m95j8J72J13L1m85L56K08l46
4809a07M5k9K86o2l98L05J05j41n3j40L95q7l03J90K2J30k58r0L94j22j80j2J48
4832C8J83l48q6L99r6j28j42K32K17m40N2K23jj15j91L05O2k73L8P7J28q9k54
4855b09K74P0j51m3k9K39j13k03J63R3Lk25M0K84j51k05J20J42Ok46L1K92j58
$$ plain form
4699 -128 9 -233 231 206 -411 159 77 23 31 -313 329 63 -211 86 -75 278 -145 -280 333 -29 -49 -130
4721 -130 -80 430 -251 -200 240 -15 100 -286 56 412 -294 -77 21 116 86 -381 172 204 -208 -17 -140 244
4743 244 90 -363 200 76 -18 -54 -229 353 -31 -247 56 43 199 -214 -212 356 -69 -108 -77 55 316 -337
4765 -337 -110 291 -31 -34 -226 132 257 -330 3 117 58 8 -264 210 159 -227 11 -62 187 -43 -301 213
4787 213 81 -33 -120 -99 308 -74 -241 114 56 75 -231 -55 357 -138 -156 16 129 160 -325 31 239 -107
4809 -107 -62 -91 195 133 -265 40 145 4 -49 -189 206 119 -184 6 28 158 -100 -190 204 82 -98 -110 38
4832 38 221 -127 -213 186 90 -38 -180 52 269 -171 -119 104 103 -12 -203 102 164 -109 -71 6 134 45 -209
4855 -209 65 135 -16 -59 -88 151 38 -165 -2 91 94 -131 -91 193 42 -163 -43 99 105 -141 -110 182 24
4878B4j39K9J80L3k62P8J69m2j43k1J92L5k12L3J09J5q6j46K05P1j83rK8J47j17
4903a2j17J65J16j81p2Q9J40j30j60J91P2j02p9O0J68j26j27J16N5o7n8L1J41
4926A13j10p3J02k2M2j16J2J10o7l9J0L5J17j72%R3l3Qj09J08J42k78R5Q5l1m1
4952a9j12J79J1j22N8K6Oj0j16J91q7l2Q1j24J75j36j6J26j16J02p5n9J68j25
4976b6MK3n4J73k05O4J31j79R5o8N0N8j86J82m1p1J30j65J53l0j26K24k00N5P1
5001F2j33J61j57Q1O8j76J63o1n7J45j91J64o3r4K01k07J25%j35K31k14J20L5
5024F8j61J91j30JJ18k21K32j40q3K76k46J25j4o1J90k96J40J24k04J94k07J58
5046E4M7k78K49n2n6J18k58K91j24j21K28j90J90r9j65K91j69M0Mj24K74k29k6
$$ plain form
4878 24 -115 -86 94 127 -135 -57 112 70 -73 -94 98 133 -79 -46 63 78 -8 -154 51 122 -61 -70 -42 105 -12
4903 -12 -129 36 152 -29 -101 -12 128 -2 -162 29 101 -1 -80 -20 148 22 -105 11 66 -1 -59 -28 113
4926 113 3 -70 32 10 52 -64 -52 58 -9 -48 -38 -3 114 -58 -58 35 2 10 -99 9 151 -127 -32 53 22 -19
4952 -19 -131 48 59 -63 -5 21 27 17 -99 92 5 -27 54 -70 105 -31 -47 79 -37 65 -10 -69 99 -26
4976 -26 -22 1 -53 120 -85 -21 110 -69 26 -42 8 66 -120 62 21 -50 80 -85 68 38 -88 136 -64 -9 62
5001 62 -71 90 -67 14 82 -94 69 8 -49 96 -95 69 6 -88 113 -94 31 31 -104 127 -87 33 68
5024 68 -93 98 -32 -31 87 -134 98 -42 -125 151 -95 30 16 -45 145 -151 -11 113 -91 103 -104 54
5046 54 101 -177 72 20 -36 82 -176 115 -9 -130 98 -92 98 -1 -166 125 -44 -4 0 -124 150 -79 -105
5069a05K26j99J68j98JL05l21J07J0j7J55l63K48J27k34J25j29J76J5l35L79j14
5091B7o3J13k58L72j61j74K52j74K03k02r7L40k26L4%q9L20l51J3K91k56J58k37
5114a65J56K29m22K11M0l3N3k91L08O1l02J94j02J96o3l17M13j61o9P5j69L89
5136B31k67j37K90j35J00j74j9L46l09k0J22n3K46m61J94K68l22J28j65K14J23
5157B00m34K60P9j21M1k32L90n8l03J96o6J97j62k45M65j93j11P3o4L19k93q0
5179a42L02j81M4j69Q7L30m06O7P8L1R6m25L37J83l34Q4n8J94Ll59L07L9j36K9
5203Aj69L76j67k35K74p1J33k32r1M45k77q9R5mK14l62J3L37k05Lj21J78K04m48
5227a98J86O3kj8k57L16R1l25J11L1J38q1l21L89j1j74Rk9K85k26k05L26o8J6
$$ plain form
5069 -105 121 -78 90 -108 -107 198 -123 -16 -6 -23 132 -231 17 144 -90 35 -94 82 97 -238 141 27
5091 27 -36 77 -181 191 30 -144 108 -66 137 -65 -162 178 -48 -14 -14 -103 217 -134 -121 170 -86 72 -165
5114 -165 -9 220 -202 9 49 16 69 -222 86 147 -155 39 -63 133 70 -247 166 5 -64 11 -158 231
5136 231 -36 -173 117 -18 82 -92 -111 235 -74 -94 28 -25 221 -240 -46 222 -100 28 -137 77 200
5157 200 -234 26 105 -16 25 -207 183 125 -178 18 -48 149 -13 -258 207 14 -97 -24 -88 231 -62 -142
5179 -142 160 -21 23 -146 -59 271 -135 -68 10 41 137 -288 49 232 -102 -18 -76 118 121 -238 69 108 -28 1
5203 1 -168 208 41 -194 80 9 142 -90 -181 264 -13 -102 -7 -11 203 -159 -146 191 -14 -11 -132 46 250 -198
5227 -198 -12 51 49 31 -226 90 181 -144 -33 -2 136 55 -266 123 112 -62 -53 -82 203 -23 -228 98 30 46
5251D6j59J9L44l35m7J30L0J29l42R1L11k47j6m7J81O0l63J90J43p7n1j77L32
5274A45j2l31K04K6J15j83j49L49j06j50L7O9J93k89p5K81o9o9j21J00K23k79
5296i1rJ55pJ8k69K03K09k76rL2J73m8k72J99J27j45n9m3K70j29j95J71L9K7j63
5321i2l1L00j84j02O9R7O5k05j5K32j14o5o4J48J23k73L3J34J2p0j35J96R6k58
5345a03K4J02O6n2k07K36M0j60j4O3J45j59j20J85K7n2r6N4J60j47j07J41M7k9
5369D4j18J1J79j01q7RJ11L8j85L9J37m3j12mJ32M5j78L3J27j4j08o7J93Mj50
5394f5jJ25J7j26m6J54k1p9j7O3N8p5j11J59Ml3p9M2J11q2n7M4Q3m9j30O1J24
5421G4o6r1O7O3k4j16Q0R5q5n8L3Q4l8q9L7J06p9n5KQ8J6j31M9N6Lm1l4Q3Mq1
$$ plain form
5251 46 -113 -94 250 -85 -132 -2 28 157 -185 -94 217 -30 -46 -93 88 148 -215 -25 118 41 -10 -187 145
5274 145 133 -198 6 32 147 -36 -185 164 58 -92 -55 14 207 -82 -157 124 55 -14 -135 -35 188 -91
5296 -91 -100 55 48 66 -203 0 209 -67 -76 -44 129 81 -191 8 135 -10 -69 -112 158 29 -166 5 44 71 -92
5321 -92 -123 177 -7 -109 -40 57 122 -83 -98 134 20 -45 -109 39 162 -111 -78 56 68 -2 -137 59 155 -103
5345 -103 -79 23 89 37 -170 66 106 -54 -68 -5 140 -19 -139 46 73 21 -75 -21 139 -8 -115 26 73 44
5369 44 -74 -63 116 15 -72 -63 48 86 -99 -60 77 34 -78 -82 50 95 -83 -50 77 63 -45 -112 81 85 -65
5394 -65 -66 59 76 -50 -96 58 37 -42 -59 4 62 -13 -124 35 39 6 -73 -31 80 -2 -59 -15 68 19 -111 -50 74
5421 74 8 -83 -16 47 23 -93 -13 82 -3 -61 -28 56 18 -71 -34 72 -7 -62 -60 28 44 -87 -38 18 21 -20 -54 29 33 -48
5451d8MK9O1n8o8J08j0l3nk0J23j23k3R0k2Qq8P2P8r2k2N7k4L2r3N6N4q4N5l9
5481b5O8l4o9R9m4k4M8o9O8J6q3L8k5N0Kp3J32q1l8M1k6O8o9JQ2o9K2Nl5R2j08
5512d0K7L7m9P2r8N7J8p7J06q0pN1o1O0l5rO7j11J06j1j03J46j33J02oo6Q0p5
5540c2K8N9j18J04n9J8L5r9J21m4o7P1p3J12o2p5J68j27L8Jm0R1q7j9J35j31R5
5567D3q5QJ13j33P9k1k8Q1j60J53j7r3O8o6Q8K2j60J41l4k4O5j09J62j00q4J53
5593F2n9M1q9l0J76j53K1K2k4J18j41J9J25j52R5r6Q1R0k22J24J6j9J4j33J77
5618F3J6j51J19q7J00m6j36J73l6n4N9j02K00j23p1J46q0M7r9J8J94j93l0J12
5642C9p1R8j55P3J39j88P1n3J04J5k03J46Rm1K1j08J72j2k03J58k6R3r9j14K57
$$ plain form
5451 -48 -44 -15 46 -12 -80 28 18 -15 -20 -40 83 -40 -63 27 5 13 -75 -3 75 -17 -39 18 -6 26 -67 -11 43 -41 14 -25
5481 -25 43 9 -60 39 -5 -29 19 -50 18 34 -49 -11 -36 14 16 -57 75 -6 -44 -3 -29 39 -30 -29 53 -16 6 11 -24 68 -40
5512 -40 -13 24 -25 47 -51 6 24 -53 53 -27 -34 17 -44 16 -19 -28 39 -72 34 23 -80 66 -67 35 29 -37 43 -32
5540 -32 -4 55 -63 41 -18 0 35 -64 57 13 -54 17 -56 56 -6 -81 87 -40 -2 -1 -41 50 -37 -56 79 -52 43
5567 43 -42 -34 79 -54 25 4 -24 57 -103 50 33 -60 8 -58 30 52 -108 33 -1 -25 40 -69 93 -7 -91 62
5593 62 3 44 -45 -75 101 -52 -31 -9 -33 85 -56 -37 88 -64 31 -65 16 106 -116 8 24 5 19 -114 63
5618 63 79 -72 47 -40 60 14 -122 51 15 -39 20 -82 118 -5 -76 70 -10 37 -62 -44 150 -43 -73 39
5642 39 -32 66 -89 -16 123 -65 6 -47 57 72 -131 15 24 -17 4 -104 68 56 -147 11 -15 78 -21 -135 122
5667A22j62k8L4L2R8j85K0J26p0J8o9M3J53k53Q3Q1l2N4k00J71N9j48O6m7J00
5692F6l5k01K22op4Ln4K17j41j21J72k0K6j18k4K29j67n1J02m4J03j93N5J69j42
5717b7J9n5J18P5k35J14L9o3N7j57J69K2j97Q5N1M1p5j28K39o1q6M3l0K03j84
5742b3j09K44q0k9o7K0J86k03j8J36l2N6k04J06J55k13L0kJ39qk11J57M6p8j4
5767a6o5J90m6k08J75j2M6j06m9K00q6j01N3K8J02j85OJ90j31j6m4J07R7k20N3
5792c8R4l6Nj28J27P7j66K1L5Q9p0j41J74K6q3Lj9J39j29r7J73k4j9p7L5J62j56
5819b3n0Q9K3K9j58N2J20j02mQK6Q7j80P1P6p3Kq8J47K9j55M8P6Lr0n5J73k5j39
5848h3P6L5O2j37m0J60m7n1j5P0O7r8m1P8Rn4n4N7O9r7oK3Q0lj56O8Q3o3j4j7
$$ plain form
5667 122 -40 -68 -34 -2 96 -89 -69 57 -13 5 -64 -21 132 -121 -38 43 11 65 -135 36 95 -53 13 -34 66
5692 66 31 -170 52 46 -28 -25 -79 138 -3 -124 48 28 54 -64 -88 141 -26 -77 25 -19 84 -109 -54 115 -27
5717 -27 -8 -63 55 130 -105 9 48 -15 42 -115 54 76 -121 -36 15 56 -19 -147 92 31 -55 -12 -42 161 -23
5742 -23 -132 112 32 3 -64 -44 142 -61 -79 57 25 81 -123 -17 138 -75 -45 -47 92 84 -127 30 76 -2 -16
5767 -16 -81 109 63 -145 30 18 64 -42 -91 109 23 -78 -25 3 105 -80 -74 116 -15 -31 -75 32 129 -91 -38
5792 -38 56 20 25 -103 24 101 -65 -44 -9 80 10 -131 43 69 -14 -11 -30 109 -20 -117 56 32 13 -64 -29 133 -23
5819 -23 -73 16 39 68 -90 -38 82 -20 -24 -16 10 97 -83 -12 64 -9 -7 -95 52 81 -74 -26 50 53 -37 -92 81 56 -83
5848 -83 -7 28 90 -47 -87 73 26 -25 -40 30 97 -1 -42 36 45 -9 -63 -6 63 -34 -40 -17 63 60 -96 -28 55 -8 -22 -39
5878c9J21m8j19Q5O3n4m3j1J01n6q3N7O5k0q6L3R7n2n2J3L5O1r9l9Q0K3m3m6Q0
5907B4M2j02k2O1O2q9n7J00M8r2k6N3M9n0o4Q6M4q9m2O5O4p1m2K8O9n1l1J5O1
5936D3k7p6M5L7J5o3rO6L0r0NL2L7p3j9J08m7l7nM6J9q1K3O2j4m9PJ7L0q3J9N9
5968B7l2k0J2L9ln1K2m2N8Ro2N5j4L0ko7R5l4r6Q7lJ5m0j0J24j45LN1J5Op9K9
6000b3P7j02M4kjL8o3N2j6n8P2l7K1K9m8L7k8K1j3k9M0J2l4M7r2R3m1k7P0o2k8
6031e1O7m1N3p2N1K9p6P0m0k1O7p8O3k5m4R7o3O0m4m3Q6j04N5L6n0L4m0NM3p1
6061d7Q1l2l2R6j24P7l7j4O8q4P3Kn6O1r3P8J1j03J21l5l0J7l9J14j14nR2q4P1
6090C3n7j8J29j08oP5p6O1r2N9N2j15J03p5M9M5j13O9k5jM1r5J23k6j23J09o2
$$ plain form
5878 -39 82 34 -85 0 63 9 -34 -45 56 0 -83 -26 39 19 -67 -34 63 11 -41 -28 7 68 -31 -70 10 33 -10 -56 24
5907 24 66 -36 -58 3 65 -24 -81 19 67 -25 -51 2 51 1 -63 23 67 -22 -64 1 65 -6 -48 -20 49 -2 -33 -18 43
5936 43 16 -60 -15 22 37 -26 -35 31 61 -29 -24 8 45 -28 -47 61 14 -23 -28 18 37 -44 -21 41 27 -22 -15 2 32 -51 -32 27
5968 27 -5 -25 -13 26 23 -28 -6 -48 10 19 -43 12 -2 28 26 -41 54 20 -76 11 8 23 -17 -27 97 -48 -45 6 21 27 -52 -23
6000 -23 54 -48 -4 -6 -7 31 -32 20 4 -54 18 -19 2 31 -17 20 -8 13 0 -29 11 23 -11 36 -56 37 -4 -31 39 -23 -51
6031 -51 16 -25 28 -44 7 36 -40 30 -10 -31 36 -42 21 -4 -48 49 -14 46 2 -41 45 -59 -4 32 -18 16 -24 -19 24 -47
6061 -47 34 2 -30 66 -58 19 -18 -32 36 -48 25 27 -29 32 -61 17 28 -75 46 11 -19 -2 -41 73 -41 -46 46 -38 33
6090 33 -24 -42 87 -21 -27 48 -28 33 -59 0 52 -63 40 -35 14 59 -54 15 -10 -11 30 -65 58 32 -91 18 -44
6117d4P5j2j00J75r6k1N2r8J42j19K9Q3j14N1j9nR0j44O3K7l8Q7j32P6M0j08Q1
6144B1k9K4M1j27R9k5o6P1p3J24l8j28J67p3K2n6l2J84j39J9K7m8Q4r4qJ53j48
6171d8Q0n9j0J01j54R9K1n5O5j24J08K7j16R2l9M6l1q4J61l8j01O2o4J84j57l6
6197g0J42j12N0m5RJ37j94L7Q1m5N2j31Q8P0j20Q8o0RP4j87J61j8l8M0q3J09J4
6224E8j55J10K9k1j4j03J87j05n2P5k4J05j52l0J94j16jl4J9J18j46K6P3l0J2
6249B3q4R9J8j17P6l9P0pj32J23L2j14L4j9J00m7j23J51l3J0k9l5J18j10j4R1
6275D2m2N6j21L4J30j24RrJ2P0j64R5P1q6Rp3J35K8j38P5k9N7j9j18J75k3j22
6302g0O3k2O4n3p4J64p9Pk6KJ17j40QR3m6J2q2N1Q9j48N2L8nK4j19O7O0o4rk6
$$ plain form
6117 -44 31 19 -81 94 -2 -23 29 -69 73 -46 -17 66 -48 3 -16 -21 69 -75 -12 15 -23 64 -68 8 48 -60 21
6144 21 -8 16 57 -70 29 4 -62 9 -64 60 22 -106 61 -12 10 -46 -78 106 -33 -14 13 -35 49 -45 -53 100 -48
6171 -48 32 -27 -37 64 -90 9 30 -25 40 -84 24 51 -65 27 -12 34 3 -81 80 42 -59 3 -61 123 -34 -70
6197 -70 72 -40 10 -35 -26 111 -83 -46 35 -10 42 -89 -1 69 -51 37 -23 -14 60 -127 34 16 -22 18 -65 44 58
6224 58 -97 13 42 21 7 -96 91 -14 -66 9 -15 90 -62 -92 102 -14 -15 -49 -30 88 -58 -32 41 11 23
6249 23 -61 38 56 -61 15 -24 46 39 -93 30 62 -52 -18 -37 63 16 -107 44 11 21 -8 -43 75 -35 -49 42
6275 42 0 56 -65 -31 99 -25 -16 -25 -13 57 -107 -12 59 -27 -18 -91 44 72 -66 9 -20 37 18 -100 75 52 -70
6302 -70 -7 -29 35 -18 -92 72 -7 0 -26 -24 93 -47 -39 54 8 20 -62 -11 78 -70 -18 20 15 39 -80 -13 47 -17 -26 -52
6332e2R2lr7N9L6rn3l1J53p8p1O0j8P4j12%J39p7l0K0oM8q4lQ0n3J7m5M2O2j02
6363d2KN3%K4j19J12K8j09K1K2K8k3o1R7K9r5J6RQ9j19j4O4j0K4p5K5P8o1rJ3
6393cJ1L2p5J7R3q1J0k3M2K5q4J1L3K9p8k5P0L7p3J4L3J9j0o0L7J5m5K4J7J5o2
6424c5K9K6K2n6OJ2K8m3oK6K5l6k7K2N0n3m6M6K5k4j6J8O4p5l6O0k0L2p2O3J7
6455B6l9J6j9L3L3p8J7K3Ok2l4M0Qm0L6k0L0Jo0O0j4pk3K2L1j8l6O5l3j7olQ4
6488F2j00J4L5qLl2K7L7l0k0RRJ8n8K0K0j4M9n3L4mk3L3n4K1nm4Q8k8m0L5k2M9
6521B8n3k6R5o7K1mLL3o4L9Mk4LK1%K1n5N9k7k5L8j7Qj3k8N8p9N9Rn8M1j7J0L6
6555B9q8P9k2j7M1o1O2k4m1R0p2L4pk2O7p8L7J8p5Q1k3n7P7q9R8n4j3N3p4M4L5
$$ plain form
6332 -52 40 37 -60 -1 35 26 -27 -58 95 17 -54 6 -12 62 -50 -50 89 12 -18 2 -4 44 -40 -43 37 -16 1 -44 -2 60 -42
6363 -42 -40 13 13 37 -82 30 58 -51 -30 -8 20 -3 -64 33 62 -33 -17 -8 81 -38 -52 12 2 26 -49 -24 54 -7 -16 -3
6393 -3 8 40 -35 -18 75 -6 4 -19 23 48 -36 -25 8 37 -41 -66 4 41 -32 -18 15 34 24 -36 1 16 -29 -5 12 27 -35
6424 -35 -6 20 42 -14 -8 4 32 -11 -17 9 34 -2 -29 -7 43 -10 -56 -10 15 -9 -25 -7 57 -18 -54 6 -14 18 -54 9 26
6455 26 -13 3 -16 17 50 -28 -11 12 18 -4 -38 2 10 -30 6 -14 16 17 -43 17 3 -4 -27 -5 26 8 -28 37 4 -13 -19 -22 62
6488 62 -38 -24 11 3 6 -26 1 38 8 -12 -3 6 24 -34 -14 6 -8 41 -12 22 18 -5 28 -26 -5 -10 -54 34 6 -34 1 -21 28
6521 28 -25 -51 44 -23 -2 -6 -3 30 -34 5 9 -15 -12 9 9 30 -25 34 7 -18 20 3 11 -2 -30 28 -51 8 17 -41 0 -17 -7 29
6555 29 -59 20 -2 -19 22 -39 23 -1 -42 48 -24 10 3 -19 48 -30 7 25 -50 31 8 -49 28 -61 37 -17 -30 23 -51 -7 28
6586B8n9P4p5M4nm6P9m6NJ5q3J04o3PN5p7N4rrK1p9Q8k3o1J04n8J4J5q9J25r8
6617d8L6Q0r4O7q1L2N3q1M5j1k8P9r7L0M8o1Q4j20P5L4q1P0k6J2J7j09J23j6n0
6646a8M5n5N1k9o5J23o2QPl4J23j30QP1n2M8n0J3O5j02K6K0l0Q0j15L9K8n7P1
6675B7p3O1M8r9O1m4K2J9q1R1jp0N7m7O4k0r0J37p5O%oP8j21O0M1o5L0k3MO1j29
6707g7Q9Ll5O0j21R9K2o8M3m2Q0j5j10J05n4MK4n5J25q1q2J19m1O2o8j8J05p5
6735bpL0j7L7q6N0M3p6N9p5L7M9j12Q5Kj4J6o4P8k7m8N0j8L4j5q4J36o0j3J0l9
6766d1J29j16j4J04m9Mo1L0R5j14J4M1l0N2r8K7R4r8L4l8M9K0q5P8K2n9Ol0R1
6795E7n6m9N9j6K6k6o3J30m7l7K9j6O9j18L5R4o7K1m3L5N0j17L6K9j6K9p0O6L0
$$ plain form
6586 28 -31 43 -32 12 7 -39 40 -6 -1 14 -69 35 -28 -21 34 -43 11 2 -7 14 -65 23 0 -61 43 -15 -1 14 -75 50 -48
6617 -48 -12 68 -26 41 -40 -8 45 -36 9 -2 -30 49 -48 -18 30 -31 53 -67 8 42 -39 31 5 17 34 -75 48 32 -18
6646 -18 27 -28 23 -6 -71 52 -10 -2 5 -29 94 -36 -28 43 -9 39 -11 2 67 -35 -9 11 -19 61 -54 -15 13 -44 27
6675 27 -46 15 63 -36 25 -19 3 22 -59 32 31 -39 18 -29 35 15 -75 62 -13 -7 -7 -13 65 -56 4 45 -20 10 -13 -9 52 -77
6707 -77 12 15 -20 40 -81 18 40 -28 15 -27 53 38 -72 33 -21 -17 7 -48 77 -4 -86 33 -8 54 -14 -32 73 -2
6735 -2 -9 21 4 41 -45 5 48 -28 31 -44 -7 42 -70 15 17 3 19 -45 33 6 -42 8 -10 24 9 -75 61 1 -12 -2 -41
6766 -41 88 -28 -42 62 13 17 -44 -14 81 -33 -19 22 -8 44 -54 -27 67 -31 3 -35 14 34 -51 27 49 -10 -4 -34 57
6795 57 1 -48 11 -5 21 -5 -68 62 15 -22 7 -9 60 -58 -23 71 4 25 -18 17 67 -50 -14 15 -1 28 -42 24 54
6824E4p4K2lK8op0O2Kl9L6n3J02n6n0Q2l5J0k4qQ8p1j1jM4ln6lQ1q4J5K7l3R2
6857F5j22P6j5j5npN2j19j2M1O4K5k0m2M5jkk8nQ3r6J0M7pj5m0N4M6q1j4N7Lk9
6890gqJ6K5n7NM2rL5n4J30j27M1l0j07J08qN6k8lrj7l0P7m8%L5m0M8q9N0M1n6
6922a8PJ00j1p1l3j8R0n0j2PJ9%l9KK8oj5L1roj7PK0jK4p6K4N6k9l2MM4j6l6L8
6957FRJ8m8j8M4l7k6N7k2J4n8O7J5j1MpK1l8QOJ0l5J4Nj7M9k8rK1nQl1L3Rm8j4
6993c4qO8m8j5K9K3o3L1JK8j0l5K5rKj2J3N3o1PM1l3NJ0JLm0L7j4pN2l5j2j2J1
7028hlj0J3L0k4qK1lmn1R2m1m4L3J2orj8N9l7j9L6l2K6J5k3K8m4L7ml8L9l3J3
7062ej9OM1m5jN9l9J5l5L6L8r2O7%m3J9pK7l6j1N0k4l3M0nK7o1L1M5r1M5J8o3
$$ plain form
6824 54 -20 2 -1 27 21 -49 13 15 -24 12 -41 61 5 -45 37 2 12 -12 -20 68 -3 -14 -15 29 26 -30 -33 48 -36 -21 6 -27 65
6857 65 -57 19 4 -11 -16 -23 29 -90 -102 -61 3 28 8 -34 11 10 8 -20 -25 58 -38 -28 19 12 -3 -43 11 57 -24 -38 19 22 -7
6890 -7 -15 1 26 -31 -26 16 7 42 -12 118 -9 32 2 -105 3 -5 51 23 20 11 -6 -36 41 -7 -7 28 -12 36 -53 -3 38 -18
6922 -18 -11 89 78 7 -26 -44 46 -4 -16 -9 10 10 -29 -27 1 -5 -20 11 2 -4 -21 -14 6 5 29 -47 -23 33 4 -28 -24 20 4 -32 6
6957 6 15 33 -15 -33 11 -26 -52 5 -17 -3 -61 6 21 10 14 7 28 -10 -2 4 14 -21 -7 -2 -19 30 2 -7 14 9 17 -14 19 28 -20 -34
6993 -34 -42 26 -22 -37 -8 15 -48 -17 -16 12 2 -33 -8 -17 -15 -27 -14 39 -22 -15 26 -7 -2 8 9 12 -28 9 -5 -12 40 5 -7 -19 -8
7028 -8 -11 -21 -8 22 -2 -10 11 8 4 -47 45 4 -40 -7 5 -1 -10 -28 31 -6 -25 11 -21 5 20 -3 25 -19 18 14 -24 15 -18 -5
7062 -5 -24 -18 23 -22 -23 36 -3 12 -23 13 51 -41 26 26 -17 2 -5 22 -14 -25 25 1 -32 8 3 30 -31 0 45 -46 -1 17 -46
7095d6M7k1N2j1o5M1Pj4jJ4K0p4L2K3k7L4krL1q1P7k3l0N2l3K2koM1o8oQ5r0L1
7129@kL1oo9M8J5k0jK9mml7N9m1k7M8n5M6l1M1J6p4Q0l7k0M8k8J4l9m6J14n4k5
7162c1N1rJ8q1M7O0j05O1POl5%O0m2m4N9%rll1N6o0N1k6l6O2n7N6k8QN2o5l3P0
7196B9j1l0j3L3K9o9K0N0m6J7p5R9m8m5R6k3Jj1k2N0m0PL1n0K2J5m3N5m9M2k0
7227Am1P7n3L4j3PM4q8j6J00o2mMM4Lj15P2L8m9K7j4K0l1k6Q5k8m6N8k8K6k9j5
7259a8L2n9N9Rq0L4J1M0m7j3P6j6o9O4kNn6L0M6q6K3J5K3ln0M4L2p2O3k8mk4J1
7292a0M1n3qN8n4N3j8j0Oj5M4l8k6M2Kj0l4J7M4o5nP4m6K5n1M7%l7N2J2k4j8J2
7325GN3m5m6Q6n1j5MjRj9L8jm8N5j5j0KJ9Jm0K4K5k4j3j0L1J0o0L3K1l8lK1L8
$$ plain form
7095 -46 1 -20 32 21 -44 -3 4 -10 -11 3 23 -51 -19 4 -23 11 9 0 31 -50 27 4 -26 26 -7 15 13 7 48 -20 -26 59 -31 0
7129 0 -2 29 23 -46 2 17 -3 -4 25 21 17 -20 39 -2 -29 19 -36 10 -21 20 36 -38 42 5 -15 33 5 19 -20 -66 48 -6 -31
7162 -31 20 11 29 -52 -5 55 -50 11 18 24 -11 -11 49 7 -37 22 22 13 10 -21 35 -25 26 0 -36 26 -31 25 -3 5 57 -8 -41 29
7196 29 18 -12 -25 8 37 -32 -12 38 -8 9 -66 33 -15 -60 36 13 14 3 -19 31 -9 -2 29 -21 1 16 -27 28 -21 21 1
7227 1 -40 37 -16 18 5 12 56 -32 -48 52 -10 -14 -10 34 37 -78 -6 32 -17 10 -4 16 -15 -41 44 16 -30 28 0 26 -3 -18
7259 -18 14 -45 14 23 -57 -23 -12 28 -19 -32 44 28 -41 23 21 26 -30 0 46 -40 -17 -2 21 18 -32 12 44 -28 35 7 3 -21 -10
7292 -10 31 -22 -30 28 -26 27 9 -1 5 -10 34 -4 -30 12 14 4 -30 -13 31 -34 -39 35 -11 14 -37 10 10 -27 25 37 13 -5 7
7325 7 60 15 -31 55 4 -11 -7 -8 1 -18 20 19 -29 26 11 1 3 22 23 -17 7 32 8 -5 -15 16 26 -34 -1 20 -18 -21 0 38
7359C8m8k2N1l5%JJ1PLk2M6o0O4j3m8K0K7j7qk6L7ol3M4J3l1NK0K8j02L7J8K6
7392B5j6o2N4J2m2J7RmLkQKl3N5m1L8k7nK6l2M4j5k9K5J6l3k0J7M1m3j6O7n4j4
7426b9j8L7L1o2M4j2K1n0M4j0krJ2Ok1Oj0M8m6QK4l4K2jJ6l6N0l1o%J1M4p7K2
7460hK3j9jL1J8m1j2L4j9Jrj4L3k5j9K6J0k0OK2rk1K7PpJ7k4k5MJ5Pj8J0ok3K2
7496gl0O9m8k0M6nj4j7J1qK2J9kj0j8j5K0qk4M4pj3K0j0K3k6L0k5lj1L6l6J9p
7530eNoKL4lk1j8K6mm0%M3j2k7L2MJ7l0j6L4l8%M7k2J1k4JJ9k6J3Nj1K9k6J5k7
7566a9mM0k1J1Ll9M9m6OL6m3N1k1mJ6j8K2l2k6N3k6KJ2nL1l3K2Jm1K0NqJ2nK8
7601B9l2l6K9J0jk6K2L2m7J6M6m8NpJ1pK0OJ4o4J6nK5Oj8K9l9L1l0J9j2PK2j4
$$ plain form
7359 38 -10 -32 19 -16 -16 -15 -4 3 6 -16 30 -30 34 21 -27 -7 20 3 -5 -31 6 0 -33 11 24 -7 -2 18 46 -56 -19 -1 25
7392 25 9 -53 1 13 -29 -12 -3 -7 -4 -6 2 4 -29 26 -15 23 -4 -9 17 -15 29 14 -15 10 26 -7 -27 -10 31 -12 -28 39 -15 -29
7426 -29 -47 -10 21 -41 3 -9 12 -38 6 -4 -6 -15 -3 3 -18 -12 -22 26 -20 -12 12 -22 0 -1 15 -21 29 -2 -8 -8 3 47 -30 -8
7460 -8 15 -4 -5 26 44 3 -9 25 6 7 -2 -16 17 -8 -27 -1 9 -11 -5 17 8 -13 14 21 14 31 7 -18 -14 1 8 -10 0 -6 -29 -7
7496 -7 -37 32 -16 -36 10 5 -9 -26 -15 -23 -1 18 16 6 -12 -27 -7 -15 -39 5 -2 -15 5 -5 18 -8 22 -3 -6 -17 19 -17 2 -5
7530 -5 0 -6 -4 30 27 6 -12 14 10 -30 -30 13 1 -26 6 10 27 -3 -19 15 -23 -23 24 2 13 -11 -10 9 -17 -4 1 -10 19 -7 8 -19
7566 -19 -23 17 -4 7 10 -29 20 -26 -20 16 -27 24 3 -1 15 -3 19 -13 -39 14 -12 -10 2 -3 28 -5 17 18 -23 -3 2 -6 6 1 29
7601 29 -3 -39 -10 0 -1 -27 -5 27 -20 -4 42 -6 -1 -8 3 -4 16 22 36 -28 -12 -17 8 14 -4 25 -14 17 -13 6 -6 1 23 9
7635Ik0L0j1nJ2l6M0m2K6J3j5j0lJ8lj6M%MJ8pKJ8m5L8k6mN3q0O2m3K1K5m7J4
7670fJ5j0MMJkk7L6k7K8oqKJK4j7n1M7j7Qlj7M5k1m6O1j7j7Qk8N4l7K1Mj4j5K8
7707ENpmN2m5l0L4j0Lk5MM1l7NK4j8L5l0lK3m9K7j3lL0k3J3NrJ6l5J8LK5j4k6
7743a3NKj3M1k6KK5m8M7lm2N3l0nnojJ5J6k4KJ0J9k0Kn3N8k5lJ6LJ0l2OL2j9j2
7780a6N1m1j4K8j4kk8N9k3n2M1LPj4MK5mlk2L1prOkpJ8l2J4Rj2J9m8NO6p3M1j5
7817a1KJ5l3L0L2m8PJ6j9KnL5k7LQk5JpL7J7m2nNRj6KJ4Rl4M4j4j1J7nJj0JK8
7855B3m1PJ9j0j9PK0Mk7L0kl3lJ3M1p7N5%K0n1L4jok7L1Jm6N3Mm0K0MJ9k2k2K0
7891b%pkK8l6L7k8J7l1RK4Rl7NL9l3qM3k7Ql2N7k1l2NL6j6j1R%j4LNlj9J7Lk0
$$ plain form
7635 9 -11 19 8 3 15 -21 19 -23 3 16 1 -9 -12 6 3 -13 -9 -9 -5 13 6 8 26 -19 19 -7 -11 42 -38 24 -19 2 27 -20 -6
7670 -6 9 -1 3 7 8 6 -21 15 -12 16 10 2 4 5 29 12 -39 8 -9 -1 -4 -21 24 3 -43 18 1 -16 -8 -36 18 -19 2 6 -8 -23 5
7707 5 10 3 -1 51 6 -24 10 0 3 -22 -18 23 -14 -9 15 -3 32 2 -1 22 -27 0 -13 -16 14 -9 4 9 0 16 -19 -1 2 27 13 -13
7743 -13 -8 -6 -19 22 -4 -2 23 -25 22 19 -23 30 0 -5 -10 -16 -17 -2 14 -10 -8 2 21 1 3 -50 8 -17 -20 -4 -1 9 -23 -17 15 -4 -16
7780 -16 35 -6 -20 8 -6 -8 -36 23 0 -52 -11 -8 -1 -15 -11 14 10 7 -15 16 9 0 6 4 -3 15 -17 -3 6 -6 13 -35 -30 36 -37 4 -11
7817 -11 -9 6 -27 3 35 -13 -6 10 -9 -7 -12 23 -4 -1 7 -18 -17 -24 13 30 -12 -17 -12 -3 -19 -17 -3 6 -28 16 2 -9 8 3 4 -6 -5 23
7855 23 -18 -11 8 -2 -21 -14 6 10 -17 13 11 -22 -25 -12 29 -48 7 7 27 -24 10 9 3 -24 7 8 -38 15 19 -21 -1 3 22 0 -22 -2
7891 -2 -2 -9 -11 17 -19 18 -10 7 -24 -15 9 18 -19 -14 25 -8 -16 27 0 8 -24 33 12 -20 -15 21 5 -6 3 3 -11 -8 -3 -6 -25 -8 -5 -25
7929b5J2L0j0l8J0L8nj8M2nl5m4P3ll2j8J0N5m6K1Mj7j2JJ6LMrJ5l6RL0mm0K9
7964ERk3jnK4k3J1nOk8M5Mk8J8LNm9L3Nlj2jL0k0qLK2k9k1O8m0J1j3L0m1J3k0
8001b5J2%K8L%k8J6jk6J0mL8n3L0O2p5J8K5nl0pK5On1J9K1lk2K1%Jlj3J4kmKQ
8039Gk7J5lJ2l1K9j0K4m4K8J0l9L8j4j2oOJ4oNmK1k1JK6j2k0K0J6l9J2Qk0QK2
8074A4j0nJ6j7L3l7J4j3Rk0J5LpoPL0j2oKj0j5J9K4l8oK0jMj7L2k7j5J7K7k4j5
8110a5MK8k8kL8j0n1K9L2k4j7L1J2m2OL9j5n4N1K3l6k7M7j1k3j6N6j9j5K2rJ6
8142B0k8RJ9k1lPj1J2k8M7l4qN3k3l2RK7lk2PJ6k1OLL4m2OJ8l0lNJ0J0nj2K6k5
8179gj1L4k0J7N%j4j8J7m%k1
$$ plain form
7929 -25 -13 17 7 -31 -21 17 12 -6 36 31 -4 -48 25 22 -10 -28 -18 37 -9 12 16 -1 -13 -12 4 7 11 2 17 -19 -10 20 16 -24 5
7964 5 14 -9 -10 -15 9 -14 -3 -8 -2 -30 15 19 -9 9 12 17 -32 1 6 3 -9 -10 20 0 -8 -5 17 -12 -33 35 -5 6 -7 23 -18 -5 -25
8001 -25 -13 -13 15 18 18 -10 6 5 -21 -11 -15 23 -30 0 62 -13 5 30 25 -5 -12 13 19 -32 -13 8 5 -17 4 4 5 2 -11 3 1 -3 -1 7
8039 7 -20 -5 -8 4 -27 2 -8 16 -28 0 10 -29 9 -5 -17 -23 -17 -3 -9 -4 -8 13 -8 -7 19 7 -13 7 23 -16 -4 4 -16 -8 14
8074 14 4 -1 15 -2 31 -6 8 -5 4 -16 -1 2 -5 -11 -4 26 14 8 10 0 -15 4 28 -10 -16 4 3 7 -10 22 -5 -20 -3 24 0 -15
8110 -15 -11 17 -11 -13 25 15 -36 -7 25 1 -16 15 27 -15 -9 30 15 -39 12 35 -1 -28 19 8 -15 -31 25 6 -9 13 4 20
8142 20 -8 1 20 -1 -4 3 -8 4 -24 23 -11 -19 34 11 -21 -12 15 12 -10 -3 13 -8 -2 1 35 -7 -1 17 -13 -16 -11 -1 9 4 -8 18 -7
8179 -7 -18 16 -4 13 18 18 4 -14 3 -1 -1 -22
8191b2
$$ Imaginary data points
##PAGE= N=2
##DATA TABLE= (X++(I..I)), XYDATA
0@%%%%%%%%%%%Qj6J6j6J6k4L2m0M8n6O4p2Q8j04J20j38J62j87K12k42K75l13L55
34A88m00M50n05N66o32P04p82Q67r61J064j176J297j429J575j734J909k104K317
52A214k552K815l110L445l825M260m767N367o089O973q083R526j1480J4270j8577
67a0613K6082m2542J31555l8653k16558K49637j63741J34111o0729j39819K70012
78A38742j71999K191O4801j03370J92380k06439N6705J25852k07695K07505j41073
89d2400k7402K12623k48627J36719j7809p6205J87124k25528Q9997R2371j37128
100e6265J02668j30276J32514L1447k25329K21173p5449j2334N8173j72854K45728
111A19196j08502j22517K03368j35582P9083l6488p7746J88205j61748M3717M1464
$$ plain form
0 0 0 0 0 0 0 0 0 0 0 0 0 8 -8 8 -8 8 -16 16 -24 24 -32 32 -40 48 -56 64 -74 88 -99 113 -129 146 -167 188
34 188 -212 238 -267 299 -333 371 -411 456 -505 559 -617 680 -749 826 -908 1001 -1103 1214
52 1214 -1338 1477 -1633 1812 -2013 2247 -2520 2847 -3242 3731 -4352 5174 -6306 7964 -10613
67 -10613 15469 -27073 104482 65829 -150729 98908 -64833 69278 8549 -131270 138742
78 138742 -33257 -31066 33735 -69635 122745 -83694 -26989 98863 -108832 98673 -42400
89 -42400 -69802 142821 -105806 30913 13104 -63101 124023 -101505 -11508 80863 -56265
100 -56265 46403 -83873 48641 80088 -145241 75932 483 -11851 46322 -126532 119196
111 119196 10694 -111823 91545 -44037 35046 -1442 -79188 109017 -52731 -9014 32450
122C2450r5735J57772j58017M5569Q7022j47163J56663j25817N419J52309j93406
133h2934R8319o164l4829J04961j77398J18057M6099j30704R7880q1264R5298
144D7321j2322j45871J91928q3867k1800N4499r6766J49569r9332m7213J38959
155G5105j17990O8471k7404m7047J26768j26931N5056J3803o8815J24655j25958
166e0287L5739O4802r5783R2932r1243L2462R0007j51535Q5898J705k6601N3049
178D1145j18135J18149k725j03089R9181n8153N3205k1948p5492J36977q3771
189a4656q334N0061o5938Q8418o9930j1133Q3296r2050O5485k8831l0700Q9093
201E4781r0682M2937j62l4324Q1337r6948L4235M9169o9232M9263m9404L6484
$$ plain form
122 32450 -63285 94487 -63530 -17961 69061 -78102 78561 -47256 -41837 110472 -82934
133 -82934 15385 9221 -25608 79353 -98045 20012 66111 -64593 33287 -47977 47321
144 47321 34999 -110872 81056 -2811 -24611 29888 -66878 82691 -16641 -63854 75105
155 75105 -42885 25586 -1818 -48865 77903 -49028 6028 19831 -48984 75671 -50287
166 -50287 -14548 50254 -45529 47403 -43840 -11378 78629 -72906 12992 14697 -11904 41145
178 41145 -76990 41159 38434 -64655 34526 -23627 29578 7630 -67862 69115 -14656
189 -14656 -22990 27071 -38867 49551 -20379 -31512 51784 -40266 25219 -3612 -34312 54781
201 54781 -35901 7036 6874 -27450 53887 -43061 -8826 40343 -28889 20374 -29030 7454
213G454L8342j07109Q0217k462k9371L0053o1357Q5036l0315n7214Q0652m6467
225a2541K3928j1027l2899P7887o4151P266L4349n0180N7290m2965k147M4805
237B9615n6688M9540l0765j2031N8271o1167K4649K049j2324L8153o2399L3735
249F38K9279n3542L0749j8024K1654O435n7049O1857j3123k3312K2008k3670L8978
262B2878k6952j8073M5948l3121R953K547j6677L3301l2011J0024J3692k8912
274a7403L4395k2955k725K0925k1784K0189j9447J977K7126l2999Q769R894o727
287g65Q174k3699K1874Q903l0880J9399j390K296l772j2735K5965j2736r751J4126
301E009n032K216m744l60J0849j3011L510P558j0728O399j682J212q93m571R516
$$ plain form
213 7454 45796 -61313 18904 16442 -12929 17124 -44233 40803 10488 -46726 33926 -12541
225 -12541 11387 360 -32539 45348 -18803 -11537 22812 -27368 29922 -13043 -15190 29615
237 29615 -27073 22467 -8298 -20329 37942 -23225 1424 3473 -8851 29302 -33097 638
249 638 29917 -23625 7124 -10900 10754 17189 -39860 21997 8874 -14438 7570 -16100 22878
262 22878 -4074 -22147 23801 -9320 633 3180 -13497 19804 -12207 -2183 11509 -17403
274 -17403 16992 -5963 -8688 12237 -9547 10642 -8805 -6828 20298 -12701 -3932 5962 -765
287 -765 7409 -16290 5584 14487 -16393 3006 1616 3912 140 -12595 13370 634 -9117 5009
301 5009 -23 2193 -2551 -2911 7938 -5073 -1563 5995 -4733 1666 -16 1196 303 -4268 5248
316E248m474n911O642K792o974O94K825K651m655m562J2069n612n993P444q69
331A315j052k601P46Q270j1289M54J2574j3059M617j212K118N214j8136J7611
345E570l5j3737J1337n955P666m332j1652K2745j3206m636J2716j3847J6534j3780
359d612j668J8953k3793J7126n554q779K0700k1279J1426M81j2857K5181k4908
372i583M841J7641k3319J9465j8217Q364J8954l9184K7973k473r406J4529k8243
385a8658L2360o155k7331L3662k0082J1066n57k4641M3261k9655j146K0185k8479
398a6170L5324k7302l402L1907l6161K6284j3782r622L8151m2824J7904P613k0468
411a2548L4460m3462K1034K2425m3534L3788k2857J3784J6145n1330M8019r940
$$ plain form
316 5248 774 -5137 1505 4297 -2677 -1983 842 3493 -1162 -5724 6345 733 -5260 2184 1315
331 1315 263 -2338 -1592 6678 -4611 -4157 8417 -4642 -25 -1237 881 6095 -12041 5570
345 5570 5535 -8202 3135 -2820 4846 514 -11138 11607 -1599 -6235 6481 -7366 9168 -4612
359 -4612 -6280 12673 -11120 6006 452 -8327 12373 -8906 2520 3001 -9856 15325 -9583
372 -9583 -4742 12899 -10420 9045 -9172 -808 18146 -21038 6935 4462 -4944 9585 -18658
385 -18658 13702 7547 -19784 13878 -6204 4862 4305 -20336 22925 -6730 -7876 12309 -16170
398 -16170 19154 -8148 -11550 20357 -15804 10480 -3302 -12924 25227 -17597 307 7920 -12548
411 -12548 21912 -21550 -516 21909 -21625 12163 -10694 3090 19235 -32095 15924 5984
423E984j7478K4181l5099M2288j4350l2897N0592l4183J7257k470k9076N7390
435C2139m5193M874K2874l4198M5274m0135R74M1541m8861L2482j7610o278M5222
448C3105o1733L2085Q724k6929L8542n3241L8170J4843n4387M8316k8058J6232
460E669J1719n5700O4417k1651k1438L3484m0552M9882k5878k9643O0633m6165
472a5223K3690q534k3633O2137n9324J4215K3561l7289M8841m9206R818M4834
484C3887o0912L9346j8791j807M1323o9494M6223K530k7661L6571n3600N0597
496A8212L96n5458O0714l5062J7162Q119n4989P6134l5689k0627M0658m2375N0839
509B8034l6146j7967O0839n3815K8706j4005j4060N9345p0615K7149K2214m2370
$$ plain form
423 5984 -11494 12687 -22412 19876 5526 -27371 23221 -10962 6295 3825 -25251 32139
435 32139 -13054 -8180 14694 -19504 25770 -14365 -13391 28150 -20711 11771 -5839 -12117 33105
448 33105 -28628 3457 12181 -14748 23794 -29447 8723 23566 -30821 17495 -10563 5669
460 5669 17388 -38312 26105 4454 -16984 16500 -24052 25830 -48 -29691 30942 -15223
472 -15223 8467 -67 -23700 38437 -20887 -6672 16889 -20400 28441 -20765 -10947 33887
484 33887 -27025 12321 -6470 -8277 33046 -36448 9775 12305 -15356 21215 -32385 18212
496 18212 18608 -36850 23864 -11198 5964 14083 -40906 35228 -461 -21088 19570 -22805 28034
509 28034 -8112 -26079 34760 -19055 9651 -4354 -18414 40931 -29684 -2535 19679 -22691
521b2691N2276n4923J9341M2252o8886M5851j8453J844L0581o5480N4865o581
533I996k4736L2216m8195N6552j4931n0013P0264m3426J6926O297m8873P8244
545D0321m7028j4736M2703l9666M3643l9766l020N1690n6461L2894j7180n918
557a2524N2110p6380M0428J6948m5405N3476n6194K7830L2998o8837M9523j7753
569c780M145J8292n5378N9439j6864k1629L1273m2694N6298k6812l9802P3992
581C6480n0752J6558N289l7789O9288n2239m441L8800l6260L5306l7310P581M0560
594C1071n5873L5835j6808k714M2891p2283M6472J0092m1750M6867m9353L2659
606G106J8517n9945M9641j7584M461R035m3730O0286k6527j8645L3503l7572M8654
$$ plain form
521 -22691 29585 -25338 -5997 36255 -32631 13220 -5233 -3389 27192 -38288 16577 9996
533 9996 -14740 17476 -30719 25833 10902 -39111 31153 -12273 4653 10950 -37923 40321
545 40321 -6707 -21443 21260 -18406 25237 -14529 -17549 34141 -22320 10574 -6606 -12524
557 -12524 39586 -36794 3634 20582 -24823 28653 -27541 289 33287 -35550 13973 -3780
569 -3780 365 18657 -36721 22718 5854 -15775 15498 -27196 29102 2290 -37512 36480
581 36480 -14272 2286 7575 -30214 39074 -13165 -17606 21194 -15066 20240 -17070 -9489 31071
594 31071 -24802 11033 -5775 -8489 34402 -37881 8591 18683 -23067 23800 -25553 7106
606 7106 25623 -34322 15319 -2265 2196 11231 -32499 27787 1260 -17385 16118 -21454 27200
619B7200l2396k4587O6666n3011J7460L225k4735N3613n1842Q213K9926l4421
631a4689L1762l4101J3162L0761n2701L7146j5735p36L1100n9948M5705K291l2780
644a8763L5130l7051L2896K959m5946M8108j9271K862M757l1213N4146l2998j2298
657a6682L3062l1544L5371k9790q850M9304m7644J8280J302j4980L7607m5230
669a9794J6599J9660l0980K9465l0500J5684K1314m5096L4282j3670J335J8528
681A6827m4079M0733m002k4590K6001k4932K7553p441l0750M3830k2065J826M068
694B979j9308M0637l3095k913K6673k5344K2775k1555N53L0461l6927J7405j69
707B172r553K4992l4806J8304J0548k3419K2940k4167J6461J0661l3208K7566
$$ plain form
619 27200 -5196 -29783 36883 -16128 1332 4557 -20178 33435 -18407 -10194 19732 -14689
631 -14689 17073 -17028 -3866 26895 -25806 11340 -4395 -5131 25969 -33979 11726 14017 -18763
644 -18763 16367 -20684 12212 15171 -30775 17333 -1938 924 5681 -25532 28614 -4384 -16682
657 -16682 16380 -15164 20207 -9583 -18433 30871 -16773 1507 2809 -12171 25436 -19794
669 -19794 -3195 16465 -14515 14950 -15550 134 21448 -23648 10634 -3036 -1701 16827
681 16827 -27252 13481 9479 -15111 10890 -14042 13511 6070 -24680 19150 -2915 -1089 2979
694 2979 -16329 24308 -8787 -11700 14973 -10371 12404 -9151 -8598 21863 -15064 2341 2172
707 2172 -7381 17611 -17195 1109 11657 -11762 11178 -12989 3472 14133 -19075 8491
719H491r862J631P788k7290L2683q652j7615K0882j6003J8522j1260j5443L3636
732A7508k2598L068L952j0103K4037k5642M413J6532j8907J4531j2725K499J6789
745A3354k4624J4065j564n390J5213k3530J5095M539j4329J3083j4156J3211K254
758G221k0218J8974m878j413K648j2487K0874r761j0256J5857r745Q520q289l740
772f693J8137j6639L838L427n198J0053j2817M585P287j0967Q558o202Q55Q517
786F741j2747P669j637j144O132j2137R024K039p355M134l331O046j592q680J0265
801C427j313m201J864k198P460o537k665Q092m479N56j352J043L152n045J533
816f63K403k827J651n96q27K072k118J820j361p04L220k339j127J862Q93j748
$$ plain form
719 8491 -1371 260 8048 -19242 13441 4789 -12826 8056 -7947 10575 -685 -16128 17508
732 17508 -5090 -2022 1930 -8173 15864 -9778 -5365 11167 -7740 6791 -5934 -3435 13354
745 13354 -11270 2795 1231 -4159 11054 -12476 2619 7158 -7171 5912 -8244 4967 7221
758 7221 -12997 5977 1099 -314 2334 -10153 10721 960 -9296 6561 -3184 5336 -2953 -6693
772 -6693 11444 -5195 -1357 2070 -3128 6925 -5892 -1307 5980 -4987 3571 -2631 -1776 6741
786 6741 -6006 1663 26 -1118 5014 -7123 1901 3940 -3415 719 -2612 3434 1842 -6838 3427
801 3427 2114 -2087 -223 -2421 5039 -1498 -4163 3929 -550 6 -1346 -303 2849 -2196 -663
816 -663 1740 -1087 564 -32 -859 1213 -905 915 -446 -1150 2070 -269 -1396 466 1359 -389
832c89m85N42K640k965j824N207k852n42L57M05K066m574K118L193n060K190Q53
849H80j414K099m803N701j065n629P559m316J305k34k726P347p355P69N687o609
865b804M440k728l74O049r768P319p00n453Q962r078N425M04n853R635r936M114
881c46N370j0631Q517m243J011N099j3327J3682k801q031J0109r096J0028n635
895b94p420J6821j2463K340L082o761J2777j3257K469J0291j4275J1586p257p68
909c129J1805j7032J2336l577m917J3572j7715J0514K930j0843J2389j3325R494
922B502M895j9234J8353o853p98N703j5920K2301j1016q810J7083j3932J1925
935F199q402o072K1555k0435O245M783j0797J7877j9269O358J1315j9043J7739
$$ plain form
832 -389 -874 -332 2308 -657 -2481 2726 -126 -668 -311 94 2160 -2414 -296 2897 -2163 27 880
849 880 -534 1565 -3238 2463 1398 -4231 3328 -988 317 83 -2643 4704 -2651 -1882 3805 -2804
865 -2804 1636 -1092 -1466 4583 -5185 2134 1434 -4019 4943 -4135 1290 1694 -4159 5476 -4460 -346
881 -346 5024 -5607 2910 -1333 -322 4777 -8550 5132 2331 -5700 4409 -4687 5341 -294
895 -294 -7714 9107 -3356 -1016 2066 -4695 8082 -5175 -2706 7585 -6690 4896 -2361 -3129
909 -3129 8676 -8356 3980 403 -4514 9058 -8657 1857 4787 -6056 6333 -6992 2502
922 2502 7397 -11837 6516 -337 -1135 4568 -11352 10949 -67 -8877 8206 -5726 6199
935 6199 -2203 -8275 13280 -7155 -910 3873 -6924 10953 -8316 -1958 9357 -9686 8053
948H053j3559K823J4239k3407J6813n062l550J3876k3533J8061K130j6536J6655
961G003j4661J3318J9k1437K7585j3307j069O726j5235K5316j8353n218K1095
974A1782j9285J3613q814n058K3222k5841J1032L701j2138K0854k4366J1223R927
987I852k0511K0126j7718Q281J2855k8542K2293n556m496J2794k5104K5165l225
1000F214j9243K1925j5924J4582o097j6823L1835k1457K024P694j4910K5496k2930
1013g614l30K2135k4321J6628r548l941K2859k8326J4677R61r708J9458k7020
1026a4090J6825O679k0764K0536j8584J2539Q624l0914K8823p562p118J2561k2241
1039a4686K7547j0440j6140K4545j7141J3660r792r254L0009k7526P463P475j5725
$$ plain form
948 8053 -5506 -2683 11556 -11851 4962 -100 -3650 10226 -13307 4754 6884 -9652 7003
961 7003 -7658 5660 5679 -15758 11827 -1480 -2549 4177 -11058 14258 -4095 -9313 11782
974 11782 -7503 6110 -2704 -7762 15460 -10381 651 4352 -7786 13068 -11298 -75 9852
987 9852 -10659 9467 -8251 30 12885 -15657 6636 1080 -3416 9378 -15726 9439 6214
1000 6214 -13029 8896 -7028 7554 1457 -15366 16469 -4988 -2964 4730 -10180 15316 -7614
1013 -7614 -7944 14191 -10130 6498 -3050 -6991 15868 -12458 2219 3180 -6528 12930 -14090
1026 -14090 2735 9414 -11350 9186 -9398 3141 11765 -19149 9674 2112 -5006 7555 -14686
1039 -14686 12861 2421 -13719 10826 -6315 7345 -2447 -11701 18308 -9218 -1755 5720 -10005
1052a0005K5512k5466M197K0829k6995J9248j1242r94J9969k8556J7046j485n946
1065c888J4810k6604K2230J894k1163K1938j7681J3649L446k8534L3215j1922
1077A390p939J2810j7443K4540j5400r304K3222j8189J2249r797m161K5382k9146
1090a1786J1709O031j5686K4294k5745P850J7147k5723J8896j1952L146J4493
1102A2674k6945J8957k709m746J0657k3096K4993l674k0112K3878j6631J2201
1114E447j194k1242L2420j7031m808J2114j3741J9893j7105k555J9736j9240J2332
1127E026q421k224K0711k7233J3523L676j2840K0069k3595J1016J1616k1927J6382
1140E779j0639O094Q175k3722K0743l919n956Q799j7421K3193q610j5432K3244
$$ plain form
1052 -10005 15507 -9959 -5762 15067 -11928 7320 -3922 -4916 15053 -13503 3543 2058 -3888
1065 -3888 10922 -15682 6548 8442 -12721 9217 -8464 5185 8631 -19903 13312 1390
1077 1390 -6549 6261 -11182 13358 -2042 -11346 11876 -6313 5936 -3861 -8022 17360 -11786
1090 -11786 -77 5954 -9732 14562 -11183 -3333 13814 -11909 6987 -4965 -1819 12674
1102 12674 -14271 4686 1977 -2769 7888 -15208 9785 6111 -14001 9877 -6754 5447
1114 5447 4253 -16989 15431 -1600 -6408 5706 -8035 11858 -5247 -7802 11934 -7306 5026
1127 5026 -3395 -5619 15092 -12141 1382 5058 -7782 12287 -11308 -292 11324 -10603 5779
1140 5779 -4860 1234 9409 -14313 6430 2511 -3445 5354 -12067 11126 2516 -12916 10328
1153A0328j5436R467l852j2002K6079j9380K90R950j1665J5868j6079J851J5337
1166A0756j8784J2764p782o52J5784k3368J3558J136q498J3832j9331J3073N709
1179H197j7783J4154q187O244K860j8308K0884o287o274Q300j1676J7699j0915
1192a092q424J9126j3696O531l372n415J7640j7284L589P231r854J2361j3294
1205e953L773J0626j5594J1326p049J377J0219j8138J1958J4n469Q031j3373J2421
1219D169J148j3751J2595o049M360l66j1432J7753q559m081P260p229J1040r800
1233b942k367J2938j1216M652j651k557J0525j2714M647M171p226Q795r892M353
1247d84O000j0599P722m943K584M675j1920R220l0m297M166p080R171j871q786
$$ plain form
1153 10328 -5108 4359 507 -11495 14584 -4796 -4506 5444 -6221 9647 -6432 -4581 10756
1166 10756 -8028 4736 -3046 -3698 12086 -11282 2276 3412 -5086 8746 -10585 2488 8197
1179 8197 -9586 4568 -3619 2625 5485 -12823 8061 1774 -4500 3800 -7876 9823 -1092
1192 -1092 -9516 9610 -4086 2445 -927 -6342 11298 -5986 -2397 4834 -5020 7341 -5953
1205 -5953 -2180 8446 -7148 4178 -2871 -1494 8725 -9413 2545 2559 -2910 5121 -8252 4169
1219 4169 5317 -8434 4161 -1888 2472 2106 -9326 8427 -132 -4213 3047 -4182 6858 -2942
1233 -2942 -5309 7629 -3587 1065 -586 -3143 7382 -5332 -685 3486 -3740 5055 -4837 -484
1247 -484 5516 -5083 2639 -2304 280 4955 -6965 2255 2225 -2072 2094 -4986 4185 2314 -6472
1262f472J0245m491J949j398m596J1177q065j145N243m213N087n850M75O819p644
1277b879L466n64j622N693p565L628J665l667M693o021L516K767n873L528j549
1292g84J763R72o095N860K77l805K204k014M419k706l583O182k613k73m13k90
1308h99L640m119R1K878k097R76j170J14K282k984J466p3p80K068k472P92Q00
1325E13m56K21j358J214J153k080j55J771l61o50r66J747O19k474P59J442o84
1342B55r21L21Q21K66j954J293R84j970J356p88O48L2j437K278j495m18J894j843
1360f78R03j23p41K179l070J756J119l054L030k128J108O51l035M068k431o00
1376a046K749l157K434j132r93L653m881K897J028l742M042l519K608L17m602
$$ plain form
1262 -6472 3773 -718 1231 -167 -4763 6414 -1651 -2796 2447 -1766 3321 -2529 -2054 4765 -2879
1277 -2879 587 23 -1599 4094 -3471 157 1822 -1845 2848 -3173 343 3110 -2763 765 -784
1292 -784 979 1951 -4144 1716 1993 -1812 392 -1622 2797 91 -3492 2690 77 -196 -609 -899
1308 -899 2741 -1378 -1287 1591 -506 470 -700 -586 1696 -1288 178 105 -675 1393 -1079 -287 513
1325 513 57 278 -1080 134 1287 -793 -948 823 462 -188 -1154 593 1212 -1262 -503 939 255
1342 255 -666 -345 476 742 -1212 81 1065 -905 451 -337 311 343 -1094 1184 -311 -729 1165 -678
1360 -678 225 102 -639 1540 -1530 226 1345 -1709 1321 -807 301 952 -2083 1985 -446 -1046
1376 -1046 1703 -1454 980 -152 -1145 2508 -2373 524 1552 -2190 1852 -1667 941 1258 -3344
1391c344O177l278o84K510l442M633l517j292N759n795K962m07k226N517o748
1406c175L668J328m662N844n260K184K591n831N865l834L30M458p602O010j252
1421F62k564M985p282O841j057n880P765n336L129m82n068R399o601n42M811n697
1437b917O637n771l34P675r306N721j776k140P174r618N765R92n386P303p673
1452c654M062L353q558P962m830J439M177j0228J0010k945l505N909p839Q975
1466D328l834n924J0591p405L133m84m789J1003r911J259N847p579Q222p913J817
1481a639P613j1474Q056l233j234P422j1605P983M27o010Q045r188O580K128j0107
1496f236J0324o085K698K262j0125J3086o053l227O823p809R447o022m551J2250
$$ plain form
1391 -3344 2833 -445 -1129 1381 -2061 2572 -945 -2237 3522 -2273 689 282 -1944 3573 -3175
1406 -3175 493 1821 -2841 3003 -2257 -73 2518 -3313 2552 -1282 -952 3506 -4096 1914 662
1421 662 -1902 3083 -4199 2642 1585 -4295 3470 -1866 1263 781 -4287 5112 -1489 -2031 2780 -2917
1437 -2917 3720 -2051 -2385 5290 -4016 1705 -71 -2211 4963 -4655 1110 2102 -3284 4019 -3654
1452 -3654 408 3761 -4797 3165 -1665 -226 3951 -6277 3733 788 -2717 3192 -4647 4328
1466 4328 494 -5430 5161 -2244 889 405 -4384 6619 -3292 -2033 3814 -3765 4457 -3456 -1639
1481 -1639 5974 -5500 2556 -677 -1911 5511 -6094 1889 2316 -3694 4351 -4837 1743 3871 -6236
1496 -6236 4088 -1997 701 2963 -7162 5924 -129 -3356 3467 -4342 5105 -917 -5468 6782
1510F782r823L655k18m106J0870j2068L931N050q119Q776r128M057O307j2349
1524f383R568l996o69P010j2558R804k33o565Q118r189Q425n94r541J1876p251
1539b178L440L03q323J4256r163k086P955q327R068p034k562J2180j1704M788
1553F13l70k928R245j2622O505L118p581Q561r495N776M675j2609J0767m381m88
1568a214O090j2209J1149j593o394P641p843Q676l518p000J2045q240L547n61
1582E76o013J3481j1277j39Q370q965Q331p179k17J0269j2205O042j027j528O882
1597E401j1783Q249J018o740Q059r072O724K717j1811J1394m876j7M309j0295
1611f723J1539l716n055O908o253P629n207m199J1243q827L147j57m250J1142
$$ plain form
1510 6782 -3041 614 396 -3710 7160 -4908 -977 4073 -4046 4730 -4398 -341 5966 -6383
1524 -6383 3185 -811 -1480 5530 -7028 2776 2543 -4022 4096 -5093 3332 2738 -6803 5073 -2178
1539 -2178 1262 1565 -6758 7498 -1665 -3751 4204 -4123 4945 -2089 -4651 7529 -4175 613
1553 613 243 -2685 6560 -6062 443 3561 -4020 4541 -4954 822 5497 -7112 3655 -726 -1214
1568 -1214 4876 -7333 3816 2223 -4171 3470 -4373 4303 785 -6215 5830 -2410 1137 576
1582 576 -5437 8044 -3233 -3372 4998 -3967 4364 -2815 -3032 7237 -4968 1074 47 -1481 5401
1597 5401 -6382 1867 2885 -3855 4204 -4868 1856 4573 -7238 4156 -720 -737 3572 -6723
1611 -6723 4816 1100 -3955 2953 -3300 4329 -878 -5077 6166 -2661 486 329 -3921 7221
1625G221j1537J993P248q675P210o542J800P164j1129O675j423q86M922j0002
1639e961Q492k37o018P243p754O749N16r601J0950n287O73K192p296J0657n654
1654c36l110O373n355O108n456j834R684r163L260K87k826Q043j0340L962M762
1669D059p349N946n498L037M098r200O764j677q56L598p960P875j148n076O122
1684B735n849N799j409o385R244n080Q27Q54m311Q414o248j309N676m854M428
1699B532m569j8P076q354L567J96j698N005p958M712K280n478M589m072K975J950
1715B735o934O158j846p17K476n725O698k024l543M736l941M181k246l425O936
1730C519m320M04P60k268N576n493O8M510m259L042l211J006M185o440L345R8
$$ plain form
1625 7221 -4316 -2323 4925 -3750 3460 -3082 -1282 5882 -5247 1428 5 -881 4041 -5961
1639 -5961 2531 2294 -3724 3519 -4235 2514 3030 -6571 4379 -908 -235 1957 -5339 5318 -336
1654 -336 -3446 2927 -2428 3680 -1776 -3610 6074 -3089 171 458 -2368 5675 -4665 -703 4059
1669 4059 -3290 2656 -2842 195 4293 -4907 1857 180 -676 2922 -5038 2837 1689 -3387 2735
1684 2735 -3114 2685 1276 -5109 4135 -945 -118 736 -3575 4839 -1409 -2718 2958 -1896 2532
1699 2532 -2037 -2055 5021 -3333 234 430 -1268 3737 -4221 491 2771 -2707 1882 -2190 785 2735
1715 2735 -4199 1959 113 -604 1872 -3853 2845 821 -2722 2014 -1927 2254 8 -3417 3519
1730 3519 -801 -397 363 -1905 3671 -1822 -1754 2756 -1503 1539 -1672 -666 3519 -2921 424 522
1746E22j079K595n013L941Q33l908L383k650K245O29m580M910j829l27J218l341
1762b451M869k361j883L165k203K297k029j281M503l394J35R18j078K967l961
1777a787J019K714l073J708j625J219J571l759K390J14q31J129k406K396J59k363
1793a425K150j372J276q1k273K928j169j99K98j118K405j538r76J853p80M64r48
1810e05k06K274k109KR14m16Q20j857J071J018j519M53j23N12J22j244R08L81
1828D96p45L70n29O81J05r41P14j83K59j89n20O95J26n63m0L53J58j72o72Q37
1848B40J93p62J59J72L33m11m22P52P3p73M65OR7j1o92J133o97r0N93p62P83m98
1870a19j08O85r25O86L9q88J201q39K53L89j099J591j251O8J013j379J236p98
$$ plain form
1746 522 -557 2038 -2975 966 1799 -2109 1274 -1376 869 1498 -3082 1828 -1 -328 890 -2451
1762 -2451 2418 57 -1826 1339 -864 1433 -596 -1877 2626 -768 -633 285 -793 2174 -1787
1777 -1787 -768 1946 -1127 581 -1044 175 1746 -2013 377 491 -340 789 -1617 779 938 -1425
1793 -1425 725 -647 629 548 -1725 1203 34 -165 133 -985 1420 -118 -1094 759 -21 443 -505
1810 -505 -711 1563 -546 -544 370 -46 774 -1083 -12 1006 -513 -60 -183 329 451 -793 115 496
1828 496 -249 121 -408 273 378 -563 151 -32 227 38 -482 213 339 -224 -264 89 247 75 -597 240
1848 240 433 -329 -170 2 335 -76 -498 254 327 -446 19 25 122 111 -581 552 -145 -235 358 -404 379 -119
1870 -119 -227 458 -467 219 258 -630 571 -268 -15 374 -725 866 -385 -317 696 -683 553 -245
1888b45m8J107j650J215k6j088J539j420Q56K02j499K280j756K39J071j661J821
1905I37j556L05J524k368J592l06o83J578k257J765J05j910K452k037J142L57
1921F40k102K838j994L75J163k287K485j320o01J980k432K180q42j455L119k782
1937a035J272P5j490L057l243J074J583k522K250j909P56J794l645K822n76j055
1953g92K161l249L032n97k202L261k822J876n5k466L699k572N14J168k747L658
1969A867k348o62K801l131K851j869q32L778m122J975L0j300L013m063K114J553
1985A655l396K928k212J177J511m280M127j428r30K311l645L853j408k069L636
2000A830l230K277m35k547M395l202O35J183k740M240l569Q4L031l579L080k489
$$ plain form
1888 -245 -293 814 -836 379 353 -735 804 -616 240 442 -1057 1223 -533 -294 777 -884 937
1905 937 -619 -314 1210 -1158 434 128 -555 1023 -1234 531 636 -1274 1178 -859 283 640
1921 640 -1462 1376 -618 -243 920 -1367 1118 -202 -803 1177 -1255 925 83 -1372 1747 -1035
1937 -1035 237 312 -1178 1879 -1364 -290 1293 -1229 1021 -888 -132 1662 -1983 839 263 -792
1953 -792 1369 -1880 1152 555 -1647 1614 -1208 668 613 -1853 1846 -726 -212 956 -1791 1867
1969 1867 -481 -1143 1658 -1473 1378 -491 -1323 2455 -1667 308 338 -962 2051 -2012 102 1655
1985 1655 -1741 1187 -1025 152 1663 -2617 1510 82 -848 1463 -2182 1671 263 -1806 1830
2000 1830 -1400 877 442 -2105 2290 -912 -277 906 -1834 2406 -1163 -1079 1952 -1627 1453 -1036
2016a036K18L494n005K794R4j499K792m196L072Q82l788L647k623J744O39m018
2032b789M953k583k34J997l617M339k158j702L812l450K498j000k065M662l934
2047a271J116Q57k126L964m451J425K613l920L137k485Q77K750n265L576k0j830
2063a053K610l820L509j54l338L926k912K133k39l258N049l203K24J717l318M437
2079B310k754j330L918l565K485j476j076M191m471J819M29j438L128m574K594
2094A90J782m070L377k245J005J942m846M197p20j722K448l341L577j138k319
2109a883L550k894K246q03k357M641l420M30J541k840M083l180n17L606l550K278
2125I31j648LL122m474K416J94j216K293l876L064P53l765L561k214J116J096
$$ plain form
2016 -1036 -818 2676 -2329 465 559 -940 1852 -2344 728 1610 -2178 1469 -1154 590 1229 -2789
2032 -2789 2164 -419 -653 1344 -2273 2066 -92 -1794 2018 -1432 1066 66 -1999 2663 -1271
2047 -1271 -155 702 -1424 2540 -1911 -486 2127 -1793 1344 -1141 -264 2486 -2779 797 777 -1053
2063 -1053 1557 -2263 1246 1092 -2246 1680 -1232 901 662 -2596 2453 -750 -526 1191 -2127 2310
2079 2310 -444 -1774 2144 -1421 1064 -412 -1488 2703 -1768 51 480 -958 2170 -2404 190
2094 190 1972 -2098 1279 -966 39 1981 -2865 1332 612 -1110 1338 -2003 1574 436 -1883
2109 -1883 1667 -1227 1019 216 -2141 2500 -920 -490 1051 -1789 2294 -886 -1403 2203 -1347 931
2125 931 -717 -714 2408 -2066 350 544 -672 1621 -2255 809 1562 -2203 1358 -856 260 1356
2141A356l950M287j609r79J941k728L356j755j409L062k652J968j045j520M055
2156B378l495P09J252k158L298l379O71K697l360K095j395N37J948l878K665L6
2172F21j385J893k907K764L0k972L294k072J128L57k752L737j960l91J370k073
2188a318K861j898q72K740k386J532r53p92L214l434J111Q91j462K195k875J445
2204aJ507k891J982j037N23J094k985K618l65j201J622k152K306n92j881K596
2220A143j788J050j73j633K835j814q7J008j426K117j776l26K224k126J169p58
2236c61r5J943k788J373M58j003J251j865J430N68k092J733p85L31N52j965K184
2253H69p07p41J189j498J749q10r56J726j217P10l24q15J964j481o1Q25q76J312
$$ plain form
2141 1356 -2594 1693 84 -895 1046 -1682 1674 -81 -1490 1572 -1080 888 -157 -1677 2378
2156 2378 -1117 -408 844 -1314 1984 -1395 -724 1973 -1387 708 -687 -150 1798 -2080 585 621
2172 621 -764 1129 -1778 986 1016 -1956 1338 -734 394 751 -2001 1736 -224 -615 755 -1318
2188 -1318 1543 -355 -1227 1513 -873 659 -294 -1086 2128 -1306 -195 696 -766 1429 -1446 -1
2204 -1 1506 -1385 597 -440 83 1177 -1808 810 445 -756 866 -1286 1020 428 -1453 1143
2220 1143 -645 405 232 -1401 1434 -380 -467 541 -885 1232 -544 -870 1354 -772 397 -361
2236 -361 -456 1487 -1301 72 530 -473 778 -1087 343 911 -1181 552 -233 98 650 -1315 869
2253 869 162 -579 610 -888 861 51 -905 821 -396 314 -10 -825 1139 -342 -403 422 -454 858
2271H58j502K48J463j694Q51m65K09Q23j765J186K27q01O90q75Q68J59j296J275
2289D59o14J90K57j081J415o49k58N44o89R71o18m59J028n90J64k22k07J083j102
2308c78M8O40m52M83q43M82N70j006M66j8N2J89o95O12J17n42M09l19L27N7n70
2329c71N89k51J11j8l49N41j86k29J48J9J63k18k29N33j76k21J28L5K25m44Q2
2350a18L31j74j34L9J32Qj35q5L19k29L3O6j23K09k06J7J13j28J63j05j45L47
2372A95k13j00J84k01L55m38J07M04n09K36j13P6K09n07M05Q6m41M31l31J88J09
2393A32n10P72n48K5M19o11N96m34P5M38p25N68q0l88N93o19M40M6o25R67p85
2414b54K22L72p61Q65o95J56N19r05P80k74l25P13q02O09j12o34J176r93L44K55
$$ plain form
2271 858 -644 -396 1067 -627 224 -241 -32 791 -974 212 439 -362 328 -547 321 480 -816 459
2289 459 -155 35 292 -789 626 -23 -281 263 -426 545 -73 -532 496 -94 70 -152 -359 724 -378
2308 -378 -330 310 -142 341 -502 -20 550 -456 10 -8 44 233 -462 150 267 -275 134 -185 142 199 -371
2329 -371 218 -33 78 60 -289 252 66 -163 -15 4 167 -51 -280 253 77 -144 -16 19 244 -200 -118
2350 -118 213 39 -95 -56 76 84 -51 -136 183 -46 -13 53 -70 139 -67 -50 63 -65 98 -7 -152 195
2372 195 -18 -118 66 -135 220 -218 -111 293 -216 20 -93 -17 192 -315 90 176 -265 166 -165 23 132
2393 132 -378 394 -154 -129 290 -321 275 -159 -84 354 -371 197 117 -271 322 -297 143 189 -436 531 -254
2414 -254 -32 340 -421 444 -251 -95 424 -481 299 25 -300 413 -389 220 108 -526 650 -343 1 256
2434B56p15J088j087L91O07j118R20m51k9O67j239J073k14o51J108j157Q05m8
2452B06q38J319j157N04L18j023J283q56O0O35j115J301p32m19J203j262R25m23
2470g1m34J456j692Q27K62q36J174j293O88N68j501J395o95K0P67j536J546n95
2488E0n82J274j520J287l53q74J505j315P49J07j159J724j220R7P63j260J556
2505H29j215o0J428j728J178n86j99J338j966J222J75j011J267j348R20L19j544
2522i81J733j062K35P07j671J890j014k86J177j603J552o35q19J648j432Q08j05
2539A42r80J943j733M35P69j295J602j549M58J192j958J417n58j31J101j919J509
2556D45n5j092J451j504J155j0j369J900j425O18L88j545K052j269j36J088j518
$$ plain form
2434 256 -459 629 -458 -67 540 -578 342 -109 -138 529 -710 363 149 -502 606 -551 254 206
2452 206 -632 687 -470 34 352 -671 612 -244 -184 451 -664 637 -95 -514 689 -573 352 -71
2470 -71 -505 951 -741 86 348 -488 686 -607 81 649 -852 543 -152 -132 635 -901 645 50
2488 50 -532 742 -778 509 156 -718 787 -528 221 328 -831 893 -327 -230 533 -727 829
2505 829 -386 -446 982 -746 432 -154 -353 985 -981 241 416 -595 672 -676 244 563 -981
2522 -981 752 -310 -75 632 -1039 851 -163 -449 728 -875 677 42 -777 871 -561 247 142
2539 142 -838 1105 -628 -193 576 -719 883 -666 -208 984 -974 443 -115 -246 855 -1064 445
2556 445 390 -702 749 -755 400 390 -979 921 -504 114 502 -1043 1009 -260 -396 692 -826
2573h26J617r06o31J768j633Q87l02n57J741k046R27M99j226J479j574Q39Q21
2590H77k003J723o64k10J017j783J652l92r07J429j501J301l64j049J784j517
2606f07Q44P4j312K050j409o0J062j374J496j081k42J627j799J010l69k63J331
2623I78k006J309K06j132J334j394R25M44j730J777q42r2Q65j581J646o84n43
2640e20J178j403J381o28p24J606j407O98j4r40J832j548J44J038j300J279j152
2657d80K17J195j750J123l41j87R35j632J314k6j013J267j219Q46K30j420J668
2674G27j003J60N67j252J512q34k54Q78j069J113o86m55J396j271N93l6n72J397
2692I11j547M86P20j095R84r30M59O59j440J128l29j75O65j174J110k01p66J085
$$ plain form
2573 -826 791 -115 -746 1022 -611 276 -26 -583 1158 -888 39 538 -688 791 -783 56 877
2590 877 -1126 597 -67 -277 740 -1043 609 217 -690 739 -762 539 175 -874 910 -607
2606 -607 237 311 -1001 1049 -360 -420 642 -732 764 -317 -559 1068 -731 279 -90 -353 978
2623 978 -1028 281 487 -645 689 -705 220 664 -1066 711 -131 -223 642 -939 707 23 -520
2640 -520 658 -745 636 8 -716 890 -517 181 167 -773 1059 -489 -345 693 -607 672 -480
2657 -480 -263 932 -818 305 -36 -223 712 -920 394 368 -645 622 -597 249 479 -941 727
2674 727 -276 -116 451 -801 711 -123 -377 501 -568 545 -141 -596 800 -471 122 86 -486 911
2692 911 -636 -150 570 -525 459 -471 -12 647 -793 335 6 -169 496 -678 432 231 -535 550
2710E50j036P59mr70J361r46L08K33q61J251p88j69P23p91Q27o49k08J115j170
2729d65N47k2l11Q90j238O84L23q22P36o65M32K87r75R47l38j79N03q70Q79k79
2749F4m51P62p74O68k11n07R01o56K45O4m94Q90o86p6O15o32N41n00N8P15r66
2770d30N04j5j80M33p44N94P5n58N37l77K19J50n93O62l05p2K89n36O31k82j92
2791a90L96l94L87k08k55N58l87P7P3k19M90n09M7M26m52K74k63J30K82n37L12
2812C8K0j14J49k90K85K2l39L51j59L9J09l30L66j93nJ21k41L08j52j19J88j02
2834d8R9q7j00L08k18m9J28n1J40k72J28J32j69L6J4N0k0j29J09Q8j44N4m9K9
2858b1Q3j40J20m5j2O5p6L5M0m0l9N2k3P1j39M5J36j42N9n5R0lj63J43L1j56R3
$$ plain form
2710 550 -486 273 269 -701 660 -286 22 255 -606 645 -143 -312 411 -380 447 -202 -410 705 -465
2729 -465 82 60 -251 639 -599 85 408 -414 322 -343 89 376 -599 348 10 -169 334 -536 343 64
2749 64 -387 375 -399 269 58 -449 452 -204 41 105 -389 501 -185 -261 354 -278 263 -237 -179 536 -430
2770 -430 74 59 -121 312 -432 162 237 -321 216 -161 58 208 -385 277 -28 -100 189 -347 284 2 -190
2791 -190 206 -188 199 -9 -264 294 -93 -16 57 -162 328 -181 -134 292 -160 114 -149 -19 263 -274 38
2812 38 58 -56 93 -197 88 110 -229 122 -37 2 111 -219 147 -46 -51 70 -171 137 -15 -134 54 -48
2834 -48 51 -36 -136 172 -46 -95 33 -18 122 -150 -22 110 -59 -23 -9 41 21 -108 1 89 -55 -1 -50 -21
2858 -21 62 -78 42 -3 -15 50 -26 9 49 9 -30 22 -1 70 -69 -24 112 -30 29 -26 64 61 -102 41 72 -84 9
2885Ij1J8N1j91K48j50o3J77j95J76j27KJ67j95J12L6j82J92j29O5L3k12L14j93
2909d8l0K16k52K21j82L6J83l12K02Pj66K47k43J40Q2l58M56l10R1J30l05L77
2931A82k98J2L24m35L16r2r4K58l57K97J3l73M70l12J22O9l60N13l86O2K61m04
2953b12L72j83q3L41m90L92n7l01M87m34K26K5l37N77n05J54K07l96L97l20J11
2974b9K91n84M68r4k14L91m72M03p1l85O03m98K05J00l70N33m49J51K61n35N10
2995B15k30j29L87n37N27k30k44O05o12L40k7k80N48n67K22K70n32M67l01M2L23
3016B57o15O27k37k27M94n91M80j51k46N26n70L16J08m44N40m31J66K28n91O57
3036B96l21j21L86n28N78l38j80O03o73L81Nk83M80n44K99J63n35N78l87O9K89
$$ plain form
2885 9 -2 16 67 -124 124 -26 -89 88 -107 69 -58 -56 111 -84 28 64 -118 74 -55 10 43 -169 145 -48
2909 -48 -78 138 -114 107 -75 -39 144 -168 34 41 -125 122 -121 19 101 -257 199 -111 -20 110 -195 182
2931 182 -116 -104 220 -215 101 9 -85 173 -184 113 126 -247 223 -89 33 102 -258 255 -131 -69 192 -212
2953 -212 160 -23 -106 235 -255 137 80 -221 266 -168 58 83 -254 323 -182 -28 179 -217 180 -140 -29
2974 -29 262 -322 146 52 -162 229 -243 160 89 -296 307 -191 14 114 -256 277 -172 -21 240 -295 215
2995 215 -15 -144 243 -294 233 3 -241 364 -248 92 65 -215 333 -234 -12 258 -274 193 -108 -66 257
3016 257 -358 269 32 -195 299 -292 188 37 -209 317 -253 63 171 -273 267 -164 2 230 -361 296
3036 296 -25 -146 240 -288 290 -48 -228 375 -298 83 88 -195 285 -259 40 203 -332 246 -141 -72 217
3057B17n71O31l47j19N18o55M93j74j94M99n76L77Q8n03N67l53J18J33m81O87
3077C55m63n4M47n68N10l29l4M87o82M18N8l34M60m63K44J20m70O09m79J53K71
3098B56n20N48l99qM54o52M33o8k25M26m59L49rm07N83m42J71P2l48N92m97P6
3120g4L40n26M15k18r1M44n78M09k8l13M71m47K50K4l04N06n19K11K38m66L99
3141A43k19M9K57n56M89n9l10L62l35L56j60k66N61m37J26R6k63M21m03Q3L19
3162B54m77L91j81j14L63m56L44j28j81M54m17J62K6j41L09m18K23J99m23L30
3182A19j17k4J77m45M87j31k45L27k57K46j56j36L94l40J01J20k66K98k59O5J72
3203A30l04L57k25q6L42l27K03j49j0L08m32J51J76k05R9j59K30Q5m32L36k5q8
$$ plain form
3057 217 -354 277 -70 -189 329 -326 167 -7 -201 298 -278 99 187 -316 251 -102 16 149 -332 355
3077 355 -108 -162 285 -283 227 -102 -136 351 -331 87 145 -189 271 -192 52 172 -298 311 -168 -15 256
3098 256 -264 284 -115 -123 331 -321 112 44 -181 245 -214 135 126 -281 302 -140 31 103 -245 347 -150 -74
3120 -74 266 -260 155 -63 -154 290 -288 121 93 -220 251 -196 54 78 -226 280 -239 -28 210 -256 143
3141 143 -76 -27 230 -326 163 104 -206 156 -179 177 17 -249 312 -125 1 97 -166 255 -148 -65 254
3162 254 -223 168 -13 -127 236 -220 124 -4 -185 269 -148 14 40 -101 208 -210 13 212 -211 119
3182 119 2 -22 155 -290 197 66 -179 148 -109 137 -19 -155 239 -101 0 120 -146 152 -107 -42 130
3203 130 -174 183 -42 -128 214 -113 90 -59 -69 239 -193 -42 134 -71 28 -131 99 184 -248 88 63 -25
3225b5J10k61L75k27j42L17k10J42o8j09K75k71J14O0j96K56j72j1J08j60K50
3246A55k41k5L15k59L2k2P8J23l45J59K34l03Q2l3J53k7l05L64p7q9M4r1K15j76
3270c9p3K30j66Q3lj19J89j43O5j0r4K25j95n0J37l6O4j67N2K11k25l5J40Pqk09
3296a69K18Q6k47Q8M2M5o4r4K10j08m5N0m2N3m4qR2j28J14j3j01J47l0n0j2%J56
3323A46k02m9J82j6j09k1J13Q1k45O0J65q4o0oJ54m6j94J55L4n0m4J2R3p5l0O9
3349C3l1k6O2p4O2l0M9p9l3J19J1j27J7J10j5j41J7J74n1j60J12Q0m5j36J01J10
3375A09j26o5J15M6j32L8N8L0j02K2N6n1L3mKl0J3N4o8k3R2j0j12M6M9nj11O2
3403a4J48j41o5O9P1q8m9J45J4j65Q0P2k6p2l4J36j15l3J15n1k0jN9j1r2R8L7
$$ plain form
3225 -25 85 -176 199 -28 -170 147 -63 79 11 -98 177 -94 20 80 -116 140 -32 -43 65 -95 155
3246 155 -86 -111 204 -55 -23 -45 33 156 -189 -30 204 -99 -17 -50 103 76 -229 135 58 -31 13 -78 137 -39
3270 -39 -112 118 -48 35 32 -87 102 -41 24 14 -80 145 -50 -100 37 1 65 -102 -50 161 -64 -99 41 48 40 -169
3296 -169 49 135 -112 -24 18 63 -1 -95 115 7 -38 12 -30 23 -21 -29 63 -65 49 36 -65 82 52 2 -10 -10 146
3323 146 -56 -105 77 61 -48 -69 44 125 -120 -60 105 21 -39 -45 109 63 -131 24 58 8 -36 -24 69 -6 -36 33
3349 33 2 -24 38 -36 26 -4 45 -34 -67 52 63 -64 -47 63 48 -93 -76 98 47 -113 -1 79 34 -102 -1 109
3375 109 -17 -82 33 79 -53 -15 43 73 -29 -7 49 -2 31 27 29 -1 12 66 -2 -25 67 57 -55 -9 40 35 -76 -14
3403 -14 134 -7 -72 -3 68 -20 -69 76 90 -75 5 77 51 -21 -55 81 -34 -67 48 -3 -23 -24 35 24 -68 30 67
3430F7r7L2L2j8l1l3J46p3r8J29m2L4j27P6Q1j78P2R8r4J0nQ2m3j29K08o7r0R3
3458C5k9O1j35L2J50k01M5J27m6j3j38J74L1j93J62m7qno8J54j33L5J03j65Q6
3483A4rj8L3j03J59j9j90K18l9o6Jn1K38k22n6K20r6rr1J21J29l05J41J04j60
3508e6R5j23J58L6k50K26j07j7J20j78J80j07NJ21k48K40j1k03J74q5J25j15j66
3531a86L76j93p7P9J2J66l11K4L33k92J5L1O8R0l36K35J41k33J16j44J61Lk21
3554a43K40j57N9J16k91K35j3r5Q3j78L14r9k81L07n2L8j85k3M35l65j23K77m8
3577E1L2k79J47L28m46J00J04j2R5l42K91O4k61K11j90J70N0l04K68j01M5P0l56
3600b65M05k0k63J48n5K85k90k24N15j84j14k1N8L38n03J3M31k34jj71J76K45
$$ plain form
3430 67 -30 2 34 16 -15 -48 98 25 -73 56 14 48 -79 -3 78 -100 -28 70 -24 -14 -19 63 20 -109 99 32 -58 35
3458 35 6 67 -68 -36 114 -87 -42 85 39 26 -112 62 93 -100 62 15 7 2 -66 88 -45 -10 93 -72 14
3483 14 5 -13 20 -83 76 57 -133 85 46 -20 -19 -70 168 -54 -110 110 14 5 -86 35 164 -141 0 104 -56
3508 -56 39 -84 74 110 -140 86 -21 -38 82 -96 84 -23 -18 103 -145 95 84 -119 55 -30 95 -20 -186
3531 -186 190 -3 -80 -1 11 177 -134 -110 223 -69 -54 -23 45 135 -201 34 175 -58 58 -86 75 78 -143
3554 -143 97 -60 -1 115 -176 59 46 -49 34 -144 170 71 -210 97 45 83 -102 -125 310 -55 -178 99 51
3577 51 83 -196 -49 279 -167 -67 37 25 120 -222 69 133 -128 83 -107 63 113 -191 77 -24 21 91 -265
3600 -265 140 120 -143 5 -50 235 -55 -279 236 52 -62 -83 -25 313 -190 -177 254 20 19 -152 24 269
3622B69n13K28J09r3J21l60L59J0k61K31k07K24O3m63L41Rk1j2k92M82j23l67
3644b66L02k2J96l34j10N89l76j25J33L9K28n07J46M12l99Q2p0J81J16m55K62
3665B2N3j00J37l23L06N5k99J96j87L14m4m45M41Lj46m5j32N52l67l04M60n7j5
3688G5k88Q9N19n41l6K83r9J62m17K41L24m82J94p9R6J81m55K80O9j12Q0l33M03
3711A54J3l72K07m0K28j58l78N79q5k97P2L3L76m98j24N79k23j29j16K19K74n54
3733b40J20K93j59O4l22L18J53m21K23q1J14Q8m24L09Q1j22nk29M73o2m49K88
3755A0O3Q3k75j32N93k85k56K09N4J35m38R9M61l67n3M1J26J39m44K21J75j72
3777a3O6k00K31J00l29J52m1J47j9l81L56J03k14j7q8M18k19l39L99k3q3j91J20
$$ plain form
3622 269 -244 -16 93 0 121 -239 120 130 -131 100 -107 117 180 -283 58 67 46 34 -258 224 101 -266
3644 -266 36 14 210 -124 -234 355 -21 -146 -13 26 254 -253 -107 305 -94 -12 -82 99 215 -240 22
3665 22 75 -25 112 -211 95 150 -149 47 -140 174 130 -315 126 129 -17 -62 -194 358 -9 -313 147 90 75
3688 75 -213 -124 395 -146 -182 101 2 164 -253 -12 312 -170 24 -55 41 222 -233 47 116 4 84 -249 154
3711 154 167 -205 2 -38 190 32 -346 233 148 -149 -77 -44 332 -166 -290 289 66 -63 -179 40 314 -240
3733 -240 -120 173 14 78 -244 74 227 -194 29 -52 62 150 -274 35 116 -6 -11 -240 233 171 -278 10
3755 10 73 156 -119 -251 342 57 -199 10 64 199 -239 -140 321 -46 -99 -58 68 207 -237 -16 159 -13
3777 -13 53 -147 84 184 -145 7 -34 113 94 -287 69 172 -42 -59 -147 271 52 -287 112 89 6 -185 -65
3800f5L56l74j57L01j1Mk47J68K79l53kQ7L7R3k79J70J08j23L4j68K05Q1k70M8
3824g8J20M5p7k41L70J3k79M6R6K19l16j46M11q9k10j5J70J62l23qK48o2q7n4
3848h5J24J19k33L7M3M7j5j44J00J19p3p8j9J35Pk31O7J95m4j80oK45m6k51J25
3873d2J70p9j65L2K32j04j88J23J03m4j17M0J50q8q7R1J2Mo6k6M7K3k1m4oJ30
3899H0l9j45J34L9kj96O6K32j82j11J60M0l7j67J53J39k49L0J06j5k5j47J96J7
3923G7j61J06l6J5Jo3J16p8L4P5j97J30M1r5Q5j29K01j28j29K30r0Mro3K00k01
3949f4mJ84j92J23j06O6J05k65K15K3j63J42j37J28n7j18K80k36J6J60j74J88
3971A14j88N3J77l42K34m3p6J95k40K10o0j65K72k01N8Q1k16K46j81R6J17l48
$$ plain form
3800 -65 291 -83 -240 61 50 54 -193 -25 254 -99 -101 -14 23 116 -163 7 115 -8 26 -142 63 144 -126 -78
3824 -78 42 87 10 -231 139 152 -127 -81 15 234 -82 -228 183 94 -116 -131 39 201 -122 -130 118 56 -31 -85
3848 -85 39 158 -75 -38 5 52 37 -107 -7 112 39 -39 -58 77 84 -147 -80 115 71 -109 -115 130 84 -167 -42
3873 -42 128 49 -116 -84 148 44 -144 -21 82 38 -79 -39 111 23 -64 27 39 43 -23 -49 -2 21 0 -44 -50 80
3899 80 41 -104 30 69 67 -129 -63 169 -13 -124 36 76 39 -128 25 164 -85 -55 51 36 11 -136 60 77
3923 77 -84 22 -14 1 2 -61 55 -23 11 86 -111 19 60 -35 50 -79 122 -6 -135 95 5 9 0 -63 137 -64
3949 -64 -68 116 -76 47 -59 7 112 -153 62 85 -78 64 -73 55 -2 -120 160 -76 -60 100 -74 114
3971 114 -74 -21 156 -186 48 5 -71 124 -116 94 34 -131 141 -60 -2 79 -137 109 -72 24 141 -207
3993b07L34j12q4J42k20L35k00j71L67k37R5m2j27L81l99P3K26k57K20k45J25
4014cK15m42L15p6p5K08l58K92J3k33K89l30K74P1m22M03k15J25ml09N12k55j65
4037a70K71k13L26k91j20N04m41J24j6o3L52n37K48K38l67K77k74K03J81n15L76
4058I3j05k0K01m92M97o4k95L19l22L86j28l92N69k52Lk2k32O10m21j59L96k36
4080f6K40l82N4N74o39J86N4m0K95o16L44K44m14K94k96K76J49o02M81j13k5J39
4102A37m93O18j35l41L08k55M15k73l74P08l20m5K1j27N76o28l6M86l18K06l79
4123b49K06M91p76L13J08j30K72o16M92J88n20L08k51K90O1n82N93j38n7M0l93
4144c50P29l67l14M15j90L20l65k23P96m95j15J22l2M77p42K00M78m54J98l61
$$ plain form
3993 -207 127 15 -69 73 -147 188 -12 -183 184 -53 42 0 -127 254 -145 -72 154 -103 117 -128 -3
4014 -3 212 -230 85 9 -66 142 -216 76 89 -144 145 -185 89 160 -262 141 -74 51 47 -262 250 -5 -170
4037 -170 101 -112 214 -77 -197 307 -134 -10 -26 -89 263 -274 -26 212 -155 122 -152 51 232 -283 93
4058 93 -12 -32 169 -323 174 110 -185 134 -188 198 70 -322 247 -5 -2 -24 -256 354 -67 -226 170 -66
4080 -66 174 -208 -154 420 -219 -33 21 -19 276 -340 4 248 -166 128 -168 108 257 -345 136 23 -2 137
4102 137 -356 262 127 -214 94 -161 254 -19 -393 315 -5 -50 -29 -156 420 -208 -244 242 -76 130 -249
4123 -249 -43 448 -328 -15 93 -37 235 -381 111 299 -221 87 -164 126 187 -395 198 60 3 43 -350
4144 -350 379 12 -302 113 -77 243 -122 -345 451 -44 -159 -37 -69 408 -334 -134 344 -110 88 -273
4164b73L30L28p79M18J10j64K03n55N63P1n53L80k05L43j11m90O33j90o8l7k22
4185b68P17n00l22N70k31K01l85j2P28o82QK37n1K99p09L97L54n15J61j74L58
4206A81Q9p03N03P5j68R7m09N66o2n07M35j75L03k56l52P24k71j59K8p0N30n60
4228a61j62O39k94M7l13J86N22p58J39K57o1J12n49M71K43n30K03r1K79j8n79
4249d18N75Jk05P0k98O04k66l48L88q2J77l27j65O63l52k12J45P2L06o22Q8N35
4271C29l73%j60K98K51o76K49K67j51k4k62M24O6m80K30mJ67r8l80M99q1j42L6
4294a5j35M54k95k78M04k8k8k75L7N36m22j93K93N6N9m83K35L95m00m7L7K49o
4317A50m38L05J49j76l2j17L16Qm09K80OO0j26j80L65n1j91MQ0K26k82j67L76
$$ plain form
4164 -273 57 385 -394 24 134 -30 173 -382 181 252 -301 79 -126 217 106 -384 249 59 -9 -46 -268
4185 -268 449 -51 -373 197 -34 167 -218 -230 498 -184 -176 61 10 309 -400 -3 351 -164 -3 -177 181
4206 181 270 -433 70 145 -23 74 -335 231 169 -338 97 -78 225 -31 -383 341 70 -89 -61 -131 399 -161
4228 -161 -323 316 22 69 -244 -58 464 -294 -155 102 41 153 -396 75 318 -212 -9 -100 179 161 -418
4249 -418 157 158 -47 23 -275 329 63 -285 103 21 198 -129 -294 369 17 -195 -50 22 328 -294 -206 329
4271 329 -44 -44 -204 94 345 -331 -82 185 34 10 -252 172 238 -242 -12 -16 151 53 -327 172 91 -51 -15
4294 -15 -150 304 9 -269 135 107 79 -196 -159 377 -45 -238 55 111 170 -313 -78 317 -83 -130 -93 156 150
4317 150 -288 17 166 -10 -42 -159 157 165 -244 36 42 102 -24 -204 161 110 -81 -77 3 229 -53 -220 156
4340A56n5j49j11J14L58m79l6L41j6j04k35K72J66l30j9J59J00j07j93K24R0k22
4362g6K3j1J84m7k30J57Q0lj69j9K58n2k25O7J74J2k03m9L09j04k14N3J87L7k54
4387a15j2K60o9j75N4J13L2j63j9J82m1q3m1J03Q1j66j3R1K5qj27N9J59j23j13
4412a09O8J04M5k34J40J20j62n6L5J75o6k36J87J00j55J6l1J67n4j89J86n3Qk1
4436a5n6J83j53mP6r3J56q6q9J67j19O7n9n7K50k81O6J34j22J22j87J03J12k13
4460i8J17kk3P8k00K42r1j70K56j91J20j8j23K54k58J10Q1k03K02j33L6Q8k24
4483a50K83j30j17K51k55K11r6j17K93l05J63O7k36K79j98N1J13k99L74j82j22
4504a22K81k84K56j86l2L09l99J78P1j39K17l33K17J35l41K95j46J9J22l57M12
$$ plain form
4340 156 101 -48 -159 -45 313 -166 -202 139 123 19 -216 56 222 -108 -127 32 132 25 -168 56 146 -76
4362 -76 -53 -64 120 73 -157 0 80 77 -92 -111 147 95 -130 -63 111 123 -80 -129 180 76 -138 -85 102 139 -115
4387 -115 -127 133 64 -111 -57 56 88 -75 -94 88 47 -36 -77 26 107 -59 -72 19 44 36 -91 -32 127 4 -109
4412 -109 -41 63 108 -126 14 134 -28 -84 -49 126 60 -176 11 111 -44 -28 -59 108 54 -135 51 -2 6 -15
4436 -15 -71 112 -41 -45 31 -62 94 8 -81 86 -33 34 -25 -82 168 -113 -47 87 -35 87 -100 3 115 -98
4460 -98 19 17 -6 72 -128 114 23 -147 109 -82 38 20 -103 151 -107 3 84 -119 83 -50 -14 74 -150
4483 -150 133 3 -114 137 -118 93 -3 -120 173 -132 31 98 -138 141 -57 -6 107 -192 182 0 -122
4504 -122 159 -125 131 -55 -87 222 -177 1 72 -67 150 -183 34 169 -172 123 -23 -4 118 -239 173
4525A73k11k0K19l26L11j15j94L14k70J92j3l06M99k77k0J10k07L61l76KL98l93
4547a49K19j87P6K96n29L30P5k38K41l73L50Q2m80M38k24J40P2m16N08k13r8J91
4569A11l15M25j93k54M38l08J85j51j72O13n07j0K63k32L21m63J83M12n36K15
4589B5p8P0K41o20M39R7l05K57l87M39j9m93M73j90J14L2m26N92k11j94K03k06
4611a47M70l94k42O05l83J24j40k2N51o69J05L20k34K11m12K48L51n93K46j9J04
4632H0J44o35N74J3l31K82l72N07j21n19N83j90N2m5l32O81l78k22L22j59L75
4653C09n41j9O59n19J09j09R7M07p54K98L38l57J59l41L57J87o09L70j8O8L8n35
4675d06O48r2l37K43k50N02k64m52O38j71n3q6j46O50m90j81L97j32K32n56K12
$$ plain form
4525 173 -38 -58 161 -165 146 31 -163 151 -119 73 60 -246 253 -24 -44 66 -141 220 -156 -154 244 -149
4547 -149 70 -117 -41 255 -274 56 131 -107 134 -239 111 193 -287 151 -73 67 139 -277 231 18 -80 111
4569 111 -204 221 28 -226 212 -96 89 -62 -234 379 -128 -138 125 -107 214 -249 -66 346 -190 25
4589 25 -53 17 258 -362 77 174 -131 126 -261 178 159 -334 139 -51 63 95 -331 261 50 -144 59 -147
4611 -147 323 -71 -313 292 -91 33 -107 -129 422 -247 -142 178 -56 155 -257 -9 342 -251 -5 -24 80
4632 80 224 -411 163 176 -155 127 -245 262 141 -378 205 15 67 22 -310 371 -7 -229 93 -66 309
4653 309 -232 -251 408 -111 -2 -111 -14 393 -361 -63 275 -82 77 -264 93 280 -329 41 23 91 129 -406
4675 -406 242 150 -187 56 -194 308 44 -408 230 59 6 -80 -226 424 -66 -247 150 18 250 -306 -94
4696i4N13o27J50J2J18K07o60L84K76m02J72k85L86Q4n90M66n3L3o3m25P02j88
4718A16l35K59j43M03l43l23P07k94j13l2M0M77o22LM28k04N8l75L33L32o38K05
4740f1Q2K7J32n79N00J44m01J72j75L77r1m99M65j3k8j11k02O09k94l27L08j5
4762B0K44m67m7O35m29j02P2J11K67n66J58L36k36J9k12K60K17n66K47J05JK2
4784H9m22M69N0l39J06j9K90j79l55M91m7j82p1MM36l48k26L61j5Pl19J41M22
4807C44m46l1J25J08N3l94K08K47k53j9n1K23O3m37K31J24m2n6k36L91l5k86J26
4830d3N7J70k45j73M21p9k47M3R8K40l77l6L21o9j17j26K06J71l18NJ31M9pk44
4854a69J94J47k46K2J7J45lk98K09J08r0j26rL03j47k18J41J46n5j59p4L53j45
$$ plain form
4696 -94 419 -208 -58 -46 72 279 -381 3 279 -123 49 -236 150 234 -356 110 57 90 27 -398 304 116
4718 116 -219 40 -103 300 -43 -366 341 47 -66 -98 -58 419 -203 -200 228 24 82 -293 40 372 -266 -61
4740 -61 21 48 180 -399 101 245 -156 16 -159 218 127 -372 93 80 52 -59 -261 348 54 -273 35 20
4762 20 264 -203 -250 385 -44 -146 -74 37 304 -262 -104 232 -4 15 -197 63 280 -286 -39 66 67 89
4784 89 -333 136 186 -153 -47 -66 224 45 -310 181 134 -48 -119 -115 321 -27 -253 108 93 100 -219 -78 344
4807 344 -102 -133 -8 100 153 -241 -33 214 -39 -58 -109 114 177 -260 -29 95 53 -3 -239 152 117 -169 -43
4830 -43 14 184 -61 -234 187 108 -139 -96 2 242 -135 -171 150 81 -36 -162 44 215 -103 -98 33 82 75 -169
4854 -169 25 172 -74 -52 -35 110 107 -191 18 126 36 -90 -99 204 57 -161 -20 126 71 -88 -162 191 46
4877D6k07J05J38L2k51O1K11r1j15J5J08M9k00NJ82k8o9r6J36R9j81n2J27N3q3
4902fj13J11J33j37p1R2J03r6j78K02J05j85n4P3J32j00j16J38O2p8o8K4J30o3
4926D0j55J17L0kl5o4J51l2j23N3K9N7j01n0J77n3p0j5J1J98k66M8J57p3k2j02
4952i5J16R9j80K2Q7q6O5j01J24J0j44J23o5M1M0j51J57p3j0M9j19J53o0o2J05
4977D5q6J07r8o1K40k14M0N1o1J32j73P5J31k12J30n1NP9j79J71k6j47K15j81
5001f8J02k5q2K05k26R3R6j67J49j11L7Q0j96J80o6p9J96k12J75p4j15K15k22
5024a15J69lj81K12j34O3M8j88K43j25n7J46j62K00j45o8K73k65Q2J4n2K01k87
5047a31J18J50k60J89j34P7J63l51K56m3m9J12k35K41n4j47J84j87J95m4k33L21
$$ plain form
4877 46 -161 -56 82 114 -137 -76 135 44 -71 -56 52 101 -99 -94 88 60 -9 -105 31 130 -51 -103 24 77 -6
4902 -6 -119 -8 125 -12 -83 9 112 16 -162 40 145 -40 -94 -21 111 11 -105 33 95 17 -51 -27 103 40
4926 40 -115 2 32 30 -5 -69 82 50 -73 -20 9 66 -35 -85 92 39 -31 -46 -35 163 -103 -55 102 29 7 -95
4952 -95 21 120 -60 -38 49 -37 28 -73 51 61 -83 40 -25 16 56 -95 62 -11 -21 28 -91 62 2 -60 45
4977 45 -41 66 -32 -93 147 -67 -27 24 -37 95 -78 -3 128 -84 46 -5 0 79 -100 71 45 -102 113 -68
5001 -68 34 9 -73 132 -94 -1 95 -72 77 -34 3 83 -113 67 1 -78 118 -94 81 7 -108 107 -115
5024 -115 54 51 -130 82 -52 11 59 -129 114 -11 -68 78 -84 116 -29 -97 176 -89 -7 7 -45 156 -131
5047 -131 -13 137 -123 66 -68 9 172 -179 77 34 -15 97 -138 103 49 -98 86 -101 94 50 -183 138
5069A38j46j3L4j73L86k85n7K45j83J41j77L2K53l14J00L5j7J78l80K25J58k84
5091a04J50j34J32R9l45K78p3j5O7k46L22o2k21K33j56J92j50j89M30k09l0K9
5113bq3L30l48l8L07j94R6j91R5K41l95J59R3o3J20l74L14R5l20K07j20J72J1
5136A12l73L62n6r9M1j57L90k01k11K73j11J52k22q5M75l54PN6l5K47m15J26K72
5159A94k28M3j22K04J33m30K16P5p0N4l09L98n6k96K31p7J74r3l04M29p6j36K4
5182b2o8L19k79j37L30j44Q1k38O5L74l88j7J41L7J16l87J86K88l48Q6q6K06J4
$$ plain form
5069 138 -8 -21 13 -160 226 -59 -116 129 -54 87 -90 -58 195 -119 -19 16 -1 177 -203 22 180 -104
5091 -104 46 -88 44 143 -202 76 3 -12 55 -191 131 69 -152 81 -75 117 -33 -222 208 -1 -31 -2
5113 -2 -85 245 -103 -141 166 -28 68 -123 -28 213 -182 -23 70 7 127 -247 67 162 -158 49 -71 101 112
5136 112 -261 101 45 -54 -13 -170 220 19 -192 81 -30 122 -100 -185 290 -64 -57 -1 -36 211 -204 -78 194
5159 194 -34 9 -113 91 224 -206 10 85 15 69 -240 158 102 -194 37 -40 134 41 -263 166 90 -46 -22
5182 -22 -90 229 -50 -187 143 -1 80 -158 -93 281 -107 -124 17 54 170 -217 -31 257 -91 -5 -91 115 129
$$ [...]
8191A6
##END NTUPLES=NMR FID
##END=
