##TITLE=1H_25-2025
 200.13MHz, CDCl3,
 8 sc
 
 11.2.2025
##JCAMPDX= 6.0         $$ Bruker NMR JCAMP-DX V2.0
##DATA TYPE= NMR FID
##DATA CLASS= NTUPLES
##ORIGIN= UXNMR, Bruker Analytische Messtechnik GmbH
##OWNER= pz
$$ XWIN-NMR		Version 3.5
$$ Tue Feb 11 15:46:49 2025 Russian Standard Time (UT+4h)  she@DPX200
##.OBSERVE FREQUENCY= 200.1313
##.OBSERVE NUCLEUS= ^1H
##.DELAY= (6, 6)
##.ACQUISITION MODE= SIMULTANEOUS
##.ACQUISITION SCHEME= undefined
##.AVERAGES= 8
##.DIGITISER RES= 18
##SPECTROMETER/DATA SYSTEM= spect
##.PULSE SEQUENCE= zg30
##.SOLVENT NAME= CDCl3
##.SHIFT REFERENCE= (INTERNAL, CDCl3, 0, 14.3821)
##AUDIT TRAIL= $$ (NUMBER, WHEN, WHO, WHERE, WHAT)
$$ ##TITLE= Audit trail, XWIN-NMR		Version 3.5
$$ ##JCAMPDX= 5.01
$$ ##ORIGIN= Bruker BioSpin GmbH
$$ ##OWNER= she
$$ F:/spectra/data/she/nmr/H-C/1/audita.txt
$$ ##AUDIT TRAIL=  $$ (NUMBER, WHEN, WHO, WHERE, WHAT)
(   1,<2025-02-11 15:45:33.53 +0400>,<she>,<DPX200>,
      <created by zg, POWCHK disabled, PULCHK disabled
       configuration hash MD5:
       00 E9 B6 7A A2 85 ED C7 34 08 36 98 17 FE 4E 26
       data hash MD5: 16K
       6D 15 A6 69 2E AE 20 38 C7 E0 E1 44 04 8D B2 82>)
$$ ##END=
$$ 
$$ hash MD5
$$ 90 2F DA 1A 41 FB 35 9B 27 C5 7A 85 E1 18 4D 5F
##$RELAX= 
##$RELAX= 
##$RELAX= 
##$RELAX= 
##$RELAX= 
##$RELAX= 
$$ Bruker specific parameters
$$ --------------------------
##$DU= <F:/spectra>
##$EXPNO= 1
##$NAME= <H-C>
##$PROCNO= 1
##$TYPE= <nmr>
##$USER= <she>
##$AMP= (0..31)
100 100 100 100 100 100 100 100 100 100 100 100 100 100 100 100 100 100 
100 100 100 100 100 100 100 100 100 100 100 100 100 100 
##$AQSEQ= 0
##$AQ_mod= 1
##$AUNM= <au_zg>
##$AUTOPOS= <>
##$BF1= 200.13
##$BF2= 200.13
##$BF3= 200.13
##$BF4= 200.13
##$BF5= 200.13
##$BF6= 200.13
##$BF7= 200.13
##$BF8= 200.13
##$BYTORDA= 1
##$CFDGTYP= 0
##$CFRGTYP= 5
##$CHEMSTR= <none>
##$CNST= (0..31)
1 1 145 1 1 1 1 1 1 1 1 1 1 1 1 1 1 1 1 1 1 1 1 1 1 1 1 1 1 1 1 1 
##$CPDPRG= <>
##$CPDPRG1= <>
##$CPDPRG2= <>
##$CPDPRG3= <>
##$CPDPRG4= <mlev>
##$CPDPRG5= <mlev>
##$CPDPRG6= <mlev>
##$CPDPRG7= <mlev>
##$CPDPRG8= <mlev>
##$CPDPRGB= <>
##$CPDPRGT= <>
##$D= (0..31)
0 0.7 0 0 0 0 0 0 0 0 0 0.03 0 0 0 0 0 0 0 0 0 0 0 0 0 0 0 0 0 0 0 0 
##$DATE= 1739274333
##$DBL= (0..7)
120 120 120 120 120 120 120 120 
##$DBP= (0..7)
150 150 150 150 150 150 150 150 
##$DBP07= 0
##$DBPNAM0= <>
##$DBPNAM1= <>
##$DBPNAM2= <>
##$DBPNAM3= <>
##$DBPNAM4= <>
##$DBPNAM5= <>
##$DBPNAM6= <>
##$DBPNAM7= <>
##$DBPOAL= (0..7)
0.5 0.5 0.5 0.5 0.5 0.5 0.5 0.5 
##$DBPOFFS= (0..7)
0 0 0 0 0 0 0 0 
##$DE= 6
##$DECBNUC= <off>
##$DECIM= 32
##$DECNUC= <off>
##$DECSTAT= 4
##$DIGMOD= 1
##$DIGTYP= 9
##$DL= (0..7)
0 120 120 120 120 120 120 120 
##$DP= (0..7)
150 150 150 150 150 150 150 150 
##$DP07= 0
##$DPNAME0= <>
##$DPNAME1= <>
##$DPNAME2= <>
##$DPNAME3= <>
##$DPNAME4= <>
##$DPNAME5= <>
##$DPNAME6= <>
##$DPNAME7= <>
##$DPOAL= (0..7)
0.5 0.5 0.5 0.5 0.5 0.5 0.5 0.5 
##$DPOFFS= (0..7)
0 0 0 0 0 0 0 0 
##$DQDMODE= 0
##$DR= 18
##$DS= 0
##$DSLIST= <SSSSSSSSSSSSSSS>
$$ [...]
##$SUBNAM0= <"">
##$SUBNAM1= <"">
##$SUBNAM2= <"">
##$SUBNAM3= <"">
##$SUBNAM4= <"">
##$SUBNAM5= <"">
##$SUBNAM6= <"">
##$SUBNAM7= <"">
##$SUBNAM8= <"">
##$SUBNAM9= <"">
##$SW= 18.0517328524113
##$SWIBOX= (0..15)
0 0 2 0 0 0 0 0 0 0 0 0 0 0 0 0 
##$SW_h= 3612.71676300578
##$TD= 16384
##$TD0= 1
##$TE= 0
##$TE2= 300
##$TE3= 300
##$TEG= 300
##$TL= (0..7)
0 120 120 120 120 120 120 120 
##$TP= (0..7)
150 150 150 150 150 150 150 150 
##$TP07= 0
##$TPNAME0= <>
##$TPNAME1= <>
##$TPNAME2= <>
##$TPNAME3= <>
##$TPNAME4= <>
##$TPNAME5= <>
##$TPNAME6= <>
##$TPNAME7= <>
##$TPOAL= (0..7)
0.5 0.5 0.5 0.5 0.5 0.5 0.5 0.5 
##$TPOFFS= (0..7)
0 0 0 0 0 0 0 0 
##$TUNHIN= 0
##$TUNHOUT= 0
##$TUNXOUT= 0
##$USERA1= <user>
##$USERA2= <user>
##$USERA3= <user>
##$USERA4= <user>
##$USERA5= <user>
##$V9= 5
##$VALIST= <valist>
##$VCLIST= <CCCCCCCCCCCCCCC>
##$VD= 0
##$VDLIST= <DDDDDDDDDDDDDDD>
##$VPLIST= <PPPPPPPPPPPPPPP>
##$VTLIST= <TTTTTTTTTTTTTTT>
##$WBST= 1024
##$WBSW= 4
##$XGAIN= (0..3)
0 0 0 0 
##$XL= 0
##$YL= 0
##$YMAX_a= 195273
##$YMIN_a= -237413
##$ZGOPTNS= <>
##$ZL1= 120
##$ZL2= 120
##$ZL3= 120
##$ZL4= 120
##$ABSF1= 10
##$ABSF2= 0
##$ABSG= 5
##$ABSL= 3
##$ALPHA= 0
##$AQORDER= 0
##$ASSFAC= 0
##$ASSFACI= 0
##$ASSFACX= 0
##$ASSWID= 0
##$AUNMP= <proc_1d>
##$AZFE= 0.1
##$AZFW= 0.1
##$BCFW= 1
##$BC_mod= 2
##$BYTORDP= 1
##$COROFFS= 0
##$CY= -3
##$DATMOD= 1
##$DC= 2
##$DFILT= <>
##$DTYPP= 0
##$F1P= 0
##$F2P= 0
##$FCOR= 0.5
##$FTSIZE= 0
##$FT_mod= 4
##$GAMMA= 1
##$GB= 0.15
##$INTBC= 1
##$INTSCL= 1
##$ISEN= 128
##$LB= 0.25
##$LEV0= 0
##$LPBIN= 0
##$MAXI= 10000
##$MC2= 0
##$MEAN= 0
##$ME_mod= 0
##$MI= 1.114404
##$NCOEF= 0
##$NC_proc= 0
##$NLEV= 6
##$NOISF1= 3.799351
##$NOISF2= 2.8
##$NSP= 1
##$NTH_PI= 0
##$NZP= 0
##$OFFSET= 14.38212
##$PC= 1
##$PHC0= -465.239
##$PHC1= 9.19221
##$PH_mod= 1
##$PKNL= yes
##$PPARMOD= 0
##$PSCAL= 0
##$PSIGN= 0
##$REVERSE= no
##$SF= 200.129724274929
##$SI= 16384
##$SIGF1= 3
##$SIGF2= 2
##$SINO= 400
##$SIOLD= 16384
##$SREGLST= <1H.CDCl3>
##$SSB= 0
##$STSI= 0
##$STSR= 0
##$SW_p= 3205.1282051282
##$SYMM= 0
##$S_DEV= 0
##$TDeff= 0
##$TDoff= 0
##$TI= <>
##$TILT= no
##$TM1= 0
##$TM2= 0
##$TOPLEV= 0
##$USERP1= <user>
##$USERP2= <user>
##$USERP3= <user>
##$USERP4= <user>
##$USERP5= <user>
##$WDW= 1
##$XDIM= 8192
##$YMAX_p= 0
##$YMIN_p= 0
$$ End of Bruker specific parameters
$$ ---------------------------------
##NTUPLES= NMR FID
##VAR_NAME=  TIME,          FID/REAL,        FID/IMAG
##SYMBOL=    X,             R,               I
##VAR_TYPE=  INDEPENDENT,   DEPENDENT,       DEPENDENT
##VAR_FORM=  AFFN,          ASDF,            ASDF
##VAR_DIM=   8192,          8192,            8192
##UNITS=     SECONDS,       ARBITRARY UNITS, ARBITRARY UNITS
##FACTOR=    0.0002768,     1,               1
##FIRST=     0,             0,               0
##LAST=      2.2672688,     0,               0
##MIN=       0,             -237413,         0
##MAX=       2.2672688,     195273,          0
$$ Real data points
##PAGE= N=1
##DATA TABLE= (X++(R..R)), XYDATA
0@%%%%%%%%%%%%%%%%%jOj3J6j6J6j6K1k9L2l2L7m5N2n7O2p0Q1r0R9j12J24j38
40g3J54j70J86k04K25k48K73l00L30l65M02m41M86n38N97o65P46q38R47j083J250
61F71j464J750k142K710l597N135q250J6645p6094j72777L53306O1515l19060
74a41652J18178K02621k21303o0506K43731n1574k33763J23455J78790j77030
84a9053p0428J66836n7388p8282J14031r136j05436K2941J02333j5515j23259
95g2356N4392J02906j05949j5608J23001q4807j08317J51330O6296k08507j8932
106a16551K17734o5530j82812J60561R5218k26859N3020K44334j92476j55728
116a69089K66101K2673k25973P5475J30703j22110m7157J51177l6583j58128J25163
$$ y = [0, 0, 0, 0, 0, 0, 0, 0, 0, 0, 0, 0, 0, 0, 0, 0, 0, 0, -1, 5, -8, 8, -8, 8, -8, 13, -16, 16, -16, 21, -24, 28, -29, 33, -37, 44, -46, 53, -59, 65, -73, 81, -89, 97, -107, 118, -130, 143, -157, 173, -192, 210, -231, 255, -283, 314, -351, 395, -443, 504, -579, 671, -793, 957, -1185, 1525, -2072, 3063, -5187, 11458, -64636, -237413, 115893, 177408, -141652, -23474, 179147, -42156, -102662, 141069, 89495, -144268, -20813, 157977, -19053, -89481, 77355, 19967, -58315, 55716, 46580, -58856, -35915, 66418, 50903, -72356, -17964, 84942, -21007, -36615, 86386, 1579, -106738, 44592, 110888, -97619, -116551, 101183, 35653, -147159, 13402, 108620, -118239, -65219, 179115, -13361, -169089, 97012, 119685, -106288, -30813, 99890, -22220, -69377, 81800, 45217, -112911, 12252]
127A2252R6040j63060L864J04372o9367j9108P0038k8325n7960M5120O7128n0175
139A0819o1690O5000M1144p3965j005O3751n5727m5190Q9008J3822j05234M362
151e4905J17636k7844j16085Q8248O7352j38379M0003J18952j26980m5256J39344
162F2086j4285j05979M4617P2021p2964k1136R3289n6868p4888J09197Q732j09496
174f5674M6091N8969o7191L676N9848m1002l1685N4940J9639n1248j8004N5992
186B4351J34n4460L2830K1687m5931J5724L0745j5322k7771L107N2048k6002n6582
199d5442O3277Q839o6415M5661L0756o3528P023N9445k5167m7898M0843K6402
211C3796n6580N815N2834m9411l0983P6915j4862p0916N7921K7679o3106J9791
$$ y = [12252, 108292, -54768, -50904, 53468, -15899, -35007, 35031, 6706, -51254, -6134, 60994, 10819, -50871, 14129, 55273, -18692, -19697, 44054, -11673, -56863, 32145, 45967, -59267, -54905, 62731, 34887, -81198, 7050, 74402, -63977, -23974, 94978, -32002, -77258, 62086, 47801, -58178, -13561, 58460, -14504, -35640, 57649, 781, -74107, 35090, 43822, -65674, -19583, 39386, -27805, -24129, 35719, -5283, -36968, 17972, 37611, -13637, -31641, 24351, 24485, -29975, 2855, 24542, -21389, -5665, 25080, 9758, -18013, -14906, 37142, 11140, -45442, 17835, 26674, -39741, 5920, 36676, -26852, -19829, 39616, 14449, -33449, 7394, 33796, -22784, -16969, 35865, -13546, -44529, 32386, 17524, -53392, 4529, 32208, -30898, -11107]
223a1107L5394l3172j3624L0642J3299m1374J551N1860l2957k3544M7380j5364
235H984k3952K5258P86j3176p534R531J4500k5576m532L3268j7043k0721L3502
248A3295m57l0940J9681J7958k4015p545K1308M973k9422O785L5875l7700j4129
261b4333N2895k8982l0074M6538q133k9642J8503J4097j3059j4465K3793R438
273A6576l4921J8969K5505l8040L544L1527k3546j2560K2101l460j3959M550P233
286C519l290j1730R323J3935k3629J563K6201k0038n252J9903r848k324L795K406
300D534L561j8286J2441J5624l2040Q975K1840k7335K324J8701j3847p034J0827
313B85O610j0720p057J9391j144k0114J8301R175k7740J2680J9317k7049M99J8353
$$ y = [-11107, 24287, -8885, -22509, 8133, 21432, -19942, -18391, 33469, 512, -23032, 24348, 8984, -14968, 10290, 11076, -2100, -9634, -103, 14397, -11179, -15711, 17557, 514, -20207, 13295, 12838, -18102, 1579, 19537, -4478, -12023, 9285, 14258, -15164, -8379, 27496, -10204, -24333, 28562, -420, -30494, 16044, 7911, -21731, -3228, 10869, -2190, -16655, 7138, 16576, -18345, 624, 26129, -11911, -8367, 23160, -386, -12946, 9155, 5695, -8264, -3714, 3519, 229, -11501, -2178, 11757, -11872, -10309, 15892, -4146, -9398, 10505, 657, -1667, 2128, 4534, 8095, -10191, 2250, 17874, -14166, -5191, 16649, -10686, -8362, 10339, -3508, -10542, 285, 6895, -3825, -10882, 8509, 7365, -12749, 5552, 14727, -13013, -333, 18984, -8065, -7566, 10787]
327A0787j2442m311M306K741k612r955J6571O21k2860K1938O110k2768J4908M848
341G882j1407O137O06J642k446o827J3943m246j5152J5278J331j7117Q977N979
355D580j2664K604O350j566l026j548J2264l868j3848K0275p23k2292K0725J535
369H798k0107J3588K830q896M47J344P551r898m287J8312j2671p830K0703j0106
383b22r396J6737k003p333N314J388O05k441k538N692o424o001J2878q178j0754
398a2676J4599k568o399P208l564L406N2l252J1196j1464m092K1394j3653q689
412h502J8000q026m716R815l608m939n18O175R89j3864M854J0894j2801K545J2071
427H369j3648J264J6598j0401m962P330m112K939k654n988N585o309K654Q146
$$ y = [10787, -1655, -5966, -1660, 1081, -1531, -11486, 5085, 5706, -17154, 4784, 10894, -11874, 3034, 7882, -3525, 2612, 3218, 4860, 2414, -4413, 9530, 5284, -9868, 5410, 6741, -10376, -1399, 4580, -8084, -5480, 870, -696, -3722, -5270, 6994, 3126, -10722, 9553, 8830, -13462, 7263, 8798, -11309, 2279, 5109, -3787, -3340, -1996, 5555, -4343, -8630, 9682, -2989, -10819, 9884, -222, -9618, 7119, 5116, -2217, 3097, 4485, 5090, 2649, 111, 5803, -621, -6622, 6256, -1922, -12676, 1923, -645, -7044, 164, -3400, 6, 58, -3194, 8002, -3462, -7554, 13840, 187, -8502, 9498, 1472, -3244, 6571, 2963, -1976, -2494, 3681, 4670, -9194, -4340, 6554, -6247, -3702, 8369, -5279, -4015, 12583, 2182, -2780, 4550, 438, 3377, 723, -5265, 320, -5989, -3335, 4811]
441D811j5108L455J0497p873L327k048l683R886n480J014O053j2751R185J3061
455A4346j6268m55J2247o806k175N541n588n463M216O751m567j2266J1674Q765
469I952j5259P782O310j7197J2084Q278j7891L025L588k289M015o491j12K499
483a706k791Q404n360j0022J1287M8m499L561o877L331R608p160K128L615q684
498e117J0687P227j7644J397J1696o815j717J964k124p28J065R710p405j3067
512a0871J9611Q69j7614J2764k740j1037J5174j990j1647N547L983J027j916l180
526b020K318k692K641M479j1550j430J1692m868k228M932p542N963Q534j2133
540c904K914M297r204J0382J355j3803N330P142j373l542k530Q097m603l263J1945
$$ y = [4811, -10297, -6842, 3655, -4218, -891, -2939, -6622, 3264, -2216, -1202, 4851, -7900, 1285, 14346, -1922, -2377, 9870, 3064, 889, 6430, 842, -4621, -405, 6346, 1779, -10487, 1187, 9952, -5307, 2475, 8785, -8412, 3672, 11950, -5941, -2916, 672, -1617, 2398, -4093, -4205, -1706, -4497, 3907, -1453, -11475, -188, -140, -4639, -1078, -7955, -4624, 4984, -2176, -48, 3567, -5117, 5570, 12797, -4847, -3450, 8246, 1431, -286, 1678, -446, -1174, -109, 9601, 2196, -10871, 8740, 9609, -8005, 4759, 2019, -9018, 6156, 4166, -7481, -1934, 2049, 3076, 1160, -2020, 298, -2394, 247, 4726, -6824, -8254, 3438, -1430, -3658, 1274, -6268, -305, 8229, -3904, -990, 3307, -5897, 4485, 5840, -7963, -2633, 4509, 3136, -406, -2936, 5161, 558, -2705, 9240]
555I240j2926p682J9948p243j1286J2311l759m188J1433l265p464N611M651k223
569C158m362J070K976m966M086M420j3309N312J1264j2616K573M855j0704Q877
583B634K112j1757O665J345l970N911j720k869J411K913L353r130p78J0032r962
598c810j565R936j1980j718J5588r294o134J2362m566l276Q513l420m228L628
612C6L956j047o707O489M093j0559Q389K793j4162J0073L663j3078P107O39o942
627e257P051p95l775L873N24M05n61n05K090l594R08L828q402J263Q094j0864
643e717R14J0055j1987R00J1404j0926n42Q967n559j152L963J194j538k485P697
658E188j365q561J1170j493j1260J1298j323j0378R185r53p224O718Jm123L602
$$ y = [9240, -3686, -11368, 8580, 1337, -9949, 2362, -1397, -5585, 5848, 2583, -4881, 730, 5381, 3158, -1204, -134, 2842, -2124, 1962, 6382, -6927, -1615, 9649, -2967, -394, 4461, -6243, 2634, 4746, -7011, -346, 999, -2971, 2940, 1220, -1649, -238, 2675, 6028, -3102, -3880, 6152, -3810, -5375, 4561, -7419, -9137, 6451, -2843, -8977, 3385, -1181, -4457, 4056, 636, -3592, 36, 3992, 2945, -3762, 2727, 6820, -3739, 4650, 7443, -6719, 3354, 7017, -6061, 1046, 1685, -5257, 1794, 999, -2776, 1097, 1621, 2026, 1465, 960, 3050, -544, 364, 4192, -4210, -2947, 5147, -5717, -4803, 5252, -6735, -5835, 5569, -5357, -5899, 3068, -2491, -3643, 320, 1514, -24, -2509, 5188, 3823, -4738, 6432, 4939, -6321, 4977, 3654, -6724, 2461, 1508, -5716, 1002, 1003, -3120, 482]
673D82K28J86J34j276K877k378j20M360o451Q68O427q590K992N302j1444N306
689a097O317j1755L868N165o807K428K572j261j254R48O110m796m327R800l733
704B178o315R842m783p370J0808k162p954O705r25l402M399j877j142O85N62L624
720B873m217r95O556m975J482M514q743M550M584q811M806M68p421P299O8o654
736d616L394J285j050R65j208J937j705J61O187o231l072R824m457m770Q189n674
752h41l585R512n008m240M604j708R35k46j533K581l144K833M268q170L279N443
768D980o533L693J363o846N931P87n511L357j538k299M672k758k389K325p04J577
784A07o03k019L787j964l98O019p093l98Q759o892j038O096o513J093M449m829
$$ y = [482, 710, 896, 1030, -246, 2631, 253, 133, 4493, -1958, -1090, 5337, -3253, -261, 5041, -6403, -1097, 5220, -6535, -2667, 2498, -4309, -1881, 691, -570, -1824, -876, 5234, 438, -3889, 5911, 2178, -4137, 5705, 922, -6448, 4360, 2198, -5756, 949, 24, -3378, 1021, -856, -1998, -1313, -751, 2873, -1344, -2339, 4217, -758, 724, 5238, -3505, 1045, 5629, -3182, 1624, 2092, -5329, 1970, 2038, -4616, -1222, 63, -987, -22, -1230, 707, -998, -837, 5350, -881, -3953, 5871, 1414, -3356, 4833, -841, -4426, 5086, 78, -4162, 442, -1266, -331, -577, -2110, 471, -2673, 160, 4428, -3742, -463, 4980, -1553, 2140, 3503, -3343, 2588, 3375, -2136, 1221, -317, -2616, 2056, -702, -3091, -766, -1470, 107, -496, -2515, 1272, -692, -1090, 4929, -2164, -2562, 6197, -695, -1733, 4363, -2150, -1057, 3392, -1437]
800a437N5K82O39J884m474K432K466n266N096J639p475N790K568n867L942j42
816B132l797M365j243l000K288k471P21J997m495K166P44k252M300k949j389N782
832B899m649J187M514o795L135M487o222J940K276l810K301l73j524R30j928K325
848F93K47m989M760J008n463N636J32n534O225o0m562M016j365j509K437k951
864a279J205K90l082L675j806k452M852l404m82M254m640J921L294m792K900K309
880B763m576M005M38l406L227r26j626J668k023R29M36l388L769p86m159N976
896B321j768m399O679k311k759N136k982j105L206k561J171p12j268L075k994
911a271q23L565m364R80L908n537J748L291m106K900J198l625L942J38k321K630
$$ y = [-1437, -1382, -1100, -461, 1423, -3051, -619, 1847, -3419, 1677, 3316, -4159, 1631, 4199, -1668, 2274, 2132, -1665, 2700, 1457, -1543, 745, -1726, -1005, 992, -3503, -1337, -593, -2845, 1455, -1494, -2883, 2899, -1750, -563, 3951, -2844, 291, 4778, -1444, 496, 2772, -1038, 1263, 890, -634, 296, -1632, 693, 940, -4049, 711, 1719, -3744, 1892, 2024, -3510, 2715, 2655, -1907, 2109, 744, -765, 1672, -1279, -74, 216, -2866, 809, -997, -3449, 1403, -2001, -2483, 1771, -2869, -948, 2346, -2446, 454, 2763, -1813, 2192, 2630, -776, 2451, 1525, -101, 1567, -456, 473, 909, -2479, 1290, 504, -3655, 2321, 553, -3846, 2833, 522, -2237, 2899, -83, -1188, 2018, -543, 628, -84, -1352, 1723, -1271, -2094, 1471, -2893, -1913, 1995, -3542, -1794, 1497, -2609, 291, 1489, -2136, 1806, 1944, -377, 2253]
927B253j774n28L066l018O03L70k713L797j959l338N191l102j377N584n054m93
943b492N506m022J2K712k385J472N33j242J261k511J523K119n034J529K381m633
959c271L290J724n765L841J886l761L063m02j896L655j735l07J348k581K914k81
975A722l419L280k112j388M669n022o09M687m481J026L261m872J852L586l242
990a062J176M87m19J764j504L60O00k895L421N77n567L904P28m589M785r70m386
1007c590N395p79k546K790j468N82J336j860J955j828o87L814l677j131L771m254
1023b177J017L032n499J578L099m131K029J654l487K823J096j959J370r21J629
1038A153J070l062K511l15l156N068k135m394N936k423l104N359l231j608M601
$$ y = [2253, 479, -49, 3017, -1, 602, 972, -1741, 2056, 97, -3241, 1950, -1152, -2529, 3055, -1999, -2492, 3014, -1008, -996, 1716, -669, 803, 1336, 94, 1355, -1156, 367, 2486, -2548, -1019, 1362, -3271, 19, 1743, -4022, -181, 1705, -2056, 1007, 605, -1291, 2364, 629, 322, 1670, -911, 2003, 1722, -1697, 1583, -529, -1917, 2752, -2270, -2879, 1808, -2673, -1647, 1614, -3258, -1406, 2180, -1062, 114, 601, 182, 1946, 442, 802, 1402, -1493, 1928, 2505, -3062, 842, 1570, -3019, 1766, 796, -3590, 1805, 1026, -1520, 1270, -198, 384, 1720, -140, 1815, -13, -700, 3114, -563, -1694, 2077, -2177, -1160, 1872, -3627, -2049, 1050, -3081, -1052, 602, -2885, -62, 1034, -925, 445, -476, 1153, 2223, -839, 1672, 1357, -1799, 3269, 1134, -3260, 2676, 253, -2851, 2508, -723, -2331, 2270]
1053B270k110m80J090r21J761j239l03K330l318J277K664m896J338K994n106K165
1069d84K025m990K764J318l464K557k3j563K213r58O81N81j839L280j152k625
1085a679M631k807j804M952m079j315M635l645o07L346k809N7K100j543O82n04
1101c89P67J199k664J953J678m288L042J505n516L724J135n204L621M77l779L002
1117B63m75j345J926j086Q23K4j438K993j825j006M197l326n85M465m618k22M080
1134B845m432J56L331l994Q72J672j874R05j98K05R20j777K393L37l240M018O8
1151B207m878M827l27m076M400j269l164L299r87j464J660j230R12l84o86K169
1167A009k157M10L710l947J41L871m008J048L177m906J217K620l786J293R61k488
$$ y = [2270, 160, -320, 770, -151, 1610, 371, 68, 2398, -920, 357, 3021, -1875, -537, 2457, -2649, -484, 1541, -3449, -685, 633, -2831, -274, -297, -1860, 353, -605, 76, 657, -1182, 2098, 946, -1679, 2952, 145, -1659, 3293, -786, -2101, 2534, -1111, -1718, 1628, -1181, -1124, 976, -567, 115, -389, 378, 1577, -1087, 866, 2544, -1744, 1298, 2803, -2713, 1011, 2146, -3058, 563, 1040, -2739, 263, -212, -1557, 369, -717, 106, 130, -1308, 1685, -140, -1146, 3051, -275, -860, 3605, -1013, -1235, 2845, -1587, -1431, 1900, -2094, -1222, 450, -1424, -519, -717, -512, 408, -1369, 1024, 1361, -1879, 2139, 2207, -2671, 2156, 1829, -2247, 2153, 884, -2280, 1019, 32, -1432, 228, -1002, -90, -474, -1160, 1009, -1148, -738, 2972, -975, -834, 3037, -971, 77, 3254, -1652, -435, 2185, -1601, -308, 653, -1835]
1183a835J780m46l56P02j754K646o7k676L605q89k664M902k104k871M689j918
1199G44k287L353k114r85K186j398j96r4l18J778j825J13K241l071J729K948m641
1216a837J939K574m348K591R09l646K344N42k258J740j233K94P41j790J809n62
1232a91j830L793j658j845L976k259j175M343l292j047L666k342m90J406j906
1247h51O50L68j119J027j876J209J634l257J745J754l687L259J168m221L205Q32
1263A840k715K309p36j486J701q36K4k25j482K174o55j573K627j572j012L665
1279B048k790o80L746k855J95K467l047J010J617k148J047m35o66R81j640M30
1295g20J041k607K126R32l258L178M60l204L309K36k825K845o01j355J799j291
$$ y = [-1835, -55, -501, -857, -155, -1909, 737, 670, -2006, 1599, 710, -1954, 2948, 844, -2027, 2662, 744, -1543, 1810, -304, -1289, 897, -501, -697, -791, -1109, 669, -1156, -1043, 1198, -1873, -144, 2804, -1837, 102, 2676, -1672, 919, 1828, -1818, 526, 1068, -1190, 550, -683, -389, 352, -1438, 371, -191, -2021, 1772, 114, -1731, 2245, -14, -1189, 3154, -138, -1185, 2481, 139, -351, 1055, -851, -201, 167, -952, 75, -1801, -592, 1042, -2215, -470, 1284, -2403, 856, 2024, -2197, 1008, 1840, -875, 1434, 698, -788, 913, 77, 101, -124, -1606, 568, -87, -1660, 967, -605, -1617, 2048, -742, -1422, 2324, -531, -336, 2131, -916, 94, 1711, -437, 610, 175, -491, 490, -1150, -720, 321, -2286, -160, 772, -2486, 692, 1152, -2052, 1257, 1493, -1332, 1513, 912, -443, 1356, 65]
1311F5K10M84j460J417q45j249K796k460n25K707k527J35K952k940P63K135k575
1328i17J511P54j996J558q06m95J309j635O40N68k279J915M41k505K751o77k074
1345a937L139j181j590K974j189n83J575j065K75N56j002J153j028r76K358k535
1361a056k27K364k795Q35K304l066J269J182k118J864L34j678J825q38j59R18
1377I58j676J170N97k245K084m87j904K280r51j663K851j730q29K602j608j96
1393g47J815j222R13J42j121J805j340l77J318k330N87J907k939J284J195k829
1409a939J944N67k375J970J69q95J170j082K70J123j303J302K51j936K396j069
1425E63j671K272j565j058K606k210m48K081j508N35J285j718J298K82p12J021
$$ y = [65, 275, 759, -701, 716, -129, -1378, 1418, -1042, -1567, 1140, -1387, -1252, 1700, -1240, -477, 1658, -917, 594, 1348, -648, 910, 104, -391, 918, -717, -77, 491, -1788, 127, 568, -1937, 814, 137, -1937, 1202, 21, -1569, 1405, 216, -367, 1208, 143, 418, 974, -28, 1125, 97, -879, 1479, -1056, -1283, 1081, -1714, -879, 1425, -1641, -372, 810, -1308, 556, 890, -788, 1037, 199, 40, 958, -718, 452, 1049, -1196, 888, 401, -1503, 777, -174, -1837, 1014, -716, -1545, 1057, -551, -747, 1068, -154, 759, 901, -220, 1585, 245, -132, 1186, -1144, -557, 1350, -1589, -305, 890, -1939, 5, 572, -1803, 167, 336, -559, 611, -471, -201, 922, -381, 921, 1172, -764, 1632, 563, -1108, 1164, -401, -1459, 1147, -1063, -1511, 570, -938, -403, 882, -836, 462, 744, 32, 1053]
1441A053j078J20J293j889J012O94k705K015N12k664J620L12k305K186n77j354
1457a755J639o07M91Q48j247J606o7j051J873j574q66K662k268n03K048k434M80
1474g25J473j880O90P16j011J033k06l86J018q08K48R93k094J772M90k156J882
1491A049l17k153K206n95k058K076q67o84J314q20L33O41o40J469n71p27J937
1508A593j461m35K017k353L77J974k653O36J122j976R70P62j705J124l00l52R56
1525B96j076Q23O25j208J687k21j613K270o70j980K287j244j263K125j287q40
1541a289J739j065L45J53m75Q94m87j26J494j747K79J985k549J010J263k184J117
1558C57Q49k216J239L9j239J046o90q5Q09r05N76N57j393J876n44j183K618j424
$$ y = [1053, -25, 95, 1388, -501, 511, 1205, -1500, 515, 1027, -1637, -17, 295, -2010, 176, -401, -1755, -116, -723, -232, 616, -631, 975, 908, -143, 1730, 156, -710, 1952, -316, -819, 1229, -1205, -725, 748, -1132, -442, 274, -737, 296, 90, -296, 722, -86, 162, 1155, -939, 833, 1323, -833, 1049, 732, -1421, 785, 190, -1868, 208, -659, -1343, -29, -849, -516, 125, -515, 954, 383, -344, 1593, 132, -303, 1714, -639, -262, 1712, -941, -305, 817, -1159, -189, 573, -1132, -8, -308, -660, 296, -780, 43, 668, -540, 1147, 926, -687, 1583, 913, -1067, 1220, -24, -1287, 838, -449, -1289, 450, -615, -270, -117, -592, 302, -185, -311, 1183, -564, -285, 1700, -849, 161, 1424, -760, 357, 1206, -1010, 229, 268, -971, 75, -615, -700, 109, -796, -220, 337, -1056, 820, 276, -907, 1711, 287]
1576B87j050K335j767o93K282j847j02J334j341J70O30p98O93r12L32J024j765
1593a188J118J156k148J578R06k218J461M24j886J349P0j567J375o21o06O53o56
1610h00Q05j29q45J683r65p10K052j610k78K295j736O7J675j897L03J325j731
1627d96N15R5p03N62o06p4P89j150J024N95j954K044L18k189K344q6j913K147
1645A262p31j238J442o80l73N43o71N77k96n64J316j328j36J933j568J10J634
1662A232j952M60J846k180O37J188j628R09j23r09O52n53K58K14j146J259k5j518
1680a379K014m60j313K273o94j499K378j078m86J279p70m63O71n51L14l51n05
1697f20J134j431M43J160j792N86J723k272R47R93j647J213M97j472J250m80l39
$$ y = [287, -763, 1572, -195, -888, 1394, -453, -555, 779, -562, -392, 238, -560, 133, -779, -447, 577, -1188, -70, 1086, -1062, 516, 1422, -796, 665, 1089, -797, 552, 622, -945, 430, -191, -797, -144, -800, 5, -124, -969, 714, -251, -961, 1091, -519, -797, 1498, -238, -171, 1504, -393, -90, 1235, -496, 19, 114, -589, -27, -633, -707, 82, -1068, -44, 551, -1403, 641, 959, -1230, 1114, 1028, -885, 1262, 531, -707, 735, 55, -318, 225, -446, 131, -165, -729, 587, -741, -877, 1056, -512, -402, 1232, -720, -260, 1586, -594, 43, 1231, -397, 512, 389, -520, 132, -421, -163, 51, -1095, 164, 139, -1379, 635, 175, -1138, 1135, 441, -1058, 1320, 242, -244, 1035, 265, -198, 473, -78, 236, -115, -620, 514, -917, -474, 686, -1106, -520, 1203, -1069, -122, 871, -776, 437, 934, -538, 712, 232, -107]
1714a07P22q81K45J98j165J087o6j295J625n93r98K055j121m51J891j171m08J386
1732I53j088K23O50r38N49l95j25O37j157N53R04j807Q68P87j975J354O45j787
1750a149J760N2j327J250Q8p47N79n66J88L02r08R99n14q63J622j130o15J839
1768H60j333l78J730j424Q1J267j247M33P97q54M56j17k37P10j004K24O66j680
1786a050R51M78j850J489K09j553J778l69r47J395k89n04P31n38M50n0o42J047
1804G36o16n99J509j406l63J409j306J54J055j649L38J268j146M62N37q30J106
1821F59l80p9P25j054K71O14j659J163J45j556J550n09j091J775n65r72J524q70
1839c09k4R00q02K55K08l38R51p12m29J396j316j33J382j925N22J007j732P58
$$ y = [-107, 615, -266, -21, 177, -988, 99, 33, -1262, 363, -230, -1228, 827, -294, -745, 1146, -25, -433, 953, -135, 88, 738, -200, 349, -46, -171, 466, -691, -138, 766, -1041, -173, 614, -1361, -7, 638, -1149, 611, 663, -664, 586, 674, -73, 506, -60, 128, 430, -478, 521, 7, -856, 766, -364, -979, 860, -473, -851, 879, -545, -464, 803, -444, -11, 786, -68, 388, 271, 34, 744, -260, -36, 630, -1050, -99, 379, -1471, 18, 227, -1326, 452, 83, -864, 531, 242, -262, 469, -69, 381, 331, -311, 736, 120, -479, 1030, -376, -739, 670, -636, -482, 573, -1076, -738, 530, -616, -154, 383, -447, 659, 279, 200, 925, -129, 142, 756, -903, 260, 405, -1151, 399, -110, -1201, 574, 9, -963, 561, -309, -333, 567, -235, 20, 228, -110, 841, 129, -300, 1096, -220, -353, 1029, -896, -374, 633, -1099, -341]
1857c41M43j034J153m0q33J017k63P3O02j202O72J80j089J389m81j086J368n55
1875b7r15J762j034n18J188r34J89N67p96O44R5l42P90o42q5R58j392L30J115
1894I53j763P80M78j396J118L75j421J080j84k45N00m83K0M12n90P75o9j268J627
1913F99l32p67J532j008p78J528j111m40R85j041J17O58o91N38N9j92R54o23K0
1932A07N10q89N49L29j393J093L09j428J189K69j365J131l04o16N53m17J43L36
1950A06p18Q00j88m91J233n50o71J584r11p01J683j325k44Q12r77K61L45o04Q06
1969B50m75l76R09r24K97O24j069Q76M14j172J312j61q49J088n9j220J177n41
1987A01l01N75r18J54K52l81N75k13m25J325r71l53J686j098q1J236j628L69N80
$$ y = [-341, 102, -932, 221, 181, -652, 365, 102, 175, 777, -425, 247, 427, -662, 727, 246, -840, 528, -27, -942, 820, -214, -732, 456, -478, -289, 278, -518, 126, 221, -121, 669, 27, -58, 900, -492, -162, 953, -810, -30, 448, -948, 170, 545, -876, 204, 20, -225, 275, -208, -188, 224, -366, 409, 340, -928, 699, 367, -400, 1132, 124, -654, 874, -237, -677, 308, -733, -616, 42, -649, -111, -52, -244, 710, 87, 107, 617, -272, 277, 606, -787, 306, 615, -813, 376, 645, -720, 411, 107, -509, 44, -373, -230, 106, -612, 188, 0, -491, 742, 192, -479, 1105, 194, -507, 1176, -149, -393, 419, -558, -297, 48, -556, 250, -225, -601, 308, -616, -319, 305, -764, 112, 526, -646, 666, 505, -344, 744, 685, -535, 642, 101, -200, 375, -543, -389, -137, -518, 57, -156, -581, 744, -227, -580, 1106, 8, -73, 1163, -465, -96, 484]
2006D84j065P45J22m67N09m58j24P77j397M46N30j053J019J94q80J078J25j049
2024d64J142k10p54J026n80l73M86r25M58J46m45N84k50l37J258j158M8R82j315
2043f81Q85M80j216P39P22j372P00J37n39N41l98P0K39q49M80Q9r94R90J83q18
2063f12J238l80n80J191r30j80Q36o83j15Q28p65K13j36k91O42m68j02R30j296
2082f60K85R03j427O79P78j230P84L27j002J266m11o62P84l77j28L34p89N99O0
2101A13q28J249p12l65J116o84k97J170j055j46J250r73J69N35r29N64O7n62P57
2120D39n05k90P56j047O65K25j028O68J89q74J015K45r93J024l04o01J085n30
2138A39N4K98o33M48j20n40Q27n32o22J301r76jR27j105J04R93j088N62L56p70
$$ y = [484, -581, 164, 286, -181, 328, -130, -254, 523, -874, -428, 102, -951, 68, 262, -618, 460, 585, -464, 678, 468, -286, 740, 160, -213, 273, -652, -194, -48, -493, 91, -159, -496, 762, -396, -348, 634, -681, 204, 684, -532, 207, 929, -443, 257, 394, -145, 396, -2, 68, 307, -542, -62, 27, -967, 23, 206, -612, 626, 246, -334, 857, -73, -253, 583, -100, -215, 613, -152, 61, -75, -366, 276, -192, -294, 636, -660, -375, 528, -899, -220, 558, -672, 112, 439, -563, 703, 292, -370, 414, 37, -91, 243, -546, 53, 113, -715, 534, -178, -543, 573, -111, -408, 762, -293, -439, 811, -162, 7, 542, -387, 177, 244, -318, 439, -66, -356, 400, -647, 18, 243, -785, -117, 72, -802, 213, 458, -535, 489, 185, -416, 669, 139, 193, 491, -142, 306, 186, -354, 473, -59, -681, 620, -356, -357, 570, -535, -431, 562, -526, 36, 392, -378]
2158c78N30M2l50O71n49R4N36j068L79L90r43P35M3j021J143k75o86J024m57j81
2178c21R84p66L06J56n13N51kn98Q11o96j19Q13r57j58Q45r14L76M28q72N58L35
2199B47q46Q23r0j88N13m36K85K94r32N60L8j000J144m77p83J228o79n76J142
2218B67m87p8R66j015M28M52m95O37m60k79M33m06J52M71j107M28N81j297O81
2237a28L49j228J008R7p21P70m8m35R76p61K67K19n43O84k03o14Q73n61n81J285
2257G05r86k37Q37p42o7Q97q13K20L63m30M45J77o76P97n92k8Q51j004L42M29
2277D88j039M32K16q38R36k61o93R26k34k43O71n13N06j06o06J024m74n46J096
2296G42o38o20J326r09j18Q71r36N2M45r10P28O2m06K89r9K0M54o42L99M93r21
$$ y = [-378, 152, 194, -156, 515, -34, 60, 596, -472, -93, 297, -646, 89, 132, -889, 254, -21, -707, 317, -140, -321, 663, -103, 203, 359, -154, 397, 395, -203, 608, -88, -207, 606, -351, -509, 336, -578, -202, 226, -646, -88, 247, -599, 224, 134, -54, 459, 23, 308, 602, -330, 230, 268, -732, 412, -65, -848, 380, -299, -875, 267, -220, -298, 668, -347, 81, 533, 38, 675, 215, -64, 369, -37, 115, 586, -521, -93, 488, -809, -128, 221, -1007, 1, 98, -623, 147, 99, -336, 640, -121, 146, 365, -178, 506, 303, -311, 562, 1, -580, 705, -281, -518, 319, -423, -490, 407, -406, -186, 177, -253, 192, 369, -307, 490, -102, -130, 721, -283, 59, 488, -551, -119, 97, -741, 195, -66, -759, 167, -67, -310, 361, -152, 354, 248, -358, 666, 192, -354, 742, 104, -516, 810, -99, -217, 654, -282, -230, 215, -695, 33, 95, -311, -22, -121, -101, 353, -289, 110, 603, -318]
2317c18Q72l6r86Q46k18q35Q18k58m14P86m53j82O37m23J92J52m01O46m33j65
2337a73O69o96P0Q72r55K39O25j019K35M26p41L13Q3n31O04l74J95O22p55L77
2357H6K97o98N36J86r78J116l45q14J209p65j53N82p36M51J47m52K10K92o20N72
2377A23j07m6P28q07O3P50q46J44O39j096M77P6o47K77K97m26L55k85J36M55q89
2398f29O47m2o18P16m1l93R32l96l05N55n17j41R36r54j9N14n57J69L5m16P93
2419B69m07p3O80o35M22M25q93N57L12q02L07K89r23P90j95k43N59o48K15p9k48
2440c21K28J32p65R84k07l86R58p02o0P04n84j72O37m49Q5K55o66M64l04k13M35
2461E3l32K9O69q27M36L80r39O83on76P62k25l43O24k49n8J12k59oK64n97N68
$$ y = [-318, 554, 518, -468, 378, 160, -675, 143, -115, -529, 257, -196, -378, 259, -164, 28, 180, -221, 425, -8, -173, 496, -200, -130, 742, -213, 26, 651, -368, -133, 293, -448, -135, -52, -583, 21, -353, -158, 464, -291, 86, 383, -315, 221, 407, -571, 545, 200, -614, 595, -170, -323, 259, -477, -26, 121, -331, -121, 171, -449, 123, 16, -30, 698, -109, -46, 704, -142, 2, 641, -455, 22, 98, -549, -272, 25, -401, -46, -331, -195, 260, -629, 18, -24, -642, 74, 33, -360, 572, 176, -129, 426, -91, -232, 704, -250, -269, 245, -312, -143, -108, -524, 269, -138, -211, 469, -166, 256, 681, -212, 345, 657, -145, 162, 451, -472, 318, 123, -120, 439, -209, 6, -73, -321, -93, 39, -726, 258, 51, -335, 623, -79, -139, 565, -19, -191, 446, -3, 82, 337, -329, 135, -169, -382, 53, -279, -250, 419, -408, 28, 408, -531, 152, 146, -430, 332, 107, -236, 388, 139, 81, 193, -66, -72, 192, -405, 163]
2483A63j00p90J026n79j81J130q59q8P79o42J08M57n31J80j08o1L47k76j31L83
2503B27o36L75J52o98L21L53n64K99M83p87P12M2m98Q40n61j21O43o82K27Q5m97
2524b85M25k09l07N76l75p4N92p75K55N38o21R1M96n24K56L80n58M22j24j77L61
2545C63m83K6K72r16Q33N8p56R22m36k38O70n27Q8M72k36j05L56n08L51J01l50
2566d3M27m06k67O37m30j25L33l12j01M69n23L82L88p45N52j54l02M50k82K74
2586B22L09j022M55M9m12N36j6n92P15l64k99O38n03nO11o05J04N49n57M17k56
2607b6K6K41k23j91M45o04L36J71p97M41K27m17L92M7m66P07k73k28N21m25J47
2628E1K61m61M43j48o48O05k03l11P30n70r1N23m94q6O30n52K33K90l75J98K14
$$ y = [163, 63, -727, 299, -280, -461, 669, -190, -278, 501, -141, -33, 424, -107, 73, -35, -96, 251, -25, -156, 227, -409, -34, 118, -580, -259, 94, -470, -171, 312, -475, 237, 279, -219, 621, 60, -61, 582, -100, 127, 212, -285, 140, -69, -376, 200, -175, -249, 343, -432, -177, 361, -260, -169, 327, -197, 59, 439, -119, 303, 179, 2, 363, -120, -94, 178, -738, 95, 153, -603, 319, -117, -355, 315, -212, -124, 348, 112, 7, 363, -145, 206, 307, -43, 384, -22, -289, 348, -82, -207, 126, -186, -287, 182, -341, 41, 429, -316, 236, 82, -220, 230, -52, 222, 531, -491, -36, 13, -399, 137, 121, -471, 244, -120, -419, 219, -284, -289, 322, -283, -179, 370, -187, 230, -26, 0, 241, 18, -173, 272, -332, 4, 175, -622, -181, 46, -371, 21, 68, -398, 309, 36, -192, 329, -96, 51, 312, -149, 294, 146, -502, 103, -100, -411, 319, -251, -342, 181, -313, -399, 231, -321, -88, 202, -173, 25, 239]
2649B39n35N88k34r9L22l25J57R9o62N83n9n42M16L8m58O68k77l42P25j05k78
2670h1J61j93L87L8n00N00j65k26L70n44J34M31m08L3M10m60P9J36m59M85j02
2691B6l77P48l40o7K56n48M30n6m36N81J3l06L31k68l54L74m08J60K93q1J1K20
2713B02l18K75K7k59M33m55R8N74n65J2K96p02L70K80m58J38K03j89J11j64r1
2734a82L63m71J55M1j97N42n1l57K66k7m12M70j05l79M26k35m5L39m32L74J05
2755A88m07L12n5q7K28l13N7L41k73K46j50l2K37L9o34M48n0m46N44k35k35K28
2777d9l79N19J33n31M77K2m93P30l47l23M28l52M0K34k48J90K17m82Q3L38m11
2798b04J49j46J2L00k64N7L10j79J09K33m86M87k27k85K72j04j64J58j32j00J56
$$ y = [239, -296, 292, 58, -41, 281, -44, 113, 212, -450, 133, 74, -468, -52, -14, -472, 196, -81, -423, 302, 197, -81, 80, -113, 274, 312, -188, 312, 147, -79, 291, -253, -119, 312, -96, -63, 347, -113, -34, 102, -357, 128, 26, -351, 397, 57, -10, 246, -302, 128, 72, -364, 217, 230, -76, 255, -13, -367, 7, -401, -241, 52, -29, -18, 202, -116, 159, 186, -73, 360, -95, 3, 577, 12, 24, 320, -382, -12, 268, -190, -52, 151, -38, 73, -91, -182, 181, -290, -135, -94, -291, 251, 200, -157, 109, 82, -330, 140, 35, -344, 82, -153, -198, 141, -291, 83, 188, -219, 93, 38, -49, 179, -134, -77, 264, -9, 237, 87, 55, 292, 331, -303, 145, 95, -351, 193, -42, -277, -49, -428, 91, 224, -307, 170, 192, -301, 429, 82, -241, 187, -165, -125, 109, -139, 51, 268, -214, -131, 207, -204, -55, -201, -189, 111, -153, -96, 214, 35, 144, 377, -109, 378, 151, -134, 138, 34, -130, 28, -104, -204, -48]
2819d8k35L08j63j78M44j43l37N91j40l58O45m65lM28n57K00K77l96L39l01j20
2840b12J19l7l5K57n45M49K26m19K12L94m34J21K22n21O05k20l14M44m70J59L53
2861C54n35J35l0l50N70m68O5M34m10J37N46n91L08K92o04K53J49l31L20k78l33
2882c67M46l99J76K73m04K58K20q86J004l36l99N03j39K6N19p12N1N04n30M27
2902B35J00l66Kk3k24M40k75J13J64k92J10K94m07Q5J94k36J15M9j53N29m47j29
2924a22K56k63O8J76l18J23N3l45L87L7o00O11j5l87M37o5k22L24k18J95J97m71
2946a62L16k29j87K22L0j30K75m71J42K68k97K72Q7l31K83M4l34L85k40J32M7
2967A22j59J65p4j33K01l08Q7M37k37m45M92n22K82J79k34n4L71l75K94p0k10
$$ y = [-48, -283, 25, -138, -316, 128, -15, -352, 239, 99, -259, 386, -79, -82, 346, -211, -11, 266, -130, 209, -92, -212, -93, -130, -165, 92, -453, -4, 222, -197, 15, 409, -25, 96, 318, -203, 402, 182, -132, 312, -158, 1, 354, -181, -46, -76, -426, 144, -324, -259, 175, -235, -98, 448, -143, 165, 457, -147, 106, 255, -76, 244, -34, -367, 79, -320, -144, 129, -275, -17, 203, -683, 321, -15, -414, 89, -50, -24, 495, -217, -166, 338, -192, 235, 335, -31, -29, -52, -276, 164, -111, 2, 166, -126, -16, 278, -129, -44, 150, -86, 29, 78, -75, 454, 7, -122, 134, -129, -61, 115, -203, -80, -27, -372, 15, 52, -548, 63, 48, -339, 98, 33, -189, 135, -83, 112, 309, -162, 154, -75, -262, -40, -10, -140, 135, -336, -194, 74, -223, 49, 136, -195, 88, 132, -202, 183, -57, 75, 122, -37, 128, 54, -79, 122, -186, -99, 338, 101, -344, 148, -374, -92, 87, -147, -201, 170, -205, 89, 19, -191]
2988a91M76m70J54L78l57j03K93m13K35P3m65J43M34l29K23j1j69K40k69J14K46
3009B32p9MR8k77L49k45j93K25j72j93M36l11J47L40n81K57J65m94K52K40l37
3030a37K58j41j10L67p11M58J6k43L31m8k68L68k88rL68k93j2L08m19M6K77j80
3052f2J31J08k99L79l19j58M78l49L7L00n20J58K93m89K75K14m23M05pl96M29
3073A85j84K49l03k58M80j08j55L19p8m15K94R4l06K45k77n1L44k42J46O2p1m3
3095g3j02M02j97j72J47K87l16Q6K34m19J37K79n09K20k2k81L22Q8k37J12j23
3116a37J51M4j00pJ57k28J06J63j54K31l21R9K62n31P8M76k93k54K58j42Q3M8
3138a1j55L77q3j29p9l4K23J34k76K33J1m41M04j32j39K84m29K13J54l57J02L73
$$ y = [-191, 285, -185, -31, 347, -10, -113, 180, -233, 2, 75, -390, -247, 187, -142, 81, 70, -99, 141, -128, -14, 232, 153, 157, 255, -22, 327, 82, -111, 114, -58, -251, 185, -126, 21, 361, -220, 37, 202, -292, -40, 200, -137, 121, -20, -130, 237, -474, -16, 0, -243, 88, 40, -228, 140, -148, -157, 211, -82, -94, 214, -205, -159, 118, -62, 69, 177, -122, 257, -62, -220, 258, -91, -54, 246, -274, -116, 177, -312, -37, 177, -246, 159, 152, -244, 185, 1, 250, -53, -311, 169, 61, -94, 225, 147, -268, 26, 120, -186, 59, -218, -269, 75, -167, -21, 41, -30, -73, -175, 227, 30, -142, 5, 292, -24, 62, 296, -123, 14, 293, -216, 4, -18, -299, 23, 111, -126, -14, -137, 14, 58, -42, -49, 108, -120, -14, 149, -5, 226, -95, 4, 266, -265, -187, 289, -4, -258, 0, -142, -59, -11, -166, 211, 128, -1, -80, -114, 109, 243, -33, 200, 211, -230, 174, 42, -97, 187, -242, -29, 125, -232, -130, 243]
3160B43k54R5p0j61K24n7m0K10k06k19M09k28J05J06l65K45K2l10L18j1j96j8
3182a58j74L27J41l37K88j3k48M65j75j18J68k10j35K92k7k91K05l5j25J58k9
3203c1J66L0k73L76k96j21K49k55N5K81j66J34j62j14K19q4k54K89j69J13P1n65
3225e07O18M7l46J79J97n27M94nj32J21j08j60P05p95J06J27j34K05P3k98Q3p4
3247a31o7K98m48K93K60k91k6L37m32L29j22n8J57oj24N8Lj2k5j72K53J5j88L29
3271B30j88k84K26po4K82k27J0K02l07J13K46j15j67J8j72K20l48J57K93k90M4
3293a28J49k31J61J98m39L86M3l16M59j83j08%Q9j66L60n00L73p8j36K42j44l89
3315c58O08m86J87J09r7p8K08k2PN6j61k7J16q6L09l16j96L31k50J96O3m70K52
$$ y = [243, -11, 84, 14, -147, 77, 20, -20, 190, -16, -235, 174, -54, 51, 157, -208, 37, 59, -251, 67, 56, -140, -158, -332, -5, 136, -201, 87, 74, -174, 291, 116, -2, 166, -44, -179, 113, 86, -205, 0, -35, -160, -2, -31, 135, 165, -108, 268, -28, -149, 100, -155, -100, 181, 15, 149, -13, -127, 92, 8, -246, 43, -126, -13, 58, -507, 111, 158, -188, -9, 188, -339, 155, 150, 18, 139, 31, -129, 576, -219, -113, 14, -120, 85, 158, -140, -57, -131, -198, 100, -348, -55, 205, -86, -112, 225, -207, 122, 0, -58, 99, 93, -31, 27, 30, 18, -7, -179, 74, 89, -99, 230, 42, -242, -16, -23, -87, 195, -32, -22, 180, -127, -14, 232, 117, -50, -32, -204, 16, -332, -175, 118, -172, -128, 21, -210, -49, 149, -290, 96, 139, -177, 282, 99, -9, -9, 80, -86, 274, -226, 147, 69, -67, 175, 31, -358, 250, -236, -49, 60, -37, -115, 93, 71, 78, 134, -27, -54, 62, -24, 285, -31, -227, 104, -146, 50, 113, -357, -105]
3338a05K21k84K82j09qJ05P4m40M13l62L56K3l20K39j11j56K69m11K70K07l29
3359a76J74L01o18M93j89k84K46J75l94N24k15l10M56j43j42R8j59J07J4r4N4
3380h2R5j32J66J09m78L44j70JM07m20Q3J64m6K55m17J27J73k63J8J86k72m7J92
3403gj47K03k44J06K12Oj67J58J80n83L28k38J35J72k98L99j06l17O4m0N3J38
3425Gk96L5L90k14r7K12l64M47o5n8L03j87j47L36l79M7K87o8k04J11j72J67q0
3448A1j26K62l5k95L47j19j70J60j42J89j74j72M06k34NJ59l15K15K16n10L5M92
3470B05l09n5L37m65L33J54k39Q1q2J8K17k16R1M3k34L1J88j5J7k21J14L5p3k30
3494b75K89p6K22L3j01j32K3l53M79k01p9L69l61Q8J16q9j10L41l85J11J73j55
$$ y = [-105, 116, -168, 114, 5, -3, 102, 176, -264, 149, -213, 143, 166, -154, 85, -26, -182, 87, -324, -54, 153, -176, -2, 299, -319, 174, -15, -299, -53, 122, -272, 252, 37, -273, 183, 40, -102, -4, -163, -56, -42, -136, -82, 13, -119, 47, 156, -322, 22, -148, -147, 260, -160, -77, 87, 41, 296, -121, 6, 179, -84, -66, 120, -152, -199, -7, -154, 49, -195, -89, 123, 129, -38, 120, 300, -283, 45, -193, -58, 114, -184, 215, 109, -208, -144, -184, -131, 7, -289, -254, 136, -78, -175, 37, -327, 120, 55, -3, 300, 113, -34, 302, -77, -30, 257, 189, -15, 96, -76, 91, 11, -115, 147, 112, -183, 164, 45, -125, 35, -107, 82, -92, -264, 142, -92, -87, 72, -243, -28, 188, -322, -287, 205, -104, -159, 178, -287, 46, 200, -39, 42, -40, -22, 195, -21, 70, 113, -121, -90, 98, 83, 100, -121, -7, 28, -45, -275, 14, -62, 160, 193, 92, -40, -17, -370, 109, -92, -171, 198, -163, -75, 41, -48, -158, 183, -202, -91, 82, -73]
3516g3M9J05n3J30k84K81P0k80QJ72l23M42k15o1O1j1j66K63L5j86pk76O2K31
3540b6O4j58m8J49o1K46j84Q4j58J49K02k71n9L46m21O7J54l03K55r2j43L15j02
3563EJ4R6q7q6J09LK84k74%j99J21M9P4k04J44P4k17N1Q7k72J55k7N4M12j48k72
3589e4J76r7q9J73n5kl4J43j60J57m64K54R3p9P4N8j1k31J74k62M54m16N84j33
3613B53k56K33j38k63O87n33j05J96j54J03J38k70J79j60n5M70m30K29n9O7m1
3634I1J24m56J46J47K9k22K71k26K61Mj76j4R4m4p8j00K96k09r1K91k05J54J1
3657I8k03P3J94l46NL57l65L34j85j4K02j16k45J45J38k13L43k00K21j81Q6k21
3679i3K38l03M73k98J1J12l06J52M5o3J8J21k36O9o9J79k22J49m9L77l53k19L55
$$ y = [-73, -24, 81, 28, 158, -126, 155, 225, -55, -47, 125, -198, 244, 29, -32, 29, 18, -148, 115, 150, -36, -43, -319, -257, -26, 38, -120, -168, -19, -80, 166, -18, 66, -92, 57, 259, -12, -71, 275, -146, -79, 75, -228, 27, -65, -208, 107, 5, 19, 115, 28, -58, 51, 54, 338, 64, 64, -135, -14, 35, 109, -95, 49, 123, -94, -43, 44, -228, -73, -100, -46, 366, 218, -54, 122, 25, -64, 109, 54, 52, 18, 161, 1, 158, -306, -52, 41, -38, 36, 94, 83, -148, 26, -236, 218, -198, 386, 253, -3, 230, 92, -171, 516, -17, -122, 74, -80, 23, 161, -109, 70, -90, -145, 325, -105, 124, 65, 132, 91, 215, -241, -95, 52, 81, -141, 130, -96, 165, 169, -7, -21, 73, 29, -49, -149, 147, -62, -153, 138, -67, 87, 98, -105, -32, 162, -184, -179, 178, -187, 147, -38, -52, 150, 34, -211, -66, 72, -141, 202, 2, 223, 42, 128, -93, 145, -158, 315, 17, 28, 140, -166, -14, 31, -32, -14, 107, -129, -60, -129, 50, -172, -23, -72, 305, -48, -267, 88]
3702H8j89K15p4J39n6k8j96r0L45k48K53k24qN0k08K72M6k36K40p5K5J84k07p1
3726e3j4q7Q6J72P5j2j43n0K4o7R6J59q4k81K90j99J30k31J84K36n4k70M4p6L
3751a22K60l99O5K03O1K6l5j41J89q6l18M15m8j44J76m9J62N9k18k9J55j97Oj2
3775b1j34O6J56j02q5o0O8J78k23K08Q2l92L04k5m1J12O2k70K00J70k04J0Ko9
3799hJ63k09P3J0j82J82k73J25J55j10r3K44k97L58J6l4Q6O1j25O1m09L36Q2m14
3823b02K20q8LN8j5j33K38K4r3j52N1M2j06K8J98j54j63M14j33q7K18r5j86L27
3847B14l02M0q4J95j21l7L7M5M6r7RJ05k05L16k47j45K90j46O3lR1J7l37J02J72
3872A8R7k45J38N5J06J3p3k5j04N2R8p4j92K11J38l94M05l04j39K93k39K38N2
$$ y = [88, -101, 114, 40, 179, 123, 95, -101, -191, 154, -94, 159, -65, -73, -23, -231, 41, 87, -149, 91, 16, 41, 225, 18, -53, -67, -154, -68, 104, 179, 167, 24, -26, -2, -69, 27, 186, 102, -179, 111, -88, 42, -189, -5, 231, 177, -93, -49, -125, -122, 138, -261, -196, 7, 68, 94, 59, -82, 107, 21, -297, 118, 70, -74, 102, 53, 215, 274, 56, 27, 182, -15, -9, -21, -155, -89, 67, -35, -120, -180, -112, 66, -157, 51, 133, -259, 45, 20, -21, 91, 153, -117, 83, 253, 49, 59, 61, -8, 155, -54, 19, 29, -153, 29, -244, -119, 36, -74, -167, 77, -220, 138, 154, 120, 206, 267, 142, 203, -206, 130, 212, -202, 18, -70, -67, -9, -24, -157, 81, 105, 12, -140, -89, -47, -153, -125, 73, -81, -244, 170, 37, -50, 168, 73, -113, 214, -88, -48, -132, 63, -58, -95, -58, -13, 33, -64, -55, 50, -155, 161, -86, -231, 59, -87, -24, -27, 64, 81, -256, -154, 18, 115, -130, 8, 63, 169, 182, 109, 84, -20, 32, 130, 56, -136, 75, 213, -181, 224, -80, -219, 74, -165, 73, 125]
3895A25o2p4o4k3k7J00N4J44k80Q0l5K0J84Rn8j05M4Q1j45L8j59K69k57P2N6j23
3921a36J73k76L55k78M13k47J03k31P1J35l03L22j56j89M7J84j87J42o4m5j0J53
3943b4m8J74k98O9P7J6K39j24r5J32o3j75K91O1k19R1o7RQ1k60K54k56Q9J87j8
3968A23j95L13l54J42j13J0m7J86k40M51j82j12J40J3q9J46j55NM1j34J54Pk89
3991a79J39P2J04p3J0%J12k18m9K69k05N9j90N0J70J9k65L63m70L01J92l49J37
4014aR0j50O1K12j35J82p5k84K37j25MN0l04L8L42k75L2J05k83J95L44j75j45
4037f0R0k0J74l46J17K17m53L98r5o9K06q0k72K04l3P4l6k02L02K2k87L2L09l31
4061a39L2J64K50l53J57k90J78o3j20L09k38L8J86j97J03o9r7J31j52L3qK08J58
$$ y = [125, 63, -11, -75, -98, -125, -25, 29, 173, -107, -27, -62, -42, 142, 151, 93, -12, 32, 113, -32, 6, -153, 116, -141, -69, -13, -136, 37, -239, 116, -162, 251, 4, 107, -124, -53, 82, -221, 101, -55, -244, -197, -13, -200, -58, -122, -167, -177, -24, -72, 102, -196, -127, -50, -34, 205, 81, -14, 118, 55, -120, 171, 232, 13, 104, 37, 46, 127, -133, 121, -135, -46, 141, 123, -72, 241, -113, 29, -84, -74, -121, 65, -175, 276, 94, -18, 122, 135, 46, 192, 37, 42, 83, -51, 103, 110, -179, -40, 32, 136, 63, 73, 73, 185, -33, -82, 187, -18, 41, -149, -99, 71, 90, -175, 188, -282, 19, 211, -138, -1, 89, -61, 0, 212, 77, 259, 184, -100, 137, 12, 16, 66, -238, -200, 142, -133, -101, 4, -279, -84, 260, 85, -60, 30, 10, 184, -162, -45, 172, -281, 117, 22, -47, 159, 79, -193, 11, -22, 52, 16, -186, 116, 138, -149, -117, 192, -139, -107, 57, 307, -46, 111, -179, -1, -64, -184, 125, -113, -75, 111, -86, 17, -52, -149, -18, -170, -137, -145, 63, 221]
4084B21j97k56J83J19q2J50j83pK93q8j52J64k24j80M69l03K20q0j17Q3K4p9p5
4107i7L5J05KL4k3J22k18Q0j50J17L5J9om7q7J19j8p8J2P6N3J2n3j22K10k9j2
4134I1l3n0k52K47j31L18j15j02q8J11j41J63j1J4j4j30K12r8j48N9J26J03j93
4157f2M0k39K25m9p5K05l05M93j56j48L9J50j6Qp2j89J9J40j23K70p3j89K61r7
4181E7N2J09k61J61r2O0j96R9j07K10K3p8J63l90K26Q7j66K77j92J31N1k23J84
4204A85j60k35K38r9K48q6P0P8j83m6N7Q4j99J12J24k00K2J02j04q3m8m8J45l2
4228e8k62N69n05P8O6Nk3K09j42J1J37l0r8j42K40j3J43k47J38l19Q9L8n6J38
4252c4O1j36J13l4j29L9R9k7k32J15m5L1J80j46J29j8K37r1o7k12J68j18J22k18
$$ y = [221, 24, -232, -49, 70, -12, 138, -45, -52, 241, 153, 1, 165, -59, -239, 230, -73, 147, 67, -50, 33, 57, -22, -97, -62, 43, 45, 79, 56, 178, -40, 40, -110, 7, 42, 61, 55, 8, -79, 40, 22, -56, -44, 32, 85, 97, 44, -78, 132, 103, 91, 58, 8, -244, 3, -128, 190, 75, -27, -115, -4, -145, 18, 7, 21, 7, -123, 89, -9, -157, -98, 28, 131, -62, -22, -261, -36, -85, -160, 45, -260, 233, 77, -71, -32, 118, 102, 110, 38, -151, -132, 8, -115, 155, 82, -107, 154, 57, 109, 218, -43, 118, 26, 86, -110, -11, -118, 92, 115, 37, 200, -190, 36, 123, -43, 234, 42, 173, 224, 1, 185, 25, -210, 28, -71, 177, 91, 161, 239, 56, 10, 67, 151, -48, 64, 188, -12, 10, 112, 8, -75, -123, -171, -26, -58, -320, 249, -256, -178, -112, -107, -130, 79, -63, -52, 85, 55, -43, -185, 55, 42, 185, -62, 76, -243, -154, -116, -172, -34, 27, -109, 4, -30, -159, -120, -21, -48, -280, -165, -210, -179, 1, -145, -16, -34, 203, 112, 45, -167, 1, -117, 5, -213]
4276b13K33j24J58k31K69k18J33j4J43K1k42J83J39j33k31L35l64K62n0l8m4l
4298b9P1j01RJ44K3o5j06P4O4J8r8j36L80k98P3L7j59J54K08k52j6j40J32J95
4322A82j62j7j32p9J62j60L52n1P6j03m43M66j90J87m6O3j70J5J61j60N6M9N0
4345A06j89Q0K52l43Q9J57j47J22k25J98J17j61j50L7j24K78Q6l37K54n7L8J95
4367B76l18l4O5o5J42mj76O4k7N7J68k38l66O84k79k9J95k25K51n7k00J96k20
4390a40Q0J77l1p2J70k78N2K07Oj48K45m24Q1K23j44j20L51l9k47J02k36L65k73
4413i3K4M2k5J73j78j9K27l72L09r2m8k8K12j95K3J09J40j80m4M3Q6o3j44Q9q1
4438h5K42L3j95o3K88j61J0k07M8O8j14J80L7q0m1J77k04L00m82j30L79N0j10
$$ y = [-213, 20, -104, 54, -177, 92, -126, 7, -7, 136, 157, -85, 98, 237, 104, -127, 208, -156, 106, 56, 18, -26, -29, 42, -59, -50, 94, 117, 52, -54, 20, 84, 102, 4, -132, 248, -50, 23, 60, -99, 55, 263, 11, -5, -145, -13, 182, 20, 3, -129, -208, -46, -206, 146, 95, 171, 68, -375, 91, -99, 88, 42, 105, -65, -50, 111, -49, 7, 56, 106, -83, -3, 249, -94, -5, 152, 5, 127, -98, 100, 217, 56, -94, -57, -181, 97, 183, -154, 100, 43, 81, 276, -42, -76, -11, -76, 66, 62, -114, -50, -77, -20, 148, -90, -456, 228, -51, -80, 115, -110, 141, 84, -116, 80, -140, -60, 117, 86, 14, 184, -94, -42, 165, 171, 23, 268, -156, -75, 148, 4, -116, 235, 196, -51, 51, -185, 180, -93, -69, -27, -52, 121, -57, -76, 151, -221, 88, -4, -52, -80, 132, -63, -40, 69, 209, 29, -15, 28, 114, 51, -93, -4, -85, 157, 190, -5, -68, 220, 59, 69, -138, -90, -22, -136, 44, 81, 1, -40, 137, -67, 233, -249, -379, 0, 50, -60]
4461f0J08n4K3j76J31J05j54K9J08j58l5J82L4k71N1K52k97J1QR4J2j23J93l4
4485b1N4q0L6P5j47N5R1l6n0J05Mj17m2j02J16k8J55k1P0P2k90J04J1m7Q5k18
4511a66J00J33l1M5J84k71m8M1j11J48Q3Q0J01j88p5J4Q4j58J2j64J33J13j27
4534f8J91j70P3k09J6K27j02q9L01j25m3J77k47q4M4j19J58m6L25k11Nn1j05P7
4558g5K10j3M8j27O3l98J40J23J52k09K15j27m2Km2L26k35L2J0J05j24j07K04
4581A31o8m2j0J07r5L5M7k31JJ24P0o6k4M3J53k40KK55l64J96P5oj76mJ28J28
4607A69l39K34J69j31k45R8Q4j68K05k03K67o7J93j72o2k24J1J19L8M5k14P5K50
4630A32j89N1j35L9K4R6o8K2K72k11K15l78P3pQ7j53J65j65K12m4j23J67k4k87
$$ y = [-60, 48, -6, 17, -159, -28, 77, -77, -48, 60, -98, -133, 49, 83, -188, -137, 115, -182, -171, -163, -69, -57, -180, 13, -21, 33, -47, -11, 64, -83, -28, 63, 27, -23, 82, 86, -31, -73, -175, -59, -87, 68, 47, 117, 189, -101, 3, 14, -33, 52, -166, -66, 67, 36, 81, 265, -6, -54, -13, -124, 24, 107, 187, 288, 100, 25, 39, 123, -35, -23, -187, -54, 59, -68, 123, -47, 26, -183, -167, 60, -42, -131, 170, 45, 2, 179, -68, -152, -108, -227, -69, -115, 210, -1, 4, -47, -152, -75, 135, 122, 170, 43, 106, -292, -152, -29, 123, -86, 129, 2, -40, -38, -80, 246, 11, 43, 53, 158, 34, -73, 131, 63, 21, 11, 118, 23, 58, 105, -126, -125, -1, 69, 3, -21, 22, 175, -65, -63, 192, -172, 24, 99, 93, -83, -87, 41, 169, -170, 64, 233, 102, -143, -45, 39, -129, 76, -127, 140, 73, 266, 94, 32, -192, -181, -62, -24, 21, -193, -118, 132, -57, -6, -141, -102, -78, 18, -50, -28, 244, 33, 248, -130, -57, -64, 23, -130, 35, -130, 82, 38, -85, 82, 58, -229]
4654b29M15k50j92M07j15o8J51j26J76j18J87%n7l0lJ4k08J90j92n0J59o8N9N
4678E7j08L3l03P9M3K04JN2j76R5J94l15J78k10J89P8j28R0R6l10L57k01L65l19
4702D1j95K91j14J29k20J23J19j53j92L11k58K45j50LJ15j06J76k46R3J9j40J13
4724Dr6n2J61j92K8L33j9j04N0q6N5j82R2j21J54p7j07J2O6M3L51l60L7M1j32
4749a01j5J59o9N9k04J20n2R8j61M93l15M0l9l0k1P6J5K5j24nL6j30N4Kj3j30
4775b32J62J00K14k35j31R8J6k57J33J48P7k5p7k6j2l7P8j43j3K39K8Nk47N4j5
4800i8J78j24l5N0j13K82j78J12J55j57j86K25j49P8J0j80K21N4J6j54J07r9J14
4823A29k32J67r7K55j68p2o2J83j31o1J79j26J8P6q6K27k85R4J48j73r4J07J39
$$ y = [-229, 186, -64, -256, 151, 36, -32, 119, -7, 169, 51, 238, 238, 181, 151, 148, 162, -46, 144, -48, -98, 61, -7, 52, 57, -51, -18, -321, -242, -199, 5, 6, 58, -118, -23, 171, -144, 34, -176, 13, 91, -37, 53, 149, -161, 196, -5, 360, 41, -154, 137, 23, 152, -68, 55, 174, 21, -171, 140, -118, 127, -23, -20, 95, -11, 165, -81, 12, 31, -109, 4, -92, -144, 17, -175, -147, 186, 167, 63, 113, 27, 82, -100, -8, -129, 25, -52, -159, -147, -81, -38, 313, -47, -10, 31, -101, -116, 43, -26, 33, -171, -51, -103, -5, -166, 327, 12, 52, 13, -17, -38, 38, 53, 78, -46, -51, -15, -145, -91, -89, -102, -232, -70, 30, 244, 9, -122, -24, -8, -265, -132, 16, 93, 68, -9, -35, -47, -84, -6, -149, -162, 77, 105, 110, -137, -83, -98, 80, -44, -79, -29, -142, 140, -38, 74, 229, 72, -114, 111, -38, 40, 50, -130, 91, 145, 161, 7, 114, 15, 129, -103, 64, -33, 222, 54, -18, -80, 103, -28, -89, 90, -36, -18, 58, -28, 199, -86, 8, 156, -17, -111, -4, 135]
4846A35k96K96j69Q3P8k52L22k60p2K18k22J64j9J37l46K57k7l9J77p3J53k25
4868B0N0rJ3j59J25k10M9J8R0J68k95K16j39n6k8J27l2K9l9K20k10RK13j03P8
4893A45j4l24J28K06Nqj35P2n8%j4j57K40j92pJ28J03k63L53m7j93r2L4J08j47
4918a29lJ52j5M8j80m8L16j19n6Q3k3m3q8K73j28j04M5j45J74P3k51R8K93k71
4942d8J06r0J54j90p2K36m0K3l0j25Q2n6l6J40q7k8l7P6J27m5j06Rj12M39l18
4967b8M6J3L4j17m5JJ90j58J36j24k0J97J02l21lJ79j04R5L2l06L05p2J37M0k29
4992b0N3Rj19O5K22m21L49j3P8k45J35j18o3p7n8L10j83J63J5m9J10l60K10j00
5016a07J65l2P0nn4l2OQ0j20O3q5J16k06j01K32R4k2k90K30r9R5J07J28l78K37
$$ y = [135, -161, 135, -34, 49, 127, -125, 197, -63, -135, 83, -139, 25, 6, 143, -203, 54, 27, -12, 165, 92, 245, 20, 70, 61, 74, -85, 40, -170, -121, -103, -13, 155, -140, 76, -63, -119, -147, -20, -52, -23, -62, 158, -52, -43, 170, 67, 145, 131, -193, -65, 141, 146, 138, 3, 75, 17, 17, 3, -154, 86, -106, -113, 15, 118, -145, 208, 161, -32, -124, -90, 18, -129, -132, 20, 5, 53, -127, -175, 141, 22, -34, 49, 26, -17, -105, 168, 40, -64, -19, -164, 10, 83, -168, -70, 223, -48, 58, -32, 122, -68, -140, 96, 56, 79, 49, -76, 6, -50, -86, 54, -33, -61, -98, -22, 105, 60, -46, -37, -149, 290, -28, 18, 31, 65, -52, -97, -96, 94, -64, 72, -52, -72, 125, 227, -94, -97, 82, -22, 73, 105, -201, 104, 32, 169, 209, -20, 33, 42, -77, -12, 210, -211, 138, 125, 203, -42, 93, -25, -88, -165, -223, 87, -96, 67, 82, 33, 143, -217, -7, -107, 58, 26, 96, 91, 37, 5, 11, 91, -29, 34, -51, 65, -141, -242, -10, 84, 62, -228, 2, -97, -2, 105, 233, -145, 92]
5041I2L3j80K35k13o9J66K44m79K28j56L1j41J22M8o1R3L2l7n0K81n3qj90R8n4
5066A2N2p7N8qL6k9j06J38K29m71J74j38L3L5J61k8M8j24N8K60j98j39O0j0K8
5091E4R1l32K39r0j42J04J51l8J68j85k0J56j05j31j48rL65j04O0P5k17J61j24
5114b1O6J68k91j92L7K27j91L13k5j5j53j34K42P4j17J96J1l60K26j31J3J41j70
5137h6k4N7l5J37N7k19J36J3j56R5Ml6n6L54k53j3J98m42L65j46k72J90J08m0
5161f4l5p3K84j46q5J50K1M7J2k84J55o9J40M1Kj63K84m13K52J39l51Q7k0J25
5185C6j72J2K25k90J52j29l2P4K15L3j60L7J57k6r0M3j47P3Q8j10L3pq0%j29M12
5211B18j74j42j10J71m5K7K03O6j48j8j04oP1J8L2p5J53j83N1J26n2k84K8K06
$$ y = [92, 125, -55, 180, -33, -102, 64, 308, -171, 57, -99, -68, -209, -87, -39, -100, -7, 25, -12, -62, 219, 166, 158, -32, 66, 12, 64, -13, 45, 37, 73, 44, -62, 76, 305, -166, 8, -130, -97, -62, 99, 71, 119, -5, 53, 313, 115, -24, 36, 26, 54, 145, -187, 52, -38, -180, -76, 75, 37, 205, 20, 0, 156, 51, -80, -228, -237, 128, 24, 84, 159, -58, 103, -21, 45, 213, -78, -270, -233, -6, -197, 116, 91, 76, -77, -211, 31, 105, -12, 184, 195, -165, 61, -70, -57, 84, -86, -110, -53, -88, 49, 106, -113, 23, 36, -120, -25, -21, -57, -113, 241, -12, -25, 173, -269, 96, -50, -322, -132, -24, -64, -99, -172, 112, -34, -119, 31, 52, 99, 111, -173, -18, -87, 53, 94, 96, -67, 217, -196, 56, 195, -156, -69, -89, 36, -136, -124, 101, -189, -37, -166, -198, -124, 91, 124, -36, 1, 158, 132, 42, 85, -62, 11, 99, -11, 22, 15, -65, -65, -194, 218, 44, -98, -208, -37, -82, -55, 148, 214, 66, 48, -56, -62, 9, 27, 59, -16, 137, -46, 5, 131, 79, -205, -177, 29]
5235B9J53l07Q3j14J28L2jOj30K52j04J8J38j31j98J20j05K26k09n0L00k63K5
5258a02J18J8j07o5K41Nj22j35J14m8k9J2O9O5q2j05K16k89M9L68o1k16k1K13
5282A06k38J02p5J84Pn1q1K32k69K77j37p7n6k8J29M8m5L3J29l57R1J98L6J02
5306B60Q2n11J64J79j80M7o3MJ09j58N5K05k81J17j60J23K1J80j46J29k05p3L07
5329B05k16J1n1J96r4j90P6J84j99N2J38k31L82k32j93n1L40r0j92K00j63J49
5351C1j25kQ4K88k39K82k40jP0j84R5o3m0J07J18l06K96j52P0j02J36j47l7r7
5375a58J69j0j41R0J35k6R8j65K2J22k54J52k05J39K23l92K38j24j3m9K28l05
5397b26J64Q4r8K43j47j9q2O2l99M49o9O9O8j46k95L16J74J59j52Rm8j83%K98
$$ y = [29, 182, -125, -42, -156, -28, 4, 3, 9, -121, 131, 27, 45, 183, 52, -146, -26, -131, 95, -114, -164, 136, -127, -102, 16, 34, -73, -138, 103, 108, -14, -149, -35, -83, -112, -100, -31, 34, -48, -153, 63, -226, -177, 191, 130, -86, -107, 106, -132, -30, -105, 79, 86, 35, -46, 186, -83, 194, 57, -20, -76, -104, 25, 73, 28, 61, 190, -167, -76, 122, 158, 260, 342, -169, -5, 174, -6, 41, -22, -18, 91, -67, -12, 193, -88, 29, -131, -8, 13, 193, 47, 176, -29, -102, 205, -11, 0, -51, 145, 51, -139, -63, 121, -78, -26, 112, -119, 263, 31, -162, -213, 127, 37, -155, 45, -118, 31, -94, -96, -12, 276, 37, 319, 79, 78, 148, -36, 59, -4, -44, 63, 181, -125, 171, 19, 89, -13, 123, -24, -61, -158, 11, 1, -140, -50, 85, 59, 157, -8, 14, 136, -118, 34, -171, -32, 191, -201, 37, -87, -100, -149, 79, -226, -62, 22, -76, 167, 20, 1, -81, -19, -418, 31, -38, 31, 99, -47, -342, -26, 148, 307, 155, 164, 116, -67, -67, 231]
5421B31j14k83K11j78J61q8O0n5L3k38K65N8L7j29ok96N92l60K04j35j91L85M1
5444B05k69n9J61k45J45O7n8J74k67M6J55K9j65J11o9O7J02k38p5J06p6K13j81
5467a21M7J17k42J39K01j31Q8j15j68K91j70Q9%J38o5k48L0J27p0j0O7n5l8P4
5491b5p5L6R7j62J02K2j04Q7o1K1J46j33l1R6J3Q2j40O1l1O3M9j99lK61j70M7
5517D9M3J14j62k22J36J95k98J67K6j77P4J57RMJ79k52n5p8lj5J98j54k9K07j3
5542A00j56O5Q7k42L80l62M1K21M6m20M90l12M0J98j24l3K0K6kj18k49M17j4k02
5566a03K33j64j47K47l99L44l45M62o6j79J22R4j77j13J13O2J89j84j0j1J9K2
5588Ij5J3N2j37R1J38q1l4j2J48j35joJ71j80j08M5K66j29l36K43j13K2p0J78
$$ y = [231, 117, -166, 45, -133, 28, -60, 0, -55, -22, -260, 5, 63, 100, -29, -35, -331, 261, -99, 105, -30, -221, 164, 205, -64, -123, 38, -207, -62, 5, -53, 121, -146, -100, 55, 84, -81, 30, -39, 28, 130, -108, -183, -77, -153, 60, -121, -74, 43, -199, -60, 141, 10, 98, -17, -185, 106, -64, 25, 25, 163, 98, -150, -120, 7, -63, -73, -6, -61, -99, -25, -100, -64, 33, -129, -27, -5, -109, -22, -83, -62, 84, -49, -80, 16, 29, 111, -29, 32, 1, 64, 113, -86, -89, 172, 2, 49, 92, 206, 44, -178, -42, 153, -145, 22, 48, -129, -55, 102, 111, 115, 294, 42, -13, -91, -94, -109, 89, -65, -94, 113, 100, -56, 9, 96, -146, 234, -128, -87, 134, 180, -240, 250, -62, -22, 176, 52, 19, 39, 65, 63, -55, -304, 113, 99, -103, 130, -34, -181, 66, -333, 11, -334, 128, 62, -117, 5, 99, -78, -191, -78, -16, 173, -11, -21, -32, -13, 9, -6, 7, 59, -78, 13, 151, 70, 36, 24, 172, 37, 36, 30, 201, 21, -87, -42, 224, 95, -241, 2, -111, -89, -159, 19]
5613A9J42l9j83L9j13J67J3J01j26j36M4R2j0M5j20J20j41oQ5KK07k30O8n6r6
5638a12J36j15J39N5j12o4J62j26J06o6j76K28M1q6n8J13Ok4P1J6j41J21p5K2
5662F1j51J53R2m5j00r1JJ83o8l8J22k24p5N31l65q6k8K60k76L98k09J20l62L67
5686A70k59M0O7K9j00R4q0k7K99j56j51k4R7J6p5j68L34K7j83J49m3kJ28k56J01
5711B7j49q1M16k13m5L9qj50J72J10J28l28j10J39n9P9O7Q1r7l3J95l05J32Q2
5735H9j15J37k75J86n3l6J00J41l30M39k3k84J16J07l20M7l4Q3L26j35k13N2j62
5758a57K14J7l4L0p3JJ42O5n02K62R6q2l0Q5M6J0j11j04J61K6n3L9k0L5p1j09
5784a17K32k48K36n6K6J03l3l46J92K21k67J14K1L4n4r8J17j05J75p4j12P2J30
$$ y = [19, 161, 122, -61, -22, -135, 32, 45, 146, 20, -116, -72, 20, 10, 55, -65, 55, -86, -92, -7, -5, 202, -28, 40, -16, -112, 24, -91, 48, 103, -9, -73, 89, -37, 69, 3, -173, 55, 96, 10, -48, 65, 71, 47, 118, 134, -7, 114, 39, 61, -90, 63, 155, 110, 10, -81, -80, 103, 35, -3, 119, -105, -180, 351, -14, -100, -128, 132, -144, 254, 45, 165, -197, 170, -89, -49, 18, 47, -53, 41, -39, -66, 233, 77, -74, -98, -1, 15, -60, -228, 106, 133, -50, 99, 56, 54, 182, -74, 27, -122, -203, 213, 0, -45, -6, -14, -164, 8, 118, 246, -82, -192, -53, -112, -33, 34, 115, 18, -15, 180, -125, 7, 89, -26, 111, -164, 22, -31, -67, 33, 174, -156, 283, 260, -24, 92, 199, -121, -74, -108, -25, 301, 166, -47, 5, -157, 57, 74, 40, 70, -3, -2, 140, 205, -297, -35, 61, -21, -51, 34, 80, 90, -21, -125, 36, 62, 9, 48, 28, 63, -8, -117, 115, -133, 103, 47, 73, 176, 143, -203, -11, 210, -57, 57, 78, 112, 58, -40, 77, -28, 147, 73, -39, 33, 163]
5807A63j55j96kJ04l5r8L68j78K85l34L42k85J34k61j41L02n1m3J71J46k55P7
5829E8J21k61O7J06q1L6Q7k06j26J29o0N2N3Q0k29n8K88P3p5n5Q8J63j83r5J52
5854A24k76R3j02K22n5j04j40J93Q5J5j45J70q5K5J44j01N5o0n8%r6O0K22k73
5878h7Q6Q2pO9O8l38Q9l0k4K31k5q5M8n6M6J00p9J46j53J49o0j57j07K26KJ4j88
5905d0l3j05J47Q1j89J53O1m1M6j56K12k39J47k6n5J39Q2j99K47j49j17J24j87
5928i7j38M01l43j44N66l12J74k02L96Ll75K95j87n3P5N3j16p0m9N2J47Lm0m6
5952gO9j91J97m9J6j59R9J57q0j34Q0Ll7p4L6K4j28R2N6J47k73J51m5K0J02k51
5978a79K33j2J42n6r8j89J69J37k99JJ9O5PJ20j7o8K05j36j15o8Q9N2J8O0j71
$$ y = [163, 8, -188, -190, -86, -121, -219, 149, -29, 256, -78, 264, -21, 113, -148, -289, 13, -38, -81, 90, 236, -19, 58, 179, -82, -15, 91, 10, 46, 133, -73, -199, -70, -130, -78, -25, 55, -174, -232, 56, 129, 54, -1, 87, 250, 67, -28, 124, -152, -59, -161, 61, 6, -98, -238, -45, 40, 55, -90, 80, -5, 20, 164, 63, 118, 58, 0, 0, -96, -36, 186, -87, -1, 81, 74, 143, 211, -127, -38, -68, -92, 139, 114, 29, 77, 21, 67, 167, 88, 234, 81, 230, 170, 13, -94, 132, 134, 148, -40, -73, -178, -31, 50, -139, 14, 75, 34, 80, -76, 136, -103, 44, 18, -37, 102, 184, -15, 232, 83, -34, 90, -97, -235, 166, -177, -321, 245, -67, 107, -95, 301, 304, -71, 224, 37, -16, 59, 112, -4, -74, -123, -71, 76, 79, 39, -7, 62, -129, 68, 19, 35, -124, -25, 132, 52, -82, -2, 1, -36, -110, -74, -50, -178, -86, -30, 117, -156, -5, -50, -30, 72, -179, 54, 42, 184, 128, 30, -159, 10, 147, -152, -151, -132, -67, -60, 60, 43, -25, 180, 44, -71, -139, -50, 2, 20, 80, -91]
6003i1M7R8k1q1K84k67J4J56P7l45K09j87J44r5k6q2J34J24j60J20l89K67K5M2
6027cjj04K0j18K08o1R9j40N9mm8j10J23K74k82J50J4j55P9J81j02P2j50J86k68
6052h1j21O5Q0M4J52j0j47M8q6J72j28L1o5O6J12k9k9J50k41o5R3J71o4l15L08
6077A11r7J16q2k1J70m39M38k94k8J72J32q5POj66QQ0R3l4j35J29j48J19k3J14
6102A43J8l07M8K14k60K74r5j82J59R6J71k64O7m5Q9k42j3K74k58j52M13n1j00
6125cK65n1l32N0R1j10K47k93j2J40R7n5l25O1L97m62L46J00j22j28k5L35j76
6148C5m5o2J20j86K67k24O6L10l39j4R8rj04R8j02K78l32J43P9k2O8M8j58j10
6172i7J29n2J6Q9k28J37l4n5K06j93J3J48K9k70J58J95r8j23j79O8J31P7j5j8
$$ y = [-91, -44, 54, 33, -48, 236, -31, -17, 139, 216, -129, 80, -107, 37, -58, -84, -166, -32, 92, -68, 52, -337, -70, -45, -3, -4, -108, -88, -206, 2, -59, 40, -100, -41, -45, -93, -203, -80, 194, -88, 62, 76, -79, 0, 181, 79, 151, 1, 187, -81, -202, -137, -57, -13, 139, 129, -18, 30, -56, 116, -12, 19, -46, 20, 132, 103, 74, 224, -17, -82, 11, 182, 118, -197, 111, 14, 130, 48, 27, 197, -242, 196, -98, -126, 46, 178, 93, 100, 106, -60, -52, 28, 121, 87, -48, 81, -67, 52, 29, 143, 161, -146, -98, 116, -144, 130, 35, -147, 12, 108, 279, 15, 82, 37, 126, -116, -129, 145, -113, -265, 148, 97, -3, 262, 211, -121, -71, 20, -90, 157, -136, -148, -8, 89, 34, -291, -230, 167, -295, 51, 151, 29, -99, -124, 211, 35, -10, -72, 48, -138, 129, -95, -29, 281, -58, -72, 26, 17, -87, 11, -91, 187, -145, -2, 77, 55, 123, 171, 13, -97, 32, -20, -4, 85, -143, -6, -40, -95, 111, -82, -69, 79, 108, -162, -4, 191, 93, -30, -209, -141, -10, 67, 52, 34]
6196C4k7J57m58L48m7K45j98n0j84K8J65K00l1j08r3M4j92kL7K00k35J90J72n3
6220A42j49k53J92l5M1K3J7%p5K05n7K3k07K04j04J28m7j10Q9L6l94L77n4j7J64
6245A39j37J74o8qk69L16k24n3J37P6k34J23j60K36j39J31J0j42K22R9Ql02P3
6268HN0j38Q7j68J65J1k64L19l1j48K16j02j05m4J02K96k72j0j22K6Q1J52k94
6291a85J13J42Q4j00J04m1l8O8l42O4J45k5M2j6o7oj1NQ2K54k89p4J04P3M5q1
6317E0Mr5J64o8N5j44J44Oq2N9j15j53q3K72N8K06l5k41j54J83J92k02j27P3L03
6342B70k49o0o4R9q8J6J69j00o6p9K11k1J51k66pK63q2L3k71Q4J9J05j49K29p7
6367G0k7k4J13j84M5o6R0M1j39M07m04P7N0j6K2j74K39j15J39l8j83P2j00K8J21
$$ y = [34, 7, 164, -294, 54, 7, 252, 54, 4, -180, -152, 13, 213, 182, 74, -19, 25, -167, -169, -132, 68, -167, 23, 195, 142, -7, -260, -68, -103, -62, -39, -22, -22, -97, 108, 51, 74, -133, 71, -33, 95, 48, -62, 27, 63, -331, 46, -8, -25, 139, 2, 176, 108, 100, -169, 147, -77, -130, 7, 83, -151, -28, -188, 48, -91, 40, 50, -92, 130, 229, 237, -65, 8, 58, -80, 7, -161, 4, 15, -249, 70, 39, -109, 107, 5, -100, -144, -42, 254, -18, -28, -150, -124, -43, 109, -185, -72, 70, 154, 54, 158, 117, 79, 147, -195, -131, 14, -11, 31, 15, -52, -58, -69, -64, 18, 272, -17, -91, 13, 86, 131, 50, 54, -41, 123, 55, 110, -34, 110, 116, 34, 93, -22, -175, -258, 14, 72, 278, 243, 2, -152, 31, 223, 21, -106, -33, 270, 21, -39, -103, -4, -92, -76, 93, -7, -73, -152, 59, 38, 189, -77, -84, 179, 97, 130, -141, -57, -38, 67, -82, 147, 70, 43, 19, 132, -52, -7, -73, 17, 58, -81, 326, -78, -1, 49, 33, 55, -119, 120, 5, 144, 106, -77, -5, -105, -77, 44]
6392D4j97M17m98R5N0j6K43l66J83R7m5J09l4K6j85l8RM4Q2K08l72P9j37J41N5
6417fn1J69j76Q5j93J71J44q8o0NJ22k05K67k47J08j16N7J69j37j82Q4L07l48
6440a21L13N2j41mj48J93k32J92j10l8l2o9J15K6j58L60l01J40r0n7J23K17j68
6463F2j59k4J36o3Q8r9o0J43R4j00n9K06P4k01J78l43P6P0N6K63n76J14J70j84
6487a38O9m8Q3K54j20K5k34K87kk26P9j10J00K6N6m7M8j4k30J23P6j15n4K83l46
6512a75J00R6P0k5J09p6k69J32m5K09Lr2o9O2p2J40r4r7J10j56K89m4r3J60j11
6537F2n1j7j3K2pj23J42N1j27o3K67k36K21L7k89N0P1oJ39k81P1J07o3K21j84
6562Aj30K21L8k77J71r0J59J2l09K15j67N2J70J41l36J24J6l3L3j1o4L2l7L9R7
$$ y = [44, -153, 264, -234, -139, -89, -105, 138, -228, -45, 52, 7, 116, 82, 108, -77, -115, -106, -62, 20, 228, -144, -65, -202, -61, -6, -57, 112, -64, 21, -172, -1, 143, 55, -5, 0, 122, -83, 184, -63, 45, -71, -14, 155, 18, -164, -80, 227, -121, 192, 244, 103, 99, -49, 144, -88, 104, -6, -44, -76, -145, -30, -4, -162, 198, -103, 37, -53, -110, 13, 230, 62, -97, -121, 15, -48, 40, -59, -119, 24, 118, 18, -41, 165, 239, 38, 216, -127, -51, 19, 75, 338, -238, -124, 46, -138, -69, -117, -34, 220, 100, 125, -109, 178, 176, -50, 29, -81, 19, 45, 101, 54, 102, 88, -142, -19, 57, -58, -112, 171, -175, -75, 21, 91, 66, 175, 99, -170, -38, -83, 126, 129, 37, -32, 30, -42, 98, 4, -93, 17, -139, 150, 106, 13, 173, 62, 11, -6, -19, 3, -4, -127, 15, 66, -61, -124, 143, -93, 128, 165, -124, -74, -3, -9, 130, -151, -80, 27, -36, 185, 1, -129, 92, 130, -147, 24, -66, 93, 105, -204, 11, -156, -104, 66, 207, -129, -5, 11, -22, 11, 0, -64, -32, -69, -30, 67]
6587F7M6j15j66K02P5p4J26k42N7Kj15J33l7j70K91m7M7j66O0J8K1j59Q9j8K08
6612A33j20j36L0KJ93j74j78K48J17j26O6k33K95k66J67N3l1J65j43N4j18R9j64
6635f7J42N0l16K64m3k3O7n3k0n4K55l71J47P6j70O7j4QJ81r8J7J10k64RJ63k26
6661a63K75J0k92L02k42P2J67lP6j13j52J39j66J18l7m2n4lJ43k47J79m2J49j12
6685c8q7M1q7J99l5k8j3m3J67j9p0l0l7j9NJ32l7j1L7j77k4K55J5J3l38K35j52
6712a46K77o6n6J05l87L35r7O0N7m7n5n7J28K0q8l0j13K63l05J72Q2l3j34J00
6736a5K2j09j6j44J93J27K4l34J47j8J78K5L0k74J33K17l44K05p5j69J11L8j00
6759a48J27oj28J06N5j42J27j30L01j74J55Mj18k0J6J08j99R0J07m7k21J78r1
$$ y = [67, 113, -2, -168, 34, 109, 35, 161, -81, -24, -22, -137, -4, -41, -211, 80, 33, 80, -86, -26, -8, 13, -146, -57, -75, 133, 13, -123, -93, -91, 102, -72, -250, -2, 115, -11, 55, -178, 117, -149, 18, 71, 40, 205, 62, 116, -2, 97, -67, 75, 125, -191, 73, 30, 7, 74, 21, 1, -53, 202, -169, -22, 54, -116, -49, -63, -55, 126, 28, 45, 155, -109, -100, 63, -163, 112, 122, -170, 132, -110, -38, 129, 126, 202, 89, -63, 76, -90, 28, -9, -51, -105, -108, 35, -212, -33, -75, 74, -38, -125, -84, -171, 28, -7, -35, -48, -91, 76, 57, -13, -43, -80, -99, -94, 38, 1, -10, 27, -150, -174, 81, 96, 109, -229, 6, -146, 131, 65, 9, 114, -273, 62, -35, 25, 82, 35, -20, -77, 51, 71, -17, -47, -160, 103, -202, -30, 52, 19, -115, -15, 7, -102, -118, -262, -69, 58, 82, -252, -105, -123, 55, 80, 110, -164, -31, 186, -158, 47, -28, -197, -86, -48, -148, -21, -27, -155, -49, 6, -136, -9, -139, 162, -12, 143, 147, 29, 9, 25, 133, -66, 24, 131, 84, -137, 41, -50]
6782e0N0j10R9j35J59R5j19r8J22q2J73j24L4P5j89N6J16j34J25j77r3J12K01
6805A06k58K06j9p8J04j13J34j23l3K4L5p0N0J7j07J71l6Q3j95J12k9M7j82K61
6829A07k11o6J71O9J5o1k53K89k8np2J82k09l3J20k5J14j84K7K08l64J09P3p6
6853a03n3L44k02O6m3r9R5J31j19l3j42O1J09N4j53J64j84m5K69j01q1K47j27
6876E5N3l3K04j87j67J53n9N2j0rqq8J10j74K73j70j6J09p6K07k00J91k55J21
6900G6j36J29j83J82N7j26j37n7R9P1J48k66K60j35l3n2Q2L5j31J40j04J48N2
6923A19j35J71j55J12l34K69N2r8O6j7n3Q4k9J2k11K1K96j55K07l34J91j47m5
6946a13J82k42L18r9QK6J9j54J62j01N5k4N1j34j91K99j60j66K81K06j60p4J3
$$ y = [-50, 0, -110, -11, -146, 13, 108, -11, -109, 13, -69, 104, -20, 14, 89, -100, -44, 72, -62, 63, -114, -207, -95, 106, -152, 54, 35, -43, 61, -52, 82, -41, -74, -50, -15, -85, -35, -18, -125, 46, 10, 93, -102, 10, -19, 28, -154, 107, -104, -170, 1, 70, 85, 24, -229, 60, 32, 27, -45, 137, -72, -105, 15, -10, 104, -80, -53, 155, -209, -100, -27, -103, -156, 188, -14, 52, 9, -90, 5, 136, 17, -16, -158, -97, 12, 66, -87, 77, -107, -152, 117, 16, -65, 182, 55, 108, 75, 279, 92, -75, 78, 19, 71, 61, 52, 44, -44, 66, -108, 165, -5, -21, 88, 12, 219, 19, 210, -45, 76, -60, 69, -114, 68, 125, -1, -138, -195, -96, -25, 123, -143, 117, -18, -51, -103, -21, 14, -117, 23, -81, 67, 119, -16, 155, 0, 112, -222, 47, 99, 1, 67, 50, -3, 81, 52, 64, -147, -126, 170, 15, 222, -112, 79, -68, -113, 69, -173, 145, 46, 54, 80, 99, -55, 107, 6, 61, 37, 88, -46, -237, 62, -98, -264, 17, 223, 63, -11, 2]
6969BJ2n0K09k21R4j14J7Q9k69K92k45PJ20k31K48n0L86k8k92n0K59k28M4N0j99
6994a48K11Q2J5k30K15k25J12j06j79L45p8j9m4J54j95J53m1j28K09j79r9J92
7016A7P9P1l38K04mr3J88k28J33L3k91J85m9O2m8J01M7j12q1J55j08k7J33J47
7040A76p7k06J69Q5j94PL03k72N3j40J16j65J32J62j71l6j05RJ19K5l6P4j34J87
7064H1n9n9R8rJ5j96Q8J2j26K19L4L9k48K81j17j14J89k86k7RK31K36Q8k72J2
7089A19O3k65J52j72M9R5k52l5K86n6r3O5j76K94l06%J92l0jK49j79Lr1R2Q9j32
7115d0M0J81m04m8N03k63J60Rj75l0J70j61K09k06p5L2P3J60j47k1J29j8L4k34
7139a22J18jj1L7J4k00M38l46Q0j0R3Q2j16J0n9l8J70j60L0q6oJ24j67K3K40j51
$$ y = [2, 14, -36, 173, -48, 46, -68, -51, 38, -231, 61, -184, -177, -57, -288, -40, -90, 296, 268, -24, -74, 185, -43, 1, 51, -148, 63, 145, 160, -70, 145, -80, 32, -74, -253, 92, 14, -5, -49, 105, -90, 63, 22, -106, 103, -76, -175, 17, 96, 167, -171, 33, 29, -64, 124, -104, 29, 62, -229, -44, -93, -31, -79, 22, 69, -43, -124, 31, -77, -104, 29, 176, 99, -107, 62, 147, -47, -40, 263, -9, 44, -96, 20, -145, -13, 149, -22, -58, -163, -154, -35, -10, -46, 28, -106, 81, 22, -37, 61, 52, 67, -129, -41, -29, -155, 64, 98, 137, -111, 170, 53, -61, 128, -158, -185, -176, 55, 291, 379, 107, 119, 182, -83, 69, -103, -54, 41, -211, -246, 40, -16, -109, -44, -220, 74, -232, -232, -40, -70, -71, 178, -1, 2, -89, 3, 92, -40, 0, 181, -223, -271, 232, -31, 129, 138, -37, -67, 103, -58, 151, -55, -130, -98, -25, 135, -12, -33, 96, 78, 112, -122, -4, -5, -16, 21, 35, -165, 273, -73, 7, -3, 90, 172, 56, 66, 7, -31, 139, -21, 9, -77, -83, 41, -126, -103, 137, -14]
7165a4q5j1J69J28k50J06j99M5R0J09k31L7M3P8Q5l45L31k21J97R2j76J55rj20
7189Dj35J8K17j47K18k86J4N8J91j28k3L8o0J4P0j07j07K45j99L7J85P2j98R3
7213H4j94J48q5k32K62O7o6l5P2Nqj21J32J40l04J0J25l7O5k11L13oj53J21j69
7238g7J9J59j45j19QK62k41K96j36l4kj12J28J13k2J0j78lM7p6J65Q3pN6p3j79
7264e8O3L3j37K4K65j79r8K30j35j32Q1J42k26K12l15L37l48K61j79j16K80j41
7286a36N3O9j41K34j79o9n3J88J1J5p1L8n4J1J62J01k78lJ85j29K90j32k25K92
7310A79j55M3k28J77j76K47j15M9k1q%l7K41n3Q6k87J6O7r9N3o7K41j31j05K59
7335A76j10R5j17p0K9qj01K27p9j34K56j77K8J4j29J48j17O8k34L44j63J7J62
$$ y = [-14, -99, -110, 59, 187, -63, 43, -156, -111, -21, 88, -143, -106, -63, 15, 100, -245, 86, -135, 62, 154, -22, 133, 124, 4, -131, -113, 104, -43, 175, -111, -97, -39, 152, 24, 1, 39, -21, -7, 63, -44, -151, 94, -105, -68, 117, 189, -9, 84, -110, 38, -47, -279, -17, 50, -16, -51, 21, 26, 18, -103, 29, 169, -135, -125, 0, -37, 28, -183, 130, 124, -29, 92, -77, -58, 101, -44, -163, -155, 107, -134, 162, 26, -8, -10, -122, 6, 119, 97, 107, -71, -74, -27, -103, 62, 145, 138, 194, 121, -58, 5, 38, -99, -75, 190, 11, -87, 143, 8, -124, -43, 99, -127, 85, -230, 107, -241, 20, -159, -275, 5, -136, -83, -14, -155, 79, -100, -169, -222, -34, -23, -8, -79, -41, -95, -84, 78, 179, -99, -102, 83, -46, 244, 112, -113, 179, 24, 67, -161, 16, -160, 87, -28, 21, 0, -8, -8, -45, 196, 143, 229, -58, -42, 25, -74, -21, -88, 153, 22, -83, 176, 66, 161, 44, -26, 3, -5, -106, 121, 42, -92, 164, -13, 15, 29, -100, 48, -69, -1, -235, 109, -54, -37, 125]
7358A25P5o3l7k99K48O0k30L47j71ko7j96J49j23J63N7k23L34k29J52L2o5k8k0
7382a1R7j31m2j78J74nR4o3L0l5J14k36P9O1M6O2kj42J2L9J49j98J83k31O4J01
7408C1J60k08J46j52Q9O1k77K68j19j6j8k1K99m79J66n8R8k55L56J01k54K39j45
7431A2m1j40R0OK27O2l73L90j10L7K9r3j3l3k00J00Qj72J22k9O5J09j02J76j59
7456c2j21K73k66R9J6o6k0J73l8o4jJ53q4p2J9Q3q9O2o4Q2o7o8R5j11L2R9J9m
7484C8M9j82M4J20j58j98M15J2j26P3J99j48k56Q2J24J04k14J02K2J0k12L9M6
7507a5R1q6j01K73o6k72Q1j2QR2q4Q0L1l7N9L7k7K71k57r2j03M68l48P4J1j88
7533a12J58o7J23o3o7%J39k18j4j17L83j61n0k37L72j95J8J59k44K68j70J22j04
$$ y = [125, 200, 137, 100, -199, 49, 109, -121, 226, 55, 53, -14, -210, -61, -184, -21, 36, -187, 147, -82, 70, 102, 37, 9, -11, 86, -45, -87, -265, -91, -96, -2, -65, -35, -70, 44, -192, -113, -52, -6, 56, 54, -88, -76, -37, 112, -86, 97, -134, -70, 31, 191, -17, 129, -23, 66, 127, -150, 118, -1, -17, -35, -56, 243, -236, -70, -128, -30, -285, 71, 172, -82, 157, 12, -29, -169, -79, -73, 154, 216, -157, 233, 123, 160, 189, 96, 83, 50, -150, -50, -42, -214, -92, -121, -56, 53, -49, 127, -32, -153, 120, -146, -47, -31, -97, -117, 56, 18, -46, -47, 106, 22, -50, -31, 52, -37, 25, -39, 43, -24, -92, 3, -108, -76, 23, 42, 38, 87, -95, -51, 69, -89, -287, 128, 140, 14, 87, 286, 138, -118, -36, 88, 192, -22, 80, 102, 112, -100, -61, -15, 76, -10, -111, 162, 96, -176, -95, -107, -99, -7, -91, -11, 20, -17, 42, 79, 52, 323, 66, -26, -129, 339, -9, 65, 76, -112, 46, -21, 102, 39, -28, -28, 111, -107, -121, -238, 145, -16, -66, -303, 69, -126, -108, 51, -193, 75, -95, 27, -77]
7556g7Ln7J86n6kj11l1RL2j13J30J04m5J15j74j88M82p2p2k03K30lJ14j91M6k2
7582C4Lj9n7j19R3J63k74K35j36J97k61L03p6q7O8j2j48K10j39q1K84o0m37L79
7606F3o6rN7j0lr0P5J9j19K28j12o9K4J27j24N3r5n8L05j42j89K63k1k33J63n3
7632a6L7ko8K42k94J02J20j57j4k7K32k30Q0j93l5K85j38J52M4R3k25J20l8j08
7656c8K33j68j90L41j82m3J7j46K06rj54K02j80J54l3p6J69J29P2l44j67J67k4
7679f4K29m3k09R2m7L26m08L17k56J08m2J70l24P0Q4J63o9j87J5n7K70k22K6r0
7703a48K94j83J12m4j38J99j86J47P6m4m00J87P4p9o8K62l6r4P1K2L0j5j08j92
7727b61J42J09p7o1J23qj39K37pj06K07l18K27k39K32m7j30J66J04j00k69K09
$$ y = [-77, -74, -131, 55, -1, -3, -114, -145, -136, -104, -217, -87, 17, -28, 87, -87, -275, 207, 135, 63, -140, 90, 87, 201, 10, 56, 34, 37, 18, -39, -158, -65, 98, -176, 59, -77, 120, -141, 162, 86, -1, 67, 55, -93, 117, -22, -103, 181, 121, -316, 63, -3, -12, 45, 35, 32, -58, 17, 36, -83, 145, 33, -36, -12, 115, -9, 44, -51, -109, 196, 54, -135, 128, 107, -126, 37, -16, 21, 19, -49, 193, -101, 1, 121, -36, -50, -77, 155, -75, 5, -188, -223, 62, -76, 76, 120, 213, -12, 108, 70, -38, 195, 27, -163, 178, -4, -47, -30, -176, 30, 21, -133, 69, -111, 43, 10, -66, 103, 232, 304, -40, -207, -40, -64, 165, 122, -87, 5, -42, 284, -124, 193, -63, 45, 3, 173, -151, -81, 3, 166, 97, -90, -75, -132, 138, -84, -58, -148, 146, -37, 75, 31, -107, 92, -94, 53, 129, 85, -315, -128, -54, -133, -201, 61, 25, -69, 2, 24, 54, 39, -69, -261, -119, -10, -87, -148, -25, -33, -172, 65, 58, -48, 159, -159, 68, -171, 61, 14, -116, 50, 154, 54, -215, -6]
7749fL7J41j80K5J03l42J51K39qj22J97k60p5J34m6K12k42K0j34J03K82k11J11
7772A29j67K28k08q4M13k09k00J8r5j42L30J01n2J3j0P3j82j1L14k72N1oN9k11
7796a20J81k15J68L3K17j92J59m6k25l2L8J05r8K8k15J51p1L01j11K21l90J47
7818C4J67k24J52L2j43J93Kl57n1J86k3qq8O5o6K60j79j0K7J86j76J7j88K48j78
7843a22K10p7j09R2k63L19p9m1q6K03n1j1Qj26O2J23j8r4No4J31n8J41j2j49J93
7869A27j51k12K60J05N8j28k95L13p9R3k86J65j0p4L30k54P7J37j40N9l71L10
7891C4N1j56J30j65K41j81M5N8q3J50j08M0j46M0O4M3p9m9O6P7j09j2K06r7o3
7916cK52j55L6j31j75K74o3n5J52n0P8j92J6m7J35j23R3J2J05m3o0J10k13j14
$$ y = [-6, 31, 172, -8, 17, 120, -222, -71, 168, 160, 38, 235, -25, -100, 34, -12, 200, -42, -22, -156, -53, 229, 18, 129, -38, 190, -18, -102, 311, 102, -98, -80, -175, -317, 13, 114, 62, 75, 65, 138, -44, -55, 259, -13, 38, 32, 91, -120, 61, -154, 14, 47, 264, 72, 231, 185, -40, -72, -34, 71, -27, 1, -214, -63, -134, 167, 56, 277, -113, 34, 201, -23, 129, 161, 18, 211, 213, -144, -195, -9, -32, -40, -128, -63, -129, 131, -48, -58, -31, 155, -21, -4, -192, 56, -122, 88, 11, -98, -6, -269, 50, -29, -70, -156, 47, -4, -15, -7, -133, -71, 52, 34, -60, -55, -119, 12, -46, 95, 83, -66, 127, -24, -236, 24, 129, 187, 59, -236, 77, -2, 91, -195, -30, -40, -114, 216, -38, 39, 176, 36, 95, -276, 34, 85, -71, 59, -106, 135, -46, -1, 57, -26, 124, 16, 56, -90, -50, 14, 57, -22, -71, -5, 72, -37, -49, 157, 60, -3, 249, 94, 130, -1, -176, 98, 35, -20, 132, 82, 160, -32, -16, -63, 72, -51, 42, 54, 159, 116, 56, 166, -47, -161]
7940a61R1q7J96J01j92J53p0k46J33Lj65J39Q7k17K81J08k13J02j10K14o0J48
7962B35j55m9pj88L65k47L30k68p6N0j19PR1L8N9o8J27r3n2j66J19Q5L7j23j99
7987b67K94n4J00M2o7j15j34L41j28J67k04lO4J7j18R6q3l2K44l45J34R4r3l3
8011h3P9k21K52q3K71l09K33J47k86Q9k16J33R4j83J92j5k34J88L0J2m1j33j6
8034a00P1R5L0Q2k00j73K84k0q0K5Qj31M4J56j60J22q7k5K54o5p4j64J39o6m3
8059g8n7K49j56K31j69J93Q8k54n4QK4K6m2k3O0J39O2l15Q6L0j94J70r7J84k7
8084H4j84K29o7r8J0J34l5j26j1k8J25j5j40M1K78q8Ok21K01j49K1j10J77P8q6
8109B6n0QJ46j57m1K59k37Q6k28J97K21k20j46M11j82j5r8Q7K8j77o2J21J35j80
$$ y = [-161, -70, -157, 39, 140, -52, 101, 31, -215, -82, -79, -244, -105, -18, -235, 46, 154, -59, 43, -67, 147, 87, 235, 80, 31, 24, -164, 201, -46, 284, 16, -60, -10, -129, -122, -31, 7, 66, -2, 125, 32, -20, -186, -67, 18, 55, -68, -267, 27, -27, 73, 115, 48, -67, -201, 140, 12, 179, -25, -28, 36, 53, -65, 31, -52, -84, 160, -185, -51, 43, -50, -83, -4, -225, 27, -56, 215, -94, 139, 286, 0, 89, -127, 6, 100, -83, 109, 94, -140, 48, 78, 90, 49, -84, -100, -29, 66, 96, 178, -22, -195, 89, 69, -11, 14, 22, -109, -65, 91, -69, 53, -34, -59, 195, 130, 56, -108, 31, -35, -78, -135, 114, -42, 189, 20, 213, 301, 47, -7, 1, 25, 51, 9, -14, 46, 185, 247, -68, 18, 48, -146, 24, -73, 111, 84, -100, 129, 62, -36, -26, 108, 73, -53, -64, -92, 33, 18, -122, -81, 197, 109, 115, -106, 95, -54, -33, -143, 34, 112, 26, -24, -16, 130, -27, -68, 191, -46, 40, -188, 9, 230, 10, -136, 275, 93, 78, -20, 67, 95, -82, -144, -23, 112, -68]
8133f8M7%j18L65l59j2J38J56j63J7k08J88K1K3N5rj23J6NJ94k26mP4J0J54rj2
8160A52n9j88K0R8j7N6l4O4m1J02j13k0p3N4%J36j25q1K3K47k11N9k48J08KmJ37
8187D4j47R7J17j23
$$ y = [-68, -21, -21, -139, 226, -133, -145, -7, 149, -14, 3, -205, -17, 4, 27, 82, 73, -50, -34, -29, 165, -61, -65, 9, 19, 173, 164, 152, 93, -95, -75, 23, 6, 62, 28, 92, 51, 153, 40, 20, -53, 1, 1, 137, 12, -69, -46, 201, -10, 49, -199, -91, -89, -93, 44, -103, -6, 111, -12]
8191a2
$$ Imaginary data points
##PAGE= N=2
##DATA TABLE= (X++(I..I)), XYDATA
0@%%%%%%%%%%%qJ6j6J6k4L2m0M8n6P2q8J04j20J40j64J92k24K56k95L39l87M41
33B34m99N65o38P18q05R00j005J119j243J380j531J695j874K069k281K515k771
50a452L052l363L705m085M512m990N530o148O862p698Q691r893J1388j3300J5847
65H658j9427K4859l4176N4388j75976J38672J98275l89565Q4167K39191j46913
76a7847j33717K42520R335k45765Q4244K28643j78579j11218J71748K824j16896
87f4708Q5621L6175j09669R296J17131l3655j08921L3713J08611o6995o8704J20357
99E8252j8706j31736J37058Q7812j92319l4531K00642k1652k07982R3048J56510
110A26396k11463k7854K58185j39612j95769K43429Q6006k41395K2082J87339
$$ y = [0, 0, 0, 0, 0, 0, 0, 0, 0, 0, 0, 0, -8, 8, -8, 8, -16, 16, -24, 24, -32, 40, -48, 56, -64, 76, -88, 104, -120, 136, -159, 180, -207, 234, -265, 300, -338, 380, -425, 475, -530, 589, -654, 726, -805, 890, -984, 1085, -1196, 1319, -1452, 1600, -1763, 1942, -2143, 2369, -2621, 2909, -3239, 3623, -4075, 4616, -5277, 6111, -7189, 8658, -10769, 14090, -20086, 34302, -141674, -3002, 195273, -194292, -110125, 129066, -17847, -151564, 90956, 100291, -145474, -61230, 167413, -11166, -122384, 49364, 52188, -64708, 20913, 57088, -52581, -43285, 73846, 40191, -68730, -35017, 73594, 6599, -62105, 58252, 39546, -92190, 44868, 132680, -59639, -94170, 106472, 84820, -123162, -30114, 126396, -85067, -112921, 145264, 5652, -190117, 53312, 139318, -102077, -79995, 107344]
120A07344r9883r8562J51665k739j59365R2892J23510j41687m9951J38040l4275
131B6989p6043Q0076j3143p5496N0986M9752m3629n7393M8227P0496p2798k3158
143c5134Q4080l9724m8276P2692J7818q9668j7614J12218q794j32085O7452R4568
155G7533j19237o781J27228q1393q6937J35355K1392j35518L6940R3489o5802
166c731l6510Q1100j5115q2226P7359N3089j22608J4512R5392p5703k3115O6832
178B9276l5075l4489M4216K6972m5342k7738O4137Q209o1842K4847L0275l7700
190a4254p07L3067r101l2931J1206M4539j8127n0333M0642L4780o4793J0006N7268
203D1262o1401j4942P2855k5065m8341L7998L2141l8667j6957N6463k2005n5732
$$ y = [107344, 7461, -91101, 60564, 57825, -101540, -8648, 114862, -26825, -76776, 61264, 26989, -49054, 31022, 17879, -57617, -6631, 43121, -508, -57901, -9674, 60822, -11976, -35134, 48946, 9222, -39054, 33638, 51456, -38212, -55826, 56392, 47598, -84487, -17035, 77533, -41704, -48485, 78743, -2650, -89587, 45768, 67160, -68358, -31418, 62071, -3731, -40241, 40859, 25744, -56482, 20877, 73966, -48642, -34130, 61262, -14441, -37556, 29276, -5799, -40288, 3928, 30900, -14442, -42180, 21957, 30166, -31676, -6829, 23446, -14254, -14961, 18106, 9005, -23926, -12720, 31819, 13692, -36641, 4001, 38781, -26012, -16006, 41262, -20139, -35081, 37774, 12709, -35632, 2366, 34507, -4160, -21117, 35346, 13341, -42391]
215d2391P2327N871q5004M6883M2819o1880N17M3826k1668k8162L1749J6949m3395
228b1559k073M6137j9381l4085L7738R202l6666K0691J9418k5577J226J1813M377
241A1261j0257j7569K8875p15l7969L2573J0104l8736J9999J9066k0252q230J5839
254C989J3782k8341k087M0034k8521k3123M8291j1406l9058L5710J2286l9703
266a8147J0093K5768k1464j3894K0179P304k4662J867L2210k3868j7360M3194
278B1220j4245k6664L2288j962j7042Q359K482J647j2209K126J8935k3663m573
291a3301K7495j6609j1243J7986l181p832L900O022k60j0772P448J5665j9666
304d348n335K7455j5485j5606K7348r729j7527J8263O61r976m431Q812R287k2656
$$ y = [-42391, 29936, 35807, -49197, -2314, 40505, -21375, -20858, 22968, 1300, -26862, 4887, 21836, -21559, -23632, 22505, 3124, -30961, 6777, 15979, -20687, 4, 19422, -6155, -4929, 6884, 11261, 1004, -16565, 12310, 11595, -26374, 6199, 16303, -22433, -2434, 16632, -3620, -11850, 3989, 17771, -10570, -12657, 27377, -1144, -24267, 24024, 12618, -26440, 9270, 21556, -18147, -8054, 17714, -3750, -17644, 2535, 9839, -14823, -12956, 19254, -4614, -21974, 21220, 6975, -19689, 12599, 10637, -6405, 1954, 4436, 6083, -6126, -4000, 14935, -8728, -13301, 14194, -2415, -13658, 4328, 1147, -6685, -2785, 3237, 2977, -7795, -347, 15318, -4348, -9683, 17772, 2287, -13319, 14029, 4300, -13227, 5036, 5697, -4279, -8710, 102, 9389, -13267]
318a3267P575K2286k9730N261K7902k5572l289K1404q296p254L760N285m329r931
332h195J2363K013k0130J1192J3282k0847K017J6509j3373j110J0425n280J0q04
346a928L953P089j6013P950J4555k1940O368J3155j7478K810N778m934r27o011
360g573J0081K74j6875J7383N264k1284J4172J0074j8675N348J1517j0458l701
373d453P045J849o163m511J1278j322j5586J5440K325k0695J5694N101j7221J0024
387a195K546k591M048n343Q435q0r524J4498m102j4122J3452p83r963L963j388
402b149M12j82k602O577n039o162J5810l272j6007J5453L213j4151J0962K371
416E234r962O194L776mo850l207J4481r530r469J6777j1834o243J9663r519p192
$$ y = [-13267, -5692, 16594, -13136, -7875, 20027, -5545, -8834, 12570, 4274, -2980, 780, 6065, 1736, -8195, 4168, 6181, -13949, -2757, 10525, -10322, -8305, 8204, -5169, -6279, 4146, -1134, -1124, -1928, 2025, 9114, -6899, 1051, 15606, -6334, 34, 13189, -4289, -1479, 4299, -635, -1562, -7573, 2508, 2782, -14093, 3290, 8554, -12730, 1442, 11516, -7159, -1811, 9706, -752, -4453, 2592, 4441, -1722, -6233, 5045, 3723, -11863, 3577, 5902, -14793, 901, 6002, -11219, -1195, 1351, -1240, 2808, -2535, 5900, 5820, -3704, 10794, 6692, -7430, 6022, 5239, -4724, -761, -2149, -1737, -1919, -4521, 2056, -2983, -9145, 6665, 3393, -12614, 2839, 6052, -8099, 2863, 5234, -4728, 1466, 5242, 5238, -1612, -4819, 9662, 132, -9337, 7440, -4394, -10637, 9026, -493, -7685]
431g685J1341j208K518j040m331O061l359q91N876j0470k499J1064m634n084K584
446a757k570M087O42o887N101n007j908J5902j2061r580K0442m464o158J0141
460E923m949k432M605K911j572j3664P795J2382j7194K182J1176j3478O496J2574
474A2755j4359j939J0522j834j680k077k838L874j39Q52k57r242O881P377j0952
489c056R79j14n093J0525o458o773R748q005M691J2073j7252P44J5912n912l873
504a864J833j23p04j158P239m868j1759J5517P406j8092N924Q567j2484P944O538
519I916j6694L335R658n053j94k236Q34M070j867M260o062o797J4427m016j0004
534f423Q075o486J284J0203j1633RQ552p147M922M250j2136J682R564k563o244
$$ y = [-7685, 3656, 2448, 4966, 3926, -405, 5656, 2297, 1406, 7282, -3188, -5687, 5377, 743, -4341, -1757, -4327, -240, 402, -6485, -1384, -6391, -8299, 7603, -4458, -14038, 6404, 1940, -4218, 5923, 974, -1458, 3147, 6058, 4486, -9178, -1383, 10999, -6195, -4013, 7163, -6315, 181, 12755, -1604, -3543, 6979, 5145, 3465, 1388, -1450, 2424, 2285, 3137, 2880, -6362, 519, 7896, -3056, -2077, -2191, -7284, 3241, -3217, -9990, -242, -8247, -3556, 8517, -8735, -7991, 7921, 2009, -1864, -31, -154, -858, -2016, 5223, 355, -11404, 4113, 11519, -6573, -649, 7918, -4566, 3378, 9916, -6778, -3443, 6215, 1162, 968, -1268, -434, 3636, 1769, 6029, -33, -6830, 7597, 3581, -6423, 1652, -4834, -3550, 6653, -4980, -4971, 3581, -3566, 1356, 5606, -6530, -4848, 4716, 2153, -4091]
549d091l44O522m36m239Q122l350j0804J6121J771j9414J0565L957j2286J0357
563B451p35j1188P999M396k242k866q67O781m410k73P106j1320R65J3494j0691
578a400k393Q979p213L368O141j0851R35O985o017O53K529n659K309M615M07m044
594f56k119R909k025r128J1440n402j0306J6561o276j3141J3393j729p603P943
608H61k038m406K912L520o99p220M937O198r550M247P305j1435M836R755j1674
623b451R20Q163q936K379M120q887L608K796l579K171j192J617J104j949N765
638E649m440l683J1258p714n130J2511r094m706J2555p905n572R673l575n056
652e229L871J326l307j703N109N58p139O950N088j0999O389P185j2636N064O177
$$ y = [-4091, -4435, 2087, 1651, -2588, 5534, 2184, -8620, 7501, 9272, -10142, 423, 4380, -7906, 2451, 1716, -9472, -1473, 2923, 681, -2185, -3052, 3729, -681, -954, 6152, -5168, -4203, 9291, -1400, -3793, 5186, -2027, 1341, 7482, -3369, -2434, 4551, -1466, -813, 1716, -3943, -1634, 2981, 3388, -656, -2775, 7134, 5109, -4019, 7421, 2019, -8287, 8274, 1998, -11143, 2250, 521, -7082, 861, -1177, -5583, -2671, 849, 150, -7070, -2133, 4065, -5485, -1238, 6067, -5368, -532, 9223, -2451, -1531, 6632, -2304, 75, 4195, -4692, -1084, 1712, -1867, 304, -888, 729, 1833, -116, 5649, 1209, -2474, 8784, 1070, -4060, 8451, -643, -5349, 7206, -699, -6271, 3402, -173, -5229, -1358, -32, -3339, -5042, 67, 625, -6514, 436, 5524, -5475, 914, 8099, -4537, 527, 6704]
667F704j1134M537L453q036L951O56j937J761k352L042j24k781N620l849k078
682b567Q271o286r09P763q224P48R048r423j760Q488o085k133M928l387k146J880
698a794K867j693n274P421K484r435Q103K441j1079R689K595j1566O538K087n919
713b535M173j105k462R70r0K680l741k217O458k957j827N343n328O05P483o563
729a113j2N880o971K963N057r034J655M591m301R08m25q10J409k080M426k232
745h9o372J0241m43q657Q668j446o096R147j954o478M865N62j603p5j521J150
761a01j236k07L643n816m99P570m648j425N563n410K143N712p139K022L250m857
777a435M758p99m965M030j056o10P85m175L539J4l236N402l981l473R380l614
$$ y = [6704, -4430, 107, 3560, -4476, -525, 131, -1806, -45, -2397, 645, 521, -2260, 3360, -489, -2567, 5704, -582, -1491, 6272, -1952, -1204, 7844, -1579, -3339, 5149, -936, -3069, 1859, -1528, -3674, -1794, 1073, -620, -5894, 1527, 4011, -5424, 2679, 5120, -5959, 3730, 6325, -5241, 1297, 3384, -2535, 1638, 533, -1929, -959, -1049, 1631, -2110, -4327, 2131, -826, -2653, 2690, -2638, -2033, 5450, -1113, -1125, 4755, -2216, 747, 5804, -3230, -1575, 3016, -1285, -377, -802, -1612, -203, -2283, 2143, -89, -6461, 3780, 3337, -5320, 3348, 1902, -4194, 4953, 2999, -3479, 1386, 1948, 345, 270, -1251, -101, -1337, -1544, 2099, -3717, -4216, 3354, -1294, -2719, 2844, -2566, -423, 5289, -1850, 172, 3422, -1435, 3323, 2524, -2441, 1589, 533, -77, 708, -3467, 72, 86, -3150, 2252, -1729, -5202, 4178, 564]
793E64m484P161k627k460N648k959k885L269m50M33k015j285M048l932K96M536
809B858p432K092O515p060J800M088n066M143J284m514L664j102p55K979m271
824g77M83J988l018K131j187l178M805k041k465N025m016j186O738m690j376N328
840B564l274J74K983k932J169j16l96K284m637J353L995o851L414K693o887M559
856I5K655n877M056P29k666L220j530k25J491k220J629L21l558L427n63l715M121
873A390k132k616M970l865j098N121m882J119L980m726K588K208l370K828o97
888H18m96K382l809K177J129m852M250L79n786N341M08m931M282j10l246L634
904A570j102p50J175j170J890q1k836L526j336k474M722m016k067N436m716l44
$$ y = [564, -3920, 3241, 614, -1846, 3802, 843, -2042, 1227, 777, 1210, -805, -2090, 1958, -1974, -1678, 2858, -4574, -2482, 4033, -3027, -1227, 2861, -2205, 1938, 3222, -1292, 2372, 1270, 515, 3494, -777, -294, 1694, -1324, 807, -380, -3558, 1247, -794, -3259, 1766, -2250, -3436, 3302, -1388, -2764, 2564, -710, -536, 2447, -485, 684, 568, 172, 2456, -2181, -828, 3167, -3684, -270, 2423, -4464, 95, 2750, -3127, 929, 1658, -1008, 2212, 682, 457, 1948, -272, 1357, 1678, -1880, 1547, 984, -2731, 1390, -742, -3358, 1612, -2253, -3351, 1770, -3112, -1993, 1987, -2739, -151, 2057, -1313, 1515, 818, 322, 2704, -1105, 1072, 2201, -2651, 1599, 1978, -3808, 1533, 1941, -2990, 1292, 1182, -2064, 1570, 468, -282, 893, -277, 1613, 1532, -1304, 2222, 886, -1588, 3134, -882, -2949, 2487, -2229, -2573]
920b573L345m481K255K524m092K559O29j491L419j977m76K258k395K155M85m260
936b116M064m13l620M595k320l592N808j978l340L785j767k77K498j936P64L35
952D90q32L507l297j083M940m388q8M045o182J489L987n094J414J259k790K823
968B00M0j802K122j505J278J871l454J963J028k648L822j640l574M939j853l059
984b272M431l949j357N187l618j219K640j501J589q9j356K525k267J555K883n275
1000b093K146L091n278K967J347n306L898J377m329K012J77j452K361j109K6Q73
1016G08j494L055m57l208M282j646j842M320l969j555N289m451o51L260m233J146
1032a446K279l203J057k9N0J923k507J452J608l429L453Q81n091M611Q79n033
$$ y = [-2573, 772, -3709, -1454, 1070, -3022, -463, 166, -1325, 2094, 117, -359, 1899, -496, 1659, 2144, -2116, 1948, 1535, -2085, 2510, 190, -3402, 2406, 428, -2912, 873, -894, -1171, 1327, -609, 155, 490, -342, 3165, -132, -1215, 3725, -663, -751, 3294, -2888, -1399, 2588, -2506, -1092, 167, -2623, 200, 240, -1562, 560, -945, 333, 2204, -1250, 713, 1741, -907, 2915, 1275, -2299, 2640, 787, -2272, 2159, -1790, -3147, 2040, -1578, -2797, -157, -1658, -69, -158, -1514, 1011, -1256, 299, 3182, -2093, 53, 3144, -2134, 833, 2180, -3126, 772, 2149, -2180, -168, 9, -1443, 918, -191, -165, 708, -786, 2269, 1812, -1396, 2886, 1240, -602, 3718, -251, -1806, 3483, -968, -1619, 1641, -2592, -1446, 833, -2370, -1313, -1342, -1292, 631, -1876, -424, 1184, -2245, 1208, 2089, -3002, 1609, 2488, -2545]
1048b545M009k46m061M188o10k670K231p35J68N61j504K408j392o88M270l668
1064b84r77N272m220j07M188n079P87L320m136O39J594k800J407q1q56R09j372
1081a796J551Q22l169L546K16l471M600r58l854N181j307l712M563j919k231L416
1097A478k054m47O87q69J907j924p6L274l892J357L887m943J577L515m788J457
1113A46L045m509J741J149k869J447L8j062J055j631J361M18k903L627o15k905
1129b467M792j788k752N351k721j903M598k949j134K829k296j6M66r21J163j594
1145a342K73J604l105K239K226m689K762K854n043K777K097m751L003J241l236
1160a090J829k31j026J121j509J183p18j641L339j747k266M931k775j390M972
$$ y = [-2545, 1464, 1218, -2843, 1345, 735, -1935, 296, -439, -271, 290, -1214, 1194, -198, -886, 3384, -284, -1261, 4011, -209, -316, 3872, -1207, -420, 2900, -1236, -597, 997, -1803, -396, -477, -1333, -424, -1796, -245, 577, -2592, 954, 1170, -2301, 2299, 1341, -2513, 2668, 1361, -2351, 2212, 293, -1938, 1478, -576, -1023, -336, -1205, 702, -1222, -1298, 1976, -1916, -559, 3328, -1615, -38, 3477, -1311, 146, 3191, -1318, 423, 1572, -1297, 150, 188, -874, 181, -1450, -89, 329, -2574, 1053, 438, -2467, 2325, 537, -2215, 3136, 415, -1488, 3110, 161, -973, 1856, -440, -456, 10, -911, 252, -1342, -1069, 535, -2570, -331, 1895, -2794, -32, 2822, -2221, 556, 2653, -2098, 905, 2146, -1090, 739, 508, -518, 603, -906, 277, -441, -2082, 1257, -490, -2756, 2175, -600, -1990, 2982]
1175B982l614o67M506l287n83K411k260Q36O48j431N59j031R04P73l148J887J536
1192A021l707L538N51m544M198P70l818L544l26k376L046r15j308N72p52J509
1208A003r40j799K824k242m49L443l697k05M490l628K9L207l119Q00K429k316
1224a70M65K95p78J426j547J17Q72k569K232M25l538L152L22l275M090j009k950
1241b440M395j061j882K849j485m0J202j424P91r56l29J920k665k86K913l328
1257a826O49K870m007J048L127l361J240J572k136J512M18j286R75j038P56N99
1273A112k530K114N5k851L225j073k577L671j337j876L561j895n32K672j817J29
1289E1J096j166J093o63n72J570k104J92K020l266Q12K101l490J559J982l591
$$ y = [2982, -632, -1299, 3207, -80, -663, 1748, -512, 324, 972, -459, 100, -931, -27, 746, -2402, -515, 1021, -2686, 852, 1403, -3141, 1057, 1827, -1991, 1553, 1227, -1149, 1897, 982, -326, 246, -506, 1003, 63, -1736, 1088, -1154, -1603, 1840, -1857, -2062, 2428, -1200, -1171, 2036, -1083, -283, 2146, -170, 295, 590, -188, 1238, -309, -192, 680, -1889, 343, 768, -2770, 382, 704, -2571, 1519, 510, -2440, 1955, 894, -988, 1861, 376, 336, 1538, 114, 905, -51, -380, 1540, -1125, -1411, 1502, -1826, -1177, 1693, -2314, -1266, 1861, -1500, -260, 1312, -824, 688, 1106, -180, 795, -243, 513, 1112, -1418, 696, 751, -2100, 1125, 52, -2525, 1146, -191, -2067, 1494, -401, -933, 1739, -78, 51, 1147, -19, 1074, 411, -161, 1409, -695, -503, 1517, -1749, -937, 1164, -2326, -767, 1215, -2376]
1305b376K343J037k530K038m1q01J306j399J038M95j768K282r80k108K950j505
1321a9j874L213j942j199L136k486K9K101j739P83Q48j415J540m16o66J644k049
1338e11K94J611k849J623J284l447K188M88l189K668l6j724K074o52n76J131o41
1355b64R49J67j252K198j128j573K774j712j082K630k369o47K495k306L49J404
1371F33j881J104M74r60J204q44k88J919k030Q97J225k700K071O94k756K078J33
1388I73k704K585j180j444J972p01m99J328j227J432o2q50J923j374n70K524j856
1405B70j119K631k453M34J862k916P21J489j838P86M3r77J296p16N4R52j629J696
1423E86Q37k387K021n8j680K119n44k218K312q55j265J669j388j20J112r85Q28
$$ y = [-2376, -33, 1004, -1526, 512, 471, -330, 976, -423, 615, 1110, -658, 1624, 644, -1464, 1486, -19, -1893, 1320, -622, -1821, 1315, -1171, -1142, 959, -780, 3, 851, -564, 976, 560, -106, 1538, -511, -217, 1394, -1455, 168, 1452, -1995, 193, 681, -2508, 160, 124, -1600, 474, -178, -754, 377, -264, 685, 852, -400, 1798, 670, -903, 1871, 159, -923, 1707, -662, -1309, 1186, -1120, -771, 633, -1248, -144, 330, -630, 574, -270, -558, 1361, -669, 228, 1453, -1247, 824, 1518, -1238, 840, 973, -1731, 854, -326, -1770, 202, -499, -998, 330, -897, 535, 473, -377, 1546, 172, -398, 2126, 270, -849, 1782, -671, -237, 1625, -1291, -570, 919, -919, -133, -90, -1067, 229, -487, -433, 519, -1110, 586, 1423, -964, 1057, 999, -681, 1438, 894, -1324, 988, 133, -1132, 537, -851, -971, 141, -844, -16]
1440a6k14o44J999j107o12K106k198Q23K121l107R16J734k569R95P69k545J584
1457C5j2r34O56j181P60Q17j250J607j78j270K405n34j704K247j075j170K327
1474A546j737p53J787j640K94Q33j363P90K48n88J333j741L96J994k586J096J746
1491A655k379J532J131k781J698K87j863J131m69j113J217r68L96J98q40J615
1507D47q5j435K152j025q35K343j455r21K309j524l41J607j760N77M57j289J071
1524B93r56k61J356j515O64J058k283J971O75k092J906M74k154K073o13j565J719
1541G50p23o11Q01o89M77p1p95J245o90q01K106j658n41K629k038qK248j897K00
1560f6J544j742Q16L59j281Q41q90k68R44j394Q86M77j651J737K30j740K122l09
$$ y = [-16, -230, -874, 1125, 18, -594, 1512, -686, 137, 2258, -849, 67, 1801, -768, 227, 996, -1549, 35, 23, -911, -255, -1436, -676, 141, -1109, 498, 320, -950, 1455, 921, -783, 1464, 389, -781, 1546, -191, -944, 843, -797, -503, 330, -1033, -243, 5, -583, 750, -991, -595, 1399, -1187, -91, 1655, -724, 808, 1939, -842, 856, 1143, -720, 411, -58, -1171, 46, -922, -526, -328, -1168, 447, 362, -1073, 1079, 54, -781, 1562, 107, -814, 1495, -29, -370, 1237, -523, 54, 511, -778, 293, -663, -924, 432, -1083, -419, 639, -1644, 327, 1002, -1090, 816, 1290, -864, 1209, 596, -969, 750, 27, -584, 217, -472, 5, -66, -861, 384, -306, -1107, 999, -659, -1200, 1429, -609, -617, 1631, -266, -66, 1478, -264, 552, 911, -370, 471, -419, -687, 257, -1137, -251, 226, -1425, 312, 542, -1198, 924, 615]
1578F15j729K464j090j088K011p39p04J014q79R5L41q57J018r34m37J724j792
1595i67j2J885j949M44J881k163P72J735k005P69N87j244Q55p60J02M77j357Q39
1613a11O23j821J723m88j353K018o92j115K138q32j004J895j039j50J407r75N
1630B29J93l25O28j174L6J004j837P61J303k433J380J148k093J510O47j900J390
1647D67K29q86J012n62k61P20q54P07k86j433J793q53j118K040j292p03K175j385
1665d90l78J913j487L62J205j208N28J27n73P61j246M21R03j963J004O53j975
1682a443J736L02k257J841N26j730J517q6p96J308o94R9K05p26P84l90j011J632
1700H17j383n11K027j652k70J767j690M43J633k047O46R22j157Q85j06l78Q06
$$ y = [615, -1114, 1350, 260, -828, 1183, 444, -260, 754, -125, -30, 311, -546, 472, -462, -899, 825, -967, -979, 906, -1043, -599, 1282, -881, -109, 1626, -379, 390, 977, -267, 588, -172, -70, 407, -950, -111, 512, -1309, 414, -74, -1427, 591, -101, -1216, 922, 90, -914, 981, -58, -208, 1199, 224, 229, 422, 97, 725, -449, -413, 591, -1246, -485, 818, -1615, -235, 913, -1180, 330, 977, -923, 467, 696, -190, 822, 260, -1, 719, -135, 572, 286, -1147, 646, -207, -1325, 715, -577, -1280, 895, -490, -868, 1045, -442, -80, 1125, -83, 445, 572, -1, 760, -486, -65, 838, -1125, -121, 532, -1443, 293, 595, -1662, 179, 705, -1025, 492, 406, -390, 918, 224, 323, 528, -198, 586, 196, -815, 817, -566, -1077, 950, -702, -972, 795, -895, -452, 1181, -866, -220, 702, -455, 430, 324, -54, 752]
1717G52q99K58M53j350R27M91j814J364J45j894K147m57j341J653k79r96J485
1734F45p72q5P12p47P38m51l94J380j443J90J205j584K32J547k345P10J073j679
1752a068Q80O19j145R49k70j83P17n58M75L03j155J017J3j646J796m77j334J788
1770G21o39r67J729j353j83R64q84J47N82n65J026n04l07J245j287L15J110j783
1788f33N20J058j987P77Q15j741J211K97j186J035l05j41O33p05O42M8j019J502
1806H21l63j244J819p57r19J750j209o04J633j480j52P72o30M1O12p16P16j66
1824g6p2R40r55L09Q92j579P78N16j560J038M09j623J148J1j035J286o25j25L99
1843G6n78M95K37p51J042j00j040K139j211o27J710j365l93J068j314o5Q70q70
$$ y = [752, -147, 111, 564, -786, 141, 632, -1182, 182, 327, -1567, 580, 123, -1218, 435, 156, -840, 645, -127, -212, 500, -247, 491, 40, -354, 1026, -417, -227, 978, -606, -374, 1173, -1172, -462, 611, -1068, -188, 431, -714, 235, -35, -218, 499, -59, 416, 719, -436, 581, 594, -1052, 744, 267, -1067, 721, 82, -885, 844, -509, -692, 272, -612, -465, 117, -448, 578, 74, -233, 1012, -275, 40, 1150, -633, -113, 945, -1042, -265, 550, -1191, 20, 317, -869, 166, -139, -280, 353, -352, 290, 338, -681, 821, 458, -786, 1033, 276, -643, 1107, -102, -706, 927, -553, -705, 67, -563, -522, 90, -626, 90, -76, -148, 792, -163, 146, 1038, -541, 237, 753, -807, 231, 640, -983, 165, 176, -859, 427, -198, -323, 76, -502, -7, 230, -521, 521, 421, -619, 1520, 309, -318, 1392, 27, -366, 702, -612, -677, 193, -677]
1861f77M51R4l09N56l95K5R73j223K83J035j533J030N06j465J239m5j079J184
1879F50n03o18Q87q34K8O87j095O01K38p19J192o65l89J773j123j72J367j580
1897b75r7J133j318L15N23r51O76o5l28N82m93N1P41r74L30O31j354J332R8j214
1917f57J443m13o92J247q58m72Q24p98L6M49n91N94k72m42J213r21r3J244j378
1936e37K47J103j262M21O78j197Q42M99j334P90J68l55L13q46K28N50j084O93
1954h3J50j133J546k49o85J146l80m48J058q69l35R41j037M48N3n38O87l71m15
1973e14R59q61n5R30j156L01Q49j323P42O78j407J313P2o67Q25l00n80N30n79
1992b43Q1M45q61P78l37n98J134o42m45J339o17n93J397r96j0R78j091N03K04
$$ y = [-677, -226, -132, -441, 115, -280, -255, 718, -505, -222, 813, -720, 310, 816, -649, 590, 545, -534, 650, 147, -471, 416, -418, -390, 297, -798, -197, 41, -678, 514, -151, -540, 1233, 110, -62, 1305, -275, -372, 761, -557, -242, 281, -670, 6, -59, -387, 195, -298, -247, 494, -480, -150, 481, -873, 459, 557, -657, 786, 373, -319, 928, 70, -402, 422, -376, -340, 109, -482, 112, -160, -602, 611, -310, -403, 841, -537, -290, 813, -449, -28, 650, -547, 295, 794, -540, 250, 418, 63, 376, -470, -242, 308, -776, -83, 67, -1066, 480, 231, -454, 692, 312, -136, 922, 53, -282, 659, -378, 70, 123, -415, 272, -99, -514, 445, -416, -471, 459, -697, -396, 453, -870, -128, 550, -857, 456, 528, -139, 686, 386, -194, 336, -243, -162, 283, -578, 200, -137, -735, 399, -243, -688, 651, 34, -559, 838, -158, -168, 810, -281, 222, 426]
2011D26o15P67l40m21R18j093j14Q71j225O87N31j323J010J82q53R94j61n63R96
2030F74m35m10P59q62M29J70r63P29o0p20J060n92m61J200p25k75J100q20j08
2049c10Q43r14Q31K09q52P18l34k07N83q13l2O30j119O35J75r56J257k73o47J245
2069F69n53m79P81m29j17M79n69K52K03m12P54m50n70J112r28k00Q37j113L42
2088c91R20j370O81O45r78N01M40o06O33n06J71M07r57M73K77j090J052J53j041
2107e86J126o69p38J132m58k78R01r21L97N42o68L89J42m87Q37o52j1O74r49R3
2127a84O97j355M24P01j034O81K37o98O01M9n11P06m91Q1O42o30N13J14j119J219
2147F43m08q43J302p12l52Q88q11k98R41q95M64J85o92Q07k07k75R10o71J73N25
$$ y = [426, -189, 578, 238, -183, 735, -358, -472, 399, -826, -139, 392, -931, 79, 261, -592, 402, 241, -322, 674, 239, -171, 588, -274, 155, 325, -638, 91, 31, -689, 371, -221, -682, 518, -207, -482, 618, -202, -310, 533, -381, 450, 659, -193, 525, 191, -16, 567, -246, -278, 352, -767, -132, 43, -913, 344, 71, -576, 669, 116, -363, 418, -11, -128, 351, -218, 34, 237, -175, 579, 129, -441, 671, -257, -457, 380, -733, -391, 529, -841, -160, 485, -493, 8, 448, -158, 475, -31, 140, 547, -410, 63, 340, -750, 302, 455, -586, 540, -129, -867, 265, -193, -471, 430, -491, -94, 448, -220, 169, 311, -176, 661, 9, -2, 672, -277, -184, 513, -842, -418, 283, -751, -70, 167, -531, 70, 119, -392, 314, -177, -96, 546, -84, 429, 543, -576, 643, 235, -608, 694, -18, -370, 518, -293, -591, 350, -545, -81, 104, -588, 219, 12, -263, 647, -24, 149, 674]
2167F74q72M55N60j489R31J72j200J106k03r06R87l43m12Q00m65K31M04p02N08
2186B36K51o45P51n76j50R73q63m44J269j224r7R08j032M20L85o09N43l04K3N98
2206D13o36M16N21r07L22N02j171Q79k90p05J114m18p85Q02m25P8K92k92J0K16
2226f4l1M04k8m05O06l83k37Q31p12k04J150j381K49O06j161N36K85p26O12j64
2246b17k25P66p39M48L35q15P21K06q68O00J40q04Q17k36p99R53n39j80N16p58
2266f78N12L58m88N81l06j60O36o18QQ76q96J23P34r21K75L11r07N58K34q36N48
2287e6k94k22Q74q56M72K29o23M60L02o58Q60l29o97J187n81l30O96m57j82N93
2307C88n41j0J08l36M74k14j92P69p72K67P33q89L57L99j137R16K21q74N60j3
$$ y = [674, -198, 257, 817, -672, 259, 431, -769, 337, 134, -772, 215, -128, -540, 260, -205, 26, 430, -272, 236, 487, -158, 593, 17, -133, 840, -23, -467, 802, -422, -519, 389, -643, -223, 162, -447, 96, -208, -185, 413, -223, 193, 714, -193, 129, 631, -540, 339, 49, -656, 458, 40, -745, 57, -368, -290, 2, -290, -280, -64, -95, 309, 281, -124, 482, 99, -138, 693, -19, -223, 927, -454, -205, 401, -760, -224, 61, -665, -53, -217, -442, 324, -415, 33, 368, -447, 274, 480, -388, 212, 352, -452, 365, 129, -670, 283, -256, -436, 80, -678, -166, 192, -296, 285, -21, -181, 455, -163, -155, 721, -175, -52, 682, -239, 36, 347, -560, -2, 232, -604, -56, -350, -572, 302, -554, -82, 147, -476, -16, 286, -372, 488, 159, -538, 649, 68, -262, 434, -23, -205, 388, -153, -163, -55, -391, 83, -131, -323, 446, -326, -59, 674, -215, 142, 541, -596, 320, 541, -333, 227, 214]
2327B14p85P13j83j21L42o58M47o9m09P15k96m63J003l92m57J117o39j06O54n21
2347A06m9M44r09M39j73k02M72m69j00P64q28M10O16r27N22J67p95O19J14o54
2367d33R62k64m84P55o55r5M06n08L58pp30P08j76k70P60o33J17R27q88o7O51
2388D34o75M86K11p29P33r4o65M74l84o1O70q21K04N41j182Q88J0o46O45j29p6
2409a66N84j65k94O29o83K90j02l86N60j86l85M94n27l45P85k71j50R52q07J41
2429c2O21r00L92Q7m71O53j50k95M11l38J8M61o66J42K46p14O46J02j013R23N2
2450A75n51P22m11j59Q09n80N9J75m64N69m20k24O77o49k82Q20o26K20L77o99
2470d62K75L27o09P17J69o84O34l63j23O22m62O1J86n76O40j95m12M12J20j168
$$ y = [214, -571, 142, -41, -162, 180, -478, -31, -100, -509, 206, -90, -553, 450, 58, -399, 718, 79, -27, 627, 106, 57, 501, -408, 31, -142, -344, 128, -341, -441, 323, -505, -95, 521, -406, 116, 283, -512, 107, 221, -433, 529, 265, -219, 536, -119, -214, 192, -316, 42, 35, -695, 13, -163, -433, 327, -306, -189, 738, -150, -217, 434, -241, 245, 456, -273, 460, 366, -299, 175, -209, -270, 400, -421, -217, 324, -858, 30, 40, -606, 39, -90, -166, 418, 253, -41, 588, -95, 195, 93, -293, 267, 81, -304, 190, -337, -682, 103, -168, -318, 634, -173, -32, 589, -311, 81, 168, -303, 350, 200, -95, 316, -22, -4, 457, -209, -67, 179, -535, 111, 213, -800, 123, 175, -376, 346, -65, -224, 585, 5, 64, 239, -225, 344, -76, -300, 377, -272, -554, 266, -360, -140, 237, -462, -187, 140, -469, 248, 417, -267, 367, 4, -119, 503, 41, 102, 288, -288, 352, 157, -255, 157, 277, -891]
2490h91J156m17j15O60n53J7P53q11K39K60k89L77k18j74L28m47mO49r65R3K87
2511f5n95N01K36o75L55N06n21N01j97k05N81o43K18L43p12P46k28l12M74l32
2531b4k82N84n50r2O92o86J88M70l95J91J22n06M36qJK00l93Q0M59j007M87J93
2553A60o16M65j13l99N63q0m12P80n84%O35m45L52j7l72M02k87k31N63m65k82
2574c83R39p44j37M93n07K92K49l49J32q3j28M48j76q9N43n90J71K88q26N83J45
2595B71o33L38J71p27P51l35oM53n80j5O76n02L99O0m71O55m34q2N39p56R4N36
2617D02o42KM25o65K01K07l62N29k39k98O51m02J63K57o79N26K41n86N43R0r16
2638e52R56l52m27O75l90j78O76o90J96M4k31M55k35j67K51Rj12M39n32J27O19
$$ y = [-891, 265, -152, -267, 393, -160, -143, 610, -201, 38, 298, 9, 386, 168, -6, 322, -125, -129, 520, -445, -352, -65, -660, -159, 77, -598, -243, 263, -258, 243, 46, -159, 422, -221, -3, 340, -372, 374, 146, -166, 308, -24, -306, 278, -272, -364, 328, -358, -170, 300, -95, 96, 218, -288, 148, 140, 141, 341, -52, 28, 487, -520, -33, 160, -456, 9, -104, -503, 60, -20, -432, 348, -236, -236, 399, -46, 306, 289, -83, 319, 32, -199, 364, -101, -383, 556, -188, -325, 168, -339, -47, 202, -147, -15, -98, -226, 222, 46, -43, 500, -90, 81, 369, -457, 126, 271, -362, -24, 147, -580, 171, -164, -170, 283, -297, -312, 364, -138, 261, 321, -150, 505, 71, -11, 528, -228, -134, 402, -240, -238, 187, -478, -277, -70, -432, 97, -142, -440, 211, -191, -28, 229, -450, 76, 317, -269, 274, 364, -552, 404, 52, -375, 300, -90, -268, 408, -282, -86, -42, -273, 182, -53, -220, 31, 40, -72, 367, -165, -38, 581]
2659E81p73K15L71n86K04rl81L78l03J80J70l45J12K82l18L48J2l44N10k25k17
2680a38N16l67k20P97p15j94N14j64j12J8N9J07j32k00M58l85K17K20m72K81J73
2701B61n16M71J54p25O51l06k71P13m65j99M21o96K66J99l03K73N4k34N18m53
2721a87j7Q54p65n2L36k79P0O70o67J65pj43J36j37k42L68l28K47J78l49O7N44
2743D62r02P51j0n74M82j05l88L77k18O1K70l96J66Q4l89J86k37m1L78k92J11
2764b24O94l77J73J6m36J80K59m91M38om09L88l84p4L90n35K57M37m97L75k34
2785f0j82L73j93j51O59l91j41K18j73l2L44n28L65j27j75M04l31j66L61l98m7
2806c71M53l12K50K19p27P95R7o54O02k29j67J98k36MM00n44K68Rl59K63J01l19
$$ y = [581, -192, 23, 394, -192, 12, 3, -378, 0, -303, -123, 47, -298, -186, 96, -222, 126, 138, -206, 304, 79, -138, 378, 11, -209, 588, -127, -321, 193, 29, -83, -65, -6, 101, -31, -231, 227, -158, 59, 279, -193, 88, 261, -255, 216, 370, -355, 296, -10, -281, 432, -33, -232, 189, -507, -241, -42, -345, -72, -18, -252, 266, -187, -204, 650, -115, -167, 169, -110, -40, 630, -37, 128, 121, -22, 114, -23, -265, 103, -225, 22, 200, -149, -82, 462, -440, 311, 301, -273, 209, 104, -284, 93, -125, -64, 206, -190, -24, 60, -329, -143, -380, -421, -43, -335, -224, 470, 93, 266, 282, -154, 26, 285, -206, 232, 226, -183, 205, -179, -253, 137, -398, -141, 296, -201, 174, -60, -242, 131, -62, -213, 446, 55, -86, 132, -41, -73, 271, -257, 108, -19, -194, 210, -121, -287, 74, -324, -371, 82, -230, 20, 239, -488, 307, 404, -250, 352, 123, -44, 154, -82, -78, 322, -222, 46, 55, -304, -41, 60, -259]
2828b59K90j32j22M59k12k48N28n69J5M44k32K63jm24L04j11lK20m04m2L48m79
2850c67K52M17m96L72R4m56M34j46j29L45p6r0M9l97J92J40n35N04k39r5L94m69
2872c02R5N12m17j11O49l67j5K09k51K80q2j08M9j55k74M40n06J26L47l83K78
2893A4J45m65K91K9m95P47m28k12O78m82M2L76j10J12k27l03L07o1j3N42o11o7
2915a91L92k83m0K30m36M98j61k56M05p9o4K48k33j20L43n89K14J91l01N11j13
2936A66m69M58j63k51N87n92Q2K50j61J53J55m66L56l3l09N90m97mK95m33j07
2957c93N50l22J66J25j09j77K74j74L20l01R0Q6k59l3K38j76L39j20k59M97l03
2978E9j24K37j11j28J21o6RL45l51L4N7K1J99k55j9M35o17L17L22n91K65K66q44
$$ y = [-259, 31, -101, -223, 236, 24, -224, 304, -265, -250, 194, -38, 225, 224, -200, 104, -7, -10, 210, -194, -236, 112, -367, -115, 302, -194, 178, 272, -184, 250, 104, -25, 320, 244, 154, 203, -194, -2, 138, -397, 107, -132, -227, 167, -302, -207, 305, -112, -223, 426, 59, 44, 253, 2, 282, 200, 92, 141, -14, -288, 152, -354, -228, 119, -264, 14, 159, -306, -15, 14, -481, 266, -162, -374, 304, -178, -136, 240, 130, 242, 15, -288, 19, -42, -55, 487, -124, -191, 201, -82, -122, 108, -328, 170, 9, -247, 158, 79, 15, 263, 30, -90, 253, -336, -122, 69, -232, 279, 166, -303, 155, -8, -259, 328, -264, -182, 68, -93, 60, 215, -251, 105, 72, -237, 353, -144, -148, 147, -286, -393, 157, -165, 1, 126, 17, -160, 114, -60, 260, -41, 49, 135, -124, -157, 81, -95, 244, 124, -135, 362, 59, -65, 172, 61, -67, 54, -12, -3, 342, -9, 25, 82, 103, 302, 47, 28, 463, -154, 163, 485, -106, 159, 425, -419]
3001d19M16M3l34M60m48J31J76j93KK37l79M18j03j5L87k99j50L48k17j93N82
3022D50n14j38L45k02k62N94l57R3L2n3J76j1j60L54k67o7L25m89J42K22l85L87
3044B15j24l77L32r1q0J56j36j45N02n06L13q2N6L29m03N3J44k50N6K58l14j8
3066a12J61k17N7j5J71l6q2m1K36k67K1L54l28Q9L83l49J77j39j45L49n2k39P3
3089D9o1j72L06j00Jo5j09N8k8j15M09q4l37N51m92QL33r6p5K35j09r3k2k86L56
3114F2n7k04L23l07L62o4k26J29k0k0K05k21j4K61j39k37L79k35k34L37k15K27
$$ y = [-419, -3, 40, -294, 166, -282, -151, 25, -168, -166, 71, -308, 110, 7, -8, 379, 80, -70, 278, 61, -132, 450, -64, -202, 143, -59, -321, 273, -84, 9, 41, -12, 164, 153, -7, 347, 80, 13, 338, -151, -9, 213, -172, 215, 91, -286, 46, -45, -125, 31, -105, -250, 252, -254, 59, -23, 33, 362, -41, 12, 156, -94, -38, 220, -94, -112, 49, -168, -111, -126, 45, 9, -73, -114, 122, -145, -124, 230, -98, -9, 374, 25, 202, 63, -82, 267, 215, -24, 49, -12, -184, 122, 22, 23, -42, -151, -93, -121, -236, 173, 89, -248, 303, -189, -181, 152, 56, -19, 216, 107, 14, -8, -294, 62, 5, -199, 124, -183, 179, 115, -111, 18, -2, -22, 183, -38, -52, 209, 70, -167, 212, -23, -257, 80, -135, 92]
$$ [...]
8191h2
##END NTUPLES=NMR FID
##END=
