##TITLE=1H_25-2024
 CDCl3
 8 sc, 
 2.4.2024
##JCAMPDX= 6.0         $$ Bruker NMR JCAMP-DX V2.0
##DATA TYPE= NMR FID
##DATA CLASS= NTUPLES
##ORIGIN= UXNMR, Bruker Analytische Messtechnik GmbH
##OWNER= root
$$ XWIN-NMR		Version 3.5
$$ Tue Apr  2 14:44:57 2024 Russian Standard Time (UT+4h)  she@DPX200
##.OBSERVE FREQUENCY= 200.131
##.OBSERVE NUCLEUS= ^1H
##.DELAY= (6, 6)
##.ACQUISITION MODE= SIMULTANEOUS
##.ACQUISITION SCHEME= undefined
##.AVERAGES= 8
##.DIGITISER RES= 18
##SPECTROMETER/DATA SYSTEM= spect
##.PULSE SEQUENCE= zg30
##.SOLVENT NAME= MeOD
##.SHIFT REFERENCE= (INTERNAL, MeOD, 0, 15.7039)
##AUDIT TRAIL= $$ (NUMBER, WHEN, WHO, WHERE, WHAT)
$$ ##TITLE= Audit trail, XWIN-NMR		Version 3.5
$$ ##JCAMPDX= 5.01
$$ ##ORIGIN= Bruker BioSpin GmbH
$$ ##OWNER= she
$$ F:/spectra/data/she/nmr/H-F/1/audita.txt
$$ ##AUDIT TRAIL=  $$ (NUMBER, WHEN, WHO, WHERE, WHAT)
(   1,<2024-04-02 14:43:31.42 +0400>,<she>,<DPX200>,
      <created by zg, POWCHK disabled, PULCHK disabled
       configuration hash MD5:
       00 E9 B6 7A A2 85 ED C7 34 08 36 98 17 FE 4E 26
       data hash MD5: 16K
       91 37 31 09 75 24 64 F3 A5 0B 44 8D DC BE 44 19>)
$$ ##END=
$$ 
$$ hash MD5
$$ 54 C9 C5 EE D0 51 05 25 86 80 47 6C B3 8A 9F 62
##$RELAX= 
##$RELAX= 
##$RELAX= 
##$RELAX= 
##$RELAX= 
##$RELAX= 
$$ Bruker specific parameters
$$ --------------------------
##$DU= <F:/spectra>
##$EXPNO= 1
##$NAME= <H-F>
##$PROCNO= 1
##$TYPE= <nmr>
##$USER= <she>
##$AMP= (0..31)
100 100 100 100 100 100 100 100 100 100 100 100 100 100 100 100 100 100 
100 100 100 100 100 100 100 100 100 100 100 100 100 100 
##$AQSEQ= 0
##$AQ_mod= 1
##$AUNM= <au_zg>
##$AUTOPOS= <>
##$BF1= 200.13
##$BF2= 200.13
##$BF3= 200.13
##$BF4= 200.13
##$BF5= 200.13
##$BF6= 200.13
##$BF7= 200.13
##$BF8= 200.13
##$BYTORDA= 1
##$CFDGTYP= 0
##$CFRGTYP= 5
##$CHEMSTR= <none>
##$CNST= (0..31)
1 1 145 1 1 1 1 1 1 1 1 1 1 1 1 1 1 1 1 1 1 1 1 1 1 1 1 1 1 1 1 1 
##$CPDPRG= <>
##$CPDPRG1= <>
##$CPDPRG2= <>
##$CPDPRG3= <>
##$CPDPRG4= <mlev>
##$CPDPRG5= <mlev>
##$CPDPRG6= <mlev>
##$CPDPRG7= <mlev>
##$CPDPRG8= <mlev>
##$CPDPRGB= <>
##$CPDPRGT= <>
##$D= (0..31)
0 1.2 0 0 0 0 0 0 0 0.06 0 0.03 0 0 0 0 0.0002 0 0 0 0 0 0 0 0 0 0 0 0 
0 0 0 
##$DATE= 1712054610
##$DBL= (0..7)
120 120 120 120 120 120 120 120 
##$DBP= (0..7)
150 150 150 150 150 150 150 150 
##$DBP07= 0
##$DBPNAM0= <>
##$DBPNAM1= <>
##$DBPNAM2= <>
##$DBPNAM3= <>
##$DBPNAM4= <>
##$DBPNAM5= <>
##$DBPNAM6= <>
##$DBPNAM7= <>
##$DBPOAL= (0..7)
0.5 0.5 0.5 0.5 0.5 0.5 0.5 0.5 
##$DBPOFFS= (0..7)
0 0 0 0 0 0 0 0 
##$DE= 6
##$DECBNUC= <off>
##$DECIM= 32
##$DECNUC= <off>
##$DECSTAT= 4
##$DIGMOD= 1
##$DIGTYP= 9
##$DL= (0..7)
0 120 120 120 120 120 120 120 
##$DP= (0..7)
150 150 150 150 150 150 150 150 
##$DP07= 0
##$DPNAME0= <>
##$DPNAME1= <>
##$DPNAME2= <>
##$DPNAME3= <>
##$DPNAME4= <>
##$DPNAME5= <>
##$DPNAME6= <>
##$DPNAME7= <>
##$DPOAL= (0..7)
0.5 0.5 0.5 0.5 0.5 0.5 0.5 0.5 
##$DPOFFS= (0..7)
0 0 0 0 0 0 0 0 
##$DQDMODE= 0
##$DR= 18
##$DS= 0
##$DSLIST= <SSSSSSSSSSSSSSS>
##$DSPFIRM= 0
$$ [...]
##$SUBNAM2= <"">
##$SUBNAM3= <"">
##$SUBNAM4= <"">
##$SUBNAM5= <"">
##$SUBNAM6= <"">
##$SUBNAM7= <"">
##$SUBNAM8= <"">
##$SUBNAM9= <"">
##$SW= 18.0517599122864
##$SWIBOX= (0..15)
0 0 2 0 0 0 0 0 0 0 0 0 0 0 0 0 
##$SW_h= 3612.71676300578
##$TD= 16384
##$TD0= 1
##$TE= 0
##$TE2= 300
##$TE3= 300
##$TEG= 300
##$TL= (0..7)
0 120 120 120 120 120 120 120 
##$TP= (0..7)
150 150 150 150 150 150 150 150 
##$TP07= 0
##$TPNAME0= <>
##$TPNAME1= <>
##$TPNAME2= <>
##$TPNAME3= <>
##$TPNAME4= <>
##$TPNAME5= <>
##$TPNAME6= <>
##$TPNAME7= <>
##$TPOAL= (0..7)
0.5 0.5 0.5 0.5 0.5 0.5 0.5 0.5 
##$TPOFFS= (0..7)
0 0 0 0 0 0 0 0 
##$TUNHIN= 0
##$TUNHOUT= 0
##$TUNXOUT= 0
##$USERA1= <user>
##$USERA2= <user>
##$USERA3= <user>
##$USERA4= <user>
##$USERA5= <user>
##$V9= 5
##$VALIST= <valist>
##$VCLIST= <CCCCCCCCCCCCCCC>
##$VD= 0
##$VDLIST= <DDDDDDDDDDDDDDD>
##$VPLIST= <PPPPPPPPPPPPPPP>
##$VTLIST= <TTTTTTTTTTTTTTT>
##$WBST= 1024
##$WBSW= 4
##$XGAIN= (0..3)
0 0 0 0 
##$XL= 0
##$YL= 0
##$YMAX_a= 235401
##$YMIN_a= -238143
##$ZGOPTNS= <>
##$ZL1= 120
##$ZL2= 120
##$ZL3= 120
##$ZL4= 120
##$ABSF1= 10
##$ABSF2= 0
##$ABSG= 5
##$ABSL= 3
##$ALPHA= 0
##$AQORDER= 0
##$ASSFAC= 0
##$ASSFACI= 0
##$ASSFACX= 0
##$ASSWID= 0
##$AUNMP= <proc_1d>
##$AZFE= 0.1
##$AZFW= 0.1
##$BCFW= 1
##$BC_mod= 2
##$BYTORDP= 1
##$COROFFS= 0
##$CY= 11.3945322036743
##$DATMOD= 1
##$DC= 2
##$DFILT= <>
##$DTYPP= 0
##$F1P= 15.7292609196834
##$F2P= 12.9074282941183
##$FCOR= 0.5
##$FTSIZE= 0
##$FT_mod= 4
##$GAMMA= 1
##$GB= 0.15
##$INTBC= 1
##$INTSCL= 1
##$ISEN= 128
##$LB= 0.24
##$LEV0= 0
##$LPBIN= 0
##$MAXI= 10000
##$MC2= 0
##$MEAN= 0
##$ME_mod= 0
##$MI= 1.114404
##$NCOEF= 0
##$NC_proc= 0
##$NLEV= 6
##$NOISF1= 3.799351
##$NOISF2= 2.8
##$NSP= 1
##$NTH_PI= 0
##$NZP= 0
##$OFFSET= 15.70392
##$PC= 1
##$PHC0= -25456.8
##$PHC1= 11.58731
##$PH_mod= 1
##$PKNL= yes
##$PPARMOD= 0
##$PSCAL= 0
##$PSIGN= 0
##$REVERSE= no
##$SF= 200.130013532006
##$SI= 16384
##$SIGF1= 3
##$SIGF2= 2
##$SINO= 400
##$SIOLD= 16384
##$SREGLST= <1H.CDCl3>
##$SSB= 0
##$STSI= 0
##$STSR= 0
##$SW_p= 3612.71676300578
##$SYMM= 0
##$S_DEV= 0
##$TDeff= 0
##$TDoff= 0
##$TI= <>
##$TILT= no
##$TM1= 0
##$TM2= 0
##$TOPLEV= 0
##$USERP1= <user>
##$USERP2= <user>
##$USERP3= <user>
##$USERP4= <user>
##$USERP5= <user>
##$WDW= 1
##$XDIM= 8192
##$YMAX_p= 0
##$YMIN_p= 0
$$ End of Bruker specific parameters
$$ ---------------------------------
##NTUPLES= NMR FID
##VAR_NAME=  TIME,          FID/REAL,        FID/IMAG
##SYMBOL=    X,             R,               I
##VAR_TYPE=  INDEPENDENT,   DEPENDENT,       DEPENDENT
##VAR_FORM=  AFFN,          ASDF,            ASDF
##VAR_DIM=   8192,          8192,            8192
##UNITS=     SECONDS,       ARBITRARY UNITS, ARBITRARY UNITS
##FACTOR=    0.0002768,     1,               1
##FIRST=     0,             0,               0
##LAST=      2.2672688,     0,               0
##MIN=       0,             -238143,         0
##MAX=       2.2672688,     235401,          0
$$ Real data points
##PAGE= N=1
##DATA TABLE= (X++(R..R)), XYDATA
0 0 0 0 0 0 0 0 0 0 0 0 0 0 0 0 0 -8 8 -8 8 -9 16 -16 24 -24 32 -33 41 -48 56 -65 73 -85 96 -110 126 -142
36 -142 158 -179 200 -224 252 -279 311 -346 383 -423 469 -517 570 -628 692 -763 839 -925 1018
55 1018 -1125 1242 -1375 1526 -1701 1903 -2140 2427 -2778 3217 -3785 4538 -5581 7033 -16841
70 -16841 152695 -38597 2016 186513 16212 91012 85980 56548 188624 52046 10560
81 10560 196444 -64973 -104960 96200 -104413 -87107 20969 -74905 -24025 -72142 -82020
92 -82020 41555 -61948 -65259 129711 -18640 -66999 103777 -33512 -46509 30838 -29268
103 -29268 30518 -24489 -47653 71700 -37524 -67311 117265 15366 -26787 132697 30718
114 30718 25705 66256 -2854 73900 -9338 -51257 68673 -67257 -119508 16183 -88282
125 -88282 -122714 -6216 -72608 -39481 -13867 -47573 66629 -867 -3897 135067 36426 20806
137 20806 121809 41199 13122 60641 1675 15704 -8782 -55006 21237 -62839 -82393 18467
149 18467 -58944 -61760 13891 -21843 -22678 11136 -6496 23108 9215 -15284 56568 -4636 -27105
162 -27105 50199 -13672 -21793 24670 -3682 -482 12328 70 29609 13387 -8131 56846
174 56846 8535 -13369 48563 -9931 -16266 5793 -27504 -19432 -29895 -43168 -13562 -36579
186 -36579 -48686 10438 -22529 -23966 34462 477 19306 36671 21055 44711 25275 21095
198 21095 40872 9409 -4350 21880 -14109 -25517 -407 -32822 -21327 -19524 -29213 -5350
210 -5350 -21300 -12167 8910 -3981 -1839 20682 7047 2315 22004 1203 9491 7649 -5295
223 -5295 12085 -7096 -5239 7304 -5913 -5147 7463 9 -3034 11093 -3010 5929 4136 -7724
237 -7724 9795 -9728 -7763 461 -13871 -9652 -6630 -9121 -9309 -990 -5429 3622 5487 1360 18305
252 18305 5577 12341 17501 6291 12710 6499 4865 205 -1076 -5742 -7625 -8047 -14943 -5931 -14970
267 -14970 -9616 -5056 -10904 326 -3588 2178 3315 4769 7273 5423 9764 3941 9279 3239 3512
282 3512 4968 -3216 3796 -4560 -1722 -2487 -5507 -1709 -6284 -676 -5124 -29 -998 -1174 4099 -1932
298 -1932 6306 747 3698 5237 100 5484 -620 2910 -1798 -467 -1669 -5780 -695 -8600 -1766
313 -1766 -6369 -5169 -566 -6559 1993 -1987 1915 2475 3289 5434 2548 8551 1064 6918 3149 251
329 251 5731 -3727 2852 -1787 -1968 53 -2182 -81 -2562 3027 -3981 2241 812 -4544 3945 -6760
345 -6760 -1398 -3620 -8422 -3646 -7463 -7080 -6453 -1345 -6884 2438 4336 232 14872 5522 14001
360 14001 16564 7550 17157 10308 4553 5316 2576 -9285 -5615 -10379 -20378 -8983 -23643 -14256
374 -14256 -8849 -21106 -48 -2170 -4178 10211 12053 8390 18253 16963 11183 21721 3098 11311
388 11311 11512 -13452 6610 -4399 -17633 -3287 -9701 -14255 -5277 -8030 -7064 4736 -11559 5261
402 5261 10916 -15935 13240 4300 -12834 7435 -3716 -6887 651 -8036 -790 8005 -12273 12198
416 12198 19679 -10873 26548 19885 574 25394 8324 7897 10035 -11316 -138 -3223 -35913
429 -35913 -11083 -10570 -48694 -10007 -15369 -31167 179 -12660 4615 14761 -2204 30756 31868
442 31868 1375 36340 36862 -5457 27763 15584 -8526 10289 -18194 -3581 -5329 -38977 498
455 498 -4413 -40766 3239 6894 -29062 10666 5469 -6775 16183 -13613 14849 13399 -30907
468 -30907 20173 10310 -33665 12735 11294 -21730 12765 5209 3348 22976 -11222 29411 28037
481 28037 -24921 33196 19938 -29500 11818 1536 -29165 -8607 -25529 -20306 -8736 -49719
493 -49719 1430 5509 -47658 23051 20965 -17562 31822 27050 14645 32482 11109 28615 30324
506 30324 -24101 25062 19091 -50568 10134 -1458 -45665 -5824 -19058 -18999 -5792 -29845 8137
519 8137 13582 -37033 25470 28872 -34605 28359 20604 -16220 17897 -3717 6068 10135 -26465
532 -26465 18430 18421 -37799 23608 28292 -31639 25802 18301 -8639 20315 -9599 11346 9784
545 9784 -38776 10552 4360 -55534 -528 1602 -49682 -1062 -7053 -17151 11401 -17297 23118
558 23118 27269 -18593 41793 38530 -15171 33788 32286 -13232 17544 1075 -8152 4826 -37521
571 -37521 919 -500 -54317 5694 3597 -42301 6615 9111 -17045 13411 660 7986 22781
584 22781 -20504 23329 23327 -33409 21890 15152 -27406 10586 4483 -11077 8589 -9847 6455
597 6455 17920 -25660 19272 21507 -30753 18765 10883 -22679 5692 -6623 -12058 -1806 -24163
610 -24163 -3711 5388 -34625 8155 15562 -27036 19688 16862 -3618 22727 9566 14955 20659
623 20659 -4937 15535 17738 -24169 7158 8433 -33874 433 -8179 -23716 -2453 -19475 -4743
636 -4743 1999 -19905 8157 13781 -16172 14263 18910 -11016 17034 8021 -1688 13703 -8420
649 -8420 6643 8174 -16527 6869 7795 -16771 5500 8454 -12670 8428 408 -3657 9999
662 9999 -11336 4278 5372 -16983 3234 1406 -16248 -1063 154 -12579 2638 -3610 -2858
675 -2858 10108 -7590 9356 12098 -5210 13012 9805 -1592 7687 5516 -3421 3514 -4122 -5622
689 -5622 2612 -14368 -2303 42 -14451 1558 -1226 -5913 2516 1918 209 5876 2442 2429 10063
704 10063 -3096 5075 6858 -6299 5190 -513 -3998 745 -3426 -2869 -1210 -3397 -2993 2294 -5311
719 -5311 425 3087 -5311 4331 -475 -612 2688 -1255 1957 389 444 -108 2337 -1235 106 3189
735 3189 -2952 2997 -291 -356 2106 -1675 2125 -698 533 -538 562 -354 -1700 2023 -3145 967
751 967 -883 -1659 1113 -2574 1121 -1602 -91 -69 -687 820 -1300 2059 -1188 1274 813 -461 2307
768 2307 -1367 2136 -979 198 417 -2112 1054 -2581 243 -1603 -819 377 -1401 2290 -593 2945
784 2945 1515 2274 3921 890 4685 510 2009 713 -1156 -561 -3947 -1808 -5880 -3690 -4750 -5870
800 -5870 -2316 -5370 -573 -1837 218 2441 2068 5101 3528 6748 3687 5816 4923 1355 5021 -1128
816 -1128 634 -851 -3394 -2130 -4059 -2859 -4209 -1508 -3722 -528 -46 -2992 4059 -1780 489
831 489 2963 -1885 1149 -421 -998 -1273 -323 -2767 583 379 -3033 5866 -663 1703 7114 541
847 541 5542 4198 2005 3190 1122 -2395 47 -3248 -8873 -286 -9338 -8368 -1039 -9526 -1617 -1240
863 -1240 -2448 4975 3147 3162 10465 7094 2977 13757 3078 1954 8969 -4465 1457 -2320 -8518
878 -8518 -807 -8780 -9819 -653 -7411 -9418 4262 -4778 -3117 7470 -3699 6360 3699 -1982
892 -1982 10463 -1216 -2284 8749 -2576 -4888 7366 -3736 -2751 6308 -5098 6635 2203
905 2203 -3810 13400 -1919 -2547 11532 -3660 -5217 5176 -7582 -6769 -1803 -13750 -567 -8342
919 -8342 -14261 8368 -8992 -6727 13157 -1673 2138 14092 4423 9042 11153 673 15119
932 15119 1951 -7428 15364 -9127 -11193 6843 -12950 -9352 -1690 -10928 -1938 -3347 -9735 10685
946 10685 -2480 -8349 19823 -3286 -3339 16257 -3666 2153 4863 -4670 6108 -3139 -9156 11717
960 11717 -5846 -11775 16683 -6392 -5912 13347 -5215 4185 3185 -5076 10167 -5194 -10075
973 -10075 12025 -9295 -15371 11527 -11230 -10286 6807 -9696 4320 594 -4774 17605 -654
986 -654 -2432 22978 931 -3982 19755 -2506 -2548 7685 -10260 3934 -7672 -15462 9053 -14386
1000 -14386 -15803 11017 -10072 -11423 11416 -4714 -44 8455 -4316 14633 697 -6170 21320
1013 21320 -5388 -7350 16711 -6097 -7022 8568 -6262 -359 1721 -9292 11987 -4587 -10332
1026 -10332 19351 -7645 -7797 14872 -6678 -4358 5208 -7082 1339 -2802 -11568 10490 -7729
1039 -7729 -12851 17051 -8147 -6530 14588 -3805 2832 7581 -1306 10295 1498 -6031 15531
1052 15531 -4434 -11475 15008 -9696 -9290 7024 -10358 -1452 -1697 -8206 7206 -4179 -8046
1065 -8046 14686 -2787 -7362 17328 -3498 -1632 10622 -5061 5861 27 -6287 9535 -5581
1078 -5581 -9087 10733 -6179 -9765 10291 -6599 -3312 5589 -7147 6449 -1317 -5886 11564
1091 11564 -4266 -5837 11298 -3542 -5792 9099 -4652 -726 4392 -6749 7503 -1999 -6208
1104 -6208 11225 -4546 -4485 9631 -3223 -3331 6616 -3982 392 2627 -7037 6840 -2918 -7157
1118 -7157 9223 -5785 -4483 6393 -4156 -2088 3745 -3402 1701 2150 -5194 7498 -1165 -4995
1132 -4995 9481 -3717 -1935 5971 -3260 -64 1909 -3311 1582 -13 -5633 4961 -2181 -5420
1146 -5420 7011 -3935 -1178 4897 -2590 2815 2444 -787 4051 1591 -2500 5247 -865 -4370 4672
1161 4672 -4991 -2749 648 -6126 -671 -2673 -3969 634 -1194 -2619 3708 1058 -1028 6846 559
1176 559 2698 5369 -379 4544 967 -581 2170 -1311 -2686 195 -2106 -4362 852 -3429 -1757
1191 -1757 1083 -3231 2282 -241 -493 2669 -302 129 1065 36 -1963 973 -1794 -1700 637 -2867
1207 -2867 1214 -342 -129 2889 880 2771 2712 3004 1924 2938 1215 -319 1229 -3261 -1375 -3385
1223 -3385 -4749 -2973 -5197 -3096 -3375 -1916 -1050 510 2118 2091 5328 3521 5617 5156 3567 4621
1239 4621 1632 1998 -632 -1407 -2502 -4117 -3441 -5461 -3418 -4591 -3139 -1798 -2196 944 -95 2265
1255 2265 2023 2507 3105 1777 3013 468 1428 -29 -581 85 -1928 258 -1425 256 635 410 2395
1272 2395 1076 3234 1691 2149 1585 260 271 -2499 -1699 -4467 -4193 -4372 -6026 -3392 -4778 -2226 -1456
1289 -1456 -224 2015 2552 4942 4598 6892 5331 5920 5856 2328 3896 -45 -748 -1772 -4593 -4079 -5330
1306 -5330 -5216 -5313 -3421 -4350 -1939 262 -1317 3349 1568 2782 4722 1578 3772 2446 719 842
1322 842 698 -2221 -1225 -515 -3830 775 -1868 -922 2347 -1417 2801 2453 241 2496 2054 -1123 417
1339 417 -257 -4297 -616 -4462 -4415 -884 -6326 -815 -189 -2941 2832 3013 1592 5509 5620 3157 7538
1356 7538 2743 2617 5536 -3532 1034 -415 -7392 -2113 -4816 -7492 -3527 -4748 -5231 239 -3581
1371 -3581 -192 5100 -2706 5443 5989 -865 6820 3193 320 4057 -457 -649 2247 -4502 -1217
1386 -1217 2798 -7276 1472 2132 -5444 4169 407 -1125 4136 -1700 712 3539 -4923 -149 2786
1401 2786 -8514 316 273 -8204 2187 -2490 -2624 3934 -2887 2949 6376 -2263 5246 7922 -3342
1416 -3342 5714 4640 -4490 4637 -2986 -3242 1879 -8609 -1480 500 -9577 -75 2090 -7502 3100
1431 3100 2809 -3371 7178 -362 2046 8017 -4519 4734 5476 -6673 3239 2874 -7185 1910 -634
1446 -634 -5656 3508 -5361 -1170 5299 -8224 3499 5036 -7145 4557 3281 -4771 3898 -69
1460 -69 -3033 4697 -5667 -154 5582 -9373 3353 4489 -7558 4772 2583 -3091 5131 -73
1474 -73 -240 6336 -5079 1626 6372 -9457 3015 3119 -9047 2890 -1457 -5087 2691 -4436 -1180
1489 -1180 4654 -6636 2156 6784 -7732 5271 4992 -5552 6172 62 -1454 5008 -4297 746
1503 746 4486 -7618 1368 4648 -8952 3069 2172 -6465 4710 -2179 -1235 5016 -5246 2237
1517 2237 5157 -6375 3015 4948 -6809 3684 1807 -4940 4619 -3616 -1181 4266 -7006 1663
1531 1663 3560 -7180 2350 3220 -5893 3520 1129 -3385 5526 -3147 759 5659 -5947 3364 4012
1546 4012 -5863 3115 2229 -4760 2940 -477 -2965 4251 -4708 181 4623 -6801 2935 3106 -5392
1561 -5392 3359 1149 -3181 2925 -1240 -1888 3735 -4878 26 3734 -6733 2535 1985 -4805 3412
1576 3412 464 -1487 3802 -724 451 4908 -2842 1542 4397 -5301 2503 1012 -5002 1867 -2614
1591 -2614 -2974 1098 -3565 -937 2468 -3685 1296 4060 -3241 4151 2891 -1359 4844 -150 414
1606 414 2864 -2526 -75 1135 -4478 -912 432 -5531 422 -790 -3743 2523 -1897 199 2940
1621 2940 -1452 2255 2825 -1130 1909 2288 -2174 1807 78 -2613 1936 -2587 -661 1585 -2580
1636 -2580 1266 1460 -948 1944 2049 -594 2239 788 -1278 1857 -2516 -1372 -183 -4488 -1081
1651 -1081 -1833 -3411 -937 -990 -1556 1068 1180 618 4007 1436 2900 4341 702 3395 1628 -291
1667 -291 680 -1045 -2020 -1782 -2385 -3399 -1438 -2955 -2080 33 -2015 1310 708 650 2587 1325 1818
1684 1818 1769 1395 250 947 -567 -1008 37 -2505 -539 -1141 -1573 286 -690 613 711 1061 1080 1585
1702 1585 1222 436 1376 -930 -142 -965 -2259 -1038 -2685 -1618 -1809 -1353 -608 26 968 1039 2744 2057
1720 2057 3110 3086 2140 2947 975 1109 -41 -1095 -1449 -2635 -2381 -3562 -2581 -3139 -2367 -1207 -1461 735
1738 735 185 1555 2027 1966 2777 2011 2299 1275 1295 256 -224 -242 -1696 -349 -1889 -1139 -683 -1231 524
1757 524 -159 962 925 1150 973 873 1021 -501 473 -1370 -1281 -1145 -2589 -1106 -2250 -1601 -815 -805 198
1776 198 931 1668 1517 2998 2123 2445 2989 791 2189 23 -699 -385 -2310 -2016 -2354 -2732 -2686 -1398
1794 -1398 -2120 -942 519 -901 2192 1225 1334 3313 1083 2078 2050 493 414 379 -1379 -806 -805 -3085
1812 -3085 -125 -1843 -1936 965 -1677 359 1279 -190 1311 1290 108 1329 776 -1625 1267 -1412
1828 -1412 -2175 963 -2892 -692 128 -1915 916 531 -147 2439 1682 199 3839 931 162 3302
1844 3302 -1558 286 373 -3203 -281 -2129 -3406 -374 -2283 -2873 1126 -1487 -1084 3145 -1098 2053
1860 2053 2892 -657 3980 991 -548 3063 -592 -1503 1926 -2139 -1929 1481 -3557 177 479 -3305
1876 -3305 2780 -564 -1305 3555 -716 -425 3209 -1143 -257 2166 -3076 876 108 -4074 2436 -1891
1892 -1891 -2579 3119 -2225 -559 2954 -1323 1162 2831 -1759 2825 1474 -2695 4057 -1442 -2563
1907 -2563 3171 -3485 -1438 1269 -3426 21 751 -3164 2294 651 -2757 4911 -544 -988 5103
1922 5103 -1940 801 2776 -2620 1428 447 -3493 1997 -1095 -3954 3349 -2546 -2513 3665 -3338 695
1938 695 2158 -2743 2796 738 -2278 3567 -433 -2716 4173 -2097 -1783 3517 -3618 878 1460 -3481
1954 -3481 3136 -256 -2431 4025 -734 -1949 4378 -1819 -732 3538 -3408 1384 979 -4089 3053
1969 3053 -1407 -3116 3293 -2154 -2294 3244 -2294 -645 3108 -3217 2159 1358 -3073 4157 -845
1984 -845 -2213 3951 -1897 -1176 2896 -2466 -304 2040 -3459 2001 532 -3570 4032 -1408 -2088 3973
2000 3973 -2171 -430 2721 -2247 880 1869 -2913 2365 241 -3184 3836 -1813 -1982 3314 -2888
2015 -2888 -151 1692 -2658 1135 878 -2670 2375 -2 -2705 3923 -1511 -1081 3512 -2401 956
2030 956 1804 -2291 1614 467 -2293 2289 -320 -2656 3038 -1828 -1344 2903 -2745 1015 1169 -2244
2046 -2244 2019 225 -1641 2412 -387 -1903 2639 -1571 -1021 2119 -2930 819 507 -2488 1967
2061 1967 -549 -1497 2086 -461 -1004 2477 -1012 -19 2326 -2073 1359 595 -2112 1854 -1189 -1506
2077 -1506 1410 -1375 -1023 1316 -1285 -177 1660 -1657 1678 912 -1251 2571 -334 -428 1823 -1080
2093 -1080 -469 616 -1560 -856 367 -2384 336 -238 -2099 1593 -927 -328 1681 -519 860 1262
2109 1262 28 767 1179 -870 909 221 -1514 1294 -1359 -872 752 -1514 159 207 -585 558 682
2126 682 -216 966 639 -672 1497 -562 -429 621 -1624 -149 -750 -1347 -315 -608 -820 120 252
2143 252 -418 1418 259 632 1815 -3 1391 632 -40 512 -406 -544 -555 -584 -1404 -427 -943 -1006 292
2162 292 -949 609 571 238 1326 485 1033 759 745 266 459 -103 -837 61 -1470 -555 -783 -1104 -105
2181 -105 -855 23 -14 283 404 634 884 385 1095 -113 470 116 -668 92 -1007 -412 -660 -696 -469 -447
2201 -447 148 -54 863 438 882 1071 460 1247 218 615 129 -335 -277 -993 -822 -1399 -933 -1199 -898 -340
2221 -340 -855 525 -87 553 925 468 1317 697 973 655 632 16 -129 26 -1062 -75 -1017 -738 -150 -984
2241 -984 238 -325 149 558 528 541 555 871 -7 801 -288 -275 165 -1246 -82 -963 -833 -326 -702 -189
2261 -189 -39 393 58 1122 386 689 1355 -170 1141 142 -321 380 -873 -586 -473 -876 -857 -223 -950
2280 -950 -364 499 -816 1183 554 134 1782 91 815 951 11 172 317 -939 -471 -21 -1860 110
2298 110 -747 -1374 701 -1134 89 802 -329 814 880 -116 801 880 -823 1075 -212 -981 1177 -1530
2316 -1530 -289 465 -1662 412 244 -760 705 623 -612 1483 204 -387 1882 -1011 408 999
2332 999 -1755 448 -178 -1577 60 -501 -1470 799 -773 -964 1804 -1322 747 1642 -1380 1711
2348 1711 531 -804 1563 -335 -783 1114 -966 -835 1388 -2004 275 877 -2209 1455 34 -1045
2364 -1045 1749 -555 -314 1482 -792 -64 1700 -1751 679 953 -2350 1543 -497 -1563 1601 -1426
2380 -1426 -447 1205 -1333 147 1390 -1678 1005 1147 -1963 2130 -397 -1294 2155 -1519 -207 1377
2396 1377 -1871 462 1061 -1940 936 687 -1903 2119 -422 -1083 2409 -1750 371 1656 -1855 907
2412 907 858 -1746 1207 185 -2039 2004 -1005 -1223 2298 -2228 297 1405 -2317 1283 642 -1727
2428 -1727 1619 -55 -1487 2173 -879 -784 2428 -2249 676 1485 -2360 1519 227 -1734 1613 -351
2444 -351 -1320 1874 -1221 -629 2265 -2151 885 1544 -2302 2015 9 -1382 1843 -798 -814 1767
2460 1767 -1427 -421 1684 -2481 680 875 -2407 1800 -390 -1350 2088 -1040 -242 1792 -1194 248
2476 248 1771 -1909 1148 1016 -2297 1953 -692 -1349 1761 -1529 -270 1334 -1442 324 1312 -1799
2492 -1799 1176 912 -1682 2205 -590 -1002 1992 -1594 4 1079 -1833 266 567 -1972 745 312
2508 312 -1756 1941 -657 -519 2285 -1156 764 1241 -1216 1024 658 -1355 998 -133 -1677 1347
2524 1347 -1037 -986 1464 -1773 336 829 -1272 1376 429 -596 1325 319 -573 1539 -743 -524
2540 -524 1313 -1729 139 294 -1828 643 -364 -1034 870 -168 -599 1193 -359 68 1640 -981
2556 -981 871 763 -1224 1097 -404 -723 742 -717 -664 447 -780 -380 846 -1055 633 727 -718
2573 -718 1330 24 -145 1011 -395 -93 365 -733 -346 189 -1274 -42 11 -1306 758 -467 -360
2590 -360 941 -278 519 757 94 476 844 -295 463 381 -813 620 -638 -610 411 -1005 -53 34
2608 34 -403 104 355 -131 436 581 -257 930 -72 -184 537 -760 120 -147 -638 -160 -349 -584 -175
2627 -175 92 -503 428 9 92 767 -209 607 320 67 342 -93 6 -123 -104 -443 37 -299 -543 182 -484
2648 -484 167 119 0 583 163 358 278 382 94 212 152 -349 200 -559 -15 -209 -521 34 -413 -71 -109
2669 -109 12 125 208 345 67 501 18 306 234 -247 366 -216 133 -114 -185 2 -332 35 -300 153 -83
2690 -83 135 268 -144 583 -89 182 122 -80 160 -176 -73 -259 7 -310 -205 64 -564 244 -322 80 262
2711 262 -295 404 101 199 149 221 73 23 308 -348 421 -176 -59 220 -361 239 -189 -46 123 12 19 42
2733 42 278 -260 456 -182 -125 542 -518 349 -88 -315 265 -336 -257 -67 -52 -382 217 -335 -133 443 -552
2754 -552 392 212 -247 730 -208 102 436 -62 -49 464 -208 -77 536 -650 473 -66 -629 580 -508
2773 -508 -2 346 -407 121 321 -353 145 573 -577 638 121 -575 761 -680 -108 404 -731 54
2791 54 73 -633 138 314 -850 778 45 -522 1228 -520 335 821 -627 559 261 -608 232 106 -843
2810 -843 469 -371 -841 985 -1000 -10 727 -1018 892 349 -515 830 224 -531 909 -273 -611
2827 -611 919 -1108 -106 500 -1552 563 -70 -1046 842 -145 -311 1014 -250 -340 1378 -641 407
2844 407 997 -1205 1019 20 -1078 975 -770 -753 693 -781 -421 1026 -1031 382 921 -1226 1458
2861 1458 78 -785 1467 -740 -333 854 -1067 -270 572 -1491 86 201 -1647 1086 -209 -871
2877 -871 1529 -712 261 1387 -619 592 979 -977 673 528 -1452 991 -648 -1206 1199 -1508
2893 -1508 -160 901 -1304 631 734 -920 1167 638 -939 1616 -123 -643 1586 -1403 -76 670
2909 670 -1778 254 -95 -1364 597 -111 -945 1278 -363 -426 1766 -923 617 1208 -1234 1161 212
2926 212 -1090 865 -606 -1157 797 -1149 -848 1117 -1392 411 909 -1263 1335 256 -550 1410
2942 1410 -219 -286 1096 -840 -386 847 -1554 82 366 -1844 877 -459 -1131 1152 -614 -59
2958 -59 1322 -494 323 1299 -789 749 751 -1386 1164 -425 -994 997 -1096 -368 562 -1070 135
2975 135 635 -1000 838 795 -909 1475 -76 -429 1430 -905 67 644 -1099 92 128 -1207 213
2992 213 -74 -1211 1066 -405 -376 1402 -863 501 891 -603 858 437 -649 535 72 -1043 682
3009 682 -705 -736 803 -1243 171 467 -832 652 307 -364 794 317 -316 918 -229 -337 991
3026 991 -1035 75 157 -1182 402 -306 -673 401 -279 -340 673 -208 115 1033 -489 505 642 -677
3044 -677 911 -237 -453 320 -495 -357 214 -556 -300 445 -693 391 462 -569 811 -35 -74 666 -167
3063 -167 36 265 -258 -214 238 -761 -20 143 -817 398 -432 -190 439 -260 144 386 14 286 444 -219
3083 -219 237 381 -457 438 -385 -378 231 -658 89 -122 -234 163 148 -75 112 269 -327 566 8 -92 494
3104 494 -424 127 -113 -277 51 -200 -204 -143 143 -431 133 8 -228 398 -299 243 105 -94 292 -55 64
3125 64 -131 98 -230 81 -71 -345 255 -275 111 -17 -227 337 -96 122 61 115 -4 103 207 -239 402
3146 402 -276 45 105 -344 335 -263 -10 6 -11 -61 -124 245 -172 211 -105 151 151 -114 408 -127 128 100 -120
3169 -120 118 -61 126 -118 126 -126 -36 189 -411 341 -225 25 170 -114 202 -59 111 -89 137 0
3189 0 -26 222 -309 251 -215 -155 202 -332 16 -147 -45 -43 50 -36 21 165 -166 416 33 16 224 -287 309
3212 309 -66 -177 26 -186 -96 -52 33 -232 219 -160 -87 403 -310 356 11 -175 325 -118 -45 -76 -30 -268
3234 -268 192 -311 -227 345 -552 191 27 -355 421 -187 10 233 14 56 381 -16 21 481 -525 237 5
3255 5 -550 447 -401 -94 191 -370 -50 350 -185 148 497 -351 545 72 -456 669 -469 -56 253 -618
3275 -618 48 -52 -625 -35 165 -577 479 6 -449 881 -337 207 566 -318 438 142 -331 292 24
3294 24 -563 361 -199 -695 662 -643 -94 497 -601 623 203 -365 723 268 -240 699 -142 -515 746
3313 746 -735 -98 324 -1222 340 -163 -633 469 -208 -289 550 -105 -176 908 -331 387 772 -833
3331 -833 810 -113 -703 615 -542 -357 398 -604 -327 572 -739 307 726 -783 1015 132 -499
3348 -499 1000 -500 -91 563 -627 -48 432 -938 139 274 -1102 605 -145 -684 1070 -526 157
3365 157 927 -345 428 572 -604 427 283 -1029 575 -390 -841 753 -973 -104 556 -866 403
3382 403 403 -473 765 340 -490 1100 -80 -481 969 -786 -32 294 -1119 281 -75 -914 390 -125
3400 -125 -719 795 -224 -276 1048 -709 477 914 -797 720 140 -593 607 -270 -639 492 -548
3417 -548 -502 660 -956 220 546 -830 764 119 -373 942 -62 -158 645 -476 -224 572 -1002 19
3435 19 255 -1121 551 -261 -559 716 -412 -47 818 -434 121 703 -360 413 429 -813 585 -304
3453 -304 -567 504 -843 -162 309 -652 24 366 -561 489 451 -556 970 81 -169 916 -533 25
3471 25 466 -657 117 52 -680 20 -16 -780 481 -206 -337 774 -525 282 609 -408 467 254 -259
3490 -259 254 -22 -642 375 -360 -508 524 -729 66 198 -510 527 34 -135 516 203 -145 551 -59
3509 -59 -103 534 -632 95 153 -691 247 -405 -328 112 -178 -294 335 -11 -62 640 -301 260 399 -336 449
3530 449 -101 -251 299 -307 -266 55 -216 -204 310 -272 109 213 -331 504 4 8 421 -153 65 79 -90 -121
3552 -121 126 -434 -63 9 -488 266 -162 -95 333 -215 212 156 79 65 235 -78 137 146 -374 351 -226 -183 77
3575 77 -306 71 -2 -74 83 81 -3 113 309 -139 270 75 -66 384 -280 124 -83 -198 -24 -87 -30 -101 57
3598 57 -199 68 -31 -87 289 -162 183 54 -86 103 -33 -28 -116 35 -236 27 68 -162 167 -205 139 103 -108
3621 -108 154 -94 76 -43 -74 -69 38 54 -218 204 -128 -86 91 -255 124 -211 83 -21 -125 -19 54 130
3643 130 -129 161 -52 13 154 -262 231 -118 12 74 -76 -16 -33 101 -101 117 -107 19 89 -313 239 -131
3665 -131 -62 153 -165 133 -21 1 -69 145 75 12 125 -277 156 -91 -2 167 -308 147 -74 -158 -102 -80 0
3688 0 -31 146 -103 231 -5 30 302 -227 201 17 -151 130 -146 -68 28 75 -223 92 -236 -80 264 -171
3710 -171 187 96 -181 184 -90 -71 42 -98 -165 164 -158 -196 253 -417 228 80 -229 272 -206 16 166
3731 166 9 35 339 -116 23 247 -210 177 -89 -463 286 -328 -147 123 -166 32 93 -174 67 382 -230
3752 -230 292 139 -180 492 -266 22 303 -449 148 -42 -333 -37 20 -381 174 45 -289 529 -184 27
3772 27 476 -197 151 78 -190 268 52 -321 221 -165 -446 431 -347 -14 290 -415 402 24 -196 383 -42
3793 -42 -224 317 -56 -292 409 -449 -106 265 -650 276 -51 -413 263 -220 -177 362 -37 -118 610 -230 204
3814 204 507 -429 462 120 -524 351 -283 -221 267 -388 -231 351 -544 2 338 -590 577 45 -281 609
3834 609 -237 -3 421 -252 -33 307 -532 23 215 -598 383 -128 -455 611 -433 79 496 -339 167
3853 167 243 -332 309 136 -514 379 -163 -473 448 -572 -130 352 -367 245 186 -254 359 278 -366 617 4
3874 4 -253 720 -391 -8 297 -525 229 -81 -366 142 -58 -497 383 -124 -214 640 -318 120 405 -351 439
3895 439 101 -323 315 -162 -212 234 -245 -337 379 -441 69 194 -566 321 -122 -266 367 -176 -225 261 -165
3916 -165 -170 504 -515 -70 249 -578 300 -79 -240 477 -313 -124 428 -243 17 430 -159 188 288 -392
3936 -392 292 -126 -350 291 -350 -106 119 -380 -174 211 -283 101 183 -328 459 -32 -268 465 -293 134
3956 134 203 -225 211 73 -190 -37 156 -293 222 -144 -187 415 -292 58 227 -227 182 225 -79 165 51
3977 51 -310 132 -83 -254 306 -292 103 253 -290 156 -116 -117 217 3 -94 212 34 -230 260 -254 -19
3998 -19 283 -293 201 -51 -61 85 -43 -14 26 55 -150 345 -174 53 153 -245 300 -119 -96 162 -123 14
4020 14 117 -23 -2 117 -314 -63 233 -342 224 -234 -29 218 -6 32 -1 35 -1 146 -55 -24 34 -199 230
4043 230 -45 -177 259 -152 37 -70 -67 -139 46 -156 17 167 -163 152 -12 -20 278 -187 182 63 10 23
4065 23 -7 -157 -9 129 -217 37 -46 -275 127 -153 65 86 -37 115 -121 -12 -41 109 -122 131 -9 -236
4087 -236 124 -197 -33 131 -98 35 -140 27 75 103 -14 106 65 -58 225 -40 -17 72 -166 17 -80 87
4109 87 45 -3 -74 -34 108 -67 225 -59 74 129 -134 280 -61 94 65 -12 -4 -94 -33 -141 27 -46 -105 87 -130
4134 -130 58 -81 -12 147 93 132 -19 186 53 277 -66 28 90 -165 65 -97 -63 23 -165 105 24 22 -48 52
4158 52 94 -8 195 -161 89 -122 -50 25 -236 59 -100 -115 -90 -10 21 30 139 -7 289 47 -38 280 -31 171
4182 171 56 -136 -60 -23 21 -93 5 -216 -18 -44 -298 159 -216 100 9 -106 152 -2 60 161 143 -61 74
4205 74 -74 -65 119 -244 100 49 -261 197 -80 7 97 -78 -79 87 -30 -26 98 -209 83 -11 -332 174 -197 -14
4229 -14 55 -210 -7 40 -73 22 127 -121 183 76 -180 244 -108 -48 143 -237 -15 51 -83 -100 85 -384
4251 -384 18 87 -285 411 -338 -3 229 -168 210 51 0 189 185 -249 126 33 -233 238 -165 -48 237 -261
4273 -261 150 26 -165 30 23 -186 159 -33 -136 350 -328 -48 125 -428 195 -72 -230 99 -160 -184 249
4294 249 31 -46 314 -210 36 397 -318 231 -56 -226 175 -158 -54 99 -245 -38 255 -204 -42 271
4314 271 -320 284 99 -229 280 -99 84 261 -143 -11 108 -240 89 130 -293 354 44 -270 309 -290
4334 -290 -46 166 -289 132 79 -183 127 254 -297 200 45 -325 467 -258 2 135 -306 158 80 -161 102
4355 102 86 -180 276 -87 -201 379 -155 -1 321 -335 124 28 -292 190 -28 -243 143 10 -180 291 -279
4376 -279 -1 246 -323 235 65 -131 246 -67 -192 143 -2 -244 306 -302 105 153 -463 212 25 -91
4396 -91 237 -68 -89 277 -57 -116 326 -89 85 262 -247 299 9 -210 244 -156 -38 107 -173 -37 224
4417 224 -260 58 205 -222 232 -26 -120 247 -188 194 159 -165 25 171 -117 35 236 -286 177 33 -213
4438 -213 295 -223 67 108 -186 40 126 -50 -33 116 -222 264 -46 -143 316 -234 -11 57 -309 99 76 -50
4460 -50 69 60 -90 197 -21 -187 209 -237 -3 -7 -208 -1 -27 -25 54 -119 -174 -6 -18 -121 191 -158 59 156
4484 156 -147 180 -40 9 135 10 -8 95 53 -195 71 -123 -35 108 -186 69 -87 -69 76 31 101 62 32
4507 32 15 166 -30 -112 66 -109 91 18 -49 52 -36 54 -86 64 -115 151 124 -56 121 -155 138 -93 -50
4530 -50 77 -159 -121 2 -87 -90 9 -50 -13 170 7 26 60 -71 218 -27 189 68 93 33 54 -53 -149 50 -88
4555 -88 -62 -118 -15 155 -45 114 69 -150 16 8 -18 -7 107 -49 59 118 -96 61 -75 5 33 -100 35 -69
4579 -69 -23 9 44 -91 -45 224 -16 87 -108 21 3 -112 -63 -120 -149 -158 -82 -57 73 18 -91 137 -65 73 119
4604 119 -53 191 -27 94 84 -50 -4 -51 -97 -106 55 -205 -89 -14 -204 26 6 -41 99 25 149 79 75 -22 99
4629 99 49 -24 268 -164 167 36 -46 181 -151 11 -35 -21 91 -19 -22 -107 7 -132 29 -77 -28 117 -226
4652 -226 19 -80 -79 -61 -121 -42 -50 118 -52 115 33 -77 232 -56 30 98 -127 52 -136 -91 -52 10 -80 31 -133
4677 -133 -246 -30 -153 52 -67 -22 169 18 38 223 93 2 97 3 -100 118 -153 -11 64 -246 126 -169
4699 -169 -54 154 -51 -73 71 -75 -81 160 -222 14 -44 -173 114 -232 -39 96 -116 74 43 62 58 57 -69
4722 -69 101 157 -105 231 -14 -13 82 -194 17 -26 -204 -51 -76 -168 -48 145 -199 132 -43 -3 161 -296 55
4745 55 67 -11 75 111 -104 4 28 -238 174 -194 17 141 -212 95 90 -88 73 59 -115 20 24 -94 181 -74
4769 -74 -226 -35 -287 58 13 -184 105 72 18 138 -29 -128 185 -31 -55 185 -227 73 -41 -64 191 -134
4791 -134 -127 -49 -105 -49 145 -88 -75 179 -118 232 98 -158 224 -29 30 171 -47 -56 54 -223 -82 157 -113
4814 -113 66 50 -269 166 -120 -174 144 -147 110 44 -78 10 147 -121 108 -67 -75 224 -188 -91 217 -92
4836 -92 20 30 -39 42 89 -164 66 33 -123 284 -145 18 152 -91 29 85 -69 110 181 -198 99 150 -247
4859 -247 127 -180 -126 212 -240 251 -2 -244 19 -24 -79 84 -50 57 156 -78 -34 98 -185 128 -14 -83
4881 -83 30 73 -71 44 -65 -106 202 -42 32 155 -139 162 56 -215 235 -94 24 42 -43 -1 213 -129
4903 -129 -74 137 -198 134 -16 -126 108 -121 9 57 -53 -2 156 85 -72 25 -87 6 9 -221 111 -66 41
4926 41 -51 -164 42 67 -59 27 73 -30 52 23 -139 96 -62 41 77 -125 84 -203 7 -103 92 -30 203
4949 203 44 -201 74 -237 -60 34 -172 8 -54 -64 29 -34 66 -10 5 -71 218 -107 -53 117 17 218 94
4972 94 102 137 57 -37 -72 -55 9 88 -119 -62 48 -250 16 -124 -122 60 -38 35 -40 118 -116 -69 -96 -65 280 -86
4998 -86 63 -47 -50 25 -15 42 85 6 -25 200 -26 101 72 -51 -55 14 -67 65 11 -74 56 21 39 -48 1 -86 172
5025 172 -103 18 89 45 110 26 97 156 -39 12 28 50 -13 -24 -156 -187 -1 -150 -25 -122 -26 -71 5 104 -10 31
5051 31 34 142 120 -19 148 -36 43 -48 -61 29 -36 88 -43 -33 -64 -57 -30 -36 86 -107 253 -54 84 14 -219 50
5077 50 -17 60 -30 32 55 30 61 -66 213 58 120 131 -62 163 96 49 137 67 30 -39 -12 -33 -10 -53 -47 1 -138 122
5105 122 -15 -73 146 68 27 130 91 36 32 26 -52 99 37 14 -30 -167 48 -82 81 -37 -50 -86 -110 -39 -45 72
5131 72 -6 167 -113 -75 76 -17 10 -1 6 -40 51 49 -96 6 -12 -12 17 -32 154 -48 41 98 -92 47 -66 8 -105
5158 -105 -51 -82 52 -60 -49 18 -150 4 36 -139 120 -48 13 71 138 50 70 -41 -45 121 -24 84 113 -88
5182 -88 152 -53 -92 -6 -16 44 -71 -46 -78 121 -128 43 55 -180 19 -56 -20 14 -54 -22 -16 -4 7 16 -13 80 -1
5209 -1 -118 122 -93 -71 101 -126 -8 -21 -6 2 7 -128 23 42 -114 34 31 -31 204 -45 144 70 -52 -48 5 -133
5235 -133 -15 59 -173 52 -35 -16 81 -83 -65 -2 -151 89 -60 13 -18 46 -111 93 61 -20 105 -43 35 3
5259 3 -99 144 1 19 0 34 27 61 53 -141 263 -110 64 92 -142 239 -31 -19 147 32 -81 -35 -21 -39 171
5284 171 -120 175 91 -165 30 -164 30 84 -38 -19 103 -11 70 152 -202 15 46 -221 94 -75 -29 115
5306 115 -41 36 72 -108 -38 68 -117 27 33 -117 136 -39 -6 166 -45 48 82 -30 -155 19 -120 37 89
5329 89 -249 192 -97 -69 192 -179 122 71 -92 71 -15 -131 -26 10 -165 150 -60 -29 63 -174 181 79
5351 79 -90 146 88 -84 -5 -15 -1 147 94 -97 85 -115 120 -95 -87 68 64 -3 175 -10 21 154 -6 -78
5375 -78 87 -157 133 -20 45 101 -109 24 169 -83 -42 -96 39 -148 200 -103 0 60 -108 156 -110 -115 59
5398 59 112 21 54 21 22 134 -201 33 85 -225 78 -29 -30 -41 14 34 -60 66 -59 86 -18 -19 31 -135 129 -52
5424 -52 -15 17 -28 48 10 -122 -21 127 -47 -11 72 -32 117 -83 59 101 -138 89 -71 -37 61 -118 -48 -103
5448 -103 0 -49 161 45 69 148 -68 33 62 -55 -47 -94 -46 -129 112 -123 47 -17 -85 11 -154 53 1 -54 -33
5473 -33 44 87 45 23 0 50 -34 61 189 -225 140 73 -92 111 -55 39 -72 24 -33 87 73 -86 141 42 54
5498 54 16 -41 34 -36 -14 105 -6 61 2 34 -30 76 -94 50 120 62 40 -68 36 123 4 61 16 -9 -45 21
5524 21 -44 -50 46 -43 3 -161 -56 -20 -107 -1 50 -21 112 134 84 -13 171 -14 102 -81 57 -6 -126 61 -44
5549 -44 37 -102 -63 -66 -67 10 -56 70 69 -110 96 -58 5 -96 -12 -30 11 87 22 30 17 70 -111 -80 90 -7 133 36
5577 36 33 70 -78 26 -40 19 7 -147 -78 34 -15 -85 87 -36 -12 67 17 17 7 113 -7 -11 -9 -83 53 -32 124
5604 124 53 -19 95 -9 31 -3 -36 -72 39 -67 -193 101 21 27 -128 -1 125 -66 11 -90 -104 98 -31 -13
5628 -13 -95 106 -47 19 85 -112 137 -22 -36 43 -22 23 10 39 -19 108 -185 -93 85 91 78 -74 47 30 -149
5653 -149 85 -49 -91 -3 -98 -85 -56 11 -136 69 -112 -23 134 -91 72 -18 -82 15 -98 -12 -46 68 -119 15
5677 15 -97 -23 75 -108 38 -23 4 129 -84 -19 61 -117 -34 46 -32 -95 88 -116 137 -50 -69 -119 -166 17 25
5702 25 -63 20 18 -78 30 44 -112 57 -96 80 29 -107 47 79 20 28 132 -57 5 77 -113 94 -22 -130 130
5727 130 -39 -61 -83 79 88 -9 -46 50 64 -41 129 12 -97 84 -12 4 7 -110 44 -64 -102 -67 -17 -38 33 -10
5753 -10 -166 80 -194 32 -47 -120 13 23 -34 -56 -36 -56 -43 33 -14 97 -84 15 15 -61 104 32 -23 38 -92 -7
5779 -7 -54 -20 -52 26 27 -1 63 -138 19 -49 -61 132 -5 79 3 -40 -21 71 -59 147 161 -85 -14 -102 -104 57 -49
5806 -49 3 42 29 28 -21 -71 -38 76 -115 60 40 59 148 -82 -61 26 -70 30 39 54 78 56 -113 55 78 -121 44
5833 44 -119 41 -37 -129 -9 -48 -45 25 27 18 76 -23 11 67 5 39 -44 -79 71 13 -4 130 -45 -75 -62 5 -186 82
5861 82 16 119 5 -34 99 -123 -63 0 15 -4 108 32 -67 29 -65 -25 -11 -52 61 -34 -26 117 90 -38 98 -61
5887 -61 -20 73 -108 76 90 -88 13 -139 -9 -33 -79 51 -69 -9 7 115 -110 60 21 7 28 61 -13 34 27
5912 27 56 -65 18 25 -5 18 -114 -51 -117 55 -46 -38 -60 -50 77 -39 -55 -49 -26 -56 43 92 -122 32 -27 -33 142 -33
5940 -33 34 -48 98 4 -30 81 -39 -23 -45 54 -86 -34 85 -140 -11 -62 -72 0 -44 -11 11 49 -95 -6 -18 -22 92
5967 92 2 27 -33 23 4 -59 71 19 76 -26 -8 141 -63 131 -149 -111 -2 -91 4 -37 83 -137 42 -25 49
5992 49 -1 -87 -11 -15 93 0 -75 124 -79 1 12 23 -14 -58 40 -60 26 -37 -72 -56 -33 -6 6 48 -18 -53 20 -17 44
6021 44 72 -28 74 -75 77 -37 114 -44 36 57 -77 95 -119 -10 -14 -36 86 -177 33 -23 24 -62 2 19
6045 19 -27 58 -106 65 76 70 -55 -12 -29 -23 0 36 -56 85 -45 17 -21 76 -51 -23 68 -83 -34 -129 11 12 -84 -27
6073 -27 63 -27 -18 -90 -47 0 53 65 -26 -73 -38 29 -29 99 12 -40 -15 -135 47 -104 -106 -36 77 -110 -74 35 -75
6100 -75 37 -65 34 -43 48 -15 19 78 59 -40 -19 -42 -4 60 22 -157 101 -4 -148 94 -70 67 -39 5 58
6125 58 6 -24 129 16 -8 -47 98 6 131 -54 -154 77 -74 -39 111 -44 15 -5 -70 33 88 -4 81 -137
6149 -137 -13 77 -10 84 46 -54 13 74 -50 109 175 -134 70 -34 -125 119 -122 -21 -3 30 3 -22 -99 46
6173 46 -38 9 -7 19 -4 -30 -67 60 15 -31 6 -65 -56 107 25 -15 31 44 -19 -35 -65 50 18 -46 15 -111 -33 49 -13
6202 -13 -26 16 0 -53 -17 -106 11 -16 -90 118 -164 52 44 -9 78 -12 -23 -25 56 -87 104 33 -88 107 -14 85 111
6229 111 58 24 76 44 33 54 9 -11 104 -53 116 -88 54 90 -128 69 -110 14 -26 18 41 16 98 -125 68
6254 68 -122 -79 12 -134 83 -30 74 4 -98 -44 7 -35 -6 133 -39 14 78 -41 91 -5 58 56 49 53 -37 68
6280 68 -42 16 -91 109 -80 -80 57 -134 70 100 -170 94 -59 -22 6 63 -105 26 58 -86 -30 -62 15 79
6304 79 -106 36 118 21 53 -3 6 21 212 29 25 38 2 7 11 -76 -16 -42 -36 24 51 -135 29 -47 -41 18 -10 68 8 -17
6334 -17 94 -99 1 -26 -47 -57 -75 -96 -21 -83 29 -57 0 -8 1 -76 -74 55 -65 -81 -44 83 -31 27 -33 20 41 76
6362 76 116 56 102 -15 -95 -109 -45 -23 -4 -72 -25 7 -15 -9 100 -26 90 -10 -136 -26 -86 -6 28 120 -25 97
6388 97 54 75 6 -4 0 11 7 6 -11 73 50 34 -2 -2 -6 -52 17 -62 -120 -86 -82 20 -103 26 16 44 66 -4 22 -193 -9
6419 -9 78 13 60 -73 34 -53 54 17 -67 -25 50 12 -77 -54 8 0 8 -49 -4 -36 19 4 -110 -71 72 108 -78 -91 -16
6448 -16 7 14 6 -49 5 36 34 15 75 -19 -1 -17 17 -136 -33 -58 -55 63 -13 16 27 -45 -44 72 -14 81 99 -4 13 63
6478 63 -66 0 -72 -112 42 -20 76 22 -172 -69 -57 57 5 27 -121 62 -54 25 91 29 -29 20 -21 38 43 19 36
6505 36 -59 -5 -65 29 -48 80 -7 54 -101 -31 90 -110 84 2 102 39 126 -8 -6 45 -108 17 74 -96 53
6530 53 42 28 -4 29 -73 -33 69 -107 -36 -49 6 -52 -19 94 -3 -103 69 -23 -51 -15 -56 14 -13 16 -13 10 -21
6557 -21 45 -55 -53 64 -55 95 53 -24 -106 -30 81 67 -75 -17 23 -56 69 2 -68 54 -28 28 -32 -45 26 -19 94
6584 94 14 4 30 -26 7 43 -71 -55 93 -30 29 -34 -48 27 70 79 -90 -64 68 52 62 -111 95 14 -34 102 -30
6611 -30 105 -37 1 -115 -50 61 30 44 57 -3 -19 -89 20 -50 -47 49 -6 -14 -94 54 -8 -41 108 -61 -5 36 71
6638 71 69 -109 -27 4 19 -27 128 -55 1 77 -30 35 -47 72 65 -26 -79 -14 -32 -29 -6 -53 -40 -56 -3 66 -43 2 -133
6667 -133 -109 29 52 6 57 32 -34 -81 -89 -12 63 -77 -15 -10 -110 -106 -39 -21 3 -46 9 -9 -152 77 101 7 2 -6 -120
6696 -120 106 27 -56 9 -21 83 50 10 28 34 -82 30 -35 41 79 -15 -90 -16 72 -29 6 -83 -63 -32 55 67 55 14
6724 14 9 50 -21 -45 -54 36 -37 -56 37 46 47 20 119 -75 14 67 35 30 -45 -22 12 19 -8 -18 0 37 14 90 -35 79 -39
6755 -39 120 98 34 -31 -53 21 -70 58 1 29 -64 -44 60 -137 1 28 -105 9 -46 134 3 17 -87 -17 -24 36
6781 36 -85 -51 -25 -23 137 -37 57 68 -83 -68 -15 -12 -5 -27 -31 -30 24 -9 -46 2 13 9 -37 9 -54 -15 -37 -51 32 -113 37
6812 37 -25 -85 -26 -26 24 -30 -25 -54 51 22 56 17 34 -68 -21 -19 -50 -86 24 -49 -78 8 -34 38 -106 -108 14 -51 -10 40
6842 40 54 -29 3 57 50 61 -25 -35 -23 7 27 -11 63 51 59 -15 14 -18 -90 -98 80 -55 -89 -8 -11 -33 61 81 -23 17 -16
6873 -16 91 -66 112 -51 16 31 85 80 21 -18 -71 -123 67 -2 -1 -2 -49 -36 -2 77 -9 116 -29 -20 52 -7 -87 -26 -17
6902 -17 -59 46 -19 -1 36 -13 37 -3 58 -20 111 -20 -18 -25 -45 -13 59 -160 12 100 20 -82 -83 -65 -39 0 -33 14 -62
6931 -62 -67 -141 14 -65 -24 -31 -8 3 -20 -80 -5 90 -22 80 1 -70 14 -44 -54 -106 -54 -38 55 -3 74 40 -27 -119 -78 37
6961 37 -7 53 49 128 -51 -44 80 -44 -57 -42 105 -2 -37 -14 20 -120 44 8 18 11 -8 93 69 -63 -21 -13 -47 58
6989 58 58 -134 -45 72 55 -18 70 25 -117 -10 23 12 -24 -3 17 8 -38 20 -53 -43 89 -11 2 -9 2 -23 17 117
7017 117 -39 2 -61 -14 -15 -31 44 84 -37 25 51 10 22 6 25 26 81 21 -12 -43 38 -8 -5 -53 12 29 15 27 24 -110
7047 -110 -13 -46 38 -108 -31 28 10 -24 22 -36 64 6 37 -114 -24 -8 18 42 -14 -16 -94 16 18 3 -51 49 1 -12
7075 -12 83 15 -14 -87 62 -16 53 -97 -57 -61 62 -58 -40 -36 105 13 63 -40 -33 6 19 61 54 90 -13 38 83 -172
7103 -172 -42 35 -43 54 -73 44 11 -6 51 -72 13 -11 -58 -42 32 37 2 89 -15 -91 12 10 -10 67 -41 -97 44
7130 44 -23 95 25 -44 -74 -83 18 -23 83 68 6 0 53 64 27 10 -70 -42 40 17 -38 122 -41 -17 9 -38 -59 30 36
7159 36 42 26 0 72 -39 -36 -73 -7 -60 43 -64 -29 45 22 -71 -64 -56 25 -53 -88 72 78 16 -31 68 -3 -44 -30 -26 37 32 -35
7191 -35 -91 -34 30 34 1 -44 -78 41 -17 22 45 114 -60 -109 -14 55 -23 -86 67 58 58 -35 -141 -12 -50 36 -29 -15 6
7220 6 -158 -19 -14 -9 7 0 -75 -34 -54 15 55 11 -50 32 -69 104 63 2 23 -89 -12 -7 -37 76 87 14 71 15 -23 -113
7250 -113 -29 -23 -87 -105 -62 -36 11 53 -116 69 40 -53 -9 -37 -9 32 35 -26 -31 1 -94 -42 -3 103 95 90 73 90 15 76 82
7281 82 -49 -57 14 -47 58 -51 -69 -98 -50 -17 20 41 34 24 -78 -80 0 21 -20 -40 -13 52 33 -122 -59 20 4 151 -142
7310 -142 48 -60 -27 -7 8 5 -18 -31 70 24 31 -44 67 -86 -113 10 -94 -9 -46 10 -88 -37 -12 73 -40 125
7336 125 -72 -8 -61 36 -10 29 -30 56 -17 -139 91 -27 -98 -75 -20 36 -27 -13 66 46 -12 27 -33 -38 4 -44 115 -80
7364 -80 -4 -33 -4 -107 116 5 -61 -12 -17 -51 -54 -26 -25 -99 -25 -2 61 -74 -51 -4 -78 14 50 19 -1 -33 -59 -5 63 -11
7394 -11 -9 84 59 30 19 54 26 54 -14 -8 35 109 -29 -13 43 48 6 -33 -98 -60 115 -87 54 35 -10 -21 -37 -20 -64 8
7424 8 53 -115 -79 -8 12 39 -19 -93 70 24 -23 -19 -23 -156 -97 -119 117 180 9 -128 40 -36 -43 -47 -42 53 45 51 12 43 -3
7455 -3 7 35 -77 -4 -20 23 -105 3 -119 -14 52 -11 -78 -9 17 50 18 -37 52 -63 45 96 -18 121 -47 -11
7481 -11 57 -97 -8 -7 -30 18 -70 -91 32 39 96 41 -96 -31 -26 -120 -4 49 -13 -57 29 -33 32 5 -105 -78 19 -123 -138
7510 -138 -51 -19 29 8 68 -42 -4 17 -46 -38 48 -88 28 -36 -45 -69 79 10 -100 -39 -35 -72 2 -42 18 -52 9 29 -85
7539 -85 -42 -71 -3 -70 -5 59 83 73 -28 -64 -65 24 57 -83 19 25 -90 -117 36 6 71 21 11 -43 7 -38 41 -79
7567 -79 -20 104 -67 14 114 0 34 43 -9 -8 -22 27 -1 27 -11 77 -139 61 -88 56 -71 17 59 -31 75 -54
7593 -54 -55 -64 68 9 -28 -27 -58 105 26 28 51 31 -88 -14 101 85 66 31 -35 -4 -58 31 68 58 -52 12 69 -21 -36 -11
7623 -11 -20 -5 8 28 55 -9 -115 16 43 -119 13 20 -50 53 -33 118 -8 0 30 -16 -73 -45 -16 53 36 44 -21 -31 -71
7652 -71 46 -37 -79 49 -103 24 -13 6 -61 13 36 61 -4 -73 -105 -26 -63 54 -26 18 -72 57 86 -78 -15 -89 -54
7679 -54 -30 -72 -54 -2 -1 -129 27 -93 -55 19 153 -50 -58 -13 -33 23 11 8 5 -65 6 -66 94 -66 -53 -27 -34 -102 -6
7708 -6 26 -70 -44 -11 20 60 22 -37 -47 46 82 -52 43 -44 22 41 5 -66 -6 42 -92 36 12 -54 13 -76 59 -12 40
7737 40 101 -8 -79 -78 14 42 26 3 -84 4 -20 -97 23 -51 -56 33 -52 36 -53 -47 8 5 -144 8 -59 -93 43 -42 -71 43
7767 43 8 52 -76 -15 -18 -102 -67 -35 -58 48 29 17 118 61 54 54 -68 -17 43 63 27 -45 -43 -3 2 45 13 43 61 19 -25
7798 -25 36 -16 -79 24 36 -19 -2 -45 29 -72 21 75 50 93 99 -68 -36 20 -98 78 23 -20 -11 -148 -25 -115 26
7825 26 52 -9 3 34 -112 47 -10 -9 -39 7 -85 46 -7 60 -55 26 12 -64 51 -56 -23 -10 38 63 31 -83 -22
7852 -22 24 17 -20 -53 -68 -65 48 -79 -60 50 34 28 -60 -39 39 89 24 -47 -56 45 8 11 -70 -26 -10 -24 -47 -40 40 -165 70
7883 70 45 20 5 33 64 -64 -39 93 31 -33 4 -9 8 3 59 -86 53 -24 28 121 -8 2 -49 89 -32 -34 -11 -130
7911 -130 36 45 -27 -8 7 -28 -7 -19 -9 -7 -46 -37 -14 99 23 -71 78 -75 -37 10 -135 37 -54 39 26 18 32 -126
7939 -126 112 -32 -44 -28 86 -37 72 -30 17 -9 -88 2 -68 28 78 -6 -63 -97 -49 82 -1 -53 -69 -19 -36 -166
7965 -166 40 -60 -39 -80 -17 -25 -17 91 -102 -31 45 -67 16 96 -102 81 19 51 93 -16 -146 -74 -3 61 5 57
7991 57 95 18 75 -23 -40 30 4 -40 -69 -1 -53 -55 -14 -101 -58 4 -118 70 -46 -96 43 35 -27 16 -24 -10 66 -53 -6
8020 -6 35 -48 35 -1 66 -25 -39 114 14 4 28 0 37 108 50 81 58 -52 -79 67 -115 -14 -18 42 -16 52 68 -115
8048 -115 -19 -131 19 -73 -31 -102 -54 5 -101 -64 56 -69 -21 20 17 -131 -21 29 -41 26 20 31 -91 29 1 -9
8074 -9 71 70 77 9 -6 -94 41 0 -73 -2 -91 28 -48 -40 -53 -20 -4 35 -47 65 -28 19 14 -9 1 -33 -75 -82 140 -67 -49
8105 -49 -83 18 -50 -35 31 14 60 17 30 28 -15 77 -73 81 5 4 55 -82 -118 9 -49 -72 147 73 6 -68 -15 -63
8133 -63 30 16 70 -5 -31 53 -46 -58 -70 -78 1 31 -44 18 88 -7 -80 85 95 60 40 45 -16 -65 46 10 -45 -29 -51 55
8163 55 48 18 -54 -60 31 -5 29 29 -19 45 33 -102 -89 -32 -8 40 -36 -7 -12 42 -51 -10 -200 -134 68 -19 21 -72
8191g2
$$ Imaginary data points
##PAGE= N=2
##DATA TABLE= (X++(I..I)), XYDATA
0 0 0 0 0 0 0 0 0 0 0 0 -8 8 -8 8 -16 16 -17 24 -29 33 -40 49 -58 71 -81 97 -112 128 -146 168 -193 220 -250
33 -250 282 -320 359 -404 452 -505 562 -626 694 -770 853 -942 1039 -1147 1265 -1395 1535
50 1535 -1690 1860 -2052 2265 -2504 2772 -3078 3430 -3839 4323 -4906 5619 -6522 7699 -9307
65 -9307 11644 -15359 22172 -38755 162499 164991 -27597 235401 39745 8564 77131 -9071
77 -9071 53968 -2344 -148958 35209 -99331 -238143 36978 -58757 -149679 54071 -35117
88 -35117 -34035 3555 -38459 73565 36910 -42881 128203 48134 -100914 83725 19511 -84398
100 -84398 55625 2923 8911 22140 -40379 66693 27889 -59995 107848 70646 -67184
111 -67184 84282 30713 -72890 18636 -52621 -28779 -31503 -121274 1331 -49767 -145335 19017
123 19017 -1965 -86560 60949 43247 6936 85331 30453 93050 82036 -2743 118139 49711
135 49711 -47700 55972 384 -79730 -10677 -43572 -65738 -34527 -83277 -16710 -26313 -83945
147 -83945 38190 7031 -41013 54537 32458 -2907 40141 24796 20390 29525 -13994 33568
159 33568 15852 -48159 36315 6608 -39200 28035 9355 -9047 16349 3370 11079 14041
171 14041 -23877 19379 5867 -54197 11990 -17499 -56790 -6208 -29624 -29347 -11699 -22877
183 -22877 5957 9781 -11584 40662 36593 174 60080 35423 12361 43592 10145 14805 5770
196 5770 -18636 -152 -20516 -43277 -13438 -24865 -47969 -6796 -19398 -22492 5610 -9005
208 -9005 13338 11618 4648 28724 15377 6076 22988 14324 -5543 13525 541 -8846 5095
221 5095 -13943 654 -3737 -13640 7326 -3125 -6688 6527 3646 -6715 6255 -1084 -6545
234 -6545 3963 -13733 326 -5037 -15413 4185 -7709 -5263 4282 2844 3115 10382 9866 8876
248 8876 16269 4677 14674 7874 -1704 9558 -6829 -4870 -5975 -12152 -10982 -13186 -11037 -13087
262 -13087 -6666 -10165 -1868 -405 -2508 10320 1989 9979 10375 7022 11564 5970 8699 3122 4623
277 4623 -15 -907 -640 -6999 -378 -8661 -3634 -4105 -7444 -70 -5731 433 -1849 1041 1927 708
293 708 5543 -245 6465 764 3151 3445 -2121 4230 -4289 -64 -2815 -4030 -2527 -6174 -1203 -6928
309 -6928 -425 -3461 -1792 2827 -2575 6878 721 5489 6647 2892 7510 2679 5995 610 3720
324 3720 -357 -2267 1616 -7206 671 -5580 -3945 -717 -6110 561 -3115 -253 -1856 830 -1200
339 -1200 -2727 3007 -7208 1261 -3528 -5576 1485 -6453 1065 360 760 3806 7783 6482 7445 15308
355 15308 4388 13704 8688 2100 10040 -5758 -1569 -4363 -14586 -11723 -12379 -18511 -16705 -8670
369 -8670 -17635 -3745 -3698 -4269 14452 1066 14921 21722 8668 19942 19356 9082 10060 10349 -3836
384 -3836 1625 -7896 -14872 -1123 -24971 -11889 -3244 -23284 -4298 -1199 -8466 1992 5077 399
398 399 11010 2259 1452 18408 -10683 3328 13951 -16049 4518 4824 -7297 5663 2291 2284
412 2284 14708 468 6100 26083 -9337 6915 20187 -18936 1817 -3993 -21091 -9131 -25259
425 -25259 -20836 -8811 -32050 -16532 9166 -25186 1747 26291 -5421 25744 25838 18309 36694
438 36694 12218 23709 31839 -7762 5319 20395 -29477 -13535 1615 -38213 -14100 -20682
450 -20682 -24529 -852 -30693 -3476 17204 -23496 6425 31695 -13614 9081 27212 -8272
462 -8272 14828 -198 -1848 21155 -26558 4158 25128 -29817 4706 28151 -16772 7147
474 7147 21020 -4881 17839 -5760 -213 24364 -37474 -4400 16566 -48832 -14775 3548
486 3548 -37145 -13811 -5120 -14838 12607 -12029 9678 46627 -15279 26629 56840 -9304 24551
499 24551 36035 -3689 10229 -2128 -10642 4929 -41175 -21113 11876 -60452 -19073 15862
511 15862 -45159 -4684 10425 -9872 14832 0 13157 36272 -14878 13470 48275 -28876
523 -28876 6352 35858 -27509 4273 5790 -10721 11501 -19195 2268 27674 -30271 2493
535 2493 40133 -32954 -454 27169 -28321 829 -9008 -17773 5659 -39403 -10589 17089 -43899
548 -43899 -6951 32455 -27223 6659 34447 -2436 29207 13871 17441 42989 -13598 16046
560 16046 38178 -31422 -4201 20755 -38015 -17864 -3882 -32978 -6580 -28573 -15675 17823
572 17823 -37022 2814 35299 -23783 10314 36704 -6970 13150 18707 -947 21227 -12550
584 -12550 -1571 28236 -35160 -1895 25811 -32363 -1527 15775 -15279 4444 1524 -4504
596 -4504 18720 -17980 -2949 27638 -33143 -4039 19635 -31055 -4510 3549 -15712 2740
608 2740 -7120 -2213 22113 -11734 6284 38889 -13049 12602 34059 -9091 12181 9553 -5778
621 -5778 6311 -15979 -11413 5505 -31649 -17528 10418 -33940 -10595 10196 -19945 5954
633 5954 3175 906 19715 -2418 10227 26986 -6476 5841 26025 -12227 2112 12679 -14024
646 -14024 4797 -6620 -8053 8701 -16551 -2725 11936 -14777 -2526 13970 -11991 -154
658 -154 7573 -10685 6205 -6864 -6724 9114 -15576 -2569 8933 -12054 -673 10565 -5112
671 -5112 4664 9918 -1086 14032 1573 2313 16239 -7311 2489 8239 -9943 -2925 337 -10334
685 -10334 -5701 -3874 -10582 1356 -7427 -5507 9017 -7589 3240 9569 -1954 6318 7237 2124
699 2124 4858 4086 -1476 5446 -2878 -4732 5590 -9735 -2494 1039 -8431 -284 -2204 -2823 235
714 235 -315 -1283 3606 15 -1120 7030 -2936 2180 3975 -2966 3794 -917 391 1025 -760 152
730 152 641 351 -2147 3107 -2418 -261 1796 -3146 2173 -1922 -128 67 -1541 68 -1277 477
746 477 -2397 1473 -1373 -1242 1874 -2644 2003 -1213 305 1052 -1029 1976 -601 1792 -463 1271
762 1271 881 -607 2284 -1754 1624 -1003 -331 447 -2185 1270 -2597 708 -554 -511 1522 -817
778 -817 2725 -155 2677 1465 1038 2620 -660 2334 -1960 -223 -1634 -3838 -1456 -5274 -2741 -4792
794 -4792 -2865 -2787 -2808 1012 -1614 3492 1978 3796 5929 3630 6956 3881 5372 3030 2721 1392
810 1392 -1433 560 -5218 -1995 -4423 -6124 -2432 -6016 -2552 -2934 -1548 -930 535 1298 570 4282
826 4282 -1041 3904 2141 -1790 4079 -1880 -190 656 -1195 -90 420 475 777 4010 -1016 4874
842 4874 3552 -1863 6405 -1242 -880 1086 -4411 -2654 -3966 -6354 -4877 -3138 -8564 -675 -741 -5852
858 -5852 6927 776 3205 9550 3491 9028 7726 3469 7152 4994 -3629 3065 -1127 -11051 378
873 378 -9401 -9712 -2878 -11646 -2491 -3179 -7022 3862 2220 -3332 9148 6321 -1647 11785 2277
888 2277 1896 7961 -4738 5647 805 -7755 5543 -883 -8178 5122 758 -6414 7093 -1665
902 -1665 -48 6171 -7647 6422 79 -11748 5578 -4419 -12924 1398 -4961 -10465 2075 -5928
916 -5928 -199 6068 -6985 13742 8120 -4057 19481 7848 -645 13955 3922 -1329 5442
929 5442 -6861 -1462 -1437 -19401 2471 -6369 -21423 5729 -6060 -11611 6134 -1909 1041 7746
943 7746 -1876 11015 9553 -8431 16527 5767 -12475 13937 -1490 -8334 5145 -6771 -571
956 -571 512 -10365 7124 2792 -14256 13407 3849 -13501 13496 -1500 -5695 5652 -8496
969 -8496 2610 -1355 -14445 7513 -409 -17446 11969 2960 -11986 14957 1584 2280 12157
982 12157 -3170 14032 6280 -9789 14787 2085 -17053 8672 -3116 -18133 3110 -11201
994 -11201 -7343 -500 -16508 7866 30 -14511 16344 5332 -9352 16717 7274 -3117 13263
1007 13263 -1075 5355 6775 -13087 12233 51 -18328 11960 -1918 -15080 7664 -1708
1019 -1708 -6624 5810 -6748 5220 4667 -14521 14210 1250 -16700 13509 -1836 -11868 6604
1032 6604 -3832 -3376 3545 -8463 7505 5059 -13227 17051 5027 -11511 17214 2112 -4547
1045 -4547 9053 -3111 1324 1959 -11658 5285 -223 -19226 9058 -1590 -16810 9794 -3247
1058 -3247 -4685 6825 -4121 6877 5240 -7007 12590 5946 -11705 13454 2724 -11489 9795
1071 9795 -4467 -3828 2874 -10096 4212 -612 -12162 8253 1271 -12418 10088 1799 -8099
1084 -8099 9684 -2901 1241 5511 -7810 8468 1437 -9834 9207 1217 -9841 7750 479
1097 479 -6398 6895 -4655 1754 4324 -9089 8269 856 -9467 8307 86 -7775 5543
1110 5543 -1109 -4759 4523 -5762 1661 3091 -9623 7450 571 -8021 7851 -217 -4047 5291
1124 5291 -369 -946 4665 -4009 3228 3657 -7976 6947 416 -7164 6065 -2091 -3425 2682 -2739
1139 -2739 -769 2131 -4446 2461 2986 -6603 6480 1394 -4388 6825 -1163 -366 3307 -2297 718
1154 718 896 -4712 605 188 -7770 2154 -1767 -6133 3286 -3272 -264 2570 -1311 3727 3252 426
1170 426 4658 4554 -1098 5113 2089 -2325 3854 -3023 -1170 -373 -5005 -885 -2548 -4302 -1076 -592
1186 -592 -3659 1293 796 -1791 3897 -537 1589 2832 -1483 2784 -133 -1016 672 -250 -1723 158
1202 158 221 -1973 2407 -388 1248 2918 -210 3590 1160 834 1481 -160 -993 -1666 -1588 -4434 -2065
1219 -2065 -4148 -3884 -1597 -3855 74 -644 839 2709 2816 4522 3946 5351 3501 4575 2828 867
1235 867 1620 -2491 -1396 -3806 -4592 -4229 -5698 -3753 -4790 -2445 -2472 -634 1056 728 3890 2413 4412
1252 4412 3745 3053 3644 1380 2261 -275 146 -1032 -1730 -730 -2565 -214 -1700 11 474 23 2048
1269 2048 84 2013 302 223 -154 -2101 -1289 -3649 -2740 -4242 -3431 -2991 -3566 -314 -1555 1807 2459
1286 2459 3263 5583 4567 6381 5180 5421 3839 2875 1418 -1315 -662 -4850 -4118 -5103 -6999 -4535
1302 -4535 -6174 -4112 -2893 -1866 -320 1510 2572 2591 5765 2978 4794 4543 1289 3827 -75 -171
1318 -171 -22 -2707 -1960 -1681 -2873 -2563 521 -2410 581 1751 -976 3738 17 926 2581 -1933
1334 -1933 -160 -182 -3154 -2792 -929 -4455 -1644 -560 -3246 3218 -287 1659 6428 1280 5056 6123
1350 6123 2182 3721 3876 -1095 623 -1015 -5699 -829 -7124 -6542 -1382 -8805 -3379 -833 -4566
1365 -4566 700 2359 588 5270 4274 2242 8820 1509 2392 7739 -3088 1584 2275 -4824 -181
1380 -181 -2174 -4610 -51 -3313 -3883 3756 -3950 -1141 6225 -4509 1918 3661 -3514 2773 -815
1395 -815 -2882 2204 -3946 -3547 3670 -5587 -2144 5813 -5194 2524 4876 -1674 6794 1676 1075
1410 1075 7414 -1508 -22 6273 -5373 -2701 3625 -8771 -1784 -1419 -7892 1736 -5063 -3204 5230
1425 5230 -4615 545 8243 -2635 2580 8592 -2475 4784 3377 -3150 6195 -4199 -2815 5311
1439 5311 -8306 -2518 3932 -7700 -1594 3191 -5765 2610 591 -3439 7826 -3743 -665 8944
1453 8944 -6151 580 6176 -5789 593 2608 -5029 2928 -1217 -3923 7444 -5260 -1091 9159
1467 9159 -6338 1414 6362 -4775 2250 1866 -4084 3618 -3141 -4620 6116 -7869 -3383 6753
1481 6753 -8857 32 3994 -5434 3384 940 -1928 6563 -1829 -1024 9497 -4893 -394 8644
1495 8644 -6906 1573 3131 -5626 3150 -2522 -3564 4754 -5321 -2736 7114 -6438 -1097 7174
1509 7174 -6355 2498 2989 -4044 5499 -2247 -1632 6386 -4965 -1484 6651 -6138 -1120 5160 -6409
1524 -6409 1880 622 -4694 5276 -3752 -1714 6463 -5190 -225 6550 -4421 764 4961 -4235
1538 -4235 3456 728 -3493 6231 -4343 -1537 6083 -6003 -685 4196 -5232 142 2254 -4378
1552 -4378 3086 -859 -3181 6172 -4338 -898 6176 -5275 547 3580 -4185 1144 1192 -3587 2977
1567 2977 -1663 -2887 5701 -4137 -499 5904 -4308 2019 3589 -2455 2857 795 -2004 3252 -2041
1582 -2041 -2885 4168 -5069 -2088 3203 -5928 406 860 -3276 2663 -173 -660 4424 -218 336 5976
1598 5976 -1942 789 4442 -3765 1592 83 -3888 1060 -3228 -2942 827 -3673 -2250 2291 -2980
1613 -2980 48 3593 -2033 3356 2075 -504 4307 -265 382 2999 -1756 -647 1726 -2863 -1004
1628 -1004 1132 -3475 1072 -178 -1984 2943 -1282 402 2874 -1093 575 1619 -1685 -585 308
1643 308 -3170 -262 -1674 -3446 842 -2843 -829 1569 -990 1709 2652 1514 2836 3604 1441 3281
1659 3281 1831 -329 2308 -1950 -1260 -799 -4091 -2149 -2662 -3208 -2164 -1344 -1850 266 660 39 3204
1676 3204 1100 2251 3226 730 2453 1077 174 211 -683 -1378 -1272 -1113 -2224 -247 -1527 -715 983
1693 983 -605 1622 996 926 1500 867 664 186 60 -1395 -545 -1742 -1872 -728 -2317 -459 -689 -33
1711 -33 1174 1061 2063 1935 2861 2122 2483 1720 626 1066 -1233 -790 -2134 -2954 -2456 -3589 -2563 -2930
1729 -2930 -1800 -1488 -405 631 754 2587 1890 3078 2975 2349 2995 1217 1545 285 -307 -974 -1535
1746 -1535 -1253 -2267 -1207 -2078 -945 -540 -777 1081 -25 1166 1128 622 1092 236 307 -701 -406 -1496
1764 -1496 -1305 -1210 -2009 -300 -1490 104 525 307 1993 1496 2187 2255 2390 1615 1596 1077 -571 363 -2022
1783 -2022 -1705 -1902 -3546 -1645 -2790 -2186 -1108 -936 -231 1097 1468 1271 3265 1529 2472 2698 380
1800 380 2258 64 -773 20 -1835 -1854 -1455 -2174 -2072 -363 -2026 -53 871 -1187 2325 835 484
1817 484 2511 110 662 1008 -626 -310 163 -2300 -454 -31 -2902 1449 -644 -844 2442 -261 1620
1834 1620 2352 289 1926 1705 -941 1083 278 -3068 706 -2290 -3265 220 -3849 -1213 -283 -2642
1850 -2642 1116 999 -803 2855 2279 -241 4266 1065 458 3630 -1525 880 1036 -3126 760 -953
1866 -953 -3488 485 -1071 -3129 1710 -1152 -995 3108 -1878 1963 2233 -2243 3031 566 -2169 2161
1882 2161 -769 -2493 1683 -2061 -1522 1968 -3601 1402 1574 -3139 3854 509 -1480 3792 -36
1897 -36 -703 2943 -1558 -308 1926 -4135 1094 278 -4956 2495 -1381 -3052 2866 -1403 -497 3091
1913 3091 -1188 1439 3274 -2528 3204 2046 -3639 3906 -1009 -2964 2760 -3030 -1241 1190 -3635
1928 -3635 219 1328 -4133 2513 1150 -3570 4465 -276 -1297 4082 -2110 877 2404 -3109 1670
1943 1670 1248 -4050 2603 331 -4053 3552 -1512 -1581 3568 -2972 1266 2215 -3244 2739 1181 -3566
1959 -3566 2957 -13 -3541 3344 -2078 -1910 2863 -3997 1316 1536 -3963 2914 565 -3077 3587
1974 3587 245 -2102 3858 -1452 -531 3434 -3629 1870 1622 -4104 2985 -233 -3210 2874 -968
1989 -968 -2109 2936 -2126 -226 2896 -3680 2245 1495 -3713 3644 -309 -2482 3107 -1390 -1133 2503
2005 2503 -2491 116 2157 -3928 2024 853 -3844 3459 -925 -2022 3025 -1737 -312 2497 -2136
2020 -2136 1055 2108 -3065 2558 1144 -3137 3433 -1027 -1576 2690 -2356 39 1631 -2511 793
2035 793 1117 -3050 2032 538 -2921 3140 -1012 -1075 2761 -2226 852 1358 -2182 1239 724 -2621
2051 -2621 1651 62 -2510 2489 -1366 -970 2341 -2295 1199 1331 -1839 2026 681 -1521 1989
2066 1989 126 -1759 2214 -1323 -929 1634 -2746 798 416 -2320 1567 -13 -1268 1698 185
2081 185 -709 2256 -626 -20 2144 -1919 1150 517 -2258 1147 -956 -1636 408 -1117 -1201 914 -1040
2098 -1040 -155 1768 -1246 1752 1184 -805 2359 148 -54 1328 -455 -380 542 -1135 -734 422 -2023
2115 -2023 226 -132 -1645 1341 -471 -21 1320 -266 585 874 -276 197 707 -1286 164 -226 -1644
2132 -1644 583 -1190 -646 380 -881 484 539 246 763 1322 192 1257 1129 -396 1226 -433 -593
2149 -593 217 -1541 -438 -1076 -1178 -685 -496 -717 94 531 -265 1438 398 682 1522 156 1156 299
2167 299 5 57 -432 -580 -853 -378 -1355 -227 -867 -671 415 -632 860 464 559 1038 658 865 228
2186 228 553 -266 112 -300 -761 -8 -1299 -267 -537 -524 292 -218 595 259 918 573 796 746 253 836
2206 836 -460 65 -573 -930 -461 -1312 -790 -1021 -701 -495 -295 91 -27 1095 431 1272 1240 748 1428 305
2226 305 555 272 -220 -298 -783 -528 -1076 -473 -1122 -463 -239 -545 738 -182 643 700 368 923 372 403 -26
2247 -26 178 -571 -387 -383 -1229 53 -1047 -418 51 -625 648 256 525 701 932 575 788 598 -200 912
2267 912 -720 -418 -21 -1586 -140 -926 -898 -113 -407 -287 533 366 139 1518 51 811 1433 -525
2285 -525 1065 -72 -665 279 -920 -803 -395 -919 -1048 103 -1155 -183 782 -1018 1282 422 -137 1683
2303 1683 -19 457 829 -296 -82 523 -1103 -212 362 -1729 758 -538 -931 1374 -884 247 1135
2320 1135 -434 517 1079 -542 487 731 -1485 890 -753 -1535 1095 -1762 -504 413 -1522 308
2336 308 561 -835 946 953 -802 1981 187 -523 2209 -1235 172 1031 -1743 570 48 -1523 557
2353 557 -360 -1519 1370 -878 -889 2204 -1437 559 1640 -1519 1355 415 -1097 1426 -320 -1126
2369 -1126 1414 -1192 -1094 1672 -2178 294 1077 -2074 1440 88 -1159 1743 -435 -602 1915 -819
2385 -819 -366 2050 -1931 585 1215 -2342 1731 -417 -1422 1842 -1183 -624 1805 -1261 -2 1830
2401 1830 -1848 787 1147 -2189 2071 -569 -1419 2180 -1604 -353 1561 -1743 -95 1221 -2111
2416 -2111 831 720 -2145 2161 -614 -1237 2504 -1675 141 1836 -1709 716 1125 -1764 1240 496
2432 496 -1975 2170 -862 -1267 2374 -2081 176 1535 -2095 831 717 -1758 1343 193 -1600 2270
2448 2270 -849 -914 2542 -2078 454 1363 -2264 1192 286 -1771 1403 -446 -1597 1963 -1199 -729
2464 -729 2246 -2052 873 1508 -1981 1933 246 -1243 1849 -617 -937 1813 -1307 -551 1877 -2352
2480 -2352 568 820 -2321 1693 -423 -1246 1901 -730 -477 1810 -1115 -78 1877 -2012 681 659
2496 659 -2263 1555 -632 -1385 1583 -1190 -438 1493 -1213 213 1654 -1333 1234 1060 -1568 2088
2512 2088 -384 -936 1736 -1334 -273 891 -1579 -36 605 -1763 681 295 -1635 1798 -516 -460
2528 -460 2002 -1040 621 1240 -1063 601 566 -1330 600 -27 -1617 1256 -1006 -895 1293 -1473
2544 -1473 480 903 -1021 913 676 -477 1074 419 -778 1333 -594 -649 1123 -1652 86 240
2560 240 -1421 604 -152 -793 618 114 -393 1297 -278 -12 1488 -930 603 439 -1137 649 -597
2577 -597 -796 276 -670 -708 397 -630 -276 1020 -840 786 819 -444 1344 162 95 889 -155 -32
2595 -32 274 -598 -559 268 -1099 -89 -46 -1002 596 -416 -17 571 -71 365 500 52 65 494 -558 65
2615 65 71 -885 319 -710 -501 80 -713 -21 4 -60 152 593 13 424 614 -124 846 -174 -106 371 -614
2636 -614 26 -281 -237 -303 -295 -381 -119 334 -412 439 -85 110 665 -68 512 55 -7 187 -59 -171 -342 -22
2658 -22 -547 -80 -273 -514 215 -514 426 218 104 424 84 450 145 370 -1 206 116 -341 317 -458 10
2679 10 -241 -364 111 -315 50 -81 90 -81 173 209 -115 390 -181 322 37 -369 281 -507 22 -298 -357
2700 -357 -158 -113 -77 -275 309 -156 241 270 -159 700 -89 207 194 -17 254 -126 -5 -255 98 -398 80
2721 80 38 -448 403 -258 14 217 -318 324 -59 133 23 192 -271 50 162 -371 358 -526 -103 196 -577
2742 -577 188 -97 -297 160 38 -100 157 207 -289 742 -317 107 669 -475 545 52 -312 312 -165
2761 -165 -247 211 -246 -559 324 -494 -191 439 -810 467 117 -438 709 -101 -53 526 -123 -179 638 -529
2781 -529 -52 569 -996 501 -158 -611 762 -547 -106 612 -339 70 699 -268 316 803 -687 875
2799 875 76 -739 899 -691 -268 412 -875 -122 261 -897 181 331 -931 816 153 -680 1344
2816 1344 -571 62 803 -733 427 280 -826 289 70 -1108 754 -349 -880 1194 -901 90
2832 90 1083 -857 990 606 -487 1042 460 -648 1061 -322 -810 1149 -1247 -250 571 -1573 472
2849 472 26 -1066 1017 -66 -557 1170 -233 -346 1492 -987 346 931 -1502 798 -281 -1243
2865 -1243 834 -678 -809 858 -725 -282 1250 -994 714 1148 -1066 1552 155 -705 1424 -598
2881 -598 -391 884 -1085 -377 655 -1516 131 425 -1757 1207 -90 -787 1576 -674 144 1340
2897 1340 -675 289 1027 -1174 441 419 -1772 1008 -659 -1338 1275 -1302 -92 992 -1088 580
2913 580 1054 -818 1126 856 -1017 1651 -281 -840 1426 -1468 -129 682 -1581 301 111 -1340
2929 -1340 644 110 -1027 1401 -296 -315 1731 -1041 585 1057 -1167 842 -17 -1295 607 -505
2945 -505 -1214 930 -875 -721 1214 -1251 462 1068 -993 1322 429 -553 1343 -23 -584 1108 -693
2962 -693 -674 946 -1565 43 470 -1733 849 -231 -808 1110 -279 -187 1250 -475 14 1214 -884
2979 -884 577 500 -1433 948 -569 -1023 736 -1059 -421 664 -866 44 927 -785 756 848 -704
2996 -704 1341 -17 -477 1035 -801 -128 454 -983 -176 218 -995 207 107 -977 1044 -366 -295
3013 -295 1308 -479 314 770 -475 466 359 -704 372 -76 -1029 557 -674 -696 729 -997 231
3030 231 466 -679 616 336 -234 700 352 -334 901 -259 -305 848 -934 119 119 -976 360 -227
3048 -227 -448 345 -2 -277 653 -219 23 978 -437 310 409 -686 508 -370 -338 70 -251 -397 185 -313
3068 -313 -435 497 -622 311 404 -330 711 53 83 560 -73 -15 177 -58 -337 337 -570 7 167 -648
3088 -648 483 -150 -188 318 -155 215 218 -44 -89 412 -135 16 150 -503 334 -330 -255 120 -342 3 3 -65
3110 -65 16 245 -14 66 355 -160 403 24 -98 424 -297 163 -72 -48 -94 20 -73 -32 285 -340 177 75
3132 75 -127 270 -98 156 1 -43 -10 -84 60 -150 199 -279 94 -5 -371 213 -291 127 -35 -146 145 -124
3154 -124 134 44 173 -92 112 206 -186 402 -252 158 23 -180 213 -200 67 -149 29 -57 -93 99 -224
3175 -224 270 -283 83 41 -258 319 -193 136 27 1 7 -122 113 -116 240 -237 81 40 -289 270 -269 11
3197 11 187 -83 157 -44 75 49 307 -102 115 304 -335 270 -224 -132 206 -387 223 -55 -126 -3 29 -49
3219 -49 81 176 -197 368 -209 -80 398 -352 172 -16 -212 39 -68 -221 33 -23 -431 382 -260 79 514
3240 514 -336 447 121 -120 351 -86 -77 164 52 -338 386 -377 -183 309 -674 429 -2 -361 492 -182
3260 -182 94 423 118 -66 424 -292 -75 409 -743 443 -202 -651 366 -549 -242 233 -415 44 423
3279 423 -296 144 649 -411 761 211 -414 703 -539 -50 185 -615 -22 53 -522 99 336 -631 657
3298 657 17 -435 897 -317 213 704 -515 328 247 -596 197 44 -881 329 -288 -766 756 -786
3316 -786 -45 653 -585 489 409 -306 565 180 -345 811 -110 -464 767 -880 -7 309 -1135 319
3334 319 25 -625 538 -112 -339 840 -102 -247 1051 -549 141 792 -930 599 -131 -676 482 -554
3352 -554 -505 519 -529 -325 775 -668 370 829 -790 994 204 -437 985 -472 -222 509 -648
3369 -648 -256 415 -1061 -48 355 -1147 750 -120 -654 1127 -435 124 926 -353 175 637 -612
3386 -612 255 226 -1037 543 -495 -898 610 -899 -86 535 -734 305 515 -328 631 445 -630 1103
3404 1103 -184 -460 977 -937 -44 454 -1071 257 37 -776 276 -1 -636 763 -151 -342 1229
3421 1229 -716 395 693 -838 523 22 -811 409 -257 -823 404 -529 -479 724 -855 273 534
3438 534 -675 1024 165 -219 800 -95 -149 638 -461 -363 537 -1041 -53 126 -1053 432 -288 -481
3456 -481 674 -178 -55 709 -167 -17 757 -461 286 482 -873 689 -376 -634 373 -625 -339 293
3474 293 -427 -102 490 -544 312 445 -433 831 -11 -259 677 -456 -52 201 -483 -195 90 -630 63
3493 63 163 -646 547 -53 -157 785 -203 327 441 -242 203 105 -396 25 -15 -690 293 -453 -464 353 -651
3514 -651 155 237 -320 387 151 -88 328 211 -233 543 45 -209 474 -488 -2 39 -566 219 -172 -227 165
3535 165 10 -203 408 8 -154 515 -290 83 150 -512 348 -220 -297 -23 -254 -202 190 -102 -148 233 -261
3556 -261 128 308 -294 510 2 37 221 -79 -64 36 -74 -143 230 -467 -78 19 -390 254 -91 -34 256 -118
3578 -118 112 68 183 89 283 -190 161 119 -391 143 -103 -201 179 -212 80 -89 -129 -106 46 36 -1 372 -273
3601 -273 220 11 14 158 -307 42 -114 -58 -10 -45 -166 -130 97 -190 108 105 -98 257 -197 249 -9 -33 99
3624 99 -230 57 -53 32 -60 158 -25 -333 163 -159 28 24 -90 131 -93 -20 46 224 -50 89 70 -294 169
3647 169 -240 51 86 -124 114 21 139 -101 -8 -81 20 50 -115 275 -202 95 149 -225 293 -136 162 89
3669 89 -22 18 -2 -8 -176 82 -264 -51 69 -305 99 -232 -54 144 -41 104 92 78 -33 204 -21 65 107
3692 107 -229 190 -140 -76 101 -236 163 -84 -137 -65 3 -62 109 95 -212 350 -114 -25 294 -132 224 -116
3714 -116 -179 64 -50 -89 5 3 -255 319 -171 46 290 -255 358 37 -85 275 -51 -73 58 88 -192 244
3736 244 -274 -285 137 -482 243 -39 -181 335 -63 42 239 13 -34 253 -172 -22 308 -380 295 65 -382
3757 -382 168 -345 -85 112 -208 70 145 -309 204 367 -354 399 197 -282 530 -294 -95 249 -311 -168
3777 -168 -5 -350 40 118 -379 420 58 -319 614 -224 110 371 -204 150 56 -290 149 -1 -561 212 -238
3798 -238 -544 528 -370 -108 306 -350 438 108 -123 432 134 -281 517 -111 -286 448 -498 -202 236 -758
3818 -758 210 -65 -337 274 -197 -212 424 26 -189 686 -319 213 509 -515 368 72 -411 296 -167 -198
3838 -198 271 -271 -185 364 -281 226 461 -560 533 130 -420 479 -194 -287 295 -331 -88 340 -513 -43
3858 -43 258 -709 378 -35 -378 687 -199 78 552 -220 140 377 -389 173 166 -487 238 -190 -501 487
3878 487 -595 1 289 -470 96 159 -311 258 271 -361 486 14 -327 478 -376 -26 327 -456 84 70 -354
3899 -354 186 26 -337 503 -120 -236 656 -418 131 353 -414 423 -16 -329 233 -100 -399 253 -214 -222
3919 -222 416 -451 40 354 -445 431 15 -252 400 -86 -147 372 -130 -225 339 -474 46 281 -494 336 -120
3940 -120 -335 394 -186 -126 290 -153 -34 448 -310 177 311 -546 374 -74 -202 273 -288 -128 125 -233
3960 -233 -72 273 -200 43 267 -346 342 -48 -146 449 -246 49 235 -116 141 162 -205 115 198 -261 301
3981 301 -54 -355 371 -302 83 260 -160 126 23 -92 -26 154 -336 259 -79 -222 342 -225 -3 110
4001 110 -288 197 26 -79 103 -58 -169 194 41 -96 388 -243 111 52 -172 161 62 -89 60 125 -135
4022 -135 65 26 -106 263 -179 83 183 -171 186 -60 -13 61 -25 -116 74 -7 -193 156 -130 41 175 -339
4044 -339 155 -156 -82 107 -15 -71 -69 92 -79 125 -83 32 159 -148 150 -72 -140 99 -127 58 -57 -53
4066 -53 -32 74 -120 -71 127 -247 119 -86 -61 72 -78 102 17 1 13 -18 79 -10 93 -153 22 -56 -45 201
4090 201 11 113 7 -145 36 -3 -3 54 101 -172 50 21 -5 113 -208 1 -125 -21 68 -10 73 55 199 -73
4114 -73 167 57 -90 180 -18 -8 -52 -104 9 -185 -18 -90 -17 -69 -79 67 -148 258 -123 57 159 17 230
4137 230 49 65 31 112 65 -83 21 -220 125 -146 -81 -21 -80 184 -161 118 103 51 77 -6 105 -242 6 -98
4161 -98 -97 -6 -265 57 -112 -127 95 -114 54 143 -19 51 114 28 78 159 -117 178 -208 -75 71 -194 -52 -103
4185 -103 -142 36 89 -72 -18 83 -169 193 -19 84 268 -79 235 31 -132 119 -33 -96 1 30 -241 202
4207 202 -145 -206 188 -227 121 154 -72 236 80 -38 -8 11 -70 25 -117 -127 156 -299 95 125 -252 184 -62
4230 -62 -80 249 39 2 244 1 21 219 -264 139 -31 -330 141 -284 -62 145 -78 2 178 -225 -15 311
4252 311 -257 142 106 -227 370 -122 -24 191 -125 40 68 -121 -46 180 -319 129 38 -260 275 -157 2 224
4274 224 -307 174 78 -194 83 49 -257 174 -28 -328 208 -314 44 212 -286 215 58 -188 209 45 -172
4295 -172 234 4 -198 253 -317 -73 268 -471 225 20 -207 44 18 -134 93 -15 -249 336 -255 55
4315 55 325 -433 261 -13 -307 201 -86 -112 161 -63 -186 220 -218 -87 199 -350 292 -79 -237 362 -183
4336 -183 -53 200 -194 -132 175 -229 89 303 -347 203 -18 -212 352 -182 -15 227 -169 -14 126 -193
4356 -193 33 159 -280 314 -49 -328 317 -344 -58 281 -280 190 91 -120 86 169 -318 264 47 -257 336
4377 336 -313 52 213 -413 123 92 -187 133 98 -269 225 -32 -204 252 -356 13 223 -200 161 77 -137
4398 -137 83 8 -110 169 -103 -190 215 -245 -139 167 -369 240 -37 -141 121 -96 -123 69 3 -87 257 -71
4420 -71 114 297 -222 294 -73 -35 311 -89 -77 -69 -206 -62 170 -210 129 182 -329 216 -24 -155 282 -16
4442 -16 63 153 -147 -2 93 -113 109 146 -251 194 35 -267 186 -231 56 116 -151 12 189 -152 -12 84
4464 84 -273 106 -66 -122 165 -192 61 60 -145 -68 73 -20 16 83 -115 75 22 -23 296 -206 15 126 -250
4487 -250 22 -1 -122 -79 86 -203 120 -92 -130 246 -121 -16 86 -92 122 -18 20 38 29 4 51 57 -82 177
4511 177 -148 -66 123 -110 99 -20 3 97 34 -20 92 96 -112 142 -51 -42 19 -247 9 -32 -127 -34 -98 12 79
4536 79 103 6 143 -78 8 176 -61 109 10 57 9 -171 38 -100 -5 -215 11 11 -200 -4 -125 101 -13
4559 -13 29 196 -32 150 -48 28 19 -42 7 -131 147 -162 93 -138 -277 53 -126 36 78 53 78 24 57 6
4583 6 98 -130 123 79 -116 155 -175 -43 -22 -79 107 135 160 43 122 60 160 42 -79 38 -111 -26 125 -77
4607 -77 -57 -124 -30 -91 -74 -138 -127 -56 -85 191 -145 81 144 0 122 25 11 -1 32 -28 58 -44 -92 -8 -160 -19
4633 -19 55 -113 77 -24 -25 96 -31 99 33 -100 -103 54 -44 -78 87 -177 25 -102 -121 137 -72 62 -31 104
4657 104 -25 119 -18 169 120 -8 130 -174 -91 74 -250 -123 -15 -24 80 25 -37 -11 87 -77 174 52 123
4680 123 301 -101 97 57 -31 91 52 -136 -35 -55 -180 93 -120 -95 156 -164 85 79 -183 18 -55 -25 76
4703 76 -44 -53 114 -68 28 137 -219 85 138 -98 161 -34 -66 165 35 34 155 120 -93 229 -228 70 23
4726 23 -252 107 -40 -201 1 -190 -74 104 -113 -48 141 -129 173 221 -101 205 -81 -15 144 -44 -24 81
4748 81 -23 -30 53 -95 101 80 -194 182 -70 -5 -22 -79 31 95 -62 -99 -14 -165 -19 21 -152 165 -109 -24
4772 -24 191 -168 116 135 -72 124 104 -103 115 105 -101 165 -164 71 157 -118 90 -52 -213 107 -57 -48
4794 -48 124 96 -55 166 -71 21 142 -224 170 7 -84 112 -150 -81 143 -126 -132 -35 -78 -41 141 -274 181
4817 181 179 -201 332 -125 -140 149 -67 -48 58 -89 47 87 -188 199 -104 -283 220 -67 -43 196 -54 69
4839 69 145 -16 53 217 -150 -22 14 -131 147 -183 -49 151 -72 13 0 -63 12 145 -220 139 71 -163 249
4862 249 -156 -100 194 -94 46 93 -100 35 44 -169 7 -5 -179 279 -63 -156 84 -207 45 -21 -111 125 67
4885 67 -5 68 51 -171 180 -120 -39 70 -203 229 128 -195 78 -11 -132 80 -20 -146 100 36 -19 137 -65
4908 -65 245 -59 -183 164 -23 -77 117 12 -94 138 -165 -3 132 -298 81 -15 57 162 -47 -9 248 77
4930 77 -84 63 -4 -3 123 -66 17 -51 -213 82 -91 96 77 -145 3 103 -62 24 104 -51 21 -57 -99 149
4954 149 -152 1 0 71 74 -49 -40 45 142 -145 138 96 168 230 -82 82 94 -80 69 -105 -93 -123 12 -58 -22 66
4980 66 -162 71 -180 44 44 9 135 61 33 149 129 -2 -19 0 -115 -40 35 -8 48 -20 99 -54 -6 2 15 39
5006 39 -108 81 -33 -45 26 -29 -85 -97 25 -49 -90 25 -127 29 162 -15 69 15 60 45 109 3 116 12
5030 12 -147 51 -117 -114 -74 -93 -81 -139 -12 -69 151 -142 14 -4 -67 82 28 94 43 106 158 41 41 4 192 -11
5056 -11 -25 56 -225 102 -62 -60 -8 -78 -38 159 -81 -115 -77 -123 -134 48 -79 178 -141 -61 -18 -15 70 45 154 25
5082 25 2 17 106 197 -33 104 -68 -4 31 -90 6 -85 -83 -66 -8 -75 -86 -34 -60 151 -36 63 142 -118 179 -44
5108 -44 143 16 113 -77 -82 1 -81 120 -50 -21 49 -98 119 -54 77 101 -99 17 -29 22 35 -14 11 82 141
5133 141 -43 156 44 -49 85 -108 -62 7 77 -32 72 -37 28 184 -133 49 72 -73 102 -215 5 -126
5155 -126 -70 -119 7 9 1 203 -82 98 -22 55 209 -25 246 125 -68 31 -71 34 -74 -69 -121 -22 21 -90
5179 -90 48 -85 -36 18 -101 56 14 -103 -28 -42 -74 166 101 -197 141 -75 -5 141 -152 146 -84 -59 105
5202 105 -64 -57 89 -38 -81 31 -165 -19 29 -132 125 -11 -55 -40 -109 -89 76 -27 -155 -26 -173 38 169
5225 169 -140 184 -66 0 146 -62 37 -53 -106 17 130 -7 -74 47 -86 197 14 21 114 -81 80 78 20 42
5249 42 47 11 146 36 -111 119 -87 -79 176 -215 143 32 -12 183 100 -1 13 61 -116 125 -89 -9 228 -177
5273 -177 92 72 -172 40 -31 -8 -11 88 -166 105 32 -54 184 -77 155 -38 -200 25 -30 -8 -9 -71 -109 229 36
5298 36 -31 48 -8 105 53 -100 114 34 -25 135 -44 -8 -6 -49 19 174 -172 187 20 -135 26 -101 23 31 -129
5323 -129 52 66 -92 68 50 -152 36 170 -4 131 -74 -43 124 -87 12 70 110 49 138 -154 76 -60 -126
5346 -126 95 -126 -5 78 -49 87 94 -17 -17 128 -36 -58 139 -91 84 -97 -72 121 -97 10 -10 -62 48
5369 48 34 -4 -2 -4 -80 59 46 35 106 -163 109 -20 31 -37 -69 34 48 87 -49 83 -6 6 138 -133 102 31
5395 31 -26 -6 -215 56 43 135 -95 1 -70 -98 43 -173 83 113 38 93 -21 89 68 68 -31 183 54 83 17 -60
5421 -60 104 16 -171 65 -48 -28 46 -92 3 -89 -109 -153 67 -111 89 60 -135 116 -9 -43 49 -56 71 24
5445 24 87 17 94 12 88 87 -5 150 -82 53 27 -7 -23 -40 41 -37 -37 22 55 -53 -13 100 -87 -11 35 -26 34 69
5473 69 9 46 28 52 15 211 -68 66 -11 -36 37 -144 -20 -42 30 30 32 -6 -21 101 -90 85 -44 -56 -77 -87 -28
5500 -28 48 -16 -21 -11 99 10 67 8 149 -62 15 124 -30 54 -90 -81 86 -32 20 95 27 -108 -70 0 -53 155
5526 155 -53 59 -14 -43 113 58 100 -45 19 33 -6 -32 -2 129 -48 -126 -9 -46 48 -180 61 -11 43 -13 -94
5551 -94 48 -69 66 -4 5 87 2 102 -114 18 -20 8 26 -9 53 -64 49 10 87 125 -54 130 -47 -107 15
5576 15 12 -29 -64 -20 92 16 -70 -20 56 -73 64 71 31 34 -90 44 18 94 -37 40 66 26 53 33 4 16 9 138 -90
5605 -90 67 -51 -25 55 -74 0 89 100 -10 76 59 54 7 -28 102 -61 -117 28 18 32 85 71 97 -29 90 -32
5631 -32 144 -76 -29 14 -83 9 46 16 39 -139 7 25 -51 2 78 -155 128 23 -175 76 -57 -44 7 -20 -3
5656 -3 77 -69 -41 98 -110 -41 -97 -85 78 -67 -66 50 -39 -41 34 -2 63 76 -73 9 50 83 98 -38 35 15 58 86
5684 86 -102 -75 -48 9 -40 -57 2 -78 -6 -28 -32 132 -92 -3 43 -26 69 19 -60 -35 27 -33 160 13 -42 -28 -65 73
5712 73 89 -34 85 -44 45 10 60 -37 -46 24 -24 59 -105 -21 51 -65 -21 19 39 -13 -56 -1 17 -115 6 64 35
5739 35 115 -18 -154 231 -156 -29 -127 -66 45 -5 -60 -71 47 -103 236 -27 -94 140 98 -16 -12 -15 48 -73 4
5764 4 145 143 -33 -64 -89 -76 46 -100 174 92 -8 29 -3 -8 8 22 -71 10 31 -123 32 -63 26 5 -63 73 -8
5791 -8 -62 81 29 -54 49 0 -98 111 -130 -68 55 -20 97 -79 60 -48 -33 -29 101 14 44 27 -21 -68 -28 -85
5817 -85 72 -50 100 -99 13 -8 -12 9 -83 58 -119 -87 50 -99 128 -143 -7 124 -86 25 6 -4 82
5840 82 90 28 79 71 -51 -1 104 -11 69 -58 -1 -26 -159 99 16 -35 12 40 -15 70 4 -94 72 -117 47 69 -11
5867 -11 16 91 5 4 8 27 150 -125 -48 31 14 1 72 -98 113 73 -179 8 127 -114 12 118 -67 145 -10
5892 -10 26 -22 -32 126 -21 -106 52 38 20 -76 9 -47 23 -167 -117 117 -89 -55 30 16 -89 37 -27 -99 -18 -20 18
5919 18 -136 44 49 -22 62 -127 109 48 23 114 30 30 38 -25 -92 67 78 -47 168 114 -28 110 -46 -67 -88 -1 -108
5946 -108 -155 -21 32 88 -42 73 38 -45 37 14 54 -14 46 111 -40 111 -70 101 -29 41 -144 4 44 -129
5970 -129 34 -110 33 -78 -55 -6 -1 90 45 68 40 -143 157 10 72 -19 -52 66 -66 -56 -122 149 12 103 43
5995 43 -3 58 0 55 54 -43 -60 -21 -45 -37 26 -114 -13 98 -121 109 -30 71 -42 -131 -14 66 1 118 7 23
6021 23 16 81 -4 2 -35 -101 65 69 -29 -40 -79 -11 -60 11 76 32 28 17 106 -25 128 -37 -18 -19 6 43 8 12 49 9 -32
6052 -32 -57 -14 18 4 -43 44 -99 -120 128 -79 -44 -64 18 -54 29 -15 20 111 -49 -6 -87 -164 43 -75 -40 13 -27
6079 -27 -16 82 -2 -36 -8 9 -41 109 -99 76 4 55 102 6 13 -134 175 -61 107 40 134 15 -23 101 4 -78
6105 -78 -126 -90 -50 -42 16 -19 77 -29 33 -1 -32 92 -64 -4 47 -63 31 -50 107 -23 -48 -7 -37 144 57 52 92 49
6133 49 -18 -165 33 -95 45 -13 88 167 -10 91 0 16 -39 27 44 -120 35 -20 -116 34 -111 33 -43 61
6157 61 10 22 -55 -22 75 -59 32 -4 -13 33 -39 -81 -15 23 77 -52 41 33 -59 24 72 -17 76 16 32 118 36 41 101 141 -7
6188 -7 16 64 -65 55 11 -80 6 -49 -10 15 -28 44 -11 102 -59 41 -57 20 -83 124 -13 -37 72 -3 46 -37
6214 -37 86 10 -99 19 -61 -3 -90 -158 9 11 49 13 -7 129 -94 -61 24 -117 -15 -10 -7 -26 62 -39 77 -18 -39
6241 -39 45 -43 -1 84 -137 1 -59 -107 68 4 -50 -78 9 28 20 -113 1 59 -41 86 -23 -23 -45 9 -33 -19 -5
6268 -5 60 33 -79 -18 -3 -27 18 41 25 9 -59 -63 -38 -59 23 37 -59 60 39 -26 66 -45 -90 61 61 50 4 1 -2 36 0
6299 0 -17 106 -94 63 0 14 -44 -45 -39 -48 -14 19 72 73 -53 -114 -133 -20 -47 43 50 -67 -18 -5 22 12 6 83 -109 73
6329 73 -36 24 93 8 24 -125 -32 52 25 28 139 4 -35 95 -3 5 5 -9 -19 35 103 -110 -72 -49 17 7 43 29 -34
6358 -34 37 129 15 105 -35 -73 -59 30 66 -9 86 -19 97 89 -32 55 -96 -55 82 -142 47 -56 24 -90 33
6383 33 21 39 50 -65 55 -98 87 21 -89 22 -73 -31 20 -10 -19 -122 -55 -63 75 -104 7 -73 14 67 -161 119
6409 119 10 33 45 7 61 -134 28 -6 166 -116 -71 141 -57 36 -14 67 10 -119 -66 54 37 39 61 -9 -26 -43
6435 -43 -57 -92 -47 -49 43 26 9 -29 21 -20 -24 -64 -3 59 102 -59 17 -57 56 -169 -99 84 83 -17 -7 52 -59 3 14
6464 14 -38 -64 -74 87 -41 -64 141 98 6 -8 39 -16 -49 -5 -134 4 34 43 -67 52 -14 -72 63 -12 1 -50 53
6491 53 -91 -78 -1 -42 -64 32 -6 6 -62 71 -52 42 0 50 -71 32 153 -23 50 -57 -67 176 -62 22 -91
6516 -91 51 -32 42 53 -75 105 16 -18 -2 -11 38 63 80 -20 91 -11 31 -12 -51 -99 -103 -12 -8 67 84 14 -44 -11 -8
6545 -8 -4 -53 35 -3 79 -43 -24 61 -4 79 27 -2 -20 18 6 -17 10 65 -52 60 98 44 -58 7 32 -86 15 13 28
6574 28 -18 -43 -46 -4 44 44 -53 -80 19 -161 77 -6 -83 -125 -74 10 14 -47 4 -29 36 -149 -37 -36 -9 19 -60 97 -79
6603 -79 43 63 54 107 -21 -13 7 69 66 -20 70 -136 108 38 19 -32 -90 -66 -166 89 75 112 -25 -26 -50 -60 35 9 8
6632 8 -31 32 14 58 84 136 -49 -16 -2 108 -12 -10 -35 -21 30 -28 -126 24 -66 111 -9 -7 81 -6 7 20 67 -20 6
6661 6 -79 96 96 49 46 -174 67 -22 48 125 -31 62 -90 105 -14 41 -114 60 32 -53 -32 -13 23 39 -32 40 12
6688 12 31 51 27 141 -23 117 -30 15 51 -23 111 -69 -10 -46 -103 -53 10 -45 84 -19 -67 -1 21 -59 77 -125
6714 -125 -29 51 -1 -79 -7 92 19 8 -14 74 -43 -165 4 16 -49 114 9 58 54 -71 -87 -48 -187 5 -29 -39
6740 -39 -42 -5 65 -75 -5 -4 -56 89 -117 36 -11 76 51 -74 -63 80 48 -28 68 29 -16 0 61 -13 39 5 -29 -125
6768 -125 12 -23 -101 -30 -88 183 -10 -62 -7 -9 -43 12 -26 17 134 -101 -16 3 -107 24 79 -8 18 65 43 -103
6794 -103 -35 -83 12 1 -38 157 12 -12 32 -82 -17 23 -33 42 -6 74 62 35 2 96 -18 -6 -46 -1 52 -64 -52
6821 -52 -31 71 -46 -32 -20 -40 -82 9 -77 8 22 -53 62 -18 -35 14 77 11 13 -19 5 27 75 24 -24 64 -47 3 -27
6850 -27 31 68 -34 -9 -10 50 -64 28 110 -92 40 -59 -106 -9 -73 51 -103 -27 -8 12 -82 119 63 -88 -6 -10 -55
6877 -55 101 -106 44 43 -50 -38 -107 51 -5 -77 -147 -19 43 38 -105 -27 -7 5 -34 -76 -133 -4 -14 -77 -39 56 79 9
6905 9 4 -24 -38 -36 -35 20 -29 87 -82 -79 -90 -78 63 -19 64 -78 -45 -50 -34 -78 94 3 -33 41 40 -86 15 84 74 -20
6935 -20 19 -7 -11 -14 -85 82 -123 -105 55 7 55 39 50 48 46 124 -22 -32 -27 28 0 129 -47 -136 -40 -47 14 -19 -67 42
6965 42 55 92 -26 -15 -15 -57 43 73 -43 6 55 -12 -28 70 -56 14 -50 25 -37 22 77 15 -94 73 40 -9 -43 25
6993 25 -31 50 -36 -89 134 -56 -14 -61 -55 -10 83 159 -40 33 61 91 112 33 55 -27 -114 -39 -63 68 -37 84 -50
7020 -50 -25 9 56 9 -27 84 41 13 82 1 46 -63 3 -34 6 39 -43 -32 -54 22 -2 81 41 77 -17 -12 54 109 -49
7049 -49 -57 -46 -63 -67 120 25 -75 -11 -72 24 -39 -4 -7 102 18 -4 96 -37 -15 29 -94 43 -11 -68 -8 -2 -97 -27 -40
7078 -40 -11 -15 39 85 15 34 65 -1 -14 -1 -40 -21 -58 -21 71 -33 -6 -50 -55 17 -61 -50 52 -158 25 48 -106 20
7106 20 30 -31 -75 53 97 89 9 -62 -51 -7 12 -44 4 48 119 90 -33 -32 95 -65 -3 -83 -50 39 4 10 -4 35 -11 59
7136 59 -17 37 37 173 -35 39 26 89 45 -77 -47 -28 25 -184 -58 -6 -28 -37 9 35 -56 -27 73 -8 -47 42 -29 49
7164 49 67 -27 12 24 33 57 39 -105 -81 -15 83 -49 -28 36 20 -44 -38 8 -66 -47 9 -22 -16 94 -27 6 76 55 26 -12
7194 -12 -77 95 -5 -7 11 -42 33 27 60 -36 0 -109 61 -69 7 93 -54 49 -24 -27 -7 100 22 13 5 -81 48 10
7222 10 47 -48 -27 -45 -67 90 89 -82 50 -106 -47 -13 38 -45 -64 109 -10 48 -26 -14 7 -71 -64 -28 83 -61 -73
7249 -73 -41 45 13 -84 71 -27 -32 -100 22 -19 44 100 -4 52 14 -30 -38 60 -55 65 -80 52 -22 -99 62 5 22
7276 22 61 43 5 -38 -72 2 -62 -65 25 123 151 -35 -49 -57 -3 -58 -12 -88 -41 34 70 -56 83 -47 -61 30 26 -32 25 -117
7306 -117 63 -40 -66 38 1 -9 50 -64 11 90 45 9 4 112 -46 -3 76 -117 43 -85 14 28 -13 4 -61 -57
7332 -57 -20 -69 -29 -120 41 -54 -4 83 95 76 -71 -80 16 45 -18 -40 52 27 -62 -52 -111 121 -50 121 -77 -35 -67 -48
7360 -48 -6 -11 -54 34 -48 90 -59 -74 -24 -130 -18 13 -23 18 36 -51 -126 27 -22 -53 7 35 -18 -54 120 15 -48
7387 -48 -82 30 8 34 92 -98 -102 -15 101 44 95 6 -9 64 -49 32 77 -15 -100 -10 7 -31 39 -35 -51 72 -53 -22
7415 -22 12 60 -5 -55 -40 46 59 -82 -99 0 -57 -104 27 32 70 -74 -69 30 42 47 -30 -20 116 11 -17 -29 108 -26
7443 -26 39 94 52 32 -64 -26 -7 -41 -12 -69 8 56 -36 18 37 5 -38 157 29 -107 -38 -52 -48 -19 45 -50 79 104 64
7472 64 -20 -117 23 -23 -81 62 -3 -23 49 57 87 -27 18 -1 2 66 -34 62 -55 -42 56 79 45 8 -48 -48 -73 42 -22
7501 -22 19 -57 54 83 38 46 23 29 51 32 -40 87 69 48 -25 -23 47 -47 59 -68 -6 93 46 50 19 13 -56 -46 53 -125
7531 -125 -25 29 58 84 -25 19 -29 -46 -51 0 -71 -110 40 58 -6 66 13 54 -9 43 -25 -7 -10 -65 -68 -33 75 65 -16
7560 -16 -37 -22 -24 89 18 35 -53 9 -66 -29 -32 90 -70 -8 32 -33 -9 47 78 74 -8 -126 -14 -49 33 71 12 -24 49
7589 49 36 -2 30 15 -8 17 6 45 38 -57 21 82 -127 21 20 22 77 -27 -15 98 -91 32 -1 -20 24 53 -41 60
7617 60 -20 -88 58 -76 -25 -17 -96 -65 -12 13 91 -62 49 52 -20 -17 119 -112 -54 -10 -92 54 33 51 -71 139 -78
7644 -78 -52 29 14 -9 -47 20 -86 84 1 99 -34 -40 -21 -118 107 34 -33 -25 22 3 20 -51 -51 -43 54 61 27 25 -14 -103 -65
7675 -65 -20 -121 -53 -34 -5 -49 -82 31 -40 -9 25 -37 42 86 135 -14 -46 21 43 -27 23 1 -16 -70 2 -2 -45 -51 39 -8
7705 -8 16 56 -45 20 -21 -15 -54 16 56 15 27 12 -41 63 -89 181 -74 9 -78 -27 47 -8 32 -154 34 -37 -4 6
7733 6 33 -1 13 -46 -109 -90 17 -97 -38 -39 2 -24 -4 65 27 -72 -66 -68 88 -5 8 21 69 -73 7 8 15 43 -14 54 55 104
7765 104 33 48 38 87 -38 -38 41 13 54 -102 9 13 -15 26 -23 2 71 -77 48 33 8 -6 62 -7 -62 62 -18 28
7793 28 -44 26 -41 52 0 5 89 51 -60 -46 40 16 79 198 89 -78 -118 -64 92 0 -88 -14 -63 44 31 136 -8
7820 -8 56 -41 -71 -51 -8 105 -34 -22 51 8 -20 -33 -79 -51 -38 -75 90 -28 -1 18 -41 -62 17 -72 42 99 -32 -59
7848 -59 -13 -4 -101 32 -34 64 13 -26 67 137 -15 70 -35 -3 -32 57 -75 24 -46 -160 31 -39 -10 -96 50 -10 -95
7875 -95 -59 -3 72 -7 -100 -36 -69 7 -37 -34 52 51 53 61 46 36 -12 19 -1 31 27 58 -97 34 -82 -38 19 -143 -90 -72 -4
7906 -4 8 128 2 5 6 -49 63 73 -7 43 14 0 -75 -11 12 28 47 16 -7 11 24 0 2 38 -62 -29 39 165 -10
7935 -10 49 53 16 36 -63 -123 28 -98 -89 -4 -79 -68 23 -9 -32 4 8 33 2 8 12 -34 17 88 -27 -17 56 6 7 42 114 -56
7967 -56 -50 -23 -45 12 76 156 -22 75 -5 30 40 7 111 -1 43 75 -10 83 66 17 -66 -9 59 -24 -62 -67 -22 74 95 -21
7997 -21 -69 4 12 22 36 2 0 -60 -30 -19 37 -49 20 -57 -49 9 11 -9 -28 2 31 -6 -40 44 -25 -20 39 -50 17 59 -48 24
8029 24 -51 -77 -45 53 -58 -5 -77 -20 -30 -46 28 7 64 -45 52 -25 -33 73 -51 -39 102 21 49 42 17 -24 -60 18 9
8058 9 -25 68 -65 11 51 -40 27 -65 69 31 74 -18 -21 45 10 -13 -47 19 -68 -30 -4 -145 11 -5 50 45 15 -51 0 -17
8088 -17 20 -38 -107 -69 55 137 -46 -31 56 -13 100 2 -18 54 16 -40 30 51 8 -37 28 -4 18 67 -81 102 -4
8115 -4 17 -47 35 -21 10 -23 -50 -56 86 -73 41 -39 -34 6 59 14 -24 77 -27 73 -27 73 24 49 77 35 -14 -20
8143 -20 -14 -15 -16 -19 -38 -44 83 12 -84 109 -106 40 5 57 -21 19 47 84 -41 9 -23 -13 30 -50 50 13 59 -98 66
8172 66 80 -71 47 45 -58 3 124 45 -28 62 32 -5 -17 60 -28 -64 -109 -51 109
8191A09
##END NTUPLES=NMR FID
##END=
