##TITLE=1H_24-2025
 200.13MHz, CDCl3,
 8 sc
 
 5.2.2025
##JCAMPDX= 6.0         $$ Bruker NMR JCAMP-DX V2.0
##DATA TYPE= NMR FID
##DATA CLASS= NTUPLES
##ORIGIN= UXNMR, Bruker Analytische Messtechnik GmbH
##OWNER= pz
$$ XWIN-NMR		Version 3.5
$$ Wed Feb  5 15:54:31 2025 Russian Standard Time (UT+4h)  she@DPX200
##.OBSERVE FREQUENCY= 200.1313
##.OBSERVE NUCLEUS= ^1H
##.DELAY= (6, 6)
##.ACQUISITION MODE= SIMULTANEOUS
##.ACQUISITION SCHEME= undefined
##.AVERAGES= 8
##.DIGITISER RES= 18
##SPECTROMETER/DATA SYSTEM= spect
##.PULSE SEQUENCE= zg30
##.SOLVENT NAME= D2O
##.SHIFT REFERENCE= (INTERNAL, D2O, 0, 14.3821)
##AUDIT TRAIL= $$ (NUMBER, WHEN, WHO, WHERE, WHAT)
$$ ##TITLE= Audit trail, XWIN-NMR		Version 3.5
$$ ##JCAMPDX= 5.01
$$ ##ORIGIN= Bruker BioSpin GmbH
$$ ##OWNER= she
$$ F:/spectra/data/she/nmr/H-C/1/audita.txt
$$ ##AUDIT TRAIL=  $$ (NUMBER, WHEN, WHO, WHERE, WHAT)
(   1,<2025-02-05 15:53:03.81 +0400>,<she>,<DPX200>,
      <created by zg, POWCHK disabled, PULCHK disabled
       configuration hash MD5:
       00 E9 B6 7A A2 85 ED C7 34 08 36 98 17 FE 4E 26
       data hash MD5: 16K
       28 F5 53 97 86 3F A8 39 CB 90 48 4E 57 FB 55 BD>)
$$ ##END=
$$ 
$$ hash MD5
$$ 59 0F 99 60 B1 DC 16 F3 2C 23 42 6B 89 BB 2D C2
##$RELAX= 
##$RELAX= 
##$RELAX= 
##$RELAX= 
##$RELAX= 
##$RELAX= 
$$ Bruker specific parameters
$$ --------------------------
##$DU= <F:/spectra>
##$EXPNO= 1
##$NAME= <H-C>
##$PROCNO= 1
##$TYPE= <nmr>
##$USER= <she>
##$AMP= (0..31)
100 100 100 100 100 100 100 100 100 100 100 100 100 100 100 100 100 100 
100 100 100 100 100 100 100 100 100 100 100 100 100 100 
##$AQSEQ= 0
##$AQ_mod= 1
##$AUNM= <au_zg>
##$AUTOPOS= <>
##$BF1= 200.13
##$BF2= 200.13
##$BF3= 200.13
##$BF4= 200.13
##$BF5= 200.13
##$BF6= 200.13
##$BF7= 200.13
##$BF8= 200.13
##$BYTORDA= 1
##$CFDGTYP= 0
##$CFRGTYP= 5
##$CHEMSTR= <none>
##$CNST= (0..31)
1 1 145 1 1 1 1 1 1 1 1 1 1 1 1 1 1 1 1 1 1 1 1 1 1 1 1 1 1 1 1 1 
##$CPDPRG= <>
##$CPDPRG1= <>
##$CPDPRG2= <>
##$CPDPRG3= <>
##$CPDPRG4= <mlev>
##$CPDPRG5= <mlev>
##$CPDPRG6= <mlev>
##$CPDPRG7= <mlev>
##$CPDPRG8= <mlev>
##$CPDPRGB= <>
##$CPDPRGT= <>
##$D= (0..31)
0 0.7 0 0 0 0 0 0 0 0 0 0.03 0 0 0 0 0 0 0 0 0 0 0 0 0 0 0 0 0 0 0 0 
##$DATE= 1738756383
##$DBL= (0..7)
120 120 120 120 120 120 120 120 
##$DBP= (0..7)
150 150 150 150 150 150 150 150 
##$DBP07= 0
##$DBPNAM0= <>
##$DBPNAM1= <>
##$DBPNAM2= <>
##$DBPNAM3= <>
##$DBPNAM4= <>
##$DBPNAM5= <>
##$DBPNAM6= <>
##$DBPNAM7= <>
##$DBPOAL= (0..7)
0.5 0.5 0.5 0.5 0.5 0.5 0.5 0.5 
##$DBPOFFS= (0..7)
0 0 0 0 0 0 0 0 
##$DE= 6
##$DECBNUC= <off>
##$DECIM= 32
##$DECNUC= <off>
##$DECSTAT= 4
##$DIGMOD= 1
##$DIGTYP= 9
##$DL= (0..7)
0 120 120 120 120 120 120 120 
##$DP= (0..7)
150 150 150 150 150 150 150 150 
##$DP07= 0
##$DPNAME0= <>
##$DPNAME1= <>
##$DPNAME2= <>
##$DPNAME3= <>
##$DPNAME4= <>
##$DPNAME5= <>
##$DPNAME6= <>
##$DPNAME7= <>
##$DPOAL= (0..7)
0.5 0.5 0.5 0.5 0.5 0.5 0.5 0.5 
##$DPOFFS= (0..7)
0 0 0 0 0 0 0 0 
##$DQDMODE= 0
##$DR= 18
##$DS= 0
##$DSLIST= <SSSSSSSSSSSSSSS>
##$DSPFIRM= 0
$$ [...]
##$SUBNAM0= <"">
##$SUBNAM1= <"">
##$SUBNAM2= <"">
##$SUBNAM3= <"">
##$SUBNAM4= <"">
##$SUBNAM5= <"">
##$SUBNAM6= <"">
##$SUBNAM7= <"">
##$SUBNAM8= <"">
##$SUBNAM9= <"">
##$SW= 18.0517328524113
##$SWIBOX= (0..15)
0 0 2 0 0 0 0 0 0 0 0 0 0 0 0 0 
##$SW_h= 3612.71676300578
##$TD= 16384
##$TD0= 1
##$TE= 0
##$TE2= 300
##$TE3= 300
##$TEG= 300
##$TL= (0..7)
0 120 120 120 120 120 120 120 
##$TP= (0..7)
150 150 150 150 150 150 150 150 
##$TP07= 0
##$TPNAME0= <>
##$TPNAME1= <>
##$TPNAME2= <>
##$TPNAME3= <>
##$TPNAME4= <>
##$TPNAME5= <>
##$TPNAME6= <>
##$TPNAME7= <>
##$TPOAL= (0..7)
0.5 0.5 0.5 0.5 0.5 0.5 0.5 0.5 
##$TPOFFS= (0..7)
0 0 0 0 0 0 0 0 
##$TUNHIN= 0
##$TUNHOUT= 0
##$TUNXOUT= 0
##$USERA1= <user>
##$USERA2= <user>
##$USERA3= <user>
##$USERA4= <user>
##$USERA5= <user>
##$V9= 5
##$VALIST= <valist>
##$VCLIST= <CCCCCCCCCCCCCCC>
##$VD= 0
##$VDLIST= <DDDDDDDDDDDDDDD>
##$VPLIST= <PPPPPPPPPPPPPPP>
##$VTLIST= <TTTTTTTTTTTTTTT>
##$WBST= 1024
##$WBSW= 4
##$XGAIN= (0..3)
0 0 0 0 
##$XL= 0
##$YL= 0
##$YMAX_a= 649233
##$YMIN_a= -696022
##$ZGOPTNS= <>
##$ZL1= 120
##$ZL2= 120
##$ZL3= 120
##$ZL4= 120
##$ABSF1= 10
##$ABSF2= 0
##$ABSG= 5
##$ABSL= 3
##$ALPHA= 0
##$AQORDER= 0
##$ASSFAC= 0
##$ASSFACI= 0
##$ASSFACX= 0
##$ASSWID= 0
##$AUNMP= <proc_1d>
##$AZFE= 0.1
##$AZFW= 0.1
##$BCFW= 1
##$BC_mod= 2
##$BYTORDP= 1
##$COROFFS= 0
##$CY= -3
##$DATMOD= 1
##$DC= 2
##$DFILT= <>
##$DTYPP= 0
##$F1P= 0
##$F2P= 0
##$FCOR= 0.5
##$FTSIZE= 0
##$FT_mod= 4
##$GAMMA= 1
##$GB= 0.15
##$INTBC= 1
##$INTSCL= 1
##$ISEN= 128
##$LB= 0.25
##$LEV0= 0
##$LPBIN= 0
##$MAXI= 10000
##$MC2= 0
##$MEAN= 0
##$ME_mod= 0
##$MI= 1.114404
##$NCOEF= 0
##$NC_proc= 0
##$NLEV= 6
##$NOISF1= 3.799351
##$NOISF2= 2.8
##$NSP= 1
##$NTH_PI= 0
##$NZP= 0
##$OFFSET= 14.38212
##$PC= 1
##$PHC0= -104.4866
##$PHC1= 9.592221
##$PH_mod= 1
##$PKNL= yes
##$PPARMOD= 0
##$PSCAL= 0
##$PSIGN= 0
##$REVERSE= no
##$SF= 200.129724274929
##$SI= 16384
##$SIGF1= 3
##$SIGF2= 2
##$SINO= 400
##$SIOLD= 16384
##$SREGLST= <1H.CDCl3>
##$SSB= 0
##$STSI= 0
##$STSR= 0
##$SW_p= 3205.1282051282
##$SYMM= 0
##$S_DEV= 0
##$TDeff= 0
##$TDoff= 0
##$TI= <>
##$TILT= no
##$TM1= 0
##$TM2= 0
##$TOPLEV= 0
##$USERP1= <user>
##$USERP2= <user>
##$USERP3= <user>
##$USERP4= <user>
##$USERP5= <user>
##$WDW= 1
##$XDIM= 8192
##$YMAX_p= 0
##$YMIN_p= 0
$$ End of Bruker specific parameters
$$ ---------------------------------
##NTUPLES= NMR FID
##VAR_NAME=  TIME,          FID/REAL,        FID/IMAG
##SYMBOL=    X,             R,               I
##VAR_TYPE=  INDEPENDENT,   DEPENDENT,       DEPENDENT
##VAR_FORM=  AFFN,          ASDF,            ASDF
##VAR_DIM=   8192,          8192,            8192
##UNITS=     SECONDS,       ARBITRARY UNITS, ARBITRARY UNITS
##FACTOR=    0.0002768,     1,               1
##FIRST=     0,             0,               0
##LAST=      2.2672688,     0,               0
##MIN=       0,             -696022,         0
##MAX=       2.2672688,     649233,          0
$$ Real data points
##PAGE= N=1
##DATA TABLE= (X++(R..R)), XYDATA
$$ [...]
1947b77k41P77r67m25J378j240L59J699j540m25K111j594K16J564j356k7O16n44
1965H4N17j24j28l03p09R94M26j499J041k09j434J669M51j807J520J29j638J483
1983D63n6q69O29k59j75J43j95R31q69m16J077j135R9J524j461l75J612j218J81
2002c69J242j143K09N06n12L10j45J56r9r65J064K0j036J246Mj567J720n1j289
2021f99J340m21r02J026k69J57m5l56L64l56j37J009j159l50J737k012M53J423
2039H03j676K78J265j168J87Q85j072M66Q1l00L64m78N99Q1r12J041l6j347J528
2058E89P5j468J429k26j079J310k68r30R92l58o9K40m00L84m58M3R50j285J50
2077c79J034j248J9J335j481K46J115j187N65K70l65K05l4m2O4n15O04O37j374
$$ plain form
1947 -277 -518 259 -708 -1133 245 -995 -636 1063 -477 -902 1209 -385 -169 1395 39 12 628 84
1965 84 601 477 349 46 -663 331 757 -742 299 90 -1344 325 776 -1031 489 618 -1020 463
1983 463 407 -462 167 -92 -267 -124 -319 612 -257 -673 404 -731 -632 892 -569 -944 668 -550 -369
2002 -369 873 -270 -61 445 -67 243 98 254 155 -810 254 274 -762 484 488 -1079 641 590 -699
2021 -699 641 220 -682 344 75 232 187 -169 195 -161 -298 711 -448 -798 939 -1073 -620 803
2039 803 -873 -595 670 -498 -311 574 -498 -32 49 -251 113 -365 234 315 -597 444 408 -939 589
2058 589 664 -804 625 399 -680 630 362 -568 424 66 -3 237 -163 221 -237 -194 756 -529 -379
2077 -379 655 -593 -574 761 -720 -474 641 -546 19 289 -76 129 95 53 117 -398 206 843 -531
2096e31J110r5j406J737l38j387J192j00q00R28j28o16Q02l11J10j93L33K70n72
2115Er9J270j398J66J297j554o8R94j166K88Q47j020J27K96m09M67k89K23L3q73
2135h63J223K5q84J121k79r70J418m13j260J546q63o90J144l14m06M46k35K65
2153A1j20J86P13o60K0R24j449L59J561k008M01Q37j321M96K34p36P9l6q8J76
2173d21l54J65N34q55J260P2r77J687j32j402J696o31j024J087m36l35L86l06
2191A4k26M08o49J51m32Q6J296j272K41Q78q43J52J140j582M55J201j495P03J51
2210C77q86K33J3K6L12r96Q41j81o49J201K41j326J840o56q51J585o17n70R12
2229H49q09J06L11n26L18m24k02K94n35K99L15j006K41J283j502Q68J092j697
$$ plain form
2096 -531 579 484 -922 815 477 -910 282 182 -618 310 182 -434 368 57 167 -26 307 577 5
2115 5 -94 1176 -222 -56 1241 -313 -381 613 -553 -265 582 -438 -311 -15 -424 43 -246 -23 10 -863
2135 -863 360 385 -499 622 343 -627 791 378 -882 664 -199 -889 255 -59 -465 -19 -254 11
2153 11 -109 77 790 130 150 1074 -375 -16 1545 -463 -62 775 -546 -50 184 -552 -473 -509 -597 -421
2173 -421 -775 -610 -76 -931 329 401 -576 1111 979 -423 1273 642 -382 705 269 -66 320 14
2191 14 -212 196 -453 -302 -734 -648 648 -624 -383 495 -348 -196 944 -638 -183 1018 -477 226 377
2210 377 -509 -276 -263 -237 75 -921 -80 -261 -910 291 532 -794 1046 390 -461 1124 507 -63 849
2229 849 40 146 457 -69 249 -175 -377 -83 -618 -319 -4 -1010 -769 514 -988 -120 972 -725
2247g25Q50N66q80O05J70m32K71m68K83j66m83O02j88r61J410m04j152J872r18
2266a48o41J394m82o34J205o84M1Op8R4m7j96N27p03J83P42j427N92J057j735
2286i34J015R08j497O21Q42j172O26K9k88J32m15M97l16k72N22n0j217J483n24
2305a0o45R21l40p73J205p89k71R86l46K7J20k93L57m6j6O69j167N59P23j327
2325d56N64O11r14K29N30j140O33J18o85M95Q0P7R2l53M11j33j126J532l39j030
2345h04J507o60p49J287o36l39R75p36r8M82k36K22j45j39M18n52J89N33r43K81
2365a43P92j490Q39O76j193N18K85q42N62Q8o32M10j36L49qn22Q85n53n83J314
2385F16n25p52J395o56p23J363o37r4O62n46j97L15p8Q4k50k51Q82q44K87N89
$$ plain form
2247 -725 125 691 -189 416 586 154 425 -43 240 74 -409 193 5 -956 454 50 -1102 770 -148
2266 -148 -789 605 123 -511 694 10 51 57 -21 73 26 -170 357 -346 -163 579 -848 -256 801 -934
2286 -934 81 989 -508 113 955 -217 409 438 150 282 -133 364 48 -224 298 248 -969 514 -10
2305 -10 -655 266 -74 -847 358 -431 -702 284 -62 -35 85 -208 149 103 87 756 -411 148 871 -456
2325 -456 108 719 -195 34 564 -576 57 175 -510 -15 65 142 234 -119 292 159 -967 565 226 -804
2345 -804 703 43 -706 581 -55 -394 581 -155 -253 229 -7 215 70 -69 349 -203 -14 519 -424 -143
2365 -143 649 -841 -2 674 -519 -1 284 -558 4 92 -540 -130 -266 83 75 -447 438 -115 -698 616
2385 616 91 -661 734 78 -645 718 81 -13 649 103 -94 221 143 227 -23 -274 608 -236 51 640
2405F40j088J97N25p03K34Q07j113K74M23p36O15m9k68Qm3K59N1n86J074k20q34
2426e33J274n66o49J165o38n58Q95n63j76N87p27M58K46l53L23m88Q7O22o61L06
2446E1P72j095O45N13j236P72J5p58M50r6j79L51m19M7M2n35O47K90p43O74Q4
2467B92p42R20l76p73J020l98l50J198j031J20J88o36M47k76L51J97n00J01O96
2486D48j074N96Q61j405P69P85j032L71K68r06Q54l04l92L36n77K66j07l23P03
2505A37k28n33Q37k49o52R91m52j11O85n18j74Q89o39K4L6l36K24lj09L26m98
2526c53R6P15j050J95N99q08O15N20r67M04M17l24K71m6O9N2n09L64No01Q34l42
2548A56p29J008o41m34R25n37l64P21k84m13N21k72L66m9k16P56p23R8P99j113
$$ plain form
2405 640 -448 -251 274 -429 -195 612 -501 -227 196 -540 75 26 -242 -234 -277 -18 33 -553 521 301 -533
2426 -533 741 175 -474 691 53 -505 390 -173 -349 238 -489 -31 215 -138 185 -303 -216 406 -255 51
2446 51 823 -272 373 886 -350 422 437 -321 129 33 -146 205 -214 -167 -125 -660 -13 277 -466 208 292
2467 292 -450 470 94 -679 341 -57 -407 791 -240 -120 68 -568 -121 -397 -46 151 -349 -248 448
2486 448 -626 -30 831 -574 195 980 -52 319 587 -319 535 231 -161 175 -402 -136 -243 -566 137
2505 137 -91 -624 213 -36 -688 303 -149 -260 425 -93 -267 622 -17 7 43 -293 -69 -72 -181 145 -353
2526 -353 -257 458 -592 -397 202 -606 9 529 -438 -34 383 59 330 284 353 405 -104 260 265 -336 498 156
2548 156 -573 435 -206 -640 285 -252 -616 105 -179 -592 -71 -343 23 -26 -242 514 -209 -111 688 -425
2568d25L91J63q21R52K1j056Q28K40r13O40K31l63L03J9J06N4j98M62m6o90O52
2589E50n42l46Q03p18m24R55p81k58P62m91L17O9j84O2j76M49K47o30P33L17q30
2610a16L37L43o61K45J42o58Q27p1p62M58o2j46L4l07K67k7m6P43l67m24Q47o62
2632f6l57J067q96j81P10m93j94L85k40k20M62j4K30n13L92L04o14K65L42o01
2652b32N92M50j023Q23j55p57K67L34q73M90k02l9N28r14P76p6l27O56l43l95
2672d20R54l62jM64o84k0M76n37j98O97p29L8K9k28O10o51L84K59l30L63L68q24
2694c42O14J82p63J50L62m62O55m68o50P35j0m9J30o12Q02l54r3N34l96j61J132
2715I36q51l2Q17p34j09K38j22l9o9N3o0k93%L13n46L69L44q02P16q6m78N70K87
$$ plain form
2568 -425 -34 129 -692 260 281 -775 53 293 -620 20 251 -112 191 210 316 370 172 634 588 -102 550
2589 550 8 -338 465 -253 -677 278 -503 -761 1 -490 -173 -104 -288 -226 -402 47 294 -336 397 714 -116
2610 -116 221 564 -97 148 290 -368 459 388 -374 84 22 -124 -90 -397 -130 -157 -203 540 173 -251 596 -66
2632 -66 -423 644 -252 -433 277 -216 -410 -25 -265 -485 -23 -37 193 -320 72 376 -238 27 369 -232
2652 -232 360 810 -213 610 455 -302 -35 299 -574 -84 -286 -325 203 -711 65 -11 -338 318 -25 -420
2672 -420 534 172 171 635 -49 -69 407 -130 -328 369 -360 -322 -293 -521 89 -562 -178 81 -249 114 482 -342
2694 -342 272 454 -309 -159 203 -259 396 -72 -722 13 3 -46 84 -528 274 -80 -173 361 -35 -196 936
2715 936 85 53 870 136 27 265 143 104 35 88 28 -265 -265 48 -498 -129 215 -587 129 43 -435 135 422
2738D22o63O69j71l63M69j21l39M58n81L58q6j01M60n57M3O28o34j71P96k69k21
2759B6N82p87O9M25k22P4m54K08J88l35L21k71k57N73M8o41N91j06l92N28r5k73
2781b00P10l77k46L49kk38L12m60K80k31l59M38K6j07L46n80j41J184j018J26
2801a88L46k34m6M85j02N4J0m73M32k12K62k82l20L45k17l00M51L07p57P03k00
2822F4l79N10k28p1J95j94K05R3l28N00l02m10P29m90q4N93q71K94M84n77m3P25
2844D15p72K53L51k06J95n1j42K56l65K31M77r12M89o7o70O35P3p58O24k24k09
2865c77K83J81l75M82k06Q6J0j30N83o23J73N09p28l75R12m60q5O23q62K06L53
2886A80m29M5L36l10J3Q3J90K39q70Q11k35m48P61n71k36N87l9m18N23k51l45
$$ plain form
2738 422 -241 428 257 -106 363 242 -97 361 -220 138 52 -49 411 -146 -103 525 -109 -280 516 247 26
2759 26 608 -179 -110 315 93 167 -287 -79 109 -226 95 -176 -433 140 188 -453 138 32 -360 168 73 -200
2781 -200 510 133 -113 236 234 -4 308 -152 128 -103 -462 -24 2 -105 241 -339 -480 704 -314 -188
2801 -188 158 -76 -122 363 261 315 325 -148 284 72 334 52 -268 77 -140 -440 11 318 -439 264 64
2822 64 -315 195 -33 -104 91 -103 102 195 -133 367 65 -345 384 -106 -190 403 -468 -174 310 -267 -310 415
2844 415 -357 -104 247 41 236 185 43 299 -66 165 642 -270 219 152 -518 117 190 -568 56 -168 -377
2865 -377 -94 87 -288 194 -12 74 84 -46 537 -86 87 596 -132 -507 405 -55 -140 483 -379 -173 180
2886 180 -249 -204 132 -178 -165 -82 108 347 -523 288 53 -395 366 -205 -441 146 107 -311 212 -39 -384
2907c84N21k94K83p0l43N58l13k10M24k37l8O02n33J55J68m83jP26n40rJ6m85
2929d87N21m06L9O39n17K90L45p35O04k5n11M65q2l76K35M9j52K06j17k53K46
2950b2k31K24J0l13K49k60N3O87n17j49Q35p22lN63p01O43P0m75L70k78N0J62
2972B45q7r8J48m87O86k39l82L15Nj57K47r1l70P46m92N0N8rk34L11m05M61mn97
2996c80O78q35J53R43o72j56N02n68J95N45p08L50M99n25K22M0k44L44m99K82
3016A66P2n06M01j54k98N70l18l88P14m99o1K23k0KL52o3J72j47l31J95K4n7L66
3039D15m74p2O32q40K93N19p86M31J3m41J37L57n08J24J58L69l11p6K59k4o19
3060d44P60k42m79N22J01o08M71p2k10J81j37K52K63l46K16j84J33J30l18J49
$$ plain form
2907 -384 137 -157 126 56 -287 271 -42 -252 172 -65 -103 499 -34 121 289 -194 -195 531 -9 -18 -2 -487
2929 -487 34 -372 -333 306 -211 79 424 -311 293 268 -243 222 140 -236 -1 48 -104 102 -15 -268 -22
2950 -22 -253 -29 -19 -332 -83 -343 -290 397 -120 -269 566 -156 -159 404 -297 346 416 -59 311 33 83 245
2972 245 158 60 208 -279 407 168 -214 101 106 -51 196 105 -265 481 -11 39 97 88 -146 165 -240 221 217 -380
2996 -380 298 -537 -384 559 -113 -269 233 -335 -140 405 -303 47 546 21 243 283 39 383 -116 166
3016 166 238 -268 133 -21 -319 251 -67 -455 259 -240 -301 -78 -98 -96 256 193 365 218 -113 82 106 49 415
3039 415 -59 -131 501 -339 -46 473 -313 118 131 -310 -173 184 -324 -200 -42 327 16 -60 199 175 -444
3060 -444 316 74 -405 117 218 -390 81 9 -201 -20 -157 95 358 12 228 44 177 307 -11 138
3080A38K47m35k00L82l01J17L93p32K33M56n81K94k48K06J41m7l9K45m38K63J38
3101B32n73O44J75n56M45k76k56M76l42o47J108q69K71N9k68N93n05K38O21n97
3121b7j12K60k00o0M68l18K66N8o59M35K18l64L3r1N3K23l60L89J33m44J47Q4
3143A32j73M84j92o53P09k08n34M48k70m4L28l38J62L65m37M9m2j28O30o26O8
3164b70O92n10J05K17l22P0M72o39N02j76l39M14l89K02P9m69N08K6m90O88n66
3185a95J06M26j67l31N30k39j18K83j93k49J54o6j47m2J19J33l34RN27k49j73
3206b16N76m85J89L35o52M44j45l65M60o4J79k47q0J48j80k65K74L28p12O45j7
3227A50k08L30j21n04P63n58R5L31P2l02R3k29k71K01KJ04l84M21O1k22L17j5
$$ plain form
3080 138 385 -50 -250 132 -169 -52 341 -391 -158 298 -283 11 -237 -31 110 63 24 269 -169 94 232
3101 232 -341 303 478 -78 367 91 -165 311 -31 -678 430 -439 -168 -109 -377 216 -289 -51 570 -27
3121 -27 -139 121 -79 -139 329 11 277 335 -324 111 329 -35 -2 -93 -40 183 -177 212 345 -99 48 132
3143 132 -41 443 251 -402 307 99 -435 13 -257 -301 27 -311 -149 216 -221 -172 -214 -342 288 -338 -270
3164 -270 422 -88 17 234 -88 -18 454 -185 317 141 -198 216 -173 29 108 -361 147 173 -317 371 -195
3185 -195 -89 337 170 -161 369 130 12 295 102 -147 7 -59 -206 -248 -129 4 -330 -321 206 -43 -216
3206 -216 360 -125 64 399 -253 191 46 -319 141 77 256 9 -71 77 -103 -368 -94 234 -478 167 150
3227 150 -58 272 151 -353 410 -148 -53 278 350 48 141 -88 -359 -158 -156 -52 -436 -15 46 -176 141 126
3249A26n40N53K45m78j68L69k54K36j05Q6m6m33K63K71l44K14R2k37K37k07l53
3270d73N87o2k25M71k64J03J28k63L37m62K78L3l36M38k18j06J19j15l33M49k52
3291a66q5L5M04o96P14j01p7Mj08K45k8K7n8rm92M86O6k88M85l28l8O3j51K33
3315A37j18rq8J05J1j58J94o8M59m72k31P71q30L62M5j83J11L36m35j52L30j79
3337f2J49p9j12J23j48M55m28MM81l42j00L70M4l70J75n2l29K41K56l09R1k95
3359b37K40Jj11J09J19r3K26m02Q6P7l57N11j19k94J82M55o88N35p2l35M1P5N6
3382Ej06J26J7Q3k71M69k10j77L83p51N18N52j141K62J58J23j40L42l14k19M42
3403A51j89J40k78J67N8k33K71J07l34K47J86l81M04l03k5J14j81RO3k69k5L30
$$ plain form
3249 126 -414 139 384 -94 -262 107 -147 89 -16 70 24 -409 -146 125 -219 -5 87 -150 87 -120 -473
3270 -473 114 52 -173 298 34 137 265 2 339 -123 155 188 -148 290 72 -34 85 -30 -363 86 -166
3291 -166 -251 -216 188 -508 206 105 28 32 -76 169 141 168 110 101 -391 95 161 -127 358 30 -8 55 -96 137
3315 137 19 10 -78 27 38 -120 74 6 465 -7 -238 533 -297 65 110 -73 38 374 -61 -213 117 -62
3337 -62 87 8 -104 19 -129 326 -102 -98 383 41 -59 311 355 -15 160 108 -221 20 276 -33 58 -237
3359 -237 3 4 -107 2 121 28 254 -148 -62 15 -342 169 50 -244 -62 393 -295 240 168 -167 -126 -51 5
3382 5 -101 25 42 125 -146 323 113 -64 319 -432 86 638 -503 -241 -83 40 -100 242 -72 -291 151
3403 151 -38 102 -176 -9 49 -184 87 194 -140 107 293 -88 316 13 -12 102 -79 -70 -7 -276 -301 29
3425B9m50L21M12l08k0J59l73M82j69M3j4o0k37L26k54K59j0Oj70j1r7K71k97
3448a62N6N26n92K64k1j07J58j8l67K30k59j53M95n9j30L78l10K47k12p9R6j31
3470a50oJ26j6l91P09m43K70K58m40N4r5P2mj59K74M7k92L46N3o44M60K02q27
3493e96O35J08l98M66k9l82L40J25k05L55l96J53j29K0n8kK3K99o01K78O6m9J3
3516C6M4j74O4j47L5K00j88J15J41l6J3o2k61j42N52k45M7r7NP9J03l57O06m44
3540a13J98J81k35o8J30K23k66n3J5oNj15K96j33r8O2k19K24j83K44m13L27J9
3563B2J46R9l66J89j36k65N16k70n1L43o03K11K71l07K80n4n6J0J79j62J11M4
3585A51k48L52m67L43Q8j21J3J55n65K88P3j98L12k01k42N06l51j41K62j57L14
$$ plain form
3425 29 -421 -100 312 4 -16 143 -230 252 83 126 112 52 -185 141 -113 146 136 142 -28 -39 -136 135 -162
3448 -162 -106 420 -172 92 71 -36 122 104 -263 -33 -292 -445 50 -9 -139 239 -71 176 -36 -115 -19 -150
3470 -150 -156 -30 -46 -437 272 -171 99 357 -83 -29 -124 -52 -56 -215 59 106 -186 160 213 -431 29 231 -596
3493 -596 39 147 -251 215 186 -196 144 269 64 419 23 176 47 67 9 7 30 329 -272 6 72 23 36
3516 36 80 -94 -30 -177 -142 58 -130 -15 126 90 103 41 -220 -362 190 -55 -8 -105 -100 -21 82 -275 331 -113
3540 -113 85 266 31 -37 93 316 50 -3 12 6 11 -104 192 59 -39 23 -196 28 -155 89 -324 3 22
3563 22 168 267 -99 90 -46 -311 205 -65 -116 227 -376 -165 106 -201 79 25 -31 -21 158 -4 107 151
3585 151 -97 255 -212 131 219 98 111 266 -299 -11 62 -136 176 -25 -267 239 -112 -253 9 -148 166
3606A66M0k84K58j55M3j24N2J18n4j16l21M99k81Q1K86k89jJ19j82J98m27L45
3628b9m9K47j97n4roj11K69K75m44Q0K71j55m28O19l73J63Pm25L13K37l22J02
3651a9l33M72J13j71j7J34l28J06K36l35K16J08o2J48m16Q1n5r8r7J91L32j92
3673A4O7k16K6j2J3L3J54L1J11k22r9J46k4j58K57k31K42j05p6K76k62K27L7k06
3697B3J77k84J04L50j90k41K31j24K8O0Kk74L72m85L22k21J19K97o08L6L37l5
3719dk12K34N6J07k85j06M64q7k82J14k40J09K00l47K56J25k36L2J60kn2j26m7
3742a69K06J03k85K8K93k50M59n43K26k4j73J36J05k93K50P3k94K24l34J05O14
3763D57n70J83K47l02q5J52n01M52r1J26k6r7K98k22n8j23L90k89K55k41r6L96
$$ plain form
3606 166 206 -78 180 25 68 -56 -4 114 60 -56 -377 122 -159 -78 208 -81 -82 37 -145 53 -374 -29
3628 -29 -78 169 -28 -82 -91 -97 -208 61 336 -108 -28 243 88 -340 279 -94 69 76 -349 -36 201 -121 -19
3651 -19 -352 120 233 62 45 179 -149 -43 193 -142 74 182 120 268 -148 -67 -122 -220 -317 -126 206 14
3673 14 81 -135 -109 -121 -108 -75 79 110 221 -1 -100 46 22 -136 121 -110 132 27 -49 227 -35 192 229 23
3697 23 200 -84 20 370 180 -61 170 46 74 134 136 -138 234 -251 71 -150 -31 266 -342 -306 31 -4
3719 -4 -216 18 74 181 -104 -210 254 167 -115 -1 -241 -132 68 -279 -23 102 -134 -102 58 56 4 -122 -169
3742 -169 37 140 -145 -117 176 -74 385 -158 68 44 -129 7 112 -181 69 142 -152 72 -262 -157 457
3763 457 -113 70 317 15 -70 82 -419 33 -58 68 42 -55 243 21 -37 -160 230 -59 196 -45 -141 255
3785B55l00J07K13j64j59K11j54K29l89J13k1j37K71R7l66K25J72l51P5L67m94
3806b00q8M52r2k55K6P5M5K61J8k45j2J35k08k09L13j16k5j8J22j13j24L76k99
3829a81K68j30j65J12R8q3r0j09L44m1j00K95l91L0M89o23P2J74K61j79j24j08
3851a81L8J51J1j4j80K29P1j92O6r6J17J71k72J44J33J67m71po3o3K67R1k8m76
3875c87L52j14L70l9j38r3o5j2L33j16k75K56l6L8N7N8k02k9K6q6P6J9k11M25
3899B07L4l52J28ol27J65J18j82L75o8k39K07j95K42l6j87M0K31l6O4l9j40Mj19
3923a11K74j89j14O8L58n91L36k82o7J27J85l5l7J05R7mk38o4Q0J33r2q4J19N
3947b1K59m30L58j73k10R3K7J96L8j25k08L64l70J44J87J1J16M9l00K28l23m0
$$ plain form
3785 255 -45 62 275 111 -48 163 9 238 -151 -38 -59 -196 75 172 -194 31 203 -148 -73 294 -200
3806 -200 -288 164 72 -183 -157 -82 -37 224 242 -3 -15 120 -88 -297 16 -100 -125 -143 -21 -134 -258 118 -181
3829 -181 87 -43 -208 -96 2 -81 -171 -280 64 23 -77 218 -173 -143 346 -277 -205 -31 230 51 -73 -181
3851 -181 -143 8 19 5 -175 54 125 -67 -1 -97 20 191 -81 63 196 363 -108 -115 -178 -241 26 117 89 -387
3875 -387 -35 -149 221 182 44 -49 -114 -126 207 91 -184 72 36 74 131 189 -13 -42 -16 -102 -26 -7 -218 207
3899 207 241 -111 17 11 -316 -151 -33 -215 160 92 -147 60 -135 107 71 -116 -76 155 119 183 144 4 8 -111
3923 -111 163 -26 -140 -72 286 -305 31 -251 -318 -191 -6 -41 -78 27 124 120 -118 -182 -102 31 -61 -145 -26 -21
3947 -21 238 -192 166 -7 -217 -124 -97 99 137 12 -196 168 -202 -58 129 140 256 305 5 233 -90 -130
3969a30l3oK68o0J70k16J47j55L7l74L46J57j43Q8j88K06k11J08j52L74m04K84
3991A13k08K42k83K27j1O1l55RN07l52n4K39o6k4j64J98l7LJ04r0k88L63Po0j71
4016i0K76n6k58N42m50J03J4l15L97j75J73j34L05l95K49k7l14J52K24l89%m6
4038b14L31k79L48l69L26j51J90j26j34j3j36q5K57M1J9K75j63j05j30J55l1R0
4060I6j28j28Q0p3K95j65R5O7j13l8K61m86L82p9J06j32l43L65r0k2K50rj59j14
4084h2k66J14K65J56j72J51k81q4LJ26J15j38L9K14k33j71J00Q7J36j67J49p1
4106a0N9k04L25k4k0k14J18p8K61r9j27Q3oO8j02j83M55n61N02l36J59n3l7L19
4130B95j95J00j85p0K59p4k44J23j04r2L11j11J70j89K7O5k7j77J2L85l41M19
$$ plain form
3969 -130 -163 -169 99 39 209 -7 140 -15 22 -352 -6 151 8 96 -92 114 -97 11 -141 233 -171 113
3991 113 -95 147 -136 91 80 141 -214 -205 302 -50 -104 135 69 45 -119 79 42 45 149 59 -229 134 141 81 -90
4016 -90 186 130 -128 414 -36 67 81 -234 163 -12 161 27 332 -63 186 159 -155 -3 221 -168 -168 -214
4038 -214 117 -162 186 -183 143 -8 182 56 -78 -91 -227 -312 -55 -14 5 280 117 12 -118 37 6 96
4060 96 -32 -160 -80 -153 142 -23 72 139 26 -12 249 -237 145 66 172 40 -303 62 -28 -50 200 191 32 -82
4084 -82 -348 -234 31 187 15 166 -115 -199 -196 -70 45 -93 -54 160 -73 -244 -144 -57 79 -88 61 -10
4106 -10 49 -155 170 146 126 -88 30 -48 213 114 -13 70 64 132 30 -153 302 -259 243 -93 66 13 -24 295
4130 295 100 200 15 -55 204 130 -114 9 -95 -187 124 13 183 -6 21 86 59 -118 -106 279 -62 357
4152C57m10M2J58j95k33J07J04N5J17j37J76k97L17q9j04N8p3k2J27k6j2J10p2
4175E8K56k54j43N2J88m9m9R5J65m08k6L02M0l34K66J7k40J2K57k99K4L26J01
4198C57k5m84Q2m0K44r3j3k02J34p6j79j24K56L83j5k33l1L1q9K16j14K8jj00
4222h8R7j70J08j58M96m01J45m0j00J95R8m8l23K09k35L36k52J68j66K19k5l06
4244b41L42nr0j32J21J34j09j59K49j08j51J13J7J68r3r2n3j81M11j86j5q8K02
4267E4k1l96L78K95o0j77O3l75N68l10Q7JK6l85J36L15k54q2j22K30o0J46om7
4291Dk18M18k15j22J47J41p9K6k0J13r9J26l04r3K29q0j46J27n7K0j98K25J5j8
4315e8J52q1J1pK20m52J54n0N8K0o3J30K7k06L29J46k27k3l68L72j19K11j31k28
$$ plain form
4152 357 -53 -11 147 -48 -281 -174 -70 -15 102 -35 141 -156 161 72 -32 26 -47 -69 58 32 20 130 58
4175 58 314 60 -83 -31 157 108 59 154 319 -89 -115 187 227 -107 159 176 -64 -52 205 -94 -70 256 357
4198 357 332 -152 -70 -110 134 41 28 -174 -40 -116 -295 -419 -163 220 205 -28 -59 -28 -117 99 -15 13 12 -88
4222 -88 9 -161 -53 -211 285 -116 29 -11 -111 84 182 134 -189 20 -215 121 -131 37 -129 90 65 -241
4244 -241 101 96 6 -126 -5 129 20 -139 110 2 -149 -36 -19 149 56 -36 -89 -270 141 -45 -60 -148 54
4267 54 33 -363 15 310 250 73 136 -239 329 19 106 107 133 -252 -116 199 -55 -137 -259 -29 -89 57 51 4
4291 4 -214 204 -11 -133 14 155 76 102 82 195 96 222 -82 -175 54 -26 -172 -45 -102 -82 -280 -55 -40 -58
4315 -58 94 13 24 17 237 -215 -61 -111 -53 -33 -96 34 61 -145 184 330 103 80 -288 84 -35 176 45 -183
4339a83J84M4p2K94L9l52K45p9r9j26J09k19L85j68k32J21K83j82k37K81M8j10
4361b6K00k69k8L14m80N16j55j12j10K99j63K11l17O8k55K21J60j88L1J75P9j74
4383cj54j63M20j70k31M89k1k32J59m4q8K79j90j87K32n2l29K12K48J44k36j51
4405f8J03r9L12j59j05K64j93L8l13K02n8L2K08k16R1k2j24J89k58k7L70J15k80
4428BJ25k26K01J38m22J07k59L38oj56M9j33J53p0J30L4j82O9k46L30J38k23J
4451a08L27k51PM7R2l9Q8j96J7m8q1lj57K85L43r6k73r8R1N6m7j9o7K1M0K02k19
4478h6J33k97M23l21j80M56K02l40q4K08K2j81M5P0k54J20m7L64l78J34m2j46
4500a79K52j30l6J64J1J1L5l72L45q8K75k60j43R6j35L34l12J55n2n0J22k10p2
$$ plain form
4339 -183 1 45 -27 267 306 -46 199 120 21 -105 4 -215 170 2 -230 -109 174 -8 -245 36 84 -26
4361 -26 174 -95 -123 191 -289 227 72 -40 -150 149 -14 197 -120 -52 -307 -86 74 -114 -83 92 171 -3
4383 -3 -157 -320 100 -70 -301 188 167 -65 94 50 -38 241 51 -136 96 44 -285 -73 175 319 83 -68
4405 -68 35 -64 248 89 -16 248 55 93 -220 -18 -76 -44 164 -52 39 17 -107 82 -176 -203 167 282 2
4428 2 127 -99 102 240 -182 -75 -334 4 -2 -158 -109 -242 -89 -159 -29 5 -177 -108 -354 -24 114 -109 -108
4451 -108 219 -32 -25 22 114 75 163 -33 -16 -64 -145 -148 -305 -20 323 227 -46 -144 -53 3 -44 -63 -130 -109 -69 133 -86
4478 -86 47 -250 173 -148 -328 128 330 -10 -94 114 136 -45 0 70 -184 -64 -111 253 -125 9 -33 -179
4500 -179 73 -57 -93 71 82 93 128 -244 101 13 288 28 -115 -19 -154 180 -132 23 -29 -79 43 -167 -239
4523b39Q1K63j86kL10l62J68N9k23q0J56mL9q3J72j12k3K22j62J91k20J4J41k2
4547I8n2j72P6n9n5K63j60L88m43J43P9k89K36k05K32J79k35l12N38n46N48k72
4569b0j3J38j98R6J91j11j36J12q9P2r2o8K35j53J04o4r8J72j40O6P1R7J96l67
4593Aj97K29n66L10K47j56J7J68j24J47k90qJ83K68j08q7k17K11Q7J70k49m1j24
4616a29j16L38j60K10j90J42J04n63N15O7l07J24k4j31%J12p3J07Qp9j57L02K16
4639C16j39k67K13j00L44l18j1J31k68J66qm8L28k80n9n7k77M58J49k48J5J31
4661A71k15OJ64k09J35K3m22N18m33K46j23L30j09n8k56L03Jl3J15P4m58L02j76
4684a04l12M71j4JR0j46J52k26m9M59l44P8m2J09mk54M07m88K33J15l12N50m64
$$ plain form
4523 -239 -158 105 -81 -83 227 -135 33 92 -131 -211 -55 -59 -20 -103 69 -43 -66 156 -6 185 -35 -21 120 98
4547 98 46 -126 -50 -109 -164 99 -61 327 -116 27 106 -183 53 -152 80 259 24 -288 250 -296 252 -20
4569 -20 -33 105 -93 3 194 83 -53 59 -30 42 -50 -118 117 -36 68 4 -94 78 -62 4 75 172 368 1
4593 1 -196 33 -533 -223 24 -132 -115 53 -71 76 -214 -222 -39 229 121 34 -183 28 115 285 36 -5 -129
4616 -129 -245 93 -67 143 -47 95 199 -364 151 218 -89 35 11 -120 -120 -8 -81 26 34 -45 -202 100 316
4639 316 177 -90 123 23 367 49 38 169 -99 67 59 11 339 59 0 -57 -334 124 273 25 40 171
4661 171 -44 -38 126 -83 52 75 -347 171 -262 -16 -139 191 82 24 -232 71 72 39 154 228 -230 72 -104
4684 -104 -416 55 41 42 132 -14 138 -88 -137 322 -22 56 14 123 119 -135 272 -216 17 132 -180 370 -94
4707i4K74j76J98k76N5J20k90K60JP4n2J23j29Q9k33N1r0P6P9k02L85j75L6l2
4731G2l7r6J25m6O1m70M64Q6l08k8J46j0j57L88k66J2k06J62K21k68J5R1k37L71
4755H5j11K58j66j73K5J60j17j33k86K27l8K50L07l91o5l0K17o5K6K05J2j92l32
4778c27N0J71r0K56r9K2L35m41K4O9K35j20j87P9k42K08J59Q7k86J26k00N7o1
4801a75K39K9m0J26j91J11k70j12L09k26K91j81K94n81P55l18j72J02J56q5J41
4822B02m52J43k50M47k73K82J80j30J12k61K36k90j34P2L23k16K46j75M1l10M8
4843a59m6J88P4j09K17k59j13J10K21q7j26k80M24k88K77O4J73l82j9J36j16K63
4865A63k80J66j44j62L34r3p7Q0O5k32J37l6R3OJ02l30J61L4O2k19kJ00J0K25
$$ plain form
4707 -94 180 4 202 -74 -19 101 -189 71 72 146 94 217 88 177 -56 -5 -95 -19 60 -142 243 68 104 72
4731 72 35 -61 64 18 79 -391 73 159 -149 -177 -31 -41 -198 190 -76 -64 -270 -108 113 -155 -140 -49 -286 85
4755 85 -26 232 66 -107 -82 78 -39 -172 -458 -231 -269 -19 288 -103 -168 -198 19 -46 -20 185 197 5 -327
4778 -327 -277 -106 -196 60 -39 -17 318 -123 -99 -30 205 85 -102 -23 -265 -57 102 189 -97 29 -171 -114 -175
4801 -175 64 93 53 179 -12 99 -171 -283 26 -200 91 -90 204 -377 378 60 -112 -10 146 61 202
4822 202 -250 -107 -357 90 -183 99 279 149 261 0 236 -54 -188 -116 207 -9 237 62 103 -207 -159
4843 -159 -205 -17 57 -52 165 -94 -207 -97 124 37 -89 -369 55 -233 44 108 281 -101 -120 16 -100 163
4865 163 -117 49 -95 -257 77 -16 -93 -13 52 -180 -43 -79 14 20 122 -208 -47 -13 49 -170 -172 -72 -62 163
4889A63k99K52j85J59j05n2J29j75K59k14k5j27K7J43K00j28j35J71Q1j29k1j65
4911a76L5K85k36R1n4k25M01j57R4m1%j19n9Q5J12q0K04p4M5O4k04m7J52j88j05
4936a97K38p9K08j67o1K83l85J16K53M0j2j94m0J67J3k25M1J42j88P0m3K21l56
4959a55K92J21k14K2o3j90n4K02J06q1N1O4k06N9K77k38j38q5J67L3k5J38j60
4982g7p9K56l0k12L13l92N7P2J00j20J20J33j55M23m71n4J23k2J88j31l22K69
5004a1k40l4L76k79j04J84P6K09M1m60J33K11k50J33L00l78K88P1l0J62l92Qj32
5027a18K11K3oj70N9k31J99N4r7J7r0J03J40k80L33j66K25k39J13J00l02Q3M01
5050C62l90M39n32J02J0j68R5J1o4J27J71n1N9j9k51L93j93r3J66k61J50j0l15
$$ plain form
4889 163 -136 116 -69 90 -15 -67 62 -113 146 -68 -93 -220 -193 -50 150 22 -113 58 139 10 -11 -176
4911 -176 -141 144 -92 -1 -55 -280 121 -36 58 17 17 -102 -161 -76 36 -44 160 86 131 195 -9 -56 96 -92 -197
4936 -197 41 -38 170 3 -58 225 -160 -44 209 249 237 43 3 170 183 -42 -1 141 -47 23 -20 201 -155
4959 -155 137 258 44 66 3 -187 -241 -39 67 -14 37 101 -105 -46 231 -7 -145 -230 -63 -30 -55 83 -77
4982 -77 -156 100 70 -142 171 -221 -164 -92 8 -112 8 141 -14 409 -62 -116 7 -15 173 42 -280 -11
5004 -11 -251 -285 91 -188 -292 -108 -32 177 218 -242 -109 102 -148 -15 285 -93 195 266 236 398 6 14 -118
5027 -118 93 116 110 -60 -1 -232 -33 21 -76 -59 -149 -46 94 -186 147 -19 206 -33 80 180 -122 -39 362
5050 362 -28 411 -121 -19 -9 -177 -82 -71 -135 -8 163 112 171 152 -99 294 101 8 174 -87 63 53 -262
5073b62J57J28k0N5lK38m16R4K32q3k53M26m35K10r2j04M1J07L0j26N8m5Q3K35
5097B55n88M39J46n15N14l63J45j55M2J40J32l07K30n6K0p3l35J53l1P04n99J86
5119H4m27M98N3p6j09n7o3L49j36k27p3K07l13L61Ol1K02k24j39J58rm4q4J5J93
5144A14q3k55K98J91k12J00j19J58k34J14J35p2M3p8k59mJ6K01J62p1J7m5P3j49
5168D1l09j15N11J44l46J86p5k29K90J39k80K49j62l5Q2k13J15R1q7%j20K92q9
5191H0j44l51K88J44R7J19k14j69J25L05j08k08J07n0K02l57J35j52M28n02L5
5212a90J16N5k54K70J59k43m4n8kj21M53k29L6j11K3n3L12m2j53QK36on40L35
5236d3J75m9l60L30J55k8k95K89l8j4J92k74J19j4J0j90J5K74l63K52j26K98m33
$$ plain form
5073 -262 -105 23 3 58 55 293 -123 -29 203 120 -133 293 -142 68 -24 -128 -87 20 50 -76 -18 -63 20 255
5097 255 -333 106 252 -263 251 -112 33 -122 -80 60 192 -115 115 59 79 6 -329 -176 -207 497 -102 84
5119 84 -343 155 208 132 23 -34 -97 252 116 -111 -184 23 -290 71 77 46 248 24 -115 43 34 -10 -94 -79 114
5144 114 31 -224 74 265 53 153 34 192 -42 72 207 135 178 100 -159 -163 -147 54 216 145 162 117 190 41
5168 41 -268 -383 128 272 -74 112 37 -192 98 237 -43 206 44 9 91 -122 -7 84 -3 -3 -123 169 80
5191 80 -64 -415 -127 17 114 233 19 -150 -25 280 172 -36 71 21 223 -134 1 -151 277 -225 -190
5212 -190 -74 -19 -273 -3 156 -87 -131 -189 -191 -312 141 -88 -52 -163 -140 -193 119 77 -76 -68 168 162 -378 -43
5236 -43 132 83 -277 53 208 180 -115 174 136 122 314 40 159 145 155 -35 -20 254 -109 143 17 315 -118
5259a18O49m01k1j93JmM7k6N1R4p9L05p13K86j34N29k74j39L06j40J9k4j61L20
5283A80j54r9K42L4k93l6R6j64K56k53J33L50l02J28K39k38qQ8j56j3k74J84K3
5306c7M64l27l21K60J44j13j61Q5K23l85L3J11j43K36j17L08j37m94L55JJ63j81
5328c3P3R3r7J8j58J57o4p2K84l93Q8J66l15L88n08L60p2l9LJ94J82j89L2k48
5352a50j2M64l11R3K43l91L95l44K7K02k12m6p6J1J41J42k28J11j13j99P2r0M40
5375A69J85k63P7M4k26k5L3j99K39l8j91R3L05l08K12l47K94J10k78J6j01j8L18
5398A01J0r5N8l0k84M64k34j22K21l1p9MJ2j24J10n2Q4Q8ok36JJ13L39l42N0j38
5424a18J05j86k9p6J30J60lJ43j42k8N4J12J17m30K63K28k47O6MJ32j56L7k80
$$ plain form
5259 -118 531 130 109 -84 -83 -87 -40 -66 -15 79 0 305 -408 -122 -256 273 -1 -140 166 26 45 21 -140 180
5283 180 26 -73 169 203 -90 -126 -30 -194 62 -191 -58 292 -10 118 357 119 111 199 43 30 -244 -60 -37
5306 -37 427 100 -221 39 183 70 -91 -6 217 -168 -135 -24 -167 69 -48 260 123 -371 -16 -15 148 -33
5328 -33 40 133 36 54 -104 53 -11 -83 201 -192 -104 62 -253 135 -373 -13 -85 -124 -121 73 255 66 98 -150
5352 -150 -162 302 -9 84 327 -64 331 -13 14 216 4 -42 -118 -107 34 176 -52 59 -54 -253 -181 -271 169
5375 169 354 91 168 212 -14 -39 -6 -205 34 -4 -195 -102 203 -105 107 -240 54 164 -114 -98 -199 -217 101
5398 101 111 16 74 44 -240 224 -10 -132 89 58 -21 -17 -5 -129 -19 -71 13 101 95 -141 -140 -27 312 -30 20 -118
5424 -118 -13 -199 -228 -304 -174 -14 -17 126 -16 -44 10 122 239 -191 72 300 53 119 123 255 99 136 -144
5447a44K49k12M2J39R2l09j57J81O3J9j1J0n1J32j04j17J43J34n2j83J38J02k97
5470a93M65n04R3K34j96M8Jp9K6j01J24J43j39j72O1L22k12J10j91R4J15l0j31
5493a12L70n55L18J99l54K41L0j41j0k48K72n3m3p7J02j95K17k6J08n0j64j54
5515c25K10Pp8R0j26K21J27j11R7K51m81M44m93J6Q9J02k7k63J51K76j25r8j81
5538b27J60K49j65K15oLk16j75J83j60J12pL08j72J16j62J98k32j59K81k22M56
5560C78k38n2K8k82J94k8j06M27jl98J32K8m3M1Q8j15m4J28o4J4k11K80j4j94
5584e2k1K72k98J31j30k61L54j79L84j04qoJ59k91O0p4Q8j45K03k99L99l60Q5
5607i3oNJ94k4l01L71k82P3p4J1j25L54k23l3L97k66J88j04j97K89j04o4mP6l27
$$ plain form
5447 -144 105 -107 -65 74 166 -143 -300 -119 -56 -37 -48 -38 -89 43 -61 -178 -35 99 47 -136 2 104 -193
5470 -193 272 -232 -139 95 -101 -53 -52 -131 -105 -206 -82 61 -78 -250 -189 133 -79 31 -160 -66 49 19 -112
5493 -112 258 -297 21 220 -134 107 137 -4 -14 -262 10 -43 -86 -163 -61 -256 -39 -65 43 -7 -171 -325
5515 -325 -115 -108 -186 -96 -222 -1 126 15 112 363 -118 326 -167 -151 -62 40 13 -250 -99 177 52 -46 -227
5538 -227 -67 182 17 232 226 229 13 -162 21 -139 -27 -34 274 102 218 56 254 22 -137 144 -78 378
5560 378 140 88 116 -166 28 0 -106 321 320 -78 54 82 39 80 168 53 9 137 73 87 -124 156 142 -52
5584 -52 -73 199 -99 32 -98 -359 -5 -184 200 96 88 82 241 -50 10 -64 24 -121 82 -217 182 -178 -93
5607 -93 -99 -94 100 76 -225 146 -136 -63 -137 -126 -251 103 -120 -153 244 -22 166 62 -135 154 50 -14 -18 58 -269
5632b69lJ11Q9J60J86k66J7J12K9j53P6Q0o9R9M3l22J2j30L16O5n0k86J4J39R2
5657I2j16k23K46J75m27O6K91j59O2J06M4q5J20j92J71k93L7N0J07nJj11L35j82
5681A10l52J78R5K7K91l03j28M03l73Kl6j15J16lp3J15j73L14J80k46l6N2o8N3
5705C0L4N1k1k15K22j14J50j95M84k08l92J12m6R4J11k72M3J60J73k47p9Q8n2
5728h9q3K18K1o3R9n92K99M58k01l7l24L48N0P5l60J88J67l20K3M9L3k95M16j19
5752c9Q6l7O9r3MJ58l68L6K91j51J15j24L1k5O6o5k04L23l8j32Q6K4J9J28k45
5777h5K49j82J4m4l9J02K43l89O0M8j98L29P9k26J21K7k34p7K52k05K88k61J17
5800a1K04l98J89r0j9M7m3K69K2o19M05q6M07m89M37j76J18j94j72K72l15K82
$$ plain form
5632 -269 -272 -161 -72 88 274 8 25 137 166 13 89 169 100 199 242 -80 -68 -198 118 183 133 -153 -139 0 92
5657 92 -24 -247 -1 174 -253 -187 104 -55 7 113 157 72 192 0 171 -122 -85 -35 72 67 68 -43 292 110
5681 110 -242 -64 31 58 349 46 -82 321 -52 -50 -86 -201 -85 -88 -161 -46 -219 95 275 29 -7 45 -23 30
5705 30 64 115 94 -121 101 -13 137 -58 426 218 -174 -62 -108 -14 97 -175 -132 28 201 -46 -125 -37 -89
5728 -89 -172 46 67 4 103 -489 -190 268 67 30 -294 54 104 179 -181 7 174 -146 -123 -74 -41 -336 80 -39
5752 -39 47 10 79 -14 -10 148 -220 -184 107 -44 71 -53 -22 -47 19 -46 -250 73 35 -97 -11 13 32 160 -85
5777 -85 164 -18 -4 -48 -87 15 258 -131 -71 -23 -221 108 187 -39 82 109 -125 -202 50 -155 133 -128 -11
5800 -11 193 -205 -16 -106 -125 -78 -121 148 170 -449 -44 -130 277 -212 225 49 167 -27 -199 73 -242 40
5822D0j83J13n3J5P4J38j0R6k05l7j6j98L25j88Q7m7M29k52k52K08j53j29J82
5845a6J22k10K72j10k16K54m7j38p5L28l29J82J44p6J39k05l5k07K42k46L49m4
5867G8J69k64j69K54L9j99J64Pk33J05r8p4K55j2k11K32Q5l43K84l5j72J13J27
5890A02l27J43N0Q9l15L87k22L2J24l26J74J90j62K68l22p2P5j69K80M0kk28K46
5913E5M2j05J16j71J61j77O9j07J84k61J78J46J14k7j04j18N8R3j96J20k63K03
5935A0J63kr3p9l0k6o5K45k03O5L6M2l48M7j2L61k30J14K44k32K77l03k7J99r1
5960F2j83k0J93j53J49J83k03K19j47k79K58rk82K84k79n8K54OJ29j69J2N5M0
5983F2J34Rl4j82P7j59q8L55n5j3P1k29%k68P3P8K09J61K03l55L14p8l27K45j86
$$ plain form
5822 40 -143 -30 -83 -68 6 144 134 230 25 -12 -28 -226 99 -89 -2 -49 380 128 -124 84 -69 -198 -16
5845 -16 106 -104 168 58 -158 96 49 -89 -164 164 -165 17 161 85 224 19 -16 -223 19 -227 122 78
5867 78 247 -17 -186 68 107 -92 72 79 -154 -49 -147 -221 34 22 -189 43 128 -215 69 34 -138 -25 102
5890 102 -225 -82 -32 57 -258 129 -93 -61 63 -263 -89 101 -61 207 -115 -187 -112 -281 -1 39 37 -191 55
5913 55 97 -8 108 -63 98 -79 -10 -117 67 -194 -16 130 244 217 113 -5 53 146 -50 70 -193 10
5935 10 173 171 78 -1 -31 -57 -122 123 -80 -15 21 63 -285 -238 -250 111 -119 -5 239 7 284 -19 -46 153 62
5960 62 -121 -141 52 -101 48 231 28 247 100 -179 79 70 -212 72 -207 -265 -11 -5 124 -45 -33 22 62
5983 62 196 205 171 -11 66 -93 -181 174 119 106 177 -52 -52 -320 -247 -169 40 201 404 49 363 285 -42 203 17
6008A7n4J79l9k73j0L59L8k67j77j7L23k55J39Q6j40J31j9K35k47J57l05L09M4
6031B14j42m1j71p7j32O07j43j06p4j21J99j44J72p5Q1r4RM4j73M24j32j59m18
6054d52M40L7k02N01j80k80P4n4lK84l15j87N6K97n5O6j72J39J21j51j28J63N7
6077E6j95N9L44R0j66l0m9J99k24n3j20j8o6K67L0k11J61J9J24l48O5j17K56J04
6101A77r8j28j7k4M3j97K86L0j01M07n30R7q0j2K23l4k01K70O3k53J09r3j01J57
6125gp2p9Q9K5j05K54k63K42j36N4N4R3o9k69L90k83K91r0j4J93j15l14o3K75
6149H1K8j05M7j1r6J68m1k94J55o9L68j15j10J24j56R1p8k8j34J60J79o6o0j70
6173a32J47J39n9Q7k72j34J13K50K0l32K70j53J34N2j07k09J62k62K26O1k22K63
$$ plain form
6008 17 -37 142 103 -170 -180 179 217 -50 -227 -244 79 -176 -37 49 -91 40 21 256 9 166 -139 170 214
6031 214 72 31 -140 -217 -349 258 115 9 -65 -186 13 -131 41 -34 47 -47 -38 6 -167 257 125 -34 -452
6054 -452 -12 25 -177 324 144 -136 -62 -116 -119 165 -150 -337 -281 16 -39 27 -145 -6 115 -36 -164 -1 56
6077 56 -139 -80 264 354 188 158 109 308 84 31 -89 -107 -173 94 124 -87 74 93 217 -131 -66 -183 73 177
6101 177 79 -49 -66 -90 -47 -244 42 72 -29 378 -152 -55 -135 -147 76 42 -159 111 174 -79 30 -63 -164 -7
6125 -7 -79 -158 -69 -44 -149 105 -158 84 -52 2 56 149 80 -189 201 -82 209 119 105 298 183 -131 -194 81
6149 81 109 4 51 40 -56 112 71 -223 -68 -137 231 116 6 130 -26 65 -13 -41 -175 -15 164 98 38 -132
6173 -132 15 154 95 182 -90 -224 -111 139 159 -173 97 -56 78 130 23 -186 -24 -286 -60 1 -221 42
6195D2j00J04j51J63o0r4J44J12J01k44J76l6j58m5k2J71j65L47m33K64k6L6k87
6218a61M2K84m70O38L0m42k8r3M65N5jl21j54K67p5o8K9J0k44L0J29j72J40l2
6242a42J78p7q4j35L03K90n07K24p0N8jM6j24j10K0L24k11n9J09J83j26O3k92
6265a40JJ57q1J55q3j10P8O0j55J71k06J68Nl9j57K14m06N17j36j97R6j73J58
6288a03k7M1J11k45J18O6mj59l4L04Q9j02J12l61K77j22j4L72l79J67j52l8R2
6311Ij3Q9l0J94j26j55Q2k9K29k85l2Q3j86J26J73j01J50k59j69M10k55r2Q9l8
6335a36M30l57r9J71K8J22k24l0J67j66J51j48J73j71k06L28k95L1J04q6K78k4
6357D1k0R1m34K77O7L4k22L32j6j98L13j18Mj74J56j71K69l81J17j14J1K11JP1
$$ plain form
6195 42 -58 46 -105 58 -2 -96 48 160 261 17 193 157 -1 -46 -68 103 -62 285 -148 116 90 126 -161
6218 -161 -119 165 -305 333 363 -79 -107 -200 265 320 319 -2 -156 111 36 -32 -3 7 -237 -207 -78 -250 -110 -142
6242 -142 36 -41 -125 -260 43 333 -174 50 -20 38 37 83 -41 -151 -131 193 -18 -77 32 215 89 152 -140
6265 -140 -139 18 -63 92 9 -101 -23 37 -118 53 -153 15 20 -19 -176 38 -368 149 13 -184 -88 -261 -103
6288 -103 -130 -89 22 -223 -105 -39 -43 -202 -236 68 157 55 167 -194 83 -39 -53 319 -60 107 -45 -83 9
6311 9 -4 85 55 249 123 -32 50 21 250 -35 -67 16 -170 -44 129 28 178 -81 -250 160 -95 -187 -98 -136
6335 -136 294 -63 -162 9 37 159 -65 -95 72 -94 57 -91 82 -89 -295 33 -262 -231 -127 -213 65 41
6357 41 21 112 -322 -45 22 56 -166 166 150 -48 265 147 151 -23 133 -38 231 -150 -33 -147 -136 75 76 147
6381A47j63N9l47K89N8q8j61o2N50k61m7K4k5J7J05k74K06l3l37N61r0j88J7n2
6405i5L14k33L6r8r4K21K9j29K9K11j73J23l3L2l15L22j20Kp1J85k66J99j00J3
6429a1J30k54L88k45k79L53j23K3P8j26J29l41K8l11M58k2J30lj6K41l75q2K90
6452F0P8k48K09O1l05J62q6l7J04pj4j69K15J5m8l7J38k26O7O1J4R0m1K7k06K84
6478A61M0k55J39M1M8k86J32R2l43p3J26R0K37j91J28n5P1q0j84K63J97k72j01
6501g5N6k69L40M0q0j47Oj27M24p3J66m08J26P7J52m66j65N14J68O1l21p0q7J70
6525A2K15k02j62K33J04l28J91K1Rj67M5m4R0j8m5n4J05q0J62K4k28k8K4L46q8
6550A37l78L28l68K74L13J16m22J61l80N13n3m56n6K09O1J11j17K08j23k3J13
$$ plain form
6381 147 -16 43 -304 -15 43 -45 -206 -268 282 21 -26 -2 -27 -10 95 -179 27 -6 -343 218 128 -60 -43 -95
6405 -95 219 -14 22 -76 -170 51 80 -49 -20 191 18 141 108 140 -175 147 27 29 -42 143 -123 76 -24 -11
6429 -11 119 -135 253 8 -271 82 -41 -18 60 -66 63 -278 -250 -561 -103 -125 5 2 -14 227 -148 -230 60
6452 60 138 -110 99 160 -145 17 -69 -106 -2 -9 -23 -192 23 38 -10 -47 91 -135 -68 -7 7 97 56 83 -123 161
6478 161 201 -54 85 126 174 -112 20 112 -231 -304 -178 -88 149 -42 86 31 102 22 -162 101 298 26 -75
6501 -75 -19 -288 52 92 12 -135 -129 -256 168 95 261 -147 -21 56 208 -258 -423 91 259 320 -1 -71 -158 12
6525 12 227 25 -137 96 200 -128 63 84 93 -74 -29 -73 17 -1 -46 -100 5 -75 87 111 -117 -145 -121 225 137
6550 137 -241 87 -281 -7 306 422 0 161 -219 294 241 -215 -271 -62 -1 110 -7 201 78 55 168
6571A68k49O5l4J06j56K83n51M49k35J46K06O9k47j74J45J59j00J94m25k6J69
6592c8J83j96q7M2J67j88J20K36k45R4j93%K03j42n4J26K34k54R2j07j83L74k87
6615a03K26k19J07k00M8J91Np9J3K9J1K07j78j79M6Q0k13K1J85pj30L34k22j84
6639b11kK30p2r8J87J57k78J66l42N21l04J60q1j08J73o8J81k29L4j70K18j56
6661i2lK06j8J41l01J21J57k72J08o3j42L55K75l02J59l56pJ83j27j19j11L07
6683I9l98J62K44r7J73j15O5J29l66K59p9n4q0J49k7p1J91kj97L40k98J35l16
6706a54M81j75P2M8m37L29k10R4j59K01M9j24j51J55L4l1j6R4J24j69j34R0K1
6729C2J9j26n6N9j13J18J21M2j85K97k82J77r3q8K5K01j60j06P5J03j31j2L9K3
$$ plain form
6571 168 -81 -16 -50 56 -100 183 -368 81 -154 -8 198 267 20 -154 -9 150 50 244 -181 -207 -38
6592 -38 145 -51 -138 -96 71 -117 3 239 -6 88 -105 -105 98 -44 -98 28 262 8 100 -7 -190 184 -103
6615 -103 123 -96 11 -189 -141 50 55 -24 -11 18 29 236 58 -121 -75 5 -208 -187 -2 -9 -139 195 -27 -211
6639 -211 -213 17 -55 -153 34 191 -87 79 -263 258 -46 114 33 -75 98 30 211 -18 16 -154 64 -92
6661 -92 -95 111 93 234 -67 54 211 -61 47 -16 -158 197 472 170 329 -27 -34 149 22 -97 -208 99
6683 99 -299 -137 107 10 183 68 133 262 -104 155 76 22 -58 91 64 -7 184 182 -15 325 27 162 -154
6706 -154 327 152 224 272 -165 164 -46 48 -111 90 139 15 -136 19 53 22 6 100 224 55 -79 11 32
6729 32 51 -75 -131 -72 -185 -67 54 96 -89 208 -74 103 10 -78 -53 148 -12 -118 -43 60 -71 -83 -44 -21
6753b1J40l5M7p7J5j8K46l90J12%j90L38l19N5n2K35J7k11O9J1Om3K38k18j12
6778a57K29J81m46L54k38K7L56k25l1j6j86K29k52P3L35m68M1L14k99J62l9j90
6800b46L11O6l12J43oj86J72J66k25K77j47K04l29J93q5j9r1J75p9k17P4J54j72
6823a79N6q2L50kk13R6j37N8K53k16K17m10J38L13k95j97R6O2j40J9K15M65l32
6846A35j32M3j67L00p5j65n0J83Q7l42M21m49j2M95k39m8j9J06k26J65k84L56
6868H3p8k26J97K95l61n7R5k35P6K21K64l76J05q6M2J00K37l22p9L7O1n3K48j06
6892H2p5j53L75l64p2p8L66j25J66j2J2N8l7k33K22q0j17M57k89o5k42K85j00
6915a9J12M5j55r8J48O5J57j32j40L0Kj03J89L0M8l84L90l49L41r1j87M5L15n2
$$ plain form
6753 -21 119 84 131 54 69 51 297 -93 19 19 -171 167 -152 -97 -149 86 103 -108 -39 -28 -22 -65 173 -45 -157
6778 -157 72 253 -193 161 -77 -50 306 81 50 34 -152 77 -175 -102 233 -235 -194 120 -179 -17 -56 -246
6800 -246 65 131 -181 -38 -44 -230 -58 108 -117 160 13 217 -112 81 -4 -23 -114 61 -18 -235 -161 -7 -179
6823 -179 -123 -205 145 143 -70 26 -111 -53 200 -16 201 -209 -71 242 -53 -250 -154 -92 -232 -213 2 467 135
6846 135 3 46 -121 179 104 -61 -111 72 159 -183 238 -211 -223 272 33 -15 -34 72 -154 11 -273 83
6868 83 5 -221 -24 271 -90 -147 -52 -287 -211 10 274 -102 3 -83 -41 59 296 -26 -105 -68 -7 -60 188 82
6892 82 7 -146 229 -135 -207 -285 81 -44 122 110 122 180 143 -90 132 52 -65 392 103 38 -204 81 -19
6915 -19 93 138 -17 -115 33 98 255 123 -17 13 15 -88 101 131 179 -205 185 -164 177 86 -101 -56 259 207
6939B07k58j32J87j54J52K01k66QJ75k35L07k9Ql49J90K51m31K65l7k81K61N3
6961I3M6j73k34J72O3j83P2Jq7O5L06l82K85j76J35k16N8J55J34p6n6K0K95j98
6985A19j29m4M04j18j07j3j50j26L77l58J8K44j73j82L36k88M15k35k52N70n29
7006b21P9Q0pOn7J38J27k76L4K06q7j59K69l40J62q1j46L42k05L55j85J29M1R1
7030B95n59J96O4q9J79j52R4J83m67L60Q3n79K5O8K56K6j5k1p0J44p2J83P2k36
7054c2O4j19L8K64l20J52p9k56J06qn2P9K8j09K16K99k7l89Q1O8J33k9l75K35
7078c2l8J60J28m34Q7K21l12K72l6l5n5L1j47P0J37n9J62l06K1J61N3j06K3l1
7102f5K44k73p0R2J00k2K02j16l5K67m50R8m9l5Q5K62kk00J86k6j57j51P6P3r5
$$ plain form
6939 207 -51 -183 4 -150 2 203 -63 -55 120 -115 192 163 171 -178 12 263 -168 97 60 -221 40 93
6961 93 139 -34 -268 -96 -33 -216 -144 -143 -230 -165 141 -241 44 -132 3 -213 -155 0 134 58 2 22 317 119
6985 119 -10 -54 350 232 125 112 -38 -164 213 -145 -127 117 -56 -238 98 -190 225 -10 -262 308 -221
7006 -221 -142 -62 -69 -63 -120 18 145 -131 -97 109 22 -137 132 -208 -46 -127 -273 69 -136 219 34 163 204 295
7030 295 -264 -68 -4 -93 86 -66 28 211 -256 104 187 -392 -367 -299 -43 -17 -32 -53 -123 21 -51 132 204 -32
7054 -32 32 -87 -49 215 -105 47 -32 -288 -182 -190 -242 -163 -135 -244 -28 271 244 -145 -64 4 137 108 -267 -32
7078 -32 -70 90 218 -216 -129 92 -220 52 16 -19 -74 -43 -190 -120 17 -42 120 -186 -165 -4 49 -57 -34 -65
7102 -65 179 -94 -164 -72 28 6 208 92 57 324 -126 -28 -77 -112 -27 235 233 33 219 193 36 -115 -39 34 -61
7127f1J55o3L1ql2J3J53K0n1k69O2J81l24M7j42M16j01n3L4J44j14p7j13K26j66
7152i2L59l12Q8k08L41j01j87J44l0R4k35J86k33K13K7j08J37K0K7k56K49j91
7174f8j2N4j23j4J29P7j05j86K40K54k74O6k13J47m4j0r2O2j89P7L75o1k09J46
7198B7p5j15M07k3k58N2k6Q4j49Q4J99L7k58R8Oj33K28k56PP8J1p3j60M6L01r9
7224D0J73m58L52L5j8j85K55l72Q2J15J30k41L51n55M46r5J37l77K2M8K15l21
7246b21J89Q0O3k90K53R1k79J46n5j02P5M0M5j37J23R1j27J85j64q8J75j06r3
7269a06M01k54j21J50l04K16j02j71L32n5rQ6k70J4J58N9K97l90j38K10k18K66
7291E1p4O5Nk09K75k6j31K22k46N4K71m24L62j96K34m04O9l2LK95Q6m65L92l25
$$ plain form
7127 -61 94 31 62 54 22 35 188 208 157 -112 -50 131 -193 -146 -288 128 27 -26 8 152 38 -39 -152 74 -92
7152 -92 267 -45 43 -165 176 75 -112 32 2 96 -139 47 -186 27 54 -54 83 103 130 -126 123 -68
7174 -68 -80 -26 -149 -163 -34 43 -62 -248 -8 246 -28 38 -175 -28 -72 -82 -174 -112 -301 -224 151 90 -119 27
7198 27 -48 -163 244 221 -37 15 -11 73 -76 8 207 244 -14 84 90 -43 185 -71 -64 14 25 -48 -208 -162 139 40
7224 40 213 -245 107 142 124 -61 194 -178 -96 19 149 -92 259 -296 150 55 192 -185 -163 -115 100 -221
7246 -221 -32 48 111 -179 74 165 -114 32 -23 -125 -50 -10 35 -102 21 112 -15 170 6 -82 93 -13 -106
7269 -106 295 41 -80 70 -234 -18 -120 -291 41 -14 -23 63 -207 -193 -35 24 321 -69 -207 3 -215 51
7291 51 -23 42 47 -162 113 87 -44 178 -68 -14 257 -167 195 -1 233 -171 -102 -134 -131 164 250 -215 177 -148
7315a48P5K16l73L06j02o2J96q5j18J80KJ05O3l37P1L70j91Q4J42m41O8j46J06
7338a9N2j44L85l75j55L82k62N78l44oj7l7L30j54k29n7m9l0K09m1J17O9j71j54
7362a22J13q3Q9J03j25K45k43K3j07o8L50J2k91J43j2j34PJ13j52J47m2p1mJ76
7386F7K12m62M71k63K06q8l06R3J23m2N5j65J79n1J03j1j99P6l1j18K70J06k3
7409B02j46j47j82N7K37k32J86m3J28j13j72Q1J59J16j32J16L08k28j70p9L5j07
7431a26J31l5K4L12l26j84J52JJ7L18m93K81j0k6j06J44r5J80J11n23P9K89o1
7454E4K50j76L2k60J34J29l08L46k64J23J8l7OP4J4l54L72j39j8J04j94j44L36
7477I8l06K3l1P2K4J01J42O5k40M60k42K5r5j55Q6K10j57j89Oo6K57J7K3l51M54
$$ plain form
7315 -148 -73 143 -230 76 -26 -88 108 23 -95 85 87 192 255 -82 -11 359 168 252 394 -47 21 -125 -19
7338 -19 33 -111 274 -101 -256 126 -136 442 98 92 75 38 368 214 -15 -72 -121 -151 58 17 134 203 32 -122
7362 -122 -9 -92 -3 100 -25 220 -23 0 -107 -175 175 187 -104 39 27 -107 -100 13 -139 8 -34 -105 -109 67
7386 67 279 -183 288 25 231 143 -163 -70 53 11 66 -99 80 29 132 121 -78 -2 -33 -151 119 225 202
7409 202 56 -91 -273 -216 21 -211 -25 -68 60 -53 -225 -144 15 131 -1 115 423 195 25 -54 -19 -126
7431 -126 5 -30 -6 306 -20 -204 -52 -51 -34 284 -209 72 62 36 -70 74 -21 159 270 -253 -174 115 54
7454 54 304 128 160 -100 34 163 -145 201 -63 60 78 41 47 121 135 -219 153 14 -4 100 -94 -238 98
7477 98 -208 -185 -216 -144 -120 -19 123 188 -52 408 166 191 96 -59 27 237 80 -109 -103 -169 88 105 128 -223 231
7502B31j78N7j99q8K22k50J78P9J8l38L81k99J83l51L49L52m74R7r1m8L38j86
7524a7O6qJ4Q9l91M55k58j28L02k01j38J91p9J29K84m00K70l04Q5m3j27P5k7j5
7548a76K30p0K35j63q9j85J5k1J13O3k2k8m9L42j03j56j79l0K71j63K45j03k01
7571b24K72J57j20k23J60L8k41J90J7m3j90P1M7O3n6j18K42n8j2q5J69K4k3j67
7595a10J65k4k1kk42K93jQ4j70K58j13j56j7j11J03l4K39j91J1K57k17P1L0m71
7619c69J76J83Q5r1rK7P2k64m9L55J06L0l75J51p8j82K29P0k92K20Q7q1J15k78
7643a62N7J29j1k7Q3mQ6m07K22J28j58K55oKj51J33n5k23K70k70J42j82K96J28
7667B75k62Q5J20k03j1L6n7k51L78j38J59J94k58M7k40N3J48k96p2L6L60J56r1
$$ plain form
7502 231 53 110 -89 -177 45 -205 -27 52 70 -268 113 -186 -3 -354 -5 347 -127 -30 -121 -169 169 -17
7524 -17 49 41 55 144 -247 208 -50 -178 124 -77 -215 -24 -103 26 310 -90 180 -124 -39 -82 -209 -134 -161 -176
7548 -176 54 -16 219 56 -33 -218 -203 -224 -111 -48 -70 -98 -147 195 92 -64 -243 -273 -2 -165 80 -23 -224
7571 -224 48 205 85 -138 22 60 -181 9 26 -17 -207 -136 -89 -26 -82 -200 42 -16 -28 -113 56 80 57 -110
7595 -110 55 31 10 8 -234 59 58 142 -28 230 117 -39 -56 -167 -64 -98 141 -50 -39 218 1 72 102 -369
7619 -369 -193 -10 75 -16 -25 2 74 -190 -239 116 222 252 -123 28 -50 -232 -3 67 -225 -5 82 1 116 -162
7643 -162 -105 24 13 -14 69 65 151 -256 -34 94 -64 191 185 187 36 169 114 -109 161 -109 33 -149 147 275
7667 275 13 98 218 15 4 40 -17 -268 110 -28 131 325 67 114 -126 -73 75 -221 -293 -257 103 259 168
7690A68j68J53j72P2J39J37k41L3k73L46l14m8K45j88M03n46J11l5M7N0M4J77
7712A40K51m11Q5j16J75j78R8j07j50L40l21L32j22J70k77J14j91K48n2P9q9M
7734B2n5j49J81N6k0P0j63L4J41j33L8R0m8J48l98O03m12n2L5J33q8j69N4R9J39
7759A56k37K2J66p9J10k68o0J90P8J38l22K13n1j64K96n8j84Q0k1J15m6j19P4
7782B9J4j24K1J93k56o7J83J09j21K49l50N4K53K7l28k3K50q4Q7l02Q1M7J92l2
7806A02n6k63K12J86l12L23k82J79l0L0lk03N8k29K20q5J36m8O0J59j87%J01j37
7830f9O9l60M69kk34K00o9k7j19M29k17q6m4j43L16K35m36L1M9l83M78p7M5r4
7854c9O0r8r7J41j10L73k08K7j29R2l9J69q6K33m69K89j33k65L37M8q8n0k14L05
$$ plain form
7690 168 0 153 -19 53 192 329 88 121 -152 194 -120 -168 77 -111 292 -254 -143 -178 -131 -81 -37 140
7712 140 391 -20 65 -51 124 -54 44 -63 -213 127 -194 138 16 186 -91 23 -168 80 28 107 18 22
7734 22 -33 -182 -1 55 35 105 -58 -24 117 -16 22 112 64 212 -186 417 5 -47 -12 121 33 -136 -82 17 156
7759 156 -81 -59 107 28 138 -130 -190 0 78 216 -106 107 56 -108 188 130 -54 26 5 120 74 -45 29
7782 29 43 -81 -60 133 -123 -190 -7 102 -19 230 -120 -66 187 214 -114 -137 113 29 116 -186 -105 -58 134 102
7806 102 46 -217 -5 181 -131 192 -90 89 59 89 86 -117 -59 -288 -68 -153 -17 -65 -5 154 -33 -33 68 -69
7830 -69 0 -360 109 107 -127 73 4 -23 -142 287 70 -16 -60 -203 113 348 -88 -57 -8 -391 87 10 55 -39
7854 -39 21 -77 -174 -33 -143 230 22 49 -80 12 -27 142 56 289 -180 109 -24 -289 48 96 8 -42 -256 49
7878D9j47O3j73kj41L26j77P2K74j01K3j70J01l22M16k89P8m7K8J77r7k2k24M29
7902A24k56K27k91k07O21j30J76k45J18j68J72j98L01l51J60J4J22j30m6j25J38
7923B6j28J55J70j82j00M3k09J19L64m36K93k55j4J69N7j94R3J42m98L00J80j27
7945c2M9j03nJ13k39L96k57Kk0O6M9J83j02k96L29k95K88K80n16J33j94K5l0M27
7969B51m35J10R3j46L84m13p4L33j14l6R5k0j55J27JJ91J49m36m1K20l58L28J36
7992A90m86M08j25n4j0k0Q1J13j92M02j42j17p9J24q6M1o9Q0j03K78k54k41M02
8015A41j59M3j44o1k35N45j13q8k1P2q2J19m1P3k46J17m3K24k6k47K59%L7k12
8039h8L22o7j77J56p6kq1k58K85mj16O3j2k1J76l8r6j17K86k24J27J87n92L87
$$ plain form
7878 49 -98 -35 -208 -210 -351 -25 -202 -130 144 43 66 -104 -3 -325 91 -198 -120 -167 -139 38 -59 -81 -305 124
7902 124 -132 95 -196 -403 218 88 264 19 137 -31 141 -57 244 -107 53 67 189 59 13 -112 26
7923 26 -102 53 223 41 -59 -16 -225 -106 258 -178 115 -140 -154 15 72 -122 -29 113 -385 -85 95 -32
7945 -32 17 -86 -91 22 -217 179 -78 -76 -96 -30 19 202 100 -196 133 -162 126 406 -110 23 -171 -146 -176 251
7969 251 -184 -74 19 -127 257 -156 -230 103 -11 -47 48 28 -127 0 1 192 341 -95 -136 84 -274 54 190
7992 190 -296 112 -13 -67 -77 -97 -16 97 -95 307 165 48 -31 93 7 48 -21 59 -44 234 -20 -261 141
8015 141 -18 25 -119 -180 -415 130 17 -71 -92 -20 -102 17 -24 49 -197 -80 -123 101 75 -172 87 87 124 -88
8039 -88 234 167 -10 146 70 68 -13 -271 14 10 -106 -43 -55 -76 100 62 -34 -151 135 -89 38 225 -367 20
8063B0K6J7l6j19J86Q7O8l13j40J6K48r3j21J51J01k53J74L6J77l22K27o7k7J40
8087A83r1N4n9J63k75l00L52l2k09M92m09j03J26M7q1Q9R5J2K09m56K38L3p2K58
8111B64p1k82K38Lj93r2o3K70j68k5K3j02L6L06k35J33j94N21j95k24K95qk91
8134e4L7L00k3j76K68k36k67K9K62l01j7P6K98j92J13q4M1k11o1J41j16O6q4K02
8158A1j05M1L12j19l65R7J71k0J36Rk28J90k81lK44l56L34m5j86J24L29k15l7
8181C8q5J43q4k42L61l78L04l57L66j78
$$ plain form
8063 20 46 63 27 -92 94 181 249 -64 -204 -188 60 -33 -154 -3 98 -155 19 55 232 -90 137 70 43 183
8087 183 92 146 87 250 -25 -325 27 -5 -214 278 -131 -234 -108 -61 -142 -53 42 54 263 -193 45 78 6 264
8111 264 193 -89 149 152 -41 -133 -196 74 -94 -119 -96 -198 -162 144 -91 42 -152 369 174 -50 245 237 -54
8134 -54 -17 283 260 84 352 116 -151 -122 140 -161 -178 -102 196 4 117 33 74 -137 -198 -57 -173 -107 -191 11
8158 11 -94 -53 259 140 -225 -128 43 23 159 168 -60 130 -151 -154 90 -266 68 23 -163 -39 290 75 38
8181 38 -47 96 12 -230 131 -247 57 -300 66 -112
8191a12
$$ Imaginary data points
##PAGE= N=2
##DATA TABLE= (X++(I..I)), XYDATA
0@%%%%%%%qJ6j6J6k4M0m8N6p2Q8j12J36j60J93k34K81l34L92m58N37o23P18q24
30d40R44j080J231j393J572j776J999k240K504k800L123l469L849m267M725n225
46b743N768o359P010p727Q513r377J0332j1393J2581j3916J5425j7151J9144k1477
60a1370K4253k7615L1790l7146M4290n4343O9641r5969J53376m93378L52083O48388
72F04000j083401J76624P54162n33308n23420R05183K09075p89996O5885O06959
82C91763l96954k38141N59439j7833n83294J55817L43949j87526j46447K29102
92A09875k9398l14792R6717L92732j72440k87196K82612P6940l82914J95124M29734
103C96994l76179l70950M80916J23949n62579K26208N32776o21354l67467Q02505
$$ plain form
0 0 0 0 0 0 0 0 0 -8 8 -8 8 -16 24 -24 32 -40 48 -64 72 -88 105 -129 152 -182 210 -248 289 -334 384 -440
30 -440 504 -576 655 -738 834 -942 1057 -1183 1321 -1479 1644 -1825 2024 -2243 2482 -2743
46 -2743 3025 -3334 3676 -4051 4462 -4915 5417 -5976 6605 -7311 8114 -9037 10107 -11370
60 -11370 12883 -14732 17058 -20088 24202 -30141 39500 -56469 96907 -396471 -44388 604000
72 604000 -479401 -302777 451385 -81923 -605343 299840 508915 -281081 -215196 391763
82 391763 -5191 -243332 316107 298274 -285020 -129203 214746 27220 -119227 109875
92 109875 80477 -234315 -137598 255134 82694 -204502 78110 155050 -227864 -32740 396994
103 396994 20815 -350135 130781 254730 -307849 -81641 451135 -170219 -537686 264819
113B64819J0642p27349L97131M59968o81299j26553P90566j30886o43640L80755
123e846L69940n46691j6569N92524k57165m63509L50854J95081l34333K7370K56286
134A67942j73961k37158K10739J98940k16118q4367K22413o9942j93576K24077
144D8989J77899k69115j02632K82389k4475k70466K27366K13063m30313p7493
154b24788M81728j61385l72990L71948J29303n00899R6683M80713k73645l33824
164c07156M00004R5555m56072J75565M09573l62101k28041M04035o633l17521
174a92792J91704J95339k73426j01479K73027J9718k24951Q5621J56519j84890
184e5610o7399K34180J425k00093N2319J47177j05574r8177J91100L9824k68670
$$ plain form
113 264819 275461 -451888 -54757 405211 -276088 -402641 387925 257039 -386601 -5846
123 -5846 364094 -182597 -199166 393358 136193 -327316 23538 218619 -115714 -88344 167942
134 167942 -6019 -243177 -32438 166502 -49616 -133983 88430 18488 -175088 48989
144 48989 226888 -42227 -144859 137530 113055 -157411 69955 283018 -147295 -224788
154 -224788 256940 95555 -277435 94513 223816 -277083 -180400 300313 26668 -307156
164 -307156 92848 188403 -267669 -92104 317469 -44632 -272673 131362 124729 -192792
174 -192792 -1088 194251 -79175 -180654 92373 112091 -112860 -27239 129280 -55610
184 -55610 -123009 111171 112596 -87497 -35178 111999 6425 -91752 99348 139172 -129498
195a29498N6453K52727j89538j40257K72536l4643k90671J65838K22258k50426
205f5221j06558K87581n3117k78083K21136J94316l18501k8040L08074j34153
215B7434j91439K39708O4452k53049L6333K15621j09455j46706J72383N0251k08919
226a03386M9719J78548j21789j03168J37706K4509j30246K3014J31479o2877j29179
237a05670J17657Q8393j66387M456J71392j00717j24507J55968N5603j71557J5520
248e9849J65427r6771j34153J77466N3493k16311O4153J77435j60142p7791J92255
259H5212k3258j65586R2846J15937j36787n6542J63111k3124j56568J05087R5261
270I5589j51814r614J40120n5329r6053Q3683N9208r5941k6189J15423j8789j16255
$$ plain form
195 -129498 -73045 179682 -9856 -150113 122423 87780 -202891 -37053 185205 -65221
205 -65221 -171779 115802 62685 -215398 5738 200054 -118447 -146487 161587 27434
215 27434 -164005 75703 140155 -112894 -76561 139060 29605 -117101 55282 105533 -103386
226 -103386 -53667 124881 3092 -100076 37630 62139 -68107 -45093 86386 23509 -105670
237 -105670 11987 100380 -66007 -61551 109841 9124 -115383 40585 96188 -75369 -59849
248 -59849 105578 8807 -125346 52120 105613 -110698 -46545 130890 -29252 -107043 85212
259 85212 61954 -103632 -10786 105151 -31636 -88178 74933 51809 -104759 328 95589
270 95589 -56225 -65839 74281 18952 -77101 6582 65790 -30151 -56340 59083 40294 -75961
282g5961P8383P8445j16545j4532J14668m1130r2336O9938O6504r5172l6513J19294
294E5043k2949j19846R5232P4954j36713J701J26357o3704q0425R7806L6801j12181
306d7924M883J15702n8408r0277J10121K4530j28114M7713R4943q8818m1415R0905
318C3841j197q1154L2423P5183o4598n3838R3940N685r3479M8116N9853p6403
330b1628k1402P3001l613o5608K0506O1805n1362m5704Q6685M707r0990M6828
342f775O1955p1670j7293P5482j1892o8522L5157O0722o6307l5349Q9387k0060
354B4835q6095O7049M0086q7069N535O9576l5719m8167N0469L1857o3747k661
366c4051P5370l2865n4148O8440J6158o5685K3435M6027l5947k8605L6388K0725
$$ plain form
282 -75961 2422 80867 -35678 -50210 64458 23328 -69008 930 67434 -27738 -64251 55043
294 55043 32094 -87752 7480 82434 -54279 -52578 73779 10075 -70350 27456 64257 -47924
306 -47924 -43041 72661 14253 -76024 34097 58627 -69487 -21774 73169 -15649 -57064 33841
318 33841 32644 -48510 -16087 59096 -5502 -59340 34600 40285 -53194 -5078 54775 -21628
330 -21628 -43030 29971 26358 -39250 -18744 43061 -8301 -54005 32680 37387 -53603 -6775
342 -6775 55180 -16490 -33783 41699 29807 -38715 -3558 57164 -9143 -44492 44895 24835
354 24835 -61260 5789 45875 -41194 -35659 33917 -1802 -49969 500 32357 -31390 -34051
366 -34051 41319 8454 -45694 22746 38904 -26781 -3346 42681 6734 -21871 14517 35242
378C5242m8705q159N5674k8452m8760N7303J5044o3179J4699M5166k8611k8389
390c1127M1650K0381n6950J875O6754l6935m4608O6052k359o8154L7553M2358
402C6490n0242j9038M4954k626m5775K7387M4833n1357k0284O2807j2772l8310
414b3933M3349J2199m2332J978L3706j261l1498N738K4487l5695j4533M9748j2626
427I327m6641K3558K0436k6492m1L4727m396m3303K3425M8798l8285j2582N5009
440D3540l0216m2682N6979J5733n2853K204K8148k6922k3725M0580J0871n9038
452c7381M690M5787l1276r688M5616j7964l3616K5406K3280o889j0348Q489M872
465A0978k3821Q761L5396k2011k8975J9148L822j5088J0271J9144j5463l1065
$$ plain form
378 35242 -13463 -21622 34052 5600 -43160 14143 29187 -33992 -19293 25873 -2738 -31127
390 -31127 10523 30904 -26046 -24171 42583 5648 -38960 27092 24733 -43421 -5868 36490
402 36490 -13752 -32790 12164 9538 -36237 -8850 35983 -15374 -35658 27149 14377 -23933
414 -23933 19416 31615 -10717 -8739 24967 23706 -7792 -2054 22433 -13262 -27795 21953 9327
427 9327 -37314 -13756 6680 -19812 -19853 14874 10478 -32825 -9400 39398 1113 -11469 43540
440 43540 13324 -29358 27621 43354 -9499 -7295 20853 -6069 -29794 10786 21657 -37381
452 -37381 -32691 13096 -18180 -27868 17748 -216 -33832 -8426 14854 7965 -2383 6106 10978
465 10978 -12843 -4082 31314 9303 -19672 -524 3298 -11790 -1519 17625 2162 -28903
477b8903K6358L3423l3599M016L8640m2380j9624O1236k801m5963J6713J3587
489B0703l6926k858M3950j5303n4622K2436K6345m0416J4574L9281m0134j9453
501d2423L9260R390q498O972N037q407r345K1974K0175k3414j3046J0183m612
514C246k960J0080L933j6480k4043K0913K2892k7800O634K4298m0370l702N4362
527C1003j2291l2256K3705M239l1806J3398L9485k8055l9220L4409P478m0104
539c0015L1311K5494n4015l356M1117j1026q413J8561m185j8584M093K4552K381
552A7915j8716J598J145r832R628P217n339r830j5751J3676J6856k0958O940J5689
566A0238l2643L934M1504j3589j9900K2312k6k2930J7460L0087k7636k5203L5306
$$ plain form
477 -28903 -2545 30878 -2721 1295 39935 -2445 -22069 39167 36366 -9597 7116 20703
489 20703 -16223 -19081 24869 9566 -45056 -22620 3725 -36691 -22117 17164 -22970 -42423
501 -42423 -3163 6227 -2271 4701 9738 1331 -8014 13960 34135 10721 -2325 7858 3246
514 3246 286 10366 14299 -2181 -26224 -5311 17581 -10219 -3585 20713 -19657 -23359 31003
527 31003 18712 -13544 10161 14400 -17406 -4008 35477 7422 -31798 2611 10089 -30015
539 -30015 1296 26790 -27225 -30581 10536 -490 -8903 9658 5473 -13111 -9018 15534 17915
552 17915 -801 797 1942 -7890 1738 8955 3616 -6214 -21965 -8289 8567 -12391 -5451 10238
566 10238 -22405 -18471 23033 9444 -10456 11856 11830 -11100 6360 36447 8811 -16392 18914
579A8914m257l4122L7044J1148n3460J0301L3056k6159m604K3757j3685k1342
591b3409J4477J9156j2738r246J3306q684r740J9810J239j0069K201q044N655
604f086J3194j2793N853R434k3143O674K6097j4133j0281J6470k865j6514J3620
617E527K0339k3507j4836L0576r835k6769L4896L136m3078J8867K2543k9833K275
630i699K3397j6744j6642J8984J0419j9953J722J8328j7551p366K5260p916j2574
643a0335J4480n527m744J1625o084K99N740j0747M443R781j0155k075R273l044
657B930r227O084J1489j5782o258K4276j1753j9956K9853j121k9658K3008J1559
670A5444k7730P011J9840j4511r402J6422K162j9519P800J8259k0779m360K2342
$$ plain form
579 18914 14657 -19465 17579 28727 -24733 -14432 18624 -7535 -12139 11618 -2067 -23409
591 -23409 -8932 10224 -2514 -11760 1546 -7138 -16878 2932 4171 -5898 -3697 -11741 -6086
604 -6086 7108 -5685 168 9602 -13541 -6867 19230 5097 -5184 11286 8421 -8093 5527
617 5527 25866 2359 -12477 18099 8264 -18505 16391 19527 -23551 -4684 17859 -11974 -9699
630 -9699 13698 -3046 -19688 -704 9715 -10238 -8516 9812 -7739 -15105 10155 2239 -10335
643 -10335 4145 -1382 -6126 5499 -585 -286 5454 -5293 -850 8931 -1224 -3299 5974 2930
657 2930 -6297 -213 11276 -4506 -10764 13512 1759 -18197 11656 10535 -19123 3885 15444
670 15444 -12286 -5275 14565 54 -9348 7074 9236 -10283 -2483 15776 -5003 -9363 12979
683A2979j5415q781K1087p880j0889J1490l507m170O503j954l78j455j960L482
697h48J263J019k861k717O774m812k142J5891j0200j3946K1467l181j6675K0453
711I485J442k2982R007J3508j0752m846J1564k683j6764J1308J5789j9666j737
724g327J7936j7147l647K2779r093j1089J0506l219m042P291K104m433o296K836
738b841M714l631M610M4j0409N591L059l291J0108o785j0316J3189j680o686J4029
753I705n187j4255Q184O837n547j366M989l666j2078J1105J2539j6842L44J3178
767G940j5726M05K0784r822r167R264k552l171O836K876o100p515N622L544o538
782c320O506l98j3661O942N229n376O958k785q827Q282J052j262P974n522o108
$$ plain form
683 12979 -2436 -11217 9870 1990 -8899 2591 -916 -5086 1417 -537 -915 -2370 -4330 -848
697 -848 415 1434 -1427 -4144 2630 -2182 -4324 11567 1367 -12579 8888 5707 -10968 9485
711 9485 10927 -12055 -3048 10460 -292 -5138 6426 3743 -13021 -1713 14076 -5590 -7327
724 -7327 10609 -6538 -10185 12594 3501 -7588 2918 -301 -4343 2948 5052 619 -5677 -2841
738 -2841 1873 -1758 2852 2896 -7513 -1922 1137 -2154 7954 1169 -9147 4042 2362 -4324 9705
753 9705 4518 -9737 -1553 5284 -263 -1629 3360 -306 -12384 -1279 11260 -5582 -5238 7940
767 7940 -7786 -7381 13403 3581 -5586 3678 1126 -2045 4791 7667 1567 -5948 -326 3218 -3320
782 -3320 3186 2788 -10873 -3931 1298 -4078 2880 95 -8732 -450 602 -660 7314 1792 -4316
797d316N344K201J089q26o36j242p938O992R181j3498K64Q574j3915K982J5500
812I756j0506n541O848k752p76N210K709m959o522P774K616p254P977q74j2301
827h595P706M474p261O105j338p306N600J226K4L528m569n83J869K94M449k682
843B941k313K724o088L149O869j0672K54O165j0429K748Q773q225k290M747j845
858c492L62K444K830j653m972P996K051p673Q319K49j0565Q692K033q067M739
873C293o48n676L132m36j061J68k445J882j175p56N384m371r97O078n634J576
889a686O695q266J418O591p440J673M682o046O63K785j053j69j321L445o02m223
905b854Q077m96p912Q618L04p935P706P5q145M896m71l923K326j253k021j082
$$ plain form
797 -4316 1028 3229 4318 3492 2856 1614 -6324 668 9849 -3649 -3385 5189 -8726 -5744 9756
812 9756 -750 -6291 557 -2195 -2971 2239 4948 -11 -6533 1241 3857 -3397 4580 3706 -8595
827 -8595 -889 3585 -3676 2429 1091 -6215 -615 611 635 4163 -406 -989 880 1174 5623 2941
843 2941 628 3352 -2736 413 7282 -3390 -3136 3029 -7400 -4652 4121 -4104 -6394 -1647 -3492
858 -3492 -3130 -686 2144 491 -4481 3515 5566 -2107 6212 6461 -4104 4588 6621 -1446 3293
873 3293 2645 -3031 101 -335 -1396 -1228 -3673 -1791 -2966 -3722 1662 -2709 -3706 2372 -3262 -1686
889 -1686 5009 -3257 -1839 4752 -2688 -1015 3667 -2379 -1716 1069 16 -153 -1474 1971 1369 -2854
905 -2854 5223 4727 -3185 5433 5737 -2198 5508 5583 -2562 2334 1863 -2060 266 -987 -3008 -4090
921d090m29L715l046j396N307n550R69Q152n891L85O369o957K331P145o045j78
937G91K983m078J161J709k29j616m202L909J2m372P505k309q144Q548P94o133
953c671P978j518p125N619J396k453K104j491j386j676J530M280n023q68M228
968A924o172K005Q205p886K71N113o924L174O386o191p09J610k336J017R86P88
984A261l186m203N311m03l863P763l924p428R626M37m825Q111k271o040N699K027
1000D092j257J188r52j432k124K940M200o680J8L392p759L404P083q880J41M436
1016A810o835L160N064m915q47J370j136N67J435K144m013l360O284j606l605
1031d483Q207m284o845R902o83m701P229k234n429N010K039j136j17o6l39l227
$$ plain form
921 -4090 -4519 -804 -3850 -5246 61 -5489 -4520 3632 -2259 -1874 4495 -2462 -131 7014 969 791
937 791 3774 -304 857 2566 2337 721 -3481 428 440 -3932 3573 1264 -6880 1668 2462 -3671
953 -3671 4307 2789 -4336 1283 2679 226 2330 839 -547 -2223 -693 3587 -1436 -2304 1924
968 1924 -4248 -2243 5962 -1924 -1653 3460 -3464 -290 6096 -95 -804 806 -1530 -513 473 1261
984 1261 -1925 -6128 -817 -1220 -5083 2680 -1244 -8672 954 1391 -3434 4677 2406 -3634 2065 4092
1000 4092 2835 4023 3071 1639 -485 2455 6655 -25 -7 3385 -4374 -970 6113 -2767 -2626 1810
1016 1810 -5025 -1865 3199 -1716 -2563 -1193 -2329 -1762 -327 1817 -2196 -5556 728 -878 -4483
1031 -4483 3724 -560 -7405 2497 1814 -2887 4342 2108 -3321 1689 3728 2592 2475 2409 2070 -1157
1047a157L613L478p624J297L963q200L877O103q818J138M345o351K749M563m141
1062a165p97J536j19J22O04K730l837k872O792k973m056Q625n268n785R369j763
1078A143n489O576j428m825L872J972j760j013J998N13m305L897L611p863L082
1093a9M388q247L335N658p966J779M133n692K102L116k767l70J112N22j358J50
1109a24L549l490k504P011m984l307Q501n347m443Q400l771m827P002j616l962
1124c912L142J377j834j398L938M17m994M525K577p473M589M473q682L542M340
1139D627p235K476L685n030J44K232j293k25N50J183k548p29N101l362j625O158
1155D109m782l198Q391m255l359O888l723l949N573o35l244J964L78j655j522
$$ plain form
1047 -1157 2456 5934 -1690 -393 3570 -4630 -753 5350 -3468 -2330 2015 -4336 -1587 2976 -1165
1062 -1165 -1962 -426 -545 -423 181 2911 -926 -3798 2994 21 -4035 4590 -678 -6463 2906 1143
1078 1143 -4346 2230 802 -4023 -151 1821 61 -952 1046 1559 -2746 1151 4762 -3101 -19
1093 -19 4369 -3878 -543 5115 -2851 -1072 3061 -2631 -529 2587 -180 -550 562 1084 -274 -124
1109 -124 3425 -65 -2569 4442 -542 -3849 4652 -695 -5138 3262 -509 -5336 1666 50 -3912
1124 -3912 -770 607 -1227 -2625 1313 1730 -3264 1261 3838 -3635 954 5427 -3255 287 4627
1139 4627 -2608 -132 3553 -1477 -1333 899 -394 -619 -69 1114 -1434 -2163 2938 -424 -2049 4109
1155 4109 -673 -3871 4520 265 -3094 3794 71 -3878 1695 1060 -2184 -220 158 -1497 -3019
1170c019M424Q27n697L818K519o600M959M150q543K860L861n809K517L155m661
1185a239l32J582N2q20L26K076l600j085N624k750j829O379n044k763P391l171
1201G97k287N222m052k444M377n21j598j20L30j145j772M569N35n810L933J753
1217A767o222N863L019p581K839L321m854K452K978l578r93Q47J335r74p63K492
1233A948m056j525N903l180j250N138m491k192O553k573j482L892l028j448L015
1248A224N6r16p15K47j94k342L822P31n653L608J634n363M787K559o599K980K413
1265B279l331K153J703k041j210O88J727j791r03K872l990j664N614k965j886
1280b745M538l590k006N850k257j140L298k297m34J794N95l92j539J485J90l010
$$ plain form
1170 -3019 1405 2232 -3465 353 2872 -3728 1231 5381 -3162 -302 3559 -2250 267 3422 -1239
1185 -1239 -1571 11 63 -757 -431 1645 -1955 -3040 2584 -166 -1995 4384 -660 -3423 3968 797
1201 797 -1490 3732 -320 -2764 1613 1092 -506 -626 -296 -1441 -3213 1356 1891 -3919 14 1767
1217 1767 -4455 1408 4427 -3154 -315 3006 -1848 604 3582 4 -989 -142 1193 219 -544 1948
1233 1948 -2108 -3633 2270 -910 -2160 2978 -1513 -3705 2848 275 -1207 2685 -343 -1791 1224
1248 1224 1280 364 -351 -104 -298 -2640 1182 1913 -3740 -132 1502 -3861 926 3485 -3114 -134 2279
1265 2279 -1052 1101 2804 763 -447 241 1968 177 -726 2146 -1844 -3508 2106 -859 -2745
1280 -2745 1793 -1797 -3803 2047 -210 -1350 1948 -349 -783 1011 1606 1214 -325 1160 1350 -1660
1296a660L346M97n288L554J194n283M516J329n165K679J420k480J508Q44o57o35
1312b81j39K421j961j009L660l652j918N534l117k094M316l038r63L572j841p03
1328a213J744o66K48K92O35N89k049J438R45l342K525Q47m473L348N90m224K574
1345a92R83l428K161O25j777Q65J90Q29n91l13K822k286j044M628l154j548M808
1362C578l763j754M368k670q74K360k001n10Q25Q2M22q74J78J252k333K260J456
1379B002l609K472O67l357L339N71l923K522j67k116J790K69j320M0m07J501p14
1396d40n05K563k775o54M561k200j355L971l666j209L981j630r74J244j959J2
1412a035L72O10M73k957J592P37k311K881J386l871J997J330k696L654L94l587
$$ plain form
1296 -1660 1686 2183 -3105 449 1643 -3640 876 2205 -2960 -281 1139 -1341 167 1011 354 -281
1312 -281 -420 2001 40 -969 2691 -961 -2879 2655 -462 -2556 1760 -1278 -2241 1331 -510 -1213
1328 -1213 531 -135 113 405 1040 1629 -420 1018 1963 -1379 1146 1993 -2480 868 1458 -2766 -192
1345 -192 791 -2637 -476 149 -1628 -763 -573 256 -335 -648 2174 -112 -1156 3472 318 -1230 3578
1362 3578 -185 -1939 2429 -241 -1115 1245 -756 -1266 -441 -359 63 -811 -633 619 -1714 546 2002
1379 2002 -1607 865 1532 -1825 1514 2085 -1838 684 517 -1599 191 460 -860 -820 -1227 274 -440
1396 -440 -945 1618 -1157 -1811 2750 550 -805 3166 -500 -1709 2272 642 -332 912 -1047 -1035
1412 -1035 -663 -53 420 -2537 -945 -208 -2519 362 1748 -2123 -126 1204 -1492 2162 2556 -1031
1428a031J956K46j337J722n99n26j190n00J875r88q02K363l120o63M303j981r99
1445a271L325l108n73L555j038m15O91j296Q4k85J465L57l446J356Q51k651K936
1462E37R10m102K134J121k591L307L62k581J480R0j49J018j30l49j561k21K186
1479A461j541o69J851l216k72L955k395p62K736k816j78L298o69m49M07n99r6
1496D6K03J638j11l398K111M26k916L014M11m465K504P27k429L033J15k408J143
1513c56L63M63M89j62M87j583j87K462j880l20J855l302k86L683k504n83K331
1530I70k527j1K500q83l17M08o2K97p00J853n8k719K075J07l010L482J77m235
1548b653K177Q09k499K152K03j690R07L59M18ok05J206j594q8K627k214k06K405
$$ plain form
1428 -1031 925 1171 -166 1556 957 431 -759 -1259 616 -372 -1174 1189 -1931 -2594 1709 -272 -1271
1445 -1271 2054 -1054 -1627 1928 890 475 1166 -130 -46 -331 1134 1491 -1955 -599 252 -2399 537
1462 537 1447 -2655 -521 600 -1991 1316 1678 -903 577 667 518 1536 1406 1057 -504 -725 1461
1479 1461 -80 -749 1102 -2114 -2386 1569 -826 -1588 1148 -1668 -1846 1452 783 334 741 142 46
1496 46 249 1887 1776 -1622 489 915 -2001 1013 1424 -3041 -537 190 -2239 794 909 -1499 -356
1513 -356 7 470 959 797 1284 -299 -486 1976 96 -224 1631 -1671 -1957 1726 -778 -1361 970
1530 970 -1557 -1568 932 49 -268 140 78 375 -325 1528 1470 -1249 826 933 -2077 1405 1582 -2653
1548 -2653 -476 333 -2166 -14 189 -1501 -594 -235 183 177 -28 1178 -416 -504 2123 -91 -297 2108
1566B108l169J6L150k951k44K384k558J12J778p90j59k9M25r1o27J861n16k154
1584a454K671k02k509K856k24l096K723k46k362K086r5r34K16P07M61j146M80
1601f8J175j757N5K744k833Q8K599l001O93K240k460k10J913j866J88R63o13l01
1619d51q1P09j66j126K290r65j557K559k58k912L211k01k879K840N0k317J487
1636B33K71r13J01L17O96j675M29J676k053N34K143k615J50L015k966K39K036
1653A618k232p8J713j274J9J10l21J01n73J323n67j647K562p05j760L213n33k507
1671a538K760k76k105K343p7j971J177M5k01p23M83J90j255M38J799k475N68K145
1689A327k952Q04K979k694K53K232k413K18J370q44j82j51L39l42q61J581q70
$$ plain form
1566 2108 -1061 -1045 2105 -846 -1090 1294 -1264 -1152 626 -164 -323 -352 73 -18 -645 1216 700 -1454
1584 -1454 1217 1015 -1494 1362 1138 -1958 765 519 -1843 243 148 -786 -570 137 598 -548 -68
1601 -68 1107 -650 -595 2149 -684 -596 2003 -998 -305 1935 -525 -735 1178 -688 -500 463 -150 -451
1619 -451 -532 177 11 -1115 1175 210 -1347 1212 954 -1958 1253 1052 -1827 1013 1063 -1254 233
1636 233 504 -409 -308 9 705 -970 -541 1135 -918 -384 1759 -856 -706 2309 -657 -418 1618
1653 1618 -614 -692 1021 -253 -234 -124 -445 -344 -917 406 -161 -1808 754 49 -1711 1502 969 -1538
1671 -1538 1222 946 -1159 1184 1107 -864 313 358 157 -566 -83 107 -1148 -710 1089 -1386 -818 1327
1689 1327 -1625 -821 2158 -536 -283 1949 -464 -246 1124 280 98 -53 286 -56 -917 664 -206
1706b06j696K344l96j878K898n37k170K676l44j356J968l41j708R99M25l71l98
1723i1K85L91j833P17J347k419R59J733k928R84K280k168P34J212j393L62Q54
1740A026j73p7p07M03l53p29J507r44j745K259r17j682K837n83j747J997l35m74
1758d37J346l25n79M93L65Pm37p1Q75j894L92J480k312L74J602k177O99J540j951
1777a010J65J621j165M36M04J30j36m50J024k09j356J706q08j664K409j095j688
1794a686K277q01j652K233m73p17R06K7k13K04J91P15j013K45J465k126M51J488
1812A521k179N24J579k513L75J024j580N76J005r67J15o1N93k39j04J566j047
1829A88q74K037j034j071K080o71j922K034k07j663J533k40j075O31j37K92j94
$$ plain form
1706 -206 -1902 442 46 -1832 1066 529 -1641 1035 691 -665 1303 962 -746 253 678 307 -91
1723 -91 194 585 -1248 -531 816 -1603 -644 1089 -1839 -855 1425 -743 -9 1203 -190 172 1026
1740 1026 853 776 69 472 119 -610 897 -47 -1792 467 -450 -2132 705 122 -1625 372 37 -437
1758 -437 909 584 5 498 863 870 433 362 1237 -657 -265 1215 -1097 -723 879 -1298 -599 941 -1010
1777 -1010 -845 776 -389 47 451 581 445 -5 1019 810 -546 1160 352 -1312 1097 2 -1686
1794 -1686 591 -210 -1862 371 -102 -819 87 114 -99 105 296 1011 -2 243 1708 -418 33 1521
1812 1521 -658 -134 1445 -1068 -693 331 -1249 -673 332 -635 -520 -581 12 -227 -331 1235 188
1829 188 -686 1351 317 -754 1326 655 -1267 767 560 -1103 430 190 -885 -254 -391 -99 -293
1846b93j21J029j412N12J681j819Q58O77k034J123J277j590Q3N71j409O09M49
1863A91r6m60n27N19j39m31J382m14j202K351o81j090K284r46j392J727o40o37
1881b01J119q47n02K99j95O27q38m9O58j238N34J356j712O68J329k168J259J537
1899A636j965P37L39j000P43j03j05l52p61O70j21q73J786r71j391K110m63p28
1917h12J953j012j119J776n77k20R84o99j31k70J12O45r57p4J037j675N48J403
1935I12j867P15J035j504O19R40r38N22k1l36J79K02J41l71p82Q52k92r40J594
1954F60r42j552J961n71p81J934j178p26J435n01L9P65r34P71l42q4R31j027K71
1973A29P35j606P02P96j480O39Q06j508P36P21r92O38k40j28M95O3K51o24o14
$$ plain form
1846 -293 -414 615 -797 -285 1396 -423 435 1112 -922 201 1478 -112 -29 542 -867 -258 191
1863 191 95 -365 -892 -373 -512 -943 439 25 -1177 1174 493 -597 1687 741 -651 1076 436 -201
1881 -201 918 71 -431 -132 -327 300 -538 -587 71 -1167 -633 723 -989 -321 1008 -1160 99 1636
1899 1636 -329 408 747 -253 490 387 282 -70 -831 -161 -282 -1155 631 -340 -1731 379 -84 -812
1917 -812 1141 129 -990 786 209 -11 973 274 143 -127 -15 630 -327 -401 636 -1039 -491 912
1935 912 -955 -240 795 -709 -90 850 -88 434 413 77 256 458 599 228 -554 298 6 -934 660
1954 660 -282 -1834 127 -444 -1225 709 -469 -1195 240 -261 -222 543 -391 380 38 -46 885 -142 129
1973 129 864 -742 -40 756 -724 -85 721 -787 -51 670 -322 316 76 -52 443 506 757 133 -481
1992d81R51k38j019J556r32j096J665o52o21J265o69o59J141m82L30N5m06M10
2010A18o12P3J125j266L45J090j725J128N04j685N93J175j309O55O54j053L23
2027A33n9J95M06q73R66o09q20J456o09p96J481r37r96J935q81o98J176n80l06
2046d16M69n47L25k02P9K04j00P8O54j370P05Q41j719Q76J116j799R76N06j358
2065f82O87L34n03J93r5L20o1l72R85n60q09J350n55q92J327p51p10J554q96k46
2085c82O86m54k3K5k67M75j91p7O86j236Q80N86j555Q91Q85j488O83M91j543J172
2105B44K48j035O06J32n14K32m36L69J32r34J230l06m62J303o07n50J524j240
2123f4k03Q43p00j54R73o92J4K31r28O47m00J91Q00j107J76P39j202R59P13j520
$$ plain form
1992 -481 470 232 -787 769 -163 -1259 406 -246 -867 398 -271 -930 211 -271 59 114 -292 118
2010 118 -494 -421 704 -562 -217 873 -852 276 780 -905 -312 863 -446 209 863 -190 133
2027 133 74 269 675 -198 768 159 -661 795 186 -610 871 -66 -1062 873 -8 -706 470 -110 -416
2046 -416 53 -494 -169 -371 -292 -88 -188 -110 544 -826 -121 720 -999 -123 993 -806 170 676 -682
2065 -682 5 339 -164 29 -66 254 193 -179 806 246 -563 787 232 -660 667 -84 -794 760 -136 -382
2085 -382 304 -150 -173 -148 -415 60 -131 -208 478 -758 122 708 -847 44 929 -559 124 615 -928 244
2105 244 492 -543 63 195 -319 -87 -523 -154 -22 -956 274 -32 -494 809 202 -348 1176 -64
2123 -64 -267 576 -124 -278 695 3 17 248 -680 -33 -433 -242 558 -549 -373 366 -836 123 836 -684
2143f84Q70L37j002Q37Pm92J90l18q1K51m92P88q56k43J371q79k99J570p77o02
2163e04J617r90j4J158r26n24P70o77L55k91l73O03j308M94J084j696R37K85j615
2182a615J755K32j018J010M82j168J124k45l01L50l72J61l65j92P76r63o38J535
2200E48j082k11J462j095j29J248r65%P32l70JJ89k9K3p43L18M23r78N73K69j393
2221a209J014L87j604J362K99j129J506k0n44M97j95J99K41p75O21k81l41M12
2239D40n92l83J076j131k01J189r63j75J029j009L86P74m28O7k17J67M17l07O3
2258B02N42j263Q06M35j627P95O79j592J519j34q99Q96m09l77Q81m00k27K03m3
2277a3M65n33m04J001o75l55R89p71j03Q84q60k52J015o81J60K23k53L75j95K63
$$ plain form
2143 -684 186 523 -479 358 365 -127 63 -255 -336 -85 -577 211 -645 -888 483 -396 -695 875 98 -504
2163 -504 1113 123 109 1267 341 -183 587 -90 265 -26 -399 204 -1104 -610 474 -1222 -285 0 -1615
2182 -1615 140 372 -646 364 846 -322 802 557 256 606 234 395 30 -162 614 -349 -987 548
2200 548 -534 -745 717 -378 -507 741 -224 -224 508 138 139 328 299 322 -421 -103 320 -658 -85 184 -1209
2221 -1209 -195 192 -1412 -50 249 -880 626 606 62 559 364 563 804 29 650 369 28 440
2239 440 -152 -535 541 -590 -791 398 -565 -740 289 -720 -334 440 12 79 -138 29 446 139 202
2258 202 744 -519 287 722 -905 -110 569 -1023 496 362 -537 359 -50 -427 454 54 -173 30 -13
2277 -13 452 -81 -485 516 -159 -514 475 -296 -399 485 -375 -627 388 -293 -133 90 -163 212 17 280
2297B80L9m94O21K96j367J102L83j877J304L46j097P51j99q22N96%k73L67k98
2316c42K25J88k76M44l65m13J102l66o13J299j028l24J238r64J44O15p60K69J70
2335B43q8l6l90L76j52m79O58J68q38P36K83j297R10K33j126Q36J6m28M47j22
2355e0P1K9j53K90p4o20J053o69k10J227r16p84J779j108pJ050j274J59N35n30
2375b02K53r3M2M89j073O35R9q92P95K31j071Q90Jj035J312N5r50Q53j89n01N11
2396A60n03M39O1o26Q44l94N4P58p32j73J072j043Q7Q21j120L2P87q34M01O9n49
2417c89L39k9n1K26m34K40l5n69P63L51r33Q14q4o51J061k16j048Q78l09m17M80
2438a3k92L11j16m82Q73p50LJ168j094rR71p93K29Q90j251L41N39n17K58k9m84
$$ plain form
2297 280 319 -175 446 742 -625 477 860 -1017 287 633 -464 287 88 -734 -138 -138 -411 -44 -342
2316 -342 -117 71 -205 239 -126 -539 563 197 -416 883 -145 -469 769 -195 -51 564 -196 73 243
2335 243 155 119 -271 105 -47 -526 132 300 -538 198 481 -816 94 327 -799 37 53 -375 72 -50
2355 -50 21 50 -103 187 113 -507 546 -123 -333 894 -22 -806 973 -135 -142 908 -366 -207 328 -202
2375 -202 51 -42 0 489 -584 51 150 -742 53 284 -787 103 104 -931 381 436 -514 339 150 -351 160
2396 160 -343 96 157 -469 375 -19 35 793 61 -112 960 -83 4 825 -295 -263 524 -310 91 160 -389
2417 -389 -50 -79 -130 96 -338 -98 -133 -702 61 412 -521 293 209 -442 619 403 -645 233 -76 -493 -13
2438 -13 -305 6 -110 -592 281 -469 -466 702 -392 -401 570 -223 6 896 -355 -14 525 8 266 237 -247
2459b47N91m37L61K11q17O20j50q12R24j51r66J061j57m93O28J12m71O47p20K71
2479Enj67K08l42m31J009o06k89J000q54K46J036j068l9Q15o52J61L33m46M41
2499C55m5k33R3k67L10J70q17P70q8j118J191j77n90J045p67l16P38k74P0K01
2519B51k81M3Q9l79P52n84N5O50p80oO79p99j10N98n37R8L23m39J95L19k01K18
2541A54j87o5K15n07Q21P2p91R15m43k85M40j49m93Q36n55m04O71m54Q1K00j7
2562E5j59o1j94P34l14k99Q60p42k58J428j298J29N23q89K00M04o37M10N1j97
2582b54J99k36J93K52m59N68J57n73Q82k00r43R43l11m38Q05l96k86K18p56L98
2602b37j05k85N58k06k17R52n33O7L57l53p9R24r88K58L39n73O30j02m35J00l69
$$ plain form
2459 -247 344 -93 268 479 -338 282 132 -680 244 93 -873 188 31 -462 166 278 -193 454 -266 5
2479 5 0 -167 41 -301 -732 277 -329 -618 382 -472 -226 810 -258 -297 518 -134 27 360 -86 355
2499 355 310 77 170 -97 213 383 -434 336 248 -870 321 144 -446 599 -168 -484 254 -20 50 251
2519 251 -30 13 102 -277 475 -109 -54 596 -184 -190 489 -310 -420 178 -359 -261 62 -377 -182 137 -64 154
2541 154 -33 -98 117 -390 431 503 -288 627 184 -101 339 190 -303 533 -22 -426 245 -209 -128 72 55
2562 55 -104 -165 -359 375 61 -238 622 -120 -378 1050 -248 -119 404 -485 -285 119 -518 -108 -57 -254
2582 -254 -55 -291 -98 154 -305 263 420 -153 729 529 -414 529 218 -220 585 189 -97 121 -635 -237
2602 -237 -342 -627 -69 -275 -492 460 -73 -6 351 -2 -81 843 -145 113 452 -121 509 407 -28 72 -297
2623b97J14K52n98M16M64r11Q77l20m28R89k09r51J138j02q15N59J46n02OQJ90
2644B6k11l04L40j98N5N26l97p6N08m54M26K88m49Q8K24l89L51j22k08L20n58
2665b14MK76o83O16n1o66J090m63m71R33m70j49O61l60k42O73m61j8L50k86K32
2686C01j26k98L10n47J94N62j015J82O77q70L99N93n54l2N58k07j39K63k08k9
2706A4j53K43l0m38N29J44j123R92l74m29Q02j54k19N79k00l80O86k38L0m0q1
2727A60N1m15J35N24q78K78L00q26M06P27j162M05L64o76O56L2l18O4k5J23R1
2748A6j84N07k52l67M74j76m20O69p8p65J112m37k68M14k71J29K42j24p5l0j07
2769IL42j52m60L83n94K87L50n35J40N16q75M20M70r00O15K76j83J65l29J47J16
$$ plain form
2623 -297 -183 69 -529 -113 351 -560 317 -3 -431 558 349 -602 536 434 -381 178 324 -178 -172 -164 26
2644 26 -185 -489 -149 -347 -292 234 -163 -239 269 -185 241 529 80 168 392 3 354 232 24 344 -214
2665 -214 -210 66 -617 -1 -52 -718 372 -91 -562 371 -99 -248 413 53 -189 484 23 5 355 69 301
2686 301 175 -123 187 -360 -166 396 -619 -437 240 -630 -231 362 -192 -224 334 127 -12 251 43 14
2706 14 -139 104 74 -364 165 309 -814 178 -196 -625 177 23 -196 383 183 -197 489 251 281 241 160
2727 160 211 -204 -69 455 -423 -145 155 -671 -265 462 -700 -295 69 -607 49 81 -237 -173 -198 -75 16
2748 16 -168 339 87 -280 194 18 -402 267 189 -576 536 99 -169 245 -26 103 345 221 146 116 9
2769 9 351 199 -261 122 -472 -185 165 -370 -230 286 -589 -169 301 -599 16 292 109 274 -55 92 208
2790B08l88O19k53l78O11j41n36P41n93l47Q79o83l72Q12k75l8R4k31N99l97p5
2811a44K69k80K9N26o51K78M31q68L65L63q78M65J64n07O83n2k83N33o80K62j5
2832A0k30N21jo74N17M1o57P57k32l89M66j85p7Q5r8J98k70j0L58m1j36L40m19
2855a26OO28q48L67M28n88K76O9o81K59K16n26K18R0J26j09m46R35k99l88P50
2876C57l33m98R44l66m42Q14l50k39O64o17J53qk3K33m74O2K88m50K61N44q79
2897c59O97K0n77L19L89q75M02K04n73M40k19k12K64P5j93K75n17L39L5n40J017
2918D11k43o77Q16m1l88O96n22j39M06l92K27k65M2K01k94NN70n64K13K93n22
2939a67K25L00o97L70M21q04P32k41l86K83j19O2p3k6N5m7k96L24k71J54J61l95
$$ plain form
2790 208 -180 439 186 -192 419 278 -258 483 -110 -457 422 -261 -633 179 -96 -134 -40 -271 328 -69 -144
2811 -144 125 -155 -126 400 -251 27 458 -410 -45 318 -560 -95 69 -438 245 193 -90 443 -237 25 10
2832 10 -220 301 300 -374 143 184 -473 284 52 -337 129 -56 -133 -48 -146 52 -218 -228 130 89 -47 293 -126
2855 -126 -120 508 -340 27 455 -133 143 212 -469 -210 6 -520 -302 -212 -86 -195 -641 294 -5 -393 357
2876 357 24 -474 470 104 -338 476 126 -113 551 -66 87 79 56 289 -185 -123 165 -285 -24 520 -359
2897 -359 338 358 -219 100 489 -386 16 220 -353 87 -132 -344 -80 -5 -198 77 -440 -101 -66 -606 411
2918 411 168 -509 307 266 -122 574 52 -87 319 -73 154 -111 -69 132 -162 -157 413 -151 62 355 -167
2939 -167 58 358 -339 31 452 -352 380 139 -247 36 -83 -21 -94 -120 -65 -112 -408 -84 -355 -201 -40 -435
2961d35J52P74p20J56L52m24K64n7k49K00Ok51N34l49J29O38q94R7N84p87K74
2982fK43m89L94j05m18M54N5k53M5N8k48J30O4J07j16p9L11j59k16N05m95Q3J76
3005D1m58N2N87n46K14L52l23L69m39LM39k8m7K23q55O24J62q13M99L39q45M91
3027D1rl01L72l93L41p1L3J31l6l28M36k14m0N35p19K67J10l44J4N27l68j94L42
3050A32k62p0M5R0J51l85K34L36l31K86J48o42P02O3n31L76l23k24M16k41m96
3071e26O58m37L27j03k1K79j64j68O10l93l00Q07n14pM15l99l17M94l42k54M73
3092A18j82O8j82j5N3j07J94K47o90O08J09l22M41j0l53J89nk27J02J22j19J01
3114A40k35N7K72n95O75l11k38M09m7qK56n86J51L35m94n7N05k41K39l19K0m0
$$ plain form
2961 -435 -283 491 -229 -73 279 -145 119 62 -187 13 19 -232 302 -47 82 720 -174 -77 507 -280 -6
2982 -6 237 -252 142 37 -381 73 128 -125 -80 -22 -270 -140 -76 31 -85 -164 147 -12 -228 277 -218 -135 41
3005 41 -417 -365 222 -324 -110 242 -81 288 -151 -148 291 263 216 439 -416 208 370 -443 56 395 -450 41
3027 41 32 -269 103 -290 51 -20 13 144 108 -220 216 2 -38 497 -222 45 155 -189 -175 352 -16 -210 132
3050 132 -130 -200 -155 -65 86 -299 -65 271 -60 226 374 -268 434 497 -34 342 19 -205 211 -30 -526
3071 -526 132 -305 22 -81 -102 177 13 -155 455 62 -238 569 55 48 463 64 -253 241 -101 -355 118
3092 118 -64 4 -178 -193 -140 -247 -53 194 -496 112 221 -101 340 330 -23 166 161 -66 36 158 39 140
3114 140 -95 -38 234 -361 314 3 -235 174 127 119 375 -211 -60 275 -219 -276 229 -12 227 -92 -72 -112
3136a12L8k0J75l84K32L68p75P22K1n41O57q5m69O23k74j09M67m72j39K23n15
3157c69L70n5M7P8k28j10M36m07j3J83k20j04J96K65j22N9L0K95Q6k79J69l31
3179b4K32j2m57L37nk82K49L17l98J24J42m44L76N4j84Q3r9o2J26k52P04m25l81
3202b81M01k08j94K31n6j59O49o80J30L65k88K58M3l90K30K3j33K08l37L4L40
3223A86p41N69R3n04O03k30k50N28k72k09N57n26J01K60n47M07L17n42L95N3j34
3244A14K46k01j91K58l26r7K64m87M45K42o42L84j52J71j17K14k18L17l45O44
3264E23m38m01p8M30l55J29j35p5M47J35l60L46k09R9J23n27O15M7m89L34J04
3285B65j20J99l39n1L79m34L82k67k24K66J39l58J41J15m06N49l54M2K71l28L02
$$ plain form
3136 -112 -74 -94 81 -303 -71 297 -478 244 265 -276 381 296 -173 450 176 67 534 62 -77 146 -369
3157 -369 1 -54 -7 71 -157 -267 169 -238 -251 -68 -288 -392 -196 69 -53 6 36 331 417 138 307 -24
3179 -24 208 196 -261 76 71 -211 38 355 -43 81 223 -221 155 209 25 108 9 -53 73 -179 525 100 -281
3202 -281 120 -88 -282 -51 -107 -266 383 -297 -167 198 -90 168 211 -179 51 74 -59 149 -188 -154 186
3223 186 -555 14 107 -397 206 -24 -274 254 -18 -227 330 -196 -95 165 -382 25 342 -200 195 248 114
3244 114 360 159 -32 226 -100 -197 67 -420 25 267 -375 9 -143 28 -89 125 -93 224 -121 523
3264 523 85 -316 -394 36 -319 -190 -325 -400 47 182 -178 168 -41 58 181 -346 269 316 -173 161 265
3285 265 145 344 5 -46 333 -101 281 14 -210 56 195 -163 -22 93 -313 236 -118 -76 195 -133 169
3306A69K53q71O70j47j38M17l97j06K10L3j29L26j08m71L65j63M05l17j13K24
3326A12k75KO20l74k46L64n05L14j6n1o8m2j04J38J66j40J05l09J38L07l80M55
3348B11J14r2k17L11n62O51l65j86M55k90m1M14l83j46J08j89L75k13lj9M7J15
3370I5J0j94J83L44l68k9R4J14k6k58j13J49J00r6Nj91J71k15mJ62J35k86M93
3393B75m03m8M70m06J68J0j57JK46l27R2K09J7Ok4l35J91K3O2O1j53k33N20n19
3417b54J1N58l43J23Ql20K99l68L59J5l57L79l77Q3L44j39q4J29k18R3M7m6m4
3440a02N11m92j0K37n8K0p9n04N91n13N58j70L0KJ58m46J44M49m45N82j92k28
3462D3Rj03K0j21J39ML99m19L0m9m4P7M5j59L25k99K37K00m06pL61l15l4j14P1
$$ plain form
3306 169 422 -449 221 74 -64 353 -44 -150 60 93 -36 290 182 -289 76 -87 318 1 -112 112
3326 112 -163 -161 459 85 -161 203 -302 12 -4 -55 -123 -165 -269 -131 35 -105 0 -309 -171 136 -244 211
3348 211 325 233 16 327 -235 416 51 -135 320 30 -11 403 20 -126 -18 -207 168 -45 -48 -67 -20 95
3370 95 105 -89 94 438 70 41 135 249 223 -35 -148 1 101 5 10 -181 -10 -225 -229 -67 68 -218 275
3393 275 -128 -176 294 -112 56 66 -91 -90 156 -171 -79 130 147 153 129 -206 -15 8 70 131 -22 -255 265 -254
3417 -254 -243 315 -28 95 103 -217 82 -286 73 88 -269 110 -267 -184 160 21 -63 66 -152 -59 -12 -58 -102
3440 -102 409 -83 -93 144 86 106 27 -477 114 -399 159 -11 19 21 179 -267 -123 326 -119 463 271 43
3462 43 52 -51 -31 -152 -13 -9 390 -29 1 -48 -92 -15 30 -129 196 -103 134 334 -72 -79 282 -33 -67 -181 -110
3487a10K13j44J95J66l28k63M38m96N41j50j03J92k0l30M96k85l68M65l60L60
3507A09j4k40K69J42l71p5Q8k02L04j69J66j09j41L00k03j03M44k15M4o1j0l2
3529g9j6J0R3J95m24J41K55k45J49J60m82M37k38J47j24P5k43K51k54K25j99N2
3551a14J92q1K5Ok7Q5K60m24n3L30k82m1j1R2M8M8K6j64J34j90J74j35K39M9n6
3576A30j94N41q80N54j18k34L68m2n21L89J14k31J80k18L17k8k50L9K88l74K15
3597D5J89l76K36Lnj88j45J05j45O6O2J69k07K65kl7J87n25K89J50k78J06K30
3620A94p0q5J14k2r2k42J89J77j99j04K8K6P1r4m1L41r7l01L54r1j6M5k09KJ81
3645E9j88R5R9k04L55m43L05L02m07R0M5k57j6K54j32J47R3m27j4L50M0J91l93
$$ plain form
3487 -110 103 -41 154 320 -8 -271 167 -329 212 62 -41 151 131 -199 297 12 -356 109 -251 109
3507 109 95 -145 124 266 -105 -180 -92 -294 10 -159 7 -102 -243 57 -146 -249 195 -20 24 -37 -47 -79
3529 -79 -95 -85 8 203 -221 -80 175 -70 79 239 -243 194 -44 103 -21 54 -189 62 -192 33 -166 -114
3551 -114 78 -3 22 28 1 86 346 -78 -131 199 -83 -124 -135 -43 5 53 79 -85 49 -141 33 -102 137 186 130
3576 130 -64 477 -403 151 33 -201 167 125 -396 -7 107 -124 56 -162 155 127 -123 -84 204 -170 45
3597 45 234 -142 94 97 92 -96 -241 -136 -281 -215 -153 16 -191 74 72 35 222 -303 -14 136 -142 -36 194
3620 194 124 39 153 131 39 -203 -14 163 -36 -140 -112 -86 -15 -109 -150 191 94 -207 147 56 40 85 -124 -122 59
3645 59 -129 -34 65 -139 216 -227 78 380 -27 63 108 -149 -165 89 -43 104 197 -230 -244 106 146 337 -56
3668e6j89M61m06R2O1J97Q2m7l62K00K34n97O01j37r8N6j30P8k48J92J72j29K26
3691B53r3r3j43P2j12R6P4n1K02j81k21K38J07l00J28oj17rJ39o4K6J23o0j63
3715a55j26N55j35k98k7Q7J4P3K22q4J40k58l44K48r6K90l10J02K29j12J00j27
3737a2j13K00J88l89j58J54J36L2K49l91J24l0j78J70n2K86n8k87J15j05l2L80
3759B29K8o83L69n4oK92k38l1o2L96j61k17j39K43m4n8rM58n40P7J36N4M2k82
3783b00m6J45L08k54K27J1l38J15j60J09J91j11LR2J18k64k39J05J9J11R2O9k24
3806a21K36j71J45k01n1J85O9n5n8L04j29K7j17P7o7q6PK5k71K52k7O0O3j60p
3831g1j8K0M3j7qJ84j8k50L1J99Q8p9k17QJ53J14j00J48j2k64N1J46J6J9k18J32
$$ plain form
3668 -56 -245 216 -190 -98 -37 160 242 195 -167 33 267 -330 271 134 36 92 -38 40 -208 -16 156 27 253
3691 253 160 67 -76 -4 -116 -20 54 3 205 24 -197 41 148 -152 -24 -30 -147 -156 -17 -81 -55 68 8 -155
3715 -155 -281 274 139 -159 -186 -99 -85 -12 210 126 266 8 -336 -88 -184 106 -204 -102 127 15 115 -12
3737 -12 -125 75 263 -126 -284 -130 6 38 287 -104 20 -10 -188 -18 -70 216 158 -129 -14 -119 -151 229
3759 229 257 -426 -57 -111 -117 175 -63 -94 -156 240 79 -138 -277 -34 -78 -136 -145 313 -227 -150 -14 40 82 -200
3783 -200 -246 -101 207 -47 180 191 -147 -32 -192 -83 108 -3 0 92 210 -54 -293 -188 -169 -58 34 103 -121
3806 -121 115 -56 89 -112 -163 22 91 36 -22 282 153 180 63 140 73 -13 -6 19 -252 0 -27 33 96 -64 -71
3831 -71 -89 -69 -26 -43 -51 133 115 -135 -104 95 183 104 -113 -105 48 162 62 210 198 -66 -15 131 147 166 -52 80
3857H0l10J54j19J44J15M1J62l73M8j86L88j39k08K58j71j38M93m30K48j65L2
3878g6K20j44L7K38k43LJ48k64R3r6RK05n0j49j41K99j59R5J00k21J70J49l53
3901a30r1L72j2l35J31J85P3k36Q4j09K9K60k73Kk03K14q0J72k17J42J15j0Q7
3924A70k63j38L25j86no7L5L97q7K5j12j92M13k68j02j66J12K21J51M7n05R6J19
3947B0k08J50O5r2M84n67j6K94m5k08M27k84k1lp7K80pk1j90kJ41K84k66j18j14
3972i4R0N5rj72M43k27j41J94j76L5J11j51k06K27L5R4j61j09K01P0K7k17J70
3995H9l23M36m02o9L62n3k16N2L66j08k12o2J77J07k04O1O7J45k1k33K72l26n9
4018a54K78k05Q9j22j53M36N1k13k0R7n2J39k44j30L28k13r1L19l85K82j09J20
$$ plain form
3857 80 -230 -76 -195 -51 64 105 267 -106 -58 -244 144 5 -203 55 -116 -254 239 -191 57 -108 -76
3878 -76 144 0 37 275 32 35 183 -81 12 -84 -75 130 80 -69 -210 89 -70 25 125 -96 74 223 -130
3901 -130 -221 151 139 -196 -65 120 193 -43 41 -68 -39 221 -52 -50 -253 -39 -119 53 -164 -22 93 83 170
3924 170 -93 -231 94 -92 -97 -164 -129 268 181 206 94 -98 315 47 -55 -221 -109 112 263 310 -195 -99 20
3947 20 -188 -38 27 -65 419 -148 -164 130 85 -123 304 20 -1 -4 -81 199 192 171 -19 -21 120 404 138 20 -94
3972 -94 -4 51 42 -130 313 86 -55 139 -37 -2 109 -42 -248 -21 14 108 -53 -162 39 109 136 -81 89
3995 89 -234 202 -200 -269 93 40 -176 -124 242 134 -78 -140 37 144 -60 1 68 213 192 -41 231 -95 -154
4018 -154 124 -81 8 -114 -267 169 220 7 -13 84 32 171 -73 -203 125 -88 -179 140 -245 37 -72 48
4040D8j42J58Q7m8k75L97n03L05j36P1L61m53r3M04j20p3j57Q6k06K04M35n63
4062b13l0L86k5%r8mP6q8J9k85M41j17l0M8N4j13K01k92mj58J18K80m29K71M2
4087E0k68P5j29K99L48m19J48j68M0j45K39j8J14l24P8N8O3j69mJ80p8R4K3P9
4111A66j2l28J2K2nk4Q4k65K43R9M7L7p9k11L12j48j3L07N2j30q1q3k21L49k17
4136h7K64j94J56r1J7j27K4j21J28J67l26L02J29j89k25K78n1k41K07j39L62m65
4158b22P1J13L9J29j19j29J91J80k87l4j17L2K66j19j02J53Ol3m2rop7L0k7N6
4183e7k6j74k2L01m61L92K70m79L25J21l11J86Mj33J48j64O8j18j27L30j52RJ30
4206F0j81J01J97M6l71l5R8J62j23L4O7n5O1j74M2q7L23k23j03J74J06m03J04
$$ plain form
4040 48 -94 64 151 103 -172 225 -278 27 -109 -38 323 -130 -223 181 61 -12 -169 -83 -289 -85 350 -213
4062 -213 -243 143 118 118 20 16 92 4 23 -262 179 62 32 80 134 21 222 -70 -74 -232 -114 166 -263 8 50
4087 50 -218 -143 -272 27 375 -44 104 -64 -24 -169 70 52 166 -158 -80 -22 41 -128 -132 48 -30 64 87 166
4111 166 154 -174 -162 -140 -145 -169 -85 -350 -107 -8 39 76 -3 -214 98 -50 -63 244 296 166 85 2 -219 130 -87
4136 -87 177 -17 139 48 65 -62 -38 -159 -31 136 -190 112 241 52 -173 105 54 -187 20 -119 243 -222
4158 -222 -151 -38 1 130 11 -118 73 253 -34 -68 -185 -153 113 -6 -108 45 51 18 -24 -33 -39 -116 -86 -113 -57
4183 -57 -83 -257 -279 22 -439 -47 223 -256 69 190 -121 65 69 -64 84 -80 -12 -130 -257 73 -79 -70 60
4206 60 -121 -20 177 223 -148 -183 -85 77 -46 -12 55 0 61 -113 -71 -158 165 -58 -161 13 119 -284 -180
4229a80J85j42K17k44R8m4K22l33M05K4j40J6r4J76l28J67L38m02j39K63j09J60
4251A16j16M9J79k61J17L8k15p2K08k04M71k77j39O6J10o1j20J6k09M23m70N22
4273A71q6k78M0K4m7J11J42J85l37k31J26R2k46M53L6o0J5m07M45k09oN7K5p1
4297e6N04n61M9O6J82O2j71J32k51K03o4l02K76j4j55J9M5K67k26j1L17k50j7
4320D4l6o2Q9L82m31j57J81o7J11N1o4j51N8r3j19L81j50L7k6oJ78m9m7M4Kq6
4346A4p7N7J56j53k40M76J71m92N4k23M16j38P4Ol2j9p0l4k91L10rj6j7K32m07
4371b52K90N6j09l07J78P5p9J30K28q8N4l0K29l08k38J18o5J34J9pp2P2O4j72
4395h0j9J55J30l12L34j24P7k01k10J54Q6R4m2J15j50K84k38j23N2j33p8L25k03
$$ plain form
4229 -180 5 -137 80 -164 -66 -110 112 -221 184 208 68 84 -10 166 -162 5 343 -59 -198 65 -44 116
4251 116 0 49 228 -33 84 122 -93 -165 43 -161 310 33 -106 -40 70 9 -111 -95 -304 119 -351 171
4273 171 85 -193 -153 -129 -176 -65 77 262 -75 -306 -180 -88 -334 119 155 95 110 -297 148 -61 -67 -10 15 -56
4297 -56 448 -113 -64 2 184 246 75 207 -44 159 95 -207 69 55 -100 -81 -36 231 5 -6 311 61 44
4320 44 8 -54 35 417 -14 -171 10 -57 54 105 41 -110 -52 -145 -264 117 -33 4 -22 -28 150 101 54 98 100 14
4346 14 -63 -6 150 -3 -243 233 404 -88 -34 -257 159 21 95 101 69 50 -20 -54 -345 -35 -44 -60 -77 155 -252
4371 -252 38 94 -15 -322 -144 -69 -148 -18 210 122 176 146 375 67 -171 -53 -118 16 35 28 -44 28 92 -80
4395 -80 -99 56 186 -126 208 84 161 -40 -250 -96 -10 84 42 157 7 291 53 -70 -18 -151 -229 96 -107
4418a07L15j92PQ4j89L22j9l21o0K47k49K17J4m8J48l6j61J22j30p7L6J58p6J06
4442A11m6L21l37o9J95j64j25rJ35j23N4r4J36q0K56k5k2k05J58j47j0J6P9q7
4466h2L2m6o1L00k77m5L77l7O8l27Q9j8J07j36J21J97k63N9J16m3l04J9O0K35
4490A41m5r7l20K77j15J65PJ45k49n4L18j59rj60L42j59q6N0K69k50L7k6J35r6
4514F1k83N8K99rr6L5j89K87L9p5r9k31J90p0J33k0k7p9J96j14J66j88j20K75
4538A39l55K88mj69L02n9K26l98J16J48l68K28J91j29j70j67M09q3k67J92n9J77
4560A88j09P5n81N03l27N4K93k83j53M49k05o2K61l16K13R5LR9o8k37j34L36j32
4583c8N0J36q1J56j24o8m5j27K70l19L1J35p5p3K04k72M47j36m51K28M53l30R8
$$ plain form
4418 -107 208 16 23 107 -82 240 221 -100 -160 87 -162 55 69 21 169 133 -28 94 -36 -113 -77 81 5 111
4442 111 65 386 49 -20 175 11 -114 -123 12 -111 -57 -151 -15 -95 161 136 114 -91 67 -80 -90 -74 5 -82
4466 -82 -50 -96 -157 143 -134 -179 198 161 229 -98 -9 -27 80 -56 65 262 -1 58 174 131 -173 -154 -94 141
4490 141 96 -1 -321 -44 -159 6 13 158 -91 -145 173 14 5 -155 187 28 -58 -8 261 11 48 22 157 61
4514 61 -222 -164 135 126 30 65 -124 163 202 127 28 -203 -13 -83 50 30 3 -76 120 6 172 -16 -136 139
4538 139 -216 72 68 -101 201 142 368 -30 86 234 -134 94 285 156 -14 -181 228 145 -122 70 11 188
4560 188 79 154 -427 76 -251 -197 96 -187 -340 109 -96 -158 103 -213 0 95 98 197 129 -108 -242 94 -38
4583 -38 12 148 67 223 99 31 -14 -141 129 -190 -159 -24 -99 -172 32 -240 207 71 -380 -152 301 -29 69
4606F9J14k73k3m2J23J80j86K0J94l62K94k56J33K26j74j17K36j56J10m7J31k21
4628b7J7J12j25R9M0M8j04j86J72j09j7J53j90K06m3k00J53k40K30K22l15J81
4650G7m44K51R5K69j96k40K60k82O5k9J7K97j64O8j13n7q3LL53j99R9j88j91N05
4674A73o9j79q7k24M52o0m7J61k00P3K2j08J07J13j86J7R0K4k80M26l11K42j00
4697D9l0k16J32K96k24J11l22M38o1M7k23l1J77m5k85J89j29N2L9K02l07J60l73
4720c54M08k25r7M02n9k37m2K46J97o0k41J49j19J13J8Q5k16Mk41L97p3N9j95
4743h1L66l53J91j58k09L40j03m15J69J23J90j07nQ6j35R0J07Q6k87K22l80K45
4765a8k40K15J06J4k56K38m3pK44m00j4J33J40j66k20J85q0NM0L24M3n11j18L77
$$ plain form
4606 69 183 -90 -113 -155 -32 148 -38 -18 176 -186 108 -148 -15 211 37 -80 156 0 110 63 194 -27
4628 -27 -10 102 -23 76 116 164 60 -126 46 -63 -80 73 -117 89 46 -154 -1 -241 -11 211 -104 77
4650 77 -367 -116 -21 248 52 -188 72 -210 -145 -174 -157 140 -24 44 -69 -126 -209 -206 147 -52 47 -141 -332 173
4674 173 104 -75 -162 -386 66 6 -41 120 -80 -7 15 -93 14 127 -59 -42 48 72 -208 218 -93 149 49
4697 49 19 -197 -65 231 7 118 -204 234 173 220 -3 -34 143 98 -187 2 -127 -75 -36 166 -141 19 -354
4720 -354 54 -171 -268 134 75 -162 -204 42 239 179 -62 87 -32 81 99 184 -32 -28 -269 128 55 114 -81
4743 -81 285 -68 123 -35 -244 96 -7 -422 -253 -130 60 -47 -52 34 -101 -11 96 182 -105 117 -263 -18
4765 -18 -258 -43 63 77 -179 59 16 9 253 -147 -161 -28 112 -54 -274 -89 -169 -164 -124 200 243 -268 -386 -9
4789iR3J38l8k48Ol1K04l2j86L53k06j38L09Q7J0r7j30l91J59j4K8K28m8j71K
4814a22K45j16k48M9J44k0j2J58K5Kl73RL37J2k2k60L53j90q1j00M44M4n10J69
4838f3L8j21J11k4r0K28r3n6j21O0K4J63k94K7L54j49j45K65K2J2J83k11oj47
4862c3l3MK45M3l14J89o7P5j2j32J76J7j90L10n5J8k58R6N3j26K64k33l4p8PO8
4888@J97l2j30J4l16M37k27J5J47k23J16O5j91OK18j08j28L57m17J36L7Q7q8%
4912b8J42p0J80n49K00q6K22r8m3j68K83j04p4K06M9mp4q0L5oJ79k87J33J59k07
4937i0RJJ40J60k74P6k64J98k5J20Rk3m3J28j02L3j57n9L35j71j10Q1K5O0j18
4962f1L3j73q9N08j87k64K01pK3J97l2j15M1j12J19j6M8J24k75J94l3l38J83M15
$$ plain form
4789 -9 84 222 184 -64 -58 -89 115 83 -103 250 44 -94 215 302 312 215 85 -306 -147 -161 -133 95 47 -124 -122
4814 -122 123 7 -241 -192 -48 -68 -80 78 103 105 -268 -259 78 90 68 -192 161 -29 -110 -210 234 278 -232 -63
4838 -63 -25 -146 -35 -59 -149 79 -14 -70 -191 -131 -107 56 -238 -211 143 -6 -151 114 136 148 331 120 114 -33
4862 -33 -66 -62 183 226 -88 101 34 109 97 -35 141 158 -32 278 223 241 -17 79 132 6 270 37 3 -75 -68 0
4888 0 197 165 35 49 -267 170 -57 -42 105 -118 -2 63 -128 -122 96 -12 -140 217 -200 -64 -27 60 -28 -28
4912 -28 114 44 224 -325 -125 -211 11 -87 -130 -298 -15 -119 -193 13 62 58 -16 -96 -61 -67 112 -175 -42 117 -90
4937 -90 -81 -80 60 220 -54 22 -242 -44 -69 51 60 37 -6 122 20 53 -104 -163 172 1 -109 -28 -3 57 -61
4962 -61 -28 -201 -290 218 31 -233 -32 -39 -16 181 149 34 75 -37 82 66 114 238 -37 157 124 -214 -31 384
4986C84o05L05k28L47n37M6L15j68r9j8j35M95j59J9r0J11n6K10J33k26j81J9
5008a18M29k49Q0j34p1kP7r2j3J81k68K5K34k4rj44K89Rl53L64l17k32J08K23
5032gj33o1K44l28L50k13J38L6Q9M8m03j04K14J42j30j40M32j48J04K9k46K50
5054A63l52N0J76l7J76k89K52K08k32j21K01j82j19M03l49M9n4J78k74J33r1Q
5076a03J9k87K34N88l89k2j25j4R0K27m21M51j95l1J44l88M23m07j81M08M7p1
5098cR0l08L17J94K2l52J24k00J88K84l66K01m13J38p8J1M57k49p2J65j22P0k51
5121a53N0R3j61M20j28j67m3J02P5J41m17J55M3J12k6j78L40j78j04J72k84K25
5143H9P6l62K59K2Ml90P3K09J90j25o0J59k89n6L09j07q9J29k97L29j14j30K21
$$ plain form
4986 384 -221 84 -144 203 -334 -288 27 -141 -240 -258 -393 102 -57 -38 -128 -17 -73 137 270 44 -137 -118
5008 -118 311 62 142 8 -63 -65 12 -80 -93 88 -180 -155 79 55 46 -98 191 200 -153 211 -106 -338 -230 -7
5032 -7 -140 -201 43 -285 65 -148 -10 26 115 163 -240 -344 -130 12 -118 -258 174 26 130 159 -87 163
5054 163 -189 -139 37 0 176 -113 139 347 115 -6 195 13 -106 297 -52 -3 -57 121 -153 -20 -111 -103
5076 -103 -84 -371 -137 451 62 40 -85 -99 -9 218 -203 248 53 22 166 -222 201 -206 -387 21 68 -3
5098 -3 87 -221 96 290 312 -40 84 -116 72 356 -10 191 -222 -84 -162 -151 306 57 -15 150 28 98 -153
5121 -153 -103 -10 -171 249 121 -46 -89 13 88 229 -188 -33 10 122 96 -82 258 80 -24 148 -136 89
5143 89 165 -197 62 84 88 -302 -229 -20 170 45 -15 144 -145 -201 108 1 -88 41 -256 73 -41 -171 50
5166E0p3k9j76J93Q3l60J20K91j01q1n6K60k52L01n12K87K43m60lL64j8N6k32
5189a05R5J13q9l24K13N4J79k16P8J20j99J5R1l0M6O4m3k29J87K4J83l28k6J54
5213B7j7k4m4m33K81M38l07j2j48L47J84j81k55J93j77N2N07l47mJ94n58J64J21
5236Ao7N9j21j90K55J21k48L27J22l07J08l12K04k4R5k8Q6K30j08k97j70M55l90
5259a99R2J27k28N75k87p1J67j97p9J44r0K63k24J81m42L52j50O1j9j3J93j69
5281a3L30k71j40k4J71Q8q8J51k03K43k85j27L95j43j17K63m84k4M05k01k98M28
5303E6O9j90R5j64N6M54m37J67o7j18j57p1J73J86j74P7M9J2m6Q0J8P6j10l0Q3
5328H7k59J11K38l16J68j0l63L03J2K18l0N5l50J13l50K25J36j00J70k47J54Q0
$$ plain form
5166 50 -23 -52 -228 -35 48 -312 -192 99 -2 -83 -139 121 -131 170 -342 -55 188 -272 -275 89 71 127 -105
5189 -105 -10 103 14 -310 -97 -43 136 -80 -2 118 -81 -66 25 -5 41 105 62 -167 20 44 227 -101 -127 27
5213 27 10 -14 -58 -491 -210 228 -79 -91 -239 108 292 111 -144 49 -128 -76 431 84 80 274 -284 -120 1
5236 1 -66 -7 -128 -318 -63 58 -190 137 259 -48 60 -252 -48 -72 23 -5 81 311 203 -94 -264 191 -199
5259 -199 -107 20 -208 367 80 9 176 -21 -100 44 -46 217 -7 174 -268 84 -66 -5 -24 -37 156 -13
5281 -13 317 46 -94 -118 53 141 53 204 1 244 -41 -168 227 84 -33 230 -254 -278 127 -74 -372 56
5303 56 125 -65 30 -134 -78 376 -61 106 39 -79 -236 -307 -134 52 -122 -45 4 16 -30 50 68 144 34 4 87
5328 87 -172 -61 177 -139 29 19 -344 -41 -29 189 159 214 -136 -23 -373 -148 -12 -112 58 -189 -35 45
5350D5R0l70K35k6J91j09l67K84j22n5K49l8L7J64j71J87k47n8jJ90j21L2K10
5373B29k06q0k9p1K97l43L50j76O6j71N92l41j27J15k89J78P6J10j24p3qK50n
5396B20l36K07Q7M6l69j5K33K27n16J30J47j76K01j80K33N1l29J02j26J29P6j24
$$ plain form
5350 45 135 -235 0 -26 165 56 -311 -27 -149 -204 45 7 44 208 37 224 -23 -81 -82 108 -13 19 229
5373 229 23 -57 -86 -157 140 -203 147 -29 37 -134 458 117 -10 105 -184 -6 70 180 56 -17 -25 225 220
5396 220 -116 91 178 224 -145 -160 73 300 -216 -86 61 -115 86 -94 139 190 -139 -37 -163 -34 42 -82
$$ [...]
8191e0
##END NTUPLES=NMR FID
##END=
