##TITLE=1H_24-2024-Bay
 CDCl3
 8 sc, 
 1.4.2024
##JCAMPDX= 6.0         $$ Bruker NMR JCAMP-DX V2.0
##DATA TYPE= NMR FID
##DATA CLASS= NTUPLES
##ORIGIN= UXNMR, Bruker Analytische Messtechnik GmbH
##OWNER= root
$$ XWIN-NMR		Version 3.5
$$ Mon Apr  1 16:36:44 2024 Russian Standard Time (UT+4h)  she@DPX200
##.OBSERVE FREQUENCY= 200.1311
##.OBSERVE NUCLEUS= ^1H
##.DELAY= (6, 6)
##.ACQUISITION MODE= SIMULTANEOUS
##.ACQUISITION SCHEME= undefined
##.AVERAGES= 8
##.DIGITISER RES= 18
##SPECTROMETER/DATA SYSTEM= spect
##.PULSE SEQUENCE= zg30
##.SOLVENT NAME= D2O
##.SHIFT REFERENCE= (INTERNAL, D2O, 0, 15.7039)
##AUDIT TRAIL= $$ (NUMBER, WHEN, WHO, WHERE, WHAT)
$$ ##TITLE= Audit trail, XWIN-NMR		Version 3.5
$$ ##JCAMPDX= 5.01
$$ ##ORIGIN= Bruker BioSpin GmbH
$$ ##OWNER= she
$$ F:/spectra/data/she/nmr/H-F/1/audita.txt
$$ ##AUDIT TRAIL=  $$ (NUMBER, WHEN, WHO, WHERE, WHAT)
(   1,<2024-04-01 16:35:35.73 +0400>,<she>,<DPX200>,
      <created by zg, POWCHK disabled, PULCHK disabled
       configuration hash MD5:
       00 E9 B6 7A A2 85 ED C7 34 08 36 98 17 FE 4E 26
       data hash MD5: 16K
       AD 31 DA B8 EC D0 D6 88 4D 5A EF 42 B5 54 C6 01>)
$$ ##END=
$$ 
$$ hash MD5
$$ 20 48 C8 FC 78 C1 C3 37 CD A3 76 60 5E 7D 23 E8
##$RELAX= 
##$RELAX= 
##$RELAX= 
##$RELAX= 
##$RELAX= 
##$RELAX= 
$$ Bruker specific parameters
$$ --------------------------
##$DU= <F:/spectra>
##$EXPNO= 1
##$NAME= <H-F>
##$PROCNO= 1
##$TYPE= <nmr>
##$USER= <she>
##$AMP= (0..31)
100 100 100 100 100 100 100 100 100 100 100 100 100 100 100 100 100 100 
100 100 100 100 100 100 100 100 100 100 100 100 100 100 
##$AQSEQ= 0
##$AQ_mod= 1
##$AUNM= <au_zg>
##$AUTOPOS= <>
##$BF1= 200.13
##$BF2= 200.13
##$BF3= 200.13
##$BF4= 200.13
##$BF5= 200.13
##$BF6= 200.13
##$BF7= 200.13
##$BF8= 200.13
##$BYTORDA= 1
##$CFDGTYP= 0
##$CFRGTYP= 5
##$CHEMSTR= <none>
##$CNST= (0..31)
1 1 145 1 1 1 1 1 1 1 1 1 1 1 1 1 1 1 1 1 1 1 1 1 1 1 1 1 1 1 1 1 
##$CPDPRG= <>
##$CPDPRG1= <>
##$CPDPRG2= <>
##$CPDPRG3= <>
##$CPDPRG4= <mlev>
##$CPDPRG5= <mlev>
##$CPDPRG6= <mlev>
##$CPDPRG7= <mlev>
##$CPDPRG8= <mlev>
##$CPDPRGB= <>
##$CPDPRGT= <>
##$D= (0..31)
0 1.2 0 0 0 0 0 0 0 0.06 0 0.03 0 0 0 0 0.0002 0 0 0 0 0 0 0 0 0 0 0 0 
0 0 0 
##$DATE= 1711974935
##$DBL= (0..7)
120 120 120 120 120 120 120 120 
##$DBP= (0..7)
150 150 150 150 150 150 150 150 
##$DBP07= 0
##$DBPNAM0= <>
##$DBPNAM1= <>
##$DBPNAM2= <>
##$DBPNAM3= <>
##$DBPNAM4= <>
##$DBPNAM5= <>
##$DBPNAM6= <>
##$DBPNAM7= <>
##$DBPOAL= (0..7)
0.5 0.5 0.5 0.5 0.5 0.5 0.5 0.5 
##$DBPOFFS= (0..7)
0 0 0 0 0 0 0 0 
##$DE= 6
##$DECBNUC= <off>
##$DECIM= 32
##$DECNUC= <off>
##$DECSTAT= 4
##$DIGMOD= 1
##$DIGTYP= 9
##$DL= (0..7)
0 120 120 120 120 120 120 120 
##$DP= (0..7)
150 150 150 150 150 150 150 150 
##$DP07= 0
##$DPNAME0= <>
##$DPNAME1= <>
##$DPNAME2= <>
##$DPNAME3= <>
##$DPNAME4= <>
##$DPNAME5= <>
##$DPNAME6= <>
##$DPNAME7= <>
##$DPOAL= (0..7)
0.5 0.5 0.5 0.5 0.5 0.5 0.5 0.5 
##$DPOFFS= (0..7)
0 0 0 0 0 0 0 0 
##$DQDMODE= 0
##$DR= 18
##$DS= 0
##$DSLIST= <SSSSSSSSSSSSSSS>
$$ [...]
##$SUBNAM2= <"">
##$SUBNAM3= <"">
##$SUBNAM4= <"">
##$SUBNAM5= <"">
##$SUBNAM6= <"">
##$SUBNAM7= <"">
##$SUBNAM8= <"">
##$SUBNAM9= <"">
##$SW= 18.051750892319
##$SWIBOX= (0..15)
0 0 2 0 0 0 0 0 0 0 0 0 0 0 0 0 
##$SW_h= 3612.71676300578
##$TD= 16384
##$TD0= 1
##$TE= 0
##$TE2= 300
##$TE3= 300
##$TEG= 300
##$TL= (0..7)
0 120 120 120 120 120 120 120 
##$TP= (0..7)
150 150 150 150 150 150 150 150 
##$TP07= 0
##$TPNAME0= <>
##$TPNAME1= <>
##$TPNAME2= <>
##$TPNAME3= <>
##$TPNAME4= <>
##$TPNAME5= <>
##$TPNAME6= <>
##$TPNAME7= <>
##$TPOAL= (0..7)
0.5 0.5 0.5 0.5 0.5 0.5 0.5 0.5 
##$TPOFFS= (0..7)
0 0 0 0 0 0 0 0 
##$TUNHIN= 0
##$TUNHOUT= 0
##$TUNXOUT= 0
##$USERA1= <user>
##$USERA2= <user>
##$USERA3= <user>
##$USERA4= <user>
##$USERA5= <user>
##$V9= 5
##$VALIST= <valist>
##$VCLIST= <CCCCCCCCCCCCCCC>
##$VD= 0
##$VDLIST= <DDDDDDDDDDDDDDD>
##$VPLIST= <PPPPPPPPPPPPPPP>
##$VTLIST= <TTTTTTTTTTTTTTT>
##$WBST= 1024
##$WBSW= 4
##$XGAIN= (0..3)
0 0 0 0 
##$XL= 0
##$YL= 0
##$YMAX_a= 608836
##$YMIN_a= -683860
##$ZGOPTNS= <>
##$ZL1= 120
##$ZL2= 120
##$ZL3= 120
##$ZL4= 120
##$ABSF1= 10
##$ABSF2= 0
##$ABSG= 5
##$ABSL= 3
##$ALPHA= 0
##$AQORDER= 0
##$ASSFAC= 0
##$ASSFACI= 0
##$ASSFACX= 0
##$ASSWID= 0
##$AUNMP= <proc_1d>
##$AZFE= 0.1
##$AZFW= 0.1
##$BCFW= 1
##$BC_mod= 2
##$BYTORDP= 1
##$COROFFS= 0
##$CY= 11.3945322036743
##$DATMOD= 1
##$DC= 2
##$DFILT= <>
##$DTYPP= 0
##$F1P= 15.7292609196834
##$F2P= 12.9074282941183
##$FCOR= 0.5
##$FTSIZE= 0
##$FT_mod= 4
##$GAMMA= 1
##$GB= 0.15
##$INTBC= 1
##$INTSCL= 1
##$ISEN= 128
##$LB= 0.24
##$LEV0= 0
##$LPBIN= 0
##$MAXI= 10000
##$MC2= 0
##$MEAN= 0
##$ME_mod= 0
##$MI= 1.114404
##$NCOEF= 0
##$NC_proc= 0
##$NLEV= 6
##$NOISF1= 3.799351
##$NOISF2= 2.8
##$NSP= 1
##$NTH_PI= 0
##$NZP= 0
##$OFFSET= 15.70392
##$PC= 1
##$PHC0= -25458.19
##$PHC1= 11.78731
##$PH_mod= 1
##$PKNL= yes
##$PPARMOD= 0
##$PSCAL= 0
##$PSIGN= 0
##$REVERSE= no
##$SF= 200.130013532006
##$SI= 16384
##$SIGF1= 3
##$SIGF2= 2
##$SINO= 400
##$SIOLD= 16384
##$SREGLST= <1H.CDCl3>
##$SSB= 0
##$STSI= 0
##$STSR= 0
##$SW_p= 3612.71676300578
##$SYMM= 0
##$S_DEV= 0
##$TDeff= 0
##$TDoff= 0
##$TI= <>
##$TILT= no
##$TM1= 0
##$TM2= 0
##$TOPLEV= 0
##$USERP1= <user>
##$USERP2= <user>
##$USERP3= <user>
##$USERP4= <user>
##$USERP5= <user>
##$WDW= 1
##$XDIM= 8192
##$YMAX_p= 0
##$YMIN_p= 0
$$ End of Bruker specific parameters
$$ ---------------------------------
##NTUPLES= NMR FID
##VAR_NAME=  TIME,          FID/REAL,        FID/IMAG
##SYMBOL=    X,             R,               I
##VAR_TYPE=  INDEPENDENT,   DEPENDENT,       DEPENDENT
##VAR_FORM=  AFFN,          ASDF,            ASDF
##VAR_DIM=   8192,          8192,            8192
##UNITS=     SECONDS,       ARBITRARY UNITS, ARBITRARY UNITS
##FACTOR=    0.0002768,     1,               1
##FIRST=     0,             0,               0
##LAST=      2.2672688,     0,               0
##MIN=       0,             -683860,         0
##MAX=       2.2672688,     608836,          0
$$ Real data points
##PAGE= N=1
##DATA TABLE= (X++(R..R)), XYDATA
$$ [...]
2481d65J325r33J19J02j075J365R72k393J280k59p45K266j997n81J257k22L24
2498C40M37j992O31J998j757J176r65j403L075q19j064M77r22O05J898k226q37
2515a348J773j414K077m92k872K518P7j53P87j961l40L132j111j200J131k411
2531a807K642J001l210J088k11J84K021j744j832K381m2l76J524l364J576K059
2547A890k275Q75p38r10K543m48k427J578m89k15K465l401M86K107j741J245m24
2564A21j759K307O49k311J388m89o17K851l039k74K225j660J086j92k144K255
2580C97J109k477J119l83n44L356k696j203K169r77J352j29k819J083K086j740
2596b97N48j233j165M150j397k000J078q96K050J341l230n01K457n27J190j467
$$ plain form
2481 -465 860 -73 46 148 -927 438 1410 -983 297 38 -707 1559 -438 -1019 238 16 340
2498 340 777 -1215 -584 1414 -343 833 -132 -1535 1540 721 -343 134 -788 -183 1715 -511 -1348
2515 -1348 425 -989 1088 596 -2276 242 319 166 953 -1008 -1348 1784 673 -527 604 -1807
2531 -1807 835 1836 -1374 -286 -497 -313 1708 -36 -1868 513 471 95 1619 -1745 -169 1890
2547 1890 -385 490 -248 -1158 1385 937 -1490 88 -401 -616 1849 -1552 -1066 1041 -700 545 121
2564 121 -1638 669 1318 -993 395 -94 -711 2140 -899 -1173 1052 -608 478 286 -1858 397
2580 397 1506 -971 148 -235 -779 2577 -119 -1322 847 -130 1222 1093 -1726 -643 1443 -297
2596 -297 251 -982 -2147 2003 606 -1394 -316 -1212 838 2179 -1051 -1552 905 378 1568 101
2612A01k988L688M89j247Rk449J709L096k129j825J068l10K715L7m234J900J055
2629F85L77R36l320l58K986k2j388k88k014K703K102l476J88j18P06K466j995
2646A70k042J886Q24L3K87k972R67K670j870K84j181n44K637k87k013M81L82M20
2664A32J575k561l27K211q53Q88q92j451J926M85j088j97m31j35J994j471j041
2681a236J419o71J363m39j438Q67Q74m86j1m02n92J929q55j047R58j047J072K99
2699E57j475K15Q80k82L24j05j195J769o8o66N80j128Q79P60j097k33K36rM58
2718D00l3j457J074J87k30N53j325N95O38j65j15j19j36L71N90j384N77k11M4
2737a46P32j036O0J93K25K3q2k98P5P99p13M67m18j85R26m84J7j98Q2P3K30l98
$$ plain form
2612 101 -2887 801 1290 43 52 -2397 -688 2408 279 -1546 -478 -788 1927 1964 -2270 -370 685
2629 685 1062 1998 -1322 -1680 1306 1284 -104 -392 -2406 297 2399 -1077 -889 -1007 -301 2165 170
2646 170 -1872 14 838 871 1158 -1814 -847 1823 -47 237 -944 -1488 1149 862 -1151 -670 -288 132
2664 132 1707 -854 -1181 1030 177 1065 173 -1278 648 1133 45 -152 -583 -718 1276 -195 -1236
2681 -1236 183 -488 875 436 -1002 -135 739 253 242 -160 -752 1177 322 -725 233 -814 258 557
2699 557 -918 -703 177 -105 219 114 -1081 688 620 -46 534 -594 285 1045 -52 -285 -49 -58 400
2718 400 367 -1090 -16 171 -59 494 -831 -236 402 237 122 3 -133 238 828 -556 21 -190 -146
2737 -146 586 -450 -390 -197 28 51 -31 -329 -254 545 -168 299 -119 -304 622 138 155 -43 39 112 342 -56
2759e6l85P83n70M74k82m07P07l13K83k62O0QJ28L2m76M36l75M13m9m79K41k13
2781c02M29k85qm4J40K39l97N08o08M37J45l35K67l17L95j51J3k60M0L88l61L28
2803B61m79K84k2o7K82m96M64k99K52j48o1K20l47M24m79K30p2J11J24o94O09
2824I7k92K47M2k70J60j94L19k70K50j10P3J33l41M02m62K85Q7j13L8k44L87l23
2846i9J86j3k52M51k04K25l55J47K6n1J35l52M17m95L84k10j4K77m53M61m33J35
2868h7J13j47K79k77J81l32L98k14k1L13m68N68m33K43M6k63K80l49M24m20L44
2889A78j43m4K66m06L20k95K80k00N7J78l62L43l48L15j30j09K38l15K89k75J36
2910b7j37k0K84l47L04l72L12m2Q3K84n64M11j93J14j45MJ10k12M15m00J61k11
$$ plain form
2759 -56 -441 342 -228 246 -36 -443 264 -49 234 -28 32 40 168 200 -276 160 -215 198 149 -330 -89 -302
2781 -302 127 -158 -166 -210 -70 169 -228 280 -328 109 254 -81 186 -131 264 113 126 -134 -94 294 -67 261
2803 261 -218 66 44 -23 259 -237 227 -72 180 32 -29 191 -156 268 -211 19 -53 58 182 -512 97
2824 97 -195 52 94 -176 -16 -210 109 -161 89 -21 52 185 -156 246 -216 69 156 43 81 -163 224 -99
2846 -99 87 74 -178 273 69 294 -61 86 112 61 196 -156 261 -234 150 -60 -74 203 -250 211 -222 -87
2868 -87 26 -121 158 -119 62 -270 128 -86 -107 206 -262 306 -127 116 162 -101 179 -170 254 -166 178
2889 178 35 -9 257 -149 171 -124 156 -44 13 191 -171 172 -176 139 9 -100 138 -177 112 -163 -27
2910 -27 -164 -184 100 -247 57 -315 -3 -45 38 322 -242 169 -24 90 -55 -51 59 -153 262 -138 23 -188
2932a88J5L55l40K83l07K30J49m4j37k46M87j88K19k92k45L53k93L29k73r6K38
2953IJ34j1m98L28k58P05j94m84L01k60M91j22l27j30L20L00l88J80n94M65L25
2974B92j42j23m00N52J12J49n83o3K35K03K67q73K72J10L5L71q10J03L6O23m59
2995i3N8k79J12R25p62k8m1nN52l14l80lL63o9R6l78l31J009m97K81l14l38P91
3018C55l5l28k7K18j86M16m21n01Q32m85L23j28m58N18J56k63j76O9l7N07q8q06
3040e45Q78n01L89Pq87N86K61j10k01L1m97Q49K9q60Q27o07N55N28j092K83K90
3061B13Q9M8j39q79Q83L55j001O71q02L05Q99p33k59J24M8N21L99j458N14P07
3081E05o22Q34j223j38J225l88j71k15m89N83R14j215JM18m86J401q03r43Q64
$$ plain form
2932 -188 -173 182 -158 125 -182 48 197 153 16 -230 257 69 288 -4 -249 104 -189 140 -133 -229 9
2953 9 143 132 -366 -38 -296 409 215 -269 32 -228 263 141 -186 -316 4 304 -84 96 -498 -33 292
2974 292 150 27 -373 179 291 440 -143 -206 29 232 499 -374 -102 8 43 414 -396 -293 -257 366 -93
2995 -93 -35 -314 -202 723 -39 -67 -108 -113 439 125 -255 -258 105 36 132 -246 -577 432 -65 216 -98 -436 355
3018 355 320 -8 -35 183 -3 413 -8 -509 323 -162 161 33 -425 93 249 -14 -190 -121 -158 349 261 -545
3040 -545 333 -168 221 228 -659 -73 188 78 -123 -92 -589 260 289 -571 256 -351 204 732 -360 -77 213
3061 213 302 350 211 -668 215 570 -431 240 -562 -257 642 -91 -350 -226 -178 343 742 -716 -202 505
3081 505 -117 717 -506 -644 581 193 22 -193 -682 -99 815 -400 -399 19 -467 934 131 -812 52
3100E2K2L51J18j102j54J579p50nk06j093J882q6r17J91n24O63J146r32j133J114
3120B16j77P47J9k148J194O36k79K33j205k39J652J65j297L69q48J181J183k113
3138g11o4N52L00J203j169j565J242R74m54K49j799M47K238j129k64q68k53K225
3156A154J40j976j18O28L69J559k210j058J911O1N97j031j759J340J585q32n66
3173b06o74j37K604q54j786N38j22J515M17k221k49J528J70L37j045j730K284
3190C69O44j002N6j531J366J583j081j151K68J46J253J19k356J023N42M5Q00j935
3208h42j37J599j24n17m4q41R53J151j811M06p0j97J579j134o68O73R7m1N51j135
3228e52J50J263j299P35k21p97J438n24n59O15j51m02Q65p40j80J079j294P22
$$ plain form
3100 52 74 425 543 -559 -713 866 116 111 -95 -1188 694 608 -309 -118 -642 21 1167 235 -898 216
3120 216 39 786 805 -1343 -149 487 208 441 -764 -1003 649 814 -483 -114 -962 219 1402 -711
3138 -711 -775 -223 77 1280 111 -1454 -212 762 308 557 -1242 -795 1443 314 50 -818 -1071 1154
3156 1154 1294 -682 -800 -172 197 1756 -454 -1512 399 460 1057 26 -1733 -393 1192 360 -206
3173 -206 -880 -1017 1587 733 -1053 -515 -637 878 1295 -926 -1175 353 523 860 -185 -1915 369
3190 369 1013 11 67 -1464 -98 1485 404 -747 -479 -333 920 1039 -1317 -294 248 293 1093 -842
3208 -842 -979 620 496 -21 -65 -906 47 1198 -613 -207 -277 -474 1105 -29 -697 -24 73 32 583 -552
3228 -552 -402 861 -438 297 76 -721 717 193 -366 249 98 -304 561 -179 -359 720 -574 148
3246A48J07p09R41o24k94N47R8m16N83o86j42J288j262L76J11n50R38l14n79K93
3266a46L43l25O07p36m41J229o02J39J04q99R30J84m66j38J58k92R08k76r06P84
3286A59l10L59J59p48K82K55J26k47J01n47O62J54p48N12o86M79M77p12J09J04
3306f0L3N9J75o18K95L88n58N74o62J85M20k83m7J40n3n7M07n21J55J92m43O97
3328D18n88N0L96k48J51r2o8k03N09m55J37J82n94O05k82J13L0j53J18j00J23
3349D9k87M39k36L3J70m33N21l83P2j2j06K16o8J74l29L47k40k4K99l01K35k05
3371f9J55r9J1Q5j15L08m28L30j17j54J44k97M06k14nJ18j81K13j92K50l05L25
3393A69k35o2K41k98K40k15K32j29k4J32j81K44k79K36p0o2K80k69L13k71K2o2
$$ plain form
3246 148 255 -454 487 -137 -431 116 214 -202 381 -305 -447 841 -421 -45 66 -484 454 140 -439 -146
3266 -146 197 -128 479 -257 -698 531 -71 68 172 -727 203 387 -79 -217 -59 -351 557 281 -625 159
3286 159 -151 208 367 -381 -99 156 282 35 136 -411 251 405 -343 169 -517 -38 439 -273 -164 -60
3306 -60 -27 32 207 -411 -116 272 -286 288 -374 -189 231 -52 -99 41 -12 -69 338 -183 -28 164 -279 418
3328 418 -170 -120 276 28 179 87 19 -184 325 -130 7 189 -405 200 -82 31 61 -92 26 -74 49
3349 49 -238 201 -35 -2 168 -265 256 -127 -55 -67 -173 43 -25 149 -180 167 -73 -97 202 -99 136 -69
3371 -69 86 -13 -2 83 -32 276 -152 178 61 -93 51 -246 160 -54 -59 59 -122 91 -101 149 -156 169
3393 169 -66 -128 113 -185 55 -160 72 -57 -81 51 -130 114 -165 71 1 -61 219 -50 263 -8 14 -48
3415d8N5p6M4L58n67L42k21j19M29m34L29j19J06j0N2p7j99M35m94N36j91l29
3437a98L62m49K84k1J11j22J4kj03K71n24O46j38k69L69n26K99J32o2k14L04j73
3459ip9M64r07P23j72l59Q33o55L3L62j72k04N17m90l6P05r12N12n0m88P68n79
3481a95j11M33k32p6N16o28j63R26r55N86J0o07P17j05l30M58k42m86J030n69
3501b3l64J008j105O14M86j111P01J03n35N71j32p57J048k68n27R16j345N77R40
3520G97j264M00L2o07J033j45j085J073j46n03J369j640J58J371j131M47j1q85
3538g37J031M10j400Q64j34p27J914j511m36J443r90M55L94j534Q44J265j643
3555d92P89l49q45K194j142j117J407j023P23R90k143K60J646j431J072m21j706
$$ plain form
3415 -48 7 -69 -25 333 -234 108 -113 -232 197 -237 92 -27 79 69 121 44 -155 280 -214 322 131 -198
3437 -198 164 -285 -1 -22 89 -33 -19 -21 -124 147 -377 269 131 -138 231 -295 4 136 74 -140 164 -9
3459 -9 -88 376 -531 192 20 -339 494 -161 -128 234 62 -142 375 -115 -151 554 -358 154 104 -384 384 -195
3481 -195 -306 127 -105 -181 335 -293 -456 470 -485 101 111 -496 221 116 -214 244 2 -484 546 -23
3501 -23 -387 621 -484 130 616 -495 206 309 -226 345 213 -544 504 236 -291 625 -720 -143 797
3520 797 -467 -67 -35 -642 391 246 -839 234 88 -415 954 -686 -528 843 -288 159 148 -737
3538 -737 294 704 -696 168 34 -693 1221 -290 -726 717 -273 182 576 -958 -114 1151 -492
3555 -492 297 -52 -897 1297 155 -962 445 -578 145 1135 -1008 -748 898 -533 539 118 -1588
3572a588K514l42j225Q82j092P32J654k012o59J673j122J549m1k968K314M48p80
3589f3R98j941l50L032j105j254Q38j502K128J173l377J036M71l31K132k197j869
3606b181K766L65p19M57k763J441K925k518L9n05o29L308p49l013J479J36M46
3623B85J933l618m17L156j118O76r67k384L067J254k142K16j121K87L579k437
3639B49j898J862j018K025L22l672J349J765r88J216j793j702L823n52j594J053
3655D47k107J737K009k878O1Q41r03K179n26l053K699j35p78J849k776L55K471
3672A492j512qL86j923K110R00k811J984p05q72K655k089n90K073j458K92J303
3689A227k365R62J204k274K040n24j714K576j263n79J798j589k10J901j917N69
$$ plain form
3572 -1588 926 584 -641 241 -851 -119 1535 -477 -1136 537 -585 964 923 -2045 269 717 -63
3589 -63 935 -1006 -1356 1676 571 -683 155 -1347 781 1954 -1423 -387 84 -247 1885 -312 -2181
3606 -2181 585 950 231 688 -2075 -634 2291 -227 -188 -693 -1322 1986 1237 -1776 -297 -161 285
3623 285 2218 -1400 -1817 1339 221 897 -70 -2454 613 1867 -275 -59 -1180 -893 2686 249
3639 249 -1649 213 -805 1220 1542 -2130 -781 984 -4 1212 -581 -2283 1540 988 -606 447
3655 447 -1660 77 2086 -792 -731 110 -793 1386 860 -2193 506 371 -407 1442 -1334 -979 1492
3672 1492 -20 -28 358 -1565 545 1445 -1366 618 -87 -959 1696 -393 -983 1090 -368 -76 1227
3689 1227 -1138 -176 1028 -1246 794 270 -1444 1132 -131 -710 1088 -501 -711 1190 -727 -158
3705a58J227k408J690K76j617J981j138p50K075j189p48J616j694O75J794k728
3721a096J074O98j637J948o47j528J845m09p13J415j648R8J982k021P11M37j742
3738a233K011l2j773J376l61o09J668j255p33J815j364O23N51j832J329L84j151
3755e86R83l83r73J926q18j021J599j249M16J038j688N77O30r18Q46n8j275J485
3773E31j82q97J342j292N4J280j173J58O58q02M22M76j257Q18qn92J111r78n3
3792c84Q93p90Q4P00j007M59O17j070O03J09p51J100m94m02P42o27J08N26p98
3811c82K00P28r62O71K32r16P24k04l82N72l41L1K71l49j60N58n61K37L36q17
3831e14Q31l36l36N07j88k51L92j68k59O48m90q3M27n20M75k0k16K74k36o1L53
$$ plain form
3705 -158 1069 -1339 351 627 -990 991 -147 -897 1178 -11 -759 857 -837 -162 1632 -1096
3721 -1096 -22 676 -961 987 340 -1188 657 248 -465 950 -698 -600 1382 -639 72 509 -1233
3738 -1233 778 746 -1027 349 -12 -621 1047 -208 -941 874 -490 133 684 -1148 181 565 -586
3755 -586 397 14 -959 967 149 -872 727 -522 -106 932 -756 -179 451 -467 379 321 -954 531
3773 531 349 -548 794 -498 -444 836 -337 -179 479 -323 99 575 -682 136 128 -464 647 -331 -384
3792 -384 509 -281 -197 503 -504 -45 572 -498 105 214 -537 563 69 -333 409 -218 -110 416 -382
3811 -382 -182 546 -416 255 487 -429 295 91 -291 281 -60 -29 242 -107 -267 291 -270 -33 303 -514
3831 -514 317 -19 -355 152 -36 -287 105 -63 -322 326 -164 -247 180 -340 135 115 -101 173 -63 -124 229
3852B29p4k87M60m09M9L26m19J88o8Pn4mN4Ql9j55L64k61o4L02l57J53L8o3pJ29
3878D6k6j65K66j82J78j51j3K41m22M09j09j97K74n2j25p4M13m02J62M8k88K97
3900A28j99J47j53L3P0l4j21J94J43n17N24k44o4K14k25J11LL2k19J12Q2j24K21
3923A14l59L64j12r2L02m89K40J88j27k07K54k7j75K97l74L44r7j98M37m03P3
3944d7J62m2q4L10m50k5O77p81L64O0m32M24n8j39N2j9n0M98n69n0N03o40L91
3967E5J99p31M65J18l52M08j05l45N18j21l89N95p23N90K68q85P02j22m11O77
3987D11j26p30R44l68m37Q92r42K34P33r43M63O0o50P23Q7j025J131m75n31J408
4007H59j362%J155r72J90M11q34O20M28j108Q56k73o37J743j407r9J220j222N44
$$ plain form
3852 229 155 -132 328 -81 -32 294 -125 63 -5 2 -52 -56 -2 6 -33 -188 176 -85 -149 153 -204 -51 -13 -76 -83 46
3878 46 20 -145 121 -61 117 -34 -47 194 -228 181 72 -125 149 97 -28 -102 311 -91 71 119 -169 128
3900 128 -71 76 -77 -44 26 -8 -129 65 208 -309 215 -29 -93 121 -104 7 10 42 -177 -65 17 -107 114
3923 114 -245 119 7 -85 217 -272 -32 156 29 -178 76 49 -126 171 -203 141 44 -154 283 -120 -47
3944 -47 115 73 -11 299 -151 -176 501 -280 84 144 -288 136 78 -61 -9 -28 -78 420 -149 -199 304 -336 55
3967 55 254 -477 -12 106 -246 162 57 -288 230 109 -280 315 -408 182 450 -435 267 145 -266 411
3987 411 285 -445 499 131 -306 586 -356 -122 611 -332 131 191 -459 264 351 -674 457 -18 -549 859
4007 859 -503 -503 652 -320 -130 281 -553 67 495 -613 243 -30 -667 1076 -331 -430 790 -432 112
4026A12N69j500O78J023j366Q71k81j104J863q80n22J083j235O53R80j817M32
4043d41J200j548J410k21j875K196k07j071J144j202J39J705j744j45J188j516
4059i88J734K61k596J989O7j128J837j560q18K426j052m91J068k130J510J427
4075A556k666J429k49j074K559j359j732K284q37j53J750k817N20K355k256J306
4091F16l90j789K688k85j878J648j147j86K723k784l00K152k076J538M25k713
4107a758J887P50j647J547j131j196L268j846o36J896k563J591J588l146J364
4122c2Q59j941K219m96k433K895r77p55K117k707P58K107k672J189N65k436K666
4139I26J41k928K787r86j115K837k392k21K165j849O26J237k813J885R73k631
$$ plain form
4026 112 681 -819 -141 882 -484 387 106 -998 865 -15 -537 546 -689 -36 944 -873 -441
4043 -441 759 -789 621 400 -1475 721 514 -557 587 -615 -476 1229 -515 -660 528 -988
4059 -988 746 1007 -1589 400 467 -661 1176 -384 -1202 1224 172 -319 749 -1381 129 1556
4075 1556 -1110 319 70 -1004 1555 196 -1536 748 -89 -242 1508 -1309 -789 1566 -690 616
4091 616 226 -1563 1125 840 -1038 610 -537 -723 2000 -784 -1084 1068 -1008 530 955 -1758
4107 -1758 129 879 -768 779 -352 -1548 1720 -126 -762 1134 -1429 162 1750 -1396 -32
4122 -32 827 -1114 1105 609 -1824 1071 94 -661 1456 -1251 -493 1614 -1058 131 696 -1740 926
4139 926 1067 -1861 926 -60 -1175 1662 -730 -951 1214 -635 -9 1228 -1585 300 1273 -1358
4155a358K474j035j610L306k003p82K247j975L67K155l071J116J284k373K228
4170I70n37k082K861j286q86K328k198k3K584k610M12J652k757K107N37k594K328
4187H06o35j031K300j872o43K540k175L83J820l206J768J233k561J881k84j641
4203a317K593j042j401K189j623K07J969k895J109J162k333K216k43k113K284
4218G62j97j610K108j430o34K536k007O6J198j930J631L89k100J691k05j330K255
4235A193j176j441K606j650jJ557k167Q36J079j592J067O6j628K179n59j418K081
4252A032j551R4J830k088K79J346j471Q52N27j876J287K46j067J417j186m58J714
4269I27j405K53P95j517Q48J143k160J107L14j192J672p01j080J544o32J2P50
$$ plain form
4155 -1358 1116 81 -1529 1777 -226 -1008 1239 -736 -369 1786 -1285 -169 1115 -1258 970
4170 970 433 -1649 1212 -74 -960 1368 -830 -853 1731 -879 -467 1185 -1572 535 1072 -1522 806
4187 806 171 -860 1440 -432 -1075 1465 -710 -327 1493 -1713 55 1288 -1273 608 324 -1317
4203 -1317 1276 234 -1167 1022 -601 -394 1575 -1320 -211 951 -1382 834 591 -1522 762
4218 762 565 -1045 1063 -367 -1001 1535 -472 -406 792 -1138 493 882 -1218 473 268 -1062 1193
4235 1193 17 -1424 1182 -468 -469 1088 -1079 -243 836 -756 311 377 -1251 928 369 -1049 1032
4252 1032 -519 -425 1405 -683 -404 942 -529 323 850 -1026 261 507 -560 857 -329 -787 927
4269 927 -478 -225 570 -947 -99 1044 -1116 -9 305 -887 785 84 -996 548 -84 -72 678
4286F78j252L95J245j653R03J58j500J737k75j194J186l77m50J171r96k70J094
4303F00j028N13L23j348J282j62p52R38n67m18J087n34m94R72o56J22O35j057
4321e44P10Q5m81N92l38l67Q48m55m12R01q15J02Q28j007L33K49m82L61Lm32L67
4342D6Ml01N41n78J92N52q40L11K96m50K79K26n58J93L39m54L33m1j69L51l76
4363a04K43N4l41J38J49m20K72K67n47M89j70j75K73k73K01j28j4J96k42k0J68
4384A6J48l59M07j83j85M39l11j5R5O9k73J35J49l52K80r8J93k28j04K52k60J51
4406c4J33j74k38M43l09l8L17k00R9N3q5J38l06K94p9r0M7N2j07r9N42n20K36
4429G5P2k45J39l3rp3K12k26J97j61l1L27m82L26L9m66L76p8k79L29Q8l03K43
$$ plain form
4286 678 -574 -179 1066 -587 316 474 -1026 711 436 -758 428 51 -399 772 -224 -494 600
4303 600 -428 85 408 -940 342 180 -572 366 -201 -619 468 -66 -560 412 -244 -122 513 -544
4321 -544 166 251 -230 362 24 -343 505 50 -362 539 -276 -174 654 -353 -20 229 -253 108 111 -321 46
4342 46 50 -251 290 -288 -96 456 -384 -73 223 -227 52 278 -280 -87 252 -202 131 90 -79 272 -104
4363 -104 139 193 -148 -10 139 -281 -9 258 -289 200 30 -145 128 -145 56 -72 -86 110 -132 -152 16
4384 16 164 -195 212 29 -156 283 -28 -43 52 121 -152 -17 132 -220 60 -38 155 -73 -177 75 -185 -34
4406 -34 99 -75 -313 130 -179 -217 100 -100 -1 52 -33 105 -201 93 14 -76 -29 23 -84 -183 359 -161 75
4429 75 147 -98 41 8 -1 -74 138 -88 109 -52 -83 244 -238 88 127 -339 37 -41 -320 9 97 -206 37
4452C7K9k52L59l86L20j9l16M26k06j11K68K5n10P16k48m50O91m77n6M18m25L42
4474A75r8l13J81J81m35O22l72l42R35p94J9O90o48N9L62m08J30M83o81M08j08
4495D6m19R22p47LO50q84L48N54j103N10N12j046Q20J33j001J160m95k60P41q19
4515c75L44N75r63L62O58j251R84K17j437J462l43p54J152o77m49J056q45L4R44
4534F94j418Q89M60j744J622l51j128J585p38p34J531r62k34J396j542N76Q68
4551G70j518J171j01j209J739o53r08J702j008m03J743j969K30J574j933R88L49
4568E64j617J491j56j184J549r56o99K201j836j28J801k213J154R95k150J387
4584B03N08j613J748o95j224K335j327l40J512k191J181J395k494J040O42j905
$$ plain form
4452 37 66 -186 173 -213 107 88 -228 198 -8 -119 149 174 -336 380 132 -318 373 -104 -160 258 -167 175
4474 175 77 -236 -55 126 -309 313 -59 -401 534 -260 -241 449 -199 -140 222 -186 -56 427 -254 154 46
4495 46 -373 549 -198 -195 455 -429 -81 473 -630 -120 392 -654 166 299 -702 458 -37 -297 444 -375
4515 -375 -31 544 -419 -57 601 -650 334 551 -886 576 233 -521 631 -46 -495 561 -284 -250 694
4534 694 -724 165 625 -1119 503 152 -976 609 -129 -863 668 -294 -528 868 -674 -98 770
4551 770 -748 423 322 -887 852 199 -709 993 -15 -418 1325 -644 -414 1160 -773 215 564
4568 564 -1053 438 282 -902 647 -309 -1008 1193 -643 -771 1030 -1183 -29 966 -1184 203
4584 203 711 -902 846 151 -1073 1262 -65 -405 1107 -1084 97 1492 -1002 38 680 -1225
4600a225K182k72k187K199o92p81K123k310L37J798j834Q09M82k227K310M02k487
4617a373K136r65j017L152k136q39K100j638P64J061k744J402J244k103K005j229
4633a80j590L331j468r26J814j992N28K384k894M25J349j999K404m49k528K508
4649G17n26p13K088k479j76K811k173L04J278l021K472Q75k728J743o57q00K574
4666A589j681j214K250j721Q06J536l461J609J360k259K185p23j996K760m82j513
4682i55J933j737P0K614k787O69J017k225K503J8k813K317k14j384K606j990j094
4699a452K814j726L19J084k666J703J040k030J475n18j598L102j131j781K266
4714I01j691N60J805k678M51J545j555J280jk319K392j88j266K022k126L7K598
$$ plain form
4600 -1225 957 685 -1502 697 5 -776 1347 -963 -626 1172 -662 147 629 -1598 712 1114 -1373
4617 -1373 763 -202 -1219 1933 -203 -1042 1058 -580 184 1245 -1499 -97 1147 -956 1049 -180
4633 -180 -1770 1561 93 -833 981 -1011 -483 1901 -993 -568 781 -1218 1186 737 -1791 717
4649 717 191 -522 1566 -913 -1089 1722 -451 -147 1131 -1890 582 1457 -1271 472 -185 -985 1589
4666 1589 -92 -1306 944 -777 29 1565 -1896 -287 1073 -1186 999 276 -1720 1040 558 -955
4682 -955 978 -759 -689 1925 -862 -193 824 -1401 1102 1120 -1693 624 410 -974 1632 -358 -1452
4699 -1452 1362 -364 -45 1039 -1627 76 1116 -914 561 43 -1555 1547 416 -1365 901
4714 901 -790 -230 1575 -1103 -652 893 -662 618 617 -1702 690 502 -764 1258 -868 -831 1767
4731A767k159O1R78j627J403Q29k586J457L12j243K122j624r12K131j245J80J032
4748H76k231J129J557k232J220k6j522K268o71j386J549q30J21J230j727J73J303
4765H01j455J043J62j897K073k40j342J382q36l20J576j152m90J351j295Q02N01
4782F64j689J343J33j128J425r21n07J619r73m83J320j211K80R83j476P30K75
4799C84q89R60m35o93J100o60l36J100j091J52J133j458O76N12j069Q26n6o01
4817d45O63l5m15Q92q03k7J037j233N55K98q19N34K59r30O60P0p60P67m05l34
4837d71P47p16L97K31o06L86J53o90N01J90o80P93j57m40P55m00k2K48j95J2K54
4858B90m06K22J64n05N79l31l07O02m01j65N88m17k14L13r0j60M61n00L67j86
$$ plain form
4731 1767 -392 -331 647 -980 423 1252 -1334 123 435 -808 1314 -310 -1222 909 -336 -156 876
4748 876 -1355 -226 1331 -901 319 293 -1229 1039 368 -1018 531 -299 -178 1052 -675 -502 801
4765 801 -654 389 551 -1346 727 487 -855 527 -309 -629 947 -205 -695 656 -639 163 664
4782 664 -1025 318 451 -677 748 -173 -680 939 -34 -517 803 -408 -128 855 -621 109 384
4799 384 -505 455 20 -673 427 -233 -569 531 -560 -408 725 -733 -57 455 -614 212 156 -445
4817 -445 218 183 -232 660 -143 -170 867 -366 189 487 -332 202 461 -469 191 261 -499 268 -137 -471
4837 -471 276 -440 -43 188 -418 -32 121 -569 -68 122 -558 235 78 -362 393 -7 -29 219 24 36 290
4858 290 -116 106 270 -235 344 13 -294 308 -93 -258 330 -87 -301 12 -78 -238 223 -277 90 -96
4878i6j57M63m37J31K31j43j44L84l35o3M91n58K77J79k90K69j76N5m4k5l2J68
4900A48k33M9K78n66K96L11m30J71j6k03J43K67l39J41Q6k44K49k38K86o8k41
4921a53K74n2k51K45l2j73J33R6k37L32l50J25K9p4J56j93J24m0R7k21K74j51
4943d2k09N02l58k0K37k63J58M7nq1J70k85K92j46k15N07m89J09M96n02J29J62
4965A94k96J19J60l42K90Mk63K72m11K53K72n21J40L31n86L10L98o98L49J22m14
4986c17N63l73k5L73k61Q5K84m05K58J94p79N78J15p81R28l11m09M65j98k02N10
5007B92m95k6N63p54M64K53q07P58j93n14Q62n41k99P73l82l81R68r22M11M96
5027E26r43P59k20n66J073n64n52R25n65k47J184j269J48R47j297Q71Mr97J135
$$ plain form
4878 -96 -253 210 -227 -96 135 -8 -152 232 -103 -166 325 -233 44 223 -67 202 26 81 37 12 -20 148
4900 148 -85 -36 242 -324 -28 283 -147 24 8 -195 -52 215 -124 17 103 -141 108 -130 156 88 -153
4921 -153 121 69 -182 63 31 -142 -9 87 -150 182 -168 -43 -14 -88 68 -125 -1 -41 56 -165 109 -42
4943 -42 -251 251 -107 -127 110 -153 5 52 47 -34 136 -149 143 -3 -218 289 -200 -91 405 -97 32 194
4965 194 -102 17 177 -165 125 129 -134 138 -273 -20 252 -269 -129 202 -384 -74 324 -374 -25 97 -317
4986 -317 246 -127 -152 221 -40 45 329 -76 182 376 -403 175 290 -491 437 126 -283 182 -16 -218 292
5007 292 -203 -229 334 -420 44 297 -510 248 55 -459 403 -138 -437 336 -46 -427 541 -381 30 526
5027 526 -417 342 122 -444 629 65 -487 438 -127 -374 810 -459 -311 636 -661 210 214 -783 352
5046C52k23o36R18o44l48J400j137m4R56j385J060N95j551Q99J41q10J212o11
5064A44r93J421p47j47J116j651P38J056j623O86L04j428J789k09j549J559n76
5081a10l18J597j744J8J285j182Q10K83j768J409N23j488J615j251n74K216j424
5098a03n07J315j473Q77J071k247R89M89j335J865q85j323K092r08k83J367j978
5115i77L75K021j941M49O51j825J939J56j840J729q21n18K003j771m42J853j729
5132f88Q43R61k548J606P42j902J840j021j037K264r89q55J653j830O82J773k533
5149a039J021N56j731K059k64j898K021m82j040K088j933k06K128j902O67O22
5165F67k072J840N86k021J610o32j131K583j404j140K114j622N99J361k623J182
$$ plain form
5046 352 129 -507 411 -233 -581 819 -318 -362 594 -791 269 864 -687 212 353 -457 755 144
5064 144 -849 572 -175 -322 794 -857 -119 937 -686 0 304 -1124 665 456 -1093 466 -110
5081 -110 -428 1169 -575 -557 728 -454 356 639 -1129 280 803 -685 930 -321 -895 1321 -103
5098 -103 -610 705 -768 109 1180 -1067 -78 411 -924 941 56 -1267 825 -83 -366 1001 -977
5115 -977 -602 1419 -522 -73 578 -1247 692 848 -992 737 -84 -602 1401 -370 -812 1041 -688
5132 -688 155 1116 -1432 174 916 -986 854 -167 -1204 1060 71 -784 869 -961 -279 1494 -1039
5149 -1039 -18 538 -1193 866 602 -1296 725 243 -797 1291 -642 -848 1280 -622 45 667
5165 667 -1405 435 1021 -1000 610 -22 -1153 1430 26 -1114 1000 -622 -23 1338 -1285 -103
5181a03Q66j593J475m68j639K447p13j063J738j708K14K131k348M29J138j877
5197a074J597J59j942J866l70j137K178j917k79K168j792L75J159k269J476Q63
5213A061k222J513o1j199K061j178r81J879j449L57J272k005P69J257j929J435
5229E80j04j803K205n17j299J806j197k49J806j778J41J095j582J232M47k098
5245a315J824j50j215J765j130o68J889j281j58J379j728R55P59j805J288p4j041
5262g06J660r30r09J667q69l73J350j574M39J294j831R05J88j131J225k24j021
5279h40J312o10l58J455j398o7J252j397P89L68j262Q71M53j108R58l74o46J386
5297G84r49l53J174j070M74O58j443P20M27r25Q46j24r49J253m74n21R60q84L36
$$ plain form
5181 -103 763 -830 645 177 -1462 985 272 -791 947 -761 -547 1584 -764 -335 803 -1074
5197 -1074 523 682 -1260 606 236 -901 1277 -640 -919 1249 -543 -168 991 -1278 198 1061
5213 1061 -1161 352 291 -908 1153 -25 -1006 873 -576 -219 1053 -952 -183 1074 -855 580
5229 580 476 -1327 878 361 -938 868 -329 -578 1228 -550 -409 686 -896 336 783 -1315
5245 -1315 509 359 -856 909 -221 -889 1000 -281 -439 940 -788 167 926 -879 409 335 -706
5262 -706 954 24 -885 782 -87 -460 890 -684 -245 1049 -782 123 311 -820 405 181 -840
5279 -840 472 -138 -496 959 -439 -506 746 -651 138 506 -756 115 568 -540 418 44 -602 784
5297 784 -165 -518 656 -414 60 718 -725 -5 422 -503 343 219 -730 523 49 -472 488 -396 -60
5316f0O40j059M00L48o91O53M8r72J072k12m96R19p53j00P21n41J00L41p01M72
5336A29J89p94P07j40n03P77n79j19P15n40ML97n92K56N52p30M87m9m09N12l07
5357c7j68M74j67j66K77l68n5O11n84K14O0m15M72q6l00L22k05kK56l47J01L93
5379B80m80K66J64n80M95m9j13J24Mk04L11j40j52L14k87J02J13l74L09p5p3P7
5401C2P8k62K02n8j64N01m76M7J82k19K34j01j04J17mk45K38Q7k87L07j49K0J01
5424G7j84R4J0q1o1J90j90K40k7j26K70k29NJ23j94O6J4K3r4J72k19M9J09j90
5448a53L65j77R1P3l57N2P7l7M7J32j65J20M7k84K90j17p3J76j27n2K44k48L7
5471c9J68k74R8J97l77L70K4l47K04j37L6J70j5k01L56l66J42K11m50L60q7k39
$$ plain form
5316 -60 580 -479 -79 269 -422 231 279 -693 379 167 -329 590 -163 -263 458 -83 17 358 -343 129
5336 129 318 -476 231 91 -412 365 -214 -333 382 -158 -154 243 -349 -93 459 -271 216 167 -242 270 -37
5357 -37 -205 269 102 -64 213 -155 -210 401 -183 31 91 -324 148 62 -238 84 -121 -123 133 -214 -113 280
5379 280 -200 66 230 -350 145 96 -17 107 111 -93 218 78 -74 240 -47 55 168 -206 103 28 -45 32
5401 32 110 -152 50 -8 -172 329 -147 -100 82 -137 97 -4 -108 9 5 -240 -2 85 -202 105 -44 -24 77
5424 77 -107 -13 -3 -84 -145 45 -145 95 68 -58 212 -17 -12 111 -83 -17 -3 20 -74 98 -121 -72 37 -153
5448 -153 212 35 126 199 -158 -106 -29 -66 -19 113 -52 68 115 -169 121 4 -69 107 -20 -72 172 -76 -39
5471 -39 129 -145 -47 150 -227 143 167 -180 24 -113 -77 93 78 -123 233 -133 9 220 -230 130 43 -196
5493a96M43k52j90L36j43j89N41n59Q8M30n70M28j58k67M73l9m86M34j65k72Q54
5514E41o67p3M53n87L99P5n02M11J04n19P66k69m99Q97o24r0N92p08L92M04q73
5535c77M68J04o41P60k2q02R74n72k39R75j133L29P34q88M52J87r38Q95K11j110
5555f33J114m58n55J208r45o6P85p86M13L90j100O67M33j019J029l62q18J422
5573G19q99j60R62r72J19J008j333N76M81j285J215j49j038J414p01m09J151j205
5591e06L2J266j185L37O74j580J239K04j370J409m07p14J403r25m13J396j360
5608e00L10J072j897J149N29j521J354k81j053J686p57r47J602j118m5J529j826
5625g14N32Q79j533J395j04j368J556l62r55J569j223l64J795j605K90R59j671
$$ plain form
5493 -196 247 -5 -195 141 -2 -191 350 -209 -121 309 -261 167 9 -258 215 176 -310 124 -41 -313 541
5514 541 -126 -199 254 -333 66 141 -361 50 154 -365 401 132 -367 530 -94 -184 408 -300 92 496 -377
5535 -377 91 195 -446 314 292 -510 464 -108 -347 628 -505 -176 558 -330 122 309 -629 266 477 -633
5555 -633 481 23 -532 676 -269 -335 450 -336 77 467 -633 34 467 -552 477 115 -703 719
5573 719 -180 -340 622 -350 -231 777 -556 20 501 -784 431 282 -756 658 -43 -452 699 -506
5591 -506 -474 792 -393 -56 618 -962 277 481 -889 520 113 -601 802 -123 -536 860 -500
5608 -500 -190 882 -1015 134 663 -858 496 215 -838 848 91 -856 746 -372 -417 1112 -714
5625 -714 -182 697 -836 559 455 -913 643 281 -674 895 -328 -692 1103 -502 -212 747 -924
5642i24J244L36j665J448j31j188J670o88r75J898j564J19J541k057R86Q29j773
5659h94J166J72j507J967p35j161J996j367j81J725j907M11J177j774J035N25
5675F48j815J715j63j325J912j246n69J794j417Q4J199j755Q45R96j757J217Q3
5692D46j541K036q18j012J774j274M2J510j900L39J293j626J086L16k006J939
5708F04j42j168J571j313k68J876j398k52J289j696J155P83k212J354J17r63J617
5725I54j117q94J957r15k51J194j977P83J456j827P22J25j196J801k80j506J413
5742D42n49j89J476j838o2J756j533Q14R6j608J593L05j377J037o05n44K005j431
5760b12n35J338j184Q97M35j736J004N36j054R68n35q97J869p86n00R22j186P41
$$ plain form
5642 -924 320 656 -1009 439 308 -880 790 102 -873 1025 -539 -420 1121 -936 50 879 -894
5659 -894 272 444 -1063 904 169 -992 1004 -363 -544 1181 -726 -315 862 -912 123 648
5675 648 -1167 548 385 -940 972 -274 -843 951 -466 -382 817 -938 -93 903 -854 363 446
5692 446 -1095 941 123 -889 885 -389 -347 1163 -737 -398 895 -731 355 671 -1335 604
5708 604 462 -706 865 -448 -716 1160 -238 -490 799 -897 258 1041 -1171 183 300 -663 954
5725 954 -163 -1057 900 -15 -266 928 -1049 -266 1190 -637 85 210 -986 815 535 -971 442
5742 442 -107 -296 1180 -658 -720 1036 -497 317 413 -1195 398 703 -674 363 -242 -786 1219 -212
5760 -212 -747 591 -593 304 739 -997 7 543 -511 457 -78 -975 894 108 -392 530 -656 85
5778H5Q96j526L45N19q03J081k43j340J490l07n33J049j172Q3J161j008j7N79
5796C39r81R66K38j216R61j00n28J107j157j70J097q40K01N73r84O56L88j050
5814e00P56j66n74R12n34l71P93n12rN30q54M30N66r22O85m9o25R62m14n12O13
5835B05j82j39O62o91q8P40q48N01O8o25N94j14m34M97j18k73O12n17j76O55n76
5856b47K62K00n91M48j2l48M76j66l38O47k59l40P03o88K39L61n53K20J88k01
5876AJ07l1k36K91p9j89M16m76L6L94l89J42J18k36R8J59m12L50J7k91L59k42
5898i3l7K68j84kJ10j67J22J71l56K69J5k56L52k37q8K69k78J40J16k00r0L19
5920A63k48J81j2k01K74j63m5Q1k2n6P3j8j03K39k53J8J97k40J78j43K0K04j63
$$ plain form
5778 85 981 -545 -200 319 -484 597 354 -986 504 197 -336 713 -459 -376 785 -223 -240 339
5796 339 -642 324 562 -654 307 207 -321 786 -371 -541 556 -284 -83 490 -494 162 550 -500
5814 -500 256 90 -484 428 -106 -477 316 -196 -205 325 -529 -99 467 -455 230 181 -444 518 104 -408 205
5835 205 23 -116 546 -145 -233 507 -341 160 228 -397 197 83 -351 146 28 -245 367 -150 -326 329 -247
5856 -247 15 215 -376 72 60 -288 188 22 -316 331 72 -268 435 -253 -14 347 -206 14 202 1
5876 1 108 77 -159 132 53 -136 280 -196 -160 234 -155 -13 105 -131 -33 126 -286 64 81 -210 149 -93
5898 -93 -130 138 -46 -48 62 -105 17 188 -168 101 116 -140 212 -25 -113 156 -122 18 134 -66 -156 163
5920 163 -85 96 84 -117 157 -6 -51 30 8 -48 25 7 -96 143 -110 -92 105 -135 43 -100 -80 124 -39
5943c9K4J77k09n8K12j13n8J78l55L42o0j47K62j50l6P4J5k09L45k97R6P2j15
5966d9J28k3j13J67j25O3M6j4j77L08k67J13J30l45J73J16k50K54j34j82K36l5
5988B0k10L01k08l4K53k88K61p4j67J01J34l31L50l8l26M72k46j58M30l23O3L49
6010C31l43O7O8k77L26J14m85N57l32k14N45n55O0K46l32P2K63m79L76J47n84
6031d29N00j32k15O37n76J22M32n50L43K58o67L86L66q01N34n5n50Q58n15p5M18
6052B89m53L5O67q70J45M63p04P37j84p59Q47k54l19P12o23M3O54p41J39M68p39
6073d47O45K05r17P46j08m85J017p26l68Q83m83p5O51j115N02O11r81P94l14o59
6093f24J094m61m94R01o27q9R98j204L46O63j076Q35O5j030R83n1p61R67n62m24
$$ plain form
5943 -39 -15 162 -47 -105 107 -6 -64 114 -241 101 41 -106 156 6 -30 44 59 -150 195 -102 -6 66 -49
5966 -49 79 56 -57 110 -15 48 94 80 -97 211 -56 57 187 -158 15 131 -119 135 1 -181 55 20
5988 20 -190 111 -97 -131 122 -166 95 21 -146 -45 89 -242 108 70 -256 216 -30 -188 242 -81 -18 331
6010 331 -12 55 123 -154 172 286 -199 358 26 -188 357 -198 -138 108 -224 -152 111 -368 8 155 -429
6031 -429 71 -61 -276 361 -215 -93 339 -211 132 390 -277 109 475 -326 208 153 -397 461 -54 -129 289
6052 289 -164 -129 538 -332 -187 276 -428 309 125 -634 213 -41 -360 352 -271 -228 426 -315 -176 292 -447
6073 -447 198 403 -514 232 124 -361 656 -70 -438 445 -38 -113 538 -577 -75 536 -445 349 35 -624
6093 -624 470 9 -485 416 -211 -300 698 -506 -160 503 -573 262 327 -703 280 229 -532 435 -127 -551
6113e51J299r55JP29j100P38M60j170P09Q5q61J254n24p83J277r01Q2Q89j224
6132e46M47O64j130Q26K54j360J237o8r19J232r00l33J472j310L99N39j247P95
6150E2O13j246P90l1r81J569p24q09J328q95J19J069j592N28P86j059R00j59j311
6169a053J695k72r65J135j023L6J564j409k01J005j116Q79M19j796J184K28o73
6186c63J112j008m85J568q05k11Q74j630R94J009j780P61J61r64J570o24r75J265
6204D69n14j24J011j635L84J203j307P31q4j070J511n7j240J062m63m10J645j367
6222b55k13J183j163P22L45j600J117L38r66R62n73o85J639q55o09J131j256Q44
6240A06O44j436O06M80r04J071m31r53J500n82m99J125j268K72J131j203K14N57
$$ plain form
6113 -551 748 -207 -206 523 -577 161 621 -549 160 245 -616 638 114 -669 608 -293 -211 678 -546
6132 -546 -99 565 -565 261 515 -845 392 324 -595 637 -263 -596 876 -434 -35 504 -743 52
6150 52 665 -581 209 178 -803 766 42 -767 561 -334 -215 854 -738 -210 576 -483 417 258 -1053
6169 -1053 642 370 -595 540 -483 -447 1117 -292 -493 512 -604 275 694 -1102 82 310 -363
6186 -363 749 -259 -744 824 19 -192 682 -948 46 1055 -725 36 197 -767 803 179 -796 469
6204 469 -45 -169 842 -793 -409 794 -513 218 134 -936 575 518 -722 340 -123 -533 1112 -255
6222 -255 -468 715 -448 274 619 -981 136 474 -492 470 -103 -788 851 -4 -613 518 -738 106
6240 106 750 -686 -80 400 -504 567 136 -817 683 101 -398 727 -541 -269 862 -341 -127 430
6258D30j099J019K3j183J202k88o16J182r47j38J055j077L47N00r67O52M56j239
6276f88R75j37p44J202p83k61R84p53J58O50j090M26O27j151R27j36q16J107n24
6295b7n25R02m30r2P24q84J77O25j011O93J17q45Q87j60m50N44l24k66Q44o69
6315a70kO05q10L91K75p99N98Nm84P98m27l89P60m51q5O36q49L22N05q74M79J54
6337A88m59M77r7m78N96k45k60O75o63J96L96o15L19J13n71M96J29m41L55r1j90
6358a70O16n48M3K77l76K26J64l83J54K15m43L25k3l79N72l42K4K82m55L43m2
6379H0k14J33L9l46L55J45m99N30k41k12L90l09J05J86k28L1K99l47J51M5k32
6400a39K86r2k00K87k32kK55q7k17L14k25P0J12m77L84k7o8K10k76O2K28m0j45
$$ plain form
6258 430 -669 350 373 -810 392 104 -512 670 -277 -415 640 -437 -90 410 -557 95 551 -688
6276 -688 287 150 -594 608 -175 -436 548 -205 -47 603 -487 -61 566 -585 342 206 -610 497 -27
6295 -27 -552 350 -80 -172 552 -332 -155 470 -541 152 269 -576 311 151 -299 245 -79 -345 499 -170
6315 -170 -172 433 -377 14 289 -510 88 93 -391 407 -20 -409 351 -100 -185 451 -398 -76 429 -445 34 188
6337 188 -271 206 109 -369 227 -18 -278 397 -266 -70 326 -289 30 143 -428 68 197 -244 111 20 -170
6358 -170 446 -102 -59 218 -158 68 232 -151 3 218 -225 100 77 -302 270 -72 -48 234 -221 122 80
6379 80 -134 -1 38 -308 47 192 -307 223 -18 -230 160 -149 -44 142 -86 -55 244 -103 48 93 -139
6400 -139 147 55 -145 142 -90 -92 163 76 -141 173 -52 18 130 -347 37 10 -58 152 -124 -62 166 126 -19
6423a9J99j75m1K14k39J49p0o4N3j9L1j07P7m8J11j37J9K47l29J11J52k33J46
6446B8K2k54J57R1k03K63j21n0K37k88J96J5k25J53m4mM5J20l26K09q7m9K56k71
6470a30K06j41J3rl7o3J56j8j37K25o4q1K31k59J05J35k16P7L0m3L5K6m2J3M5
6495E7o3K90l35R9Oj59Q9Q9j96K30L4l69L55J9l74M59k72r9J79k28K34J9k08L5
6519a09K28l32L27k03j92M59k92L5K75k52k6L00l10N4J78l11L44Om11M00p9k52
6541a63M70l82j21M71k04p5L28o30L26K38n21N10k32l05N07k82k65M58k66o7N39
6562C34n69J59J84l18L89l8l58L59l0l72O83l81j47N19n29J07L04o42N02P7m89
6583b56L74l7l37N07k19k77O03o70K18N44r09L78K88o47N65M1o60Q21k66m60Q11
$$ plain form
6423 -19 180 5 -36 178 -61 88 18 -46 7 -12 19 -88 -11 -59 52 -85 -66 181 -148 -37 115 -118 28
6446 28 50 -204 -47 44 -159 104 -17 -67 170 -118 78 93 -132 21 -23 -27 18 138 -188 21 -66 -115 141 -130
6470 -130 76 -65 -52 -61 -98 -161 -5 -23 -160 65 1 -80 151 -108 -3 132 -84 -7 23 -20 15 41 -1 12 57
6495 57 -6 284 -51 48 54 -105 -16 73 -123 107 141 -228 127 146 -228 231 -41 -140 39 -189 45 64 -144 -109
6519 -109 119 -213 114 -89 -281 178 -114 -79 196 -56 -82 218 -92 -38 140 -171 173 179 -232 168 89 -163
6541 -163 307 -75 -196 275 71 -4 324 -306 20 258 -263 247 15 -290 217 -65 -330 128 -138 -205 334
6562 334 -235 -76 108 -210 179 141 -217 142 112 -260 423 42 -105 414 -115 -8 296 -346 156 233 -256
6583 -256 118 81 -256 251 32 -245 358 -312 -94 450 -459 -81 207 -440 125 166 -494 327 61 -399 412
6604D12n99o9P48p76K83K60o61N93R9p13N61M8n40R18p48j45P41n24N5M02o80
6625c35K88N07q96O14k0n79R41m68m53Q98p47J45N68p03O3N14p42N63J22q16P45
6646B09j36m79R28p63m6P96p09p5P41r43M24M86r70P10j28m50Q98n23l10P41n88
6667a87j10P77r42M01N79j036O26J14p45R15k74n65Q19m98k80Q91q57j3J003j130
6687e12O38K88j038Q87q6o43Q19l50m67J122q76k0P54r69M39N91j160P04K31p97
6707d45Q99l82o98J183o77n0P47j114M43N41q13N06j4o50R16j73p86J083o15k71
6727c70J145j064J26N39p30M10K54q25O23J89q47Q81l26m87J119q94l9O97p07
6746c06K83N29r37M13M54q93P27j44o25R36m23k94O78o70J88N92q44K82M14q84
$$ plain form
6604 412 -187 -256 492 -284 -1 259 -402 191 290 -423 138 186 -354 564 -184 -329 412 -112 -57 345 -335
6625 -335 -47 460 -436 178 158 -421 520 52 -401 497 -250 -105 463 -240 -177 337 -405 158 280 -536 209
6646 209 73 -406 522 -241 -287 509 -200 -275 466 -477 -53 433 -537 173 45 -405 493 -30 -340 401 -187
6667 -187 -297 480 -462 -61 518 -518 108 222 -523 392 118 -447 372 -126 -406 485 -372 -385 618 -512
6687 -512 126 414 -624 263 177 -466 353 3 -464 658 -218 -238 516 -453 -14 577 -583 121 352 -445
6707 -445 454 72 -626 557 -120 -170 577 -537 -94 447 -366 140 126 -524 392 219 -567 516 -99 -370
6727 -370 775 -289 -163 376 -354 56 310 -515 108 297 -550 331 5 -482 637 -257 -296 401 -306
6746 -306 -23 506 -431 -18 436 -457 270 126 -499 437 14 -280 398 -272 -84 508 -336 -54 360 -524
6766e24P63M2r17J009l33k30N78n94p8O70n34qM57q06N30L18p83O75j99l41O21
6787C16l35k37O23m54j19N62q44N46K33o38N41k01l32O29k23m08O10l64qN28p18
6808b93L28K88n77M31N3n49O21k38l54N00l54j52O73o75J58M43n49K48J94n08
6828c12M58K3n09O53k33k73N76m81j2K97m19K18J86l99K98J17m78L80R2m72O34
6849C44l00j68L02l54J55K35l42P7R1l15M24n2n28N19j39r3L08l10N5K12q4pJ48
6872A78k68K09P8m83M74j48r5K66k66j01K23J0j45K06l03K33J23k91K44p5j53
6893h4L06k42qJ43j37j08L07k99K4K51k05J34l6j59J45M0p0J21j45o5J66o3MQ5
6917A05l12L33q2j33Q8N5j40Q3J14k83L56k79Q1K22l59J67qm4J05n8k1O0j24j2
$$ plain form
6766 -524 239 281 -636 373 40 -190 388 -206 -284 386 -148 -156 301 -505 25 343 -440 235 36 -305 316
6787 316 -19 -256 367 -87 -206 356 -488 58 291 -347 194 -7 -339 290 67 -341 269 -95 -103 425 -293
6808 -293 35 323 -254 177 230 -319 302 64 -290 210 -144 -296 377 -298 -140 303 -246 2 196 -312
6828 -312 146 169 -340 313 80 -193 383 -98 -110 187 -232 -14 172 -227 71 188 -290 90 182 -290 344
6849 344 44 -124 178 -176 -21 214 -128 -51 40 -275 149 97 -431 88 -51 -144 164 -146 -91 121 37 30 178
6872 178 -90 119 197 -286 188 40 -55 211 -55 -156 67 77 -68 138 -165 68 191 -100 144 69 -84
6893 -84 222 -20 -28 115 -22 -130 177 -122 -98 153 -52 82 46 -113 32 72 2 123 -22 -87 79 16 20 105
6917 105 -207 126 44 -89 -1 54 -86 -3 111 -172 184 -95 -14 208 -151 16 8 -36 69 11 -10 50 -74 -86
6941h6J75%j86J76q8j12Q3R1q4J30q8m3N8j40J65k1J2P5o6l3M8j36p1J26O9m5
6967IO4k50L14l5k27K60j46j5K4L3j40J13qp7O6j9J07j29j20K71j63r5K48k0j87
6992a22J45l6l4K37k62K16j64o5P6J2n0J58j13k6J29j97o7L63l80K39n5j61L07
7015A50j74J4L9k3j14J80nj69K04j95J88qk96L19k26J1K49j73o9J69q9r8K80k91
7039a27N6K22l36K41o3k5QJ0k14K97o3j2J96l38J49J71k29K12R4l83K00J14l48
7062a68L70k02p2M25m89J05K14l43K58O2l84L55q9k88N44k47l77N16l47J48L27
7083C18n48K27K81m11J37K07n27M55j2m03M98l05q0N62m29j99M74m11K04J48m70
7104b84L91K0m07N25k73k45O12l32j22K31k30O7M01n89K44J81m55M86j81l87N52
$$ plain form
6941 -86 89 89 -97 79 -9 -121 -38 53 -31 99 11 -32 26 -114 51 30 42 117 51 18 66 -70 -141 -15 54 9
6967 9 73 -177 137 102 -125 135 -11 -26 -2 31 -109 4 -4 -81 -15 -34 73 -56 -176 95 -68 -163 85 65 -122
6992 -122 23 -13 -47 190 -72 144 -20 -85 -9 3 -47 111 -2 -28 101 -96 -163 200 -180 59 4 -157 150
7015 150 -24 -10 29 6 -108 72 67 -102 102 -93 95 87 -209 110 -116 -105 144 -29 -98 71 -18 -116 164 -127
7039 -127 -71 151 -185 56 -7 -32 -24 -14 -228 69 6 -6 190 -148 1 172 -57 155 249 -134 66 180 -168
7062 -168 202 0 -72 353 -136 -31 183 -160 98 160 -224 131 42 -246 298 51 -326 190 -157 -9 318
7083 318 -230 -3 278 -133 4 211 -316 139 127 -276 222 -83 -163 399 -30 -229 245 -166 38 186 -284
7104 -284 107 127 -280 245 -28 -273 339 7 -115 116 -114 -47 354 -235 9 190 -265 221 40 -347 205
7125B05l00m2M96n47Q5M90o17K88K53o19M27L9m51M84k23k24O17m95j85O75n53
7146a97J37K96n57N47k0n29N05j56m06O48k63l30O49n12J01N71q18L73J69o14
7166d06N84q1l61O12m06m80R04n20k4N40p82M78K45o04K80J13n62Q43j90n29O12
7187B66l69l4N64p37J30N41n40L08j3o53P55L6o40N79k62j86P77p22OK68m06N53
7209B21Q1p29M32K85o04P03m28m28Q40m11j55M35m99K55M50p68K68L31o18O64
7229C25j72o50Q08l64j07N87p53J27N42m77J39K35o16N56Q9p01O20k39j24N34
7249C59l91j72O09n52M4L28n66L71L06p12M67o6l03M65k84j72O25l74k4L22o10
7270c30M22K62o73M45m0l60M79j24l71M75j94j32N08o43K59L57o94M28J33n14
$$ plain form
7125 205 -95 -137 359 -188 -103 387 -230 58 311 -308 119 158 -293 191 -32 -256 361 -134 -319 356 -197
7146 -197 -60 236 -321 226 206 -323 182 26 -380 268 5 -325 324 -188 -87 484 -334 39 208 -406
7166 -406 178 97 -264 348 -58 -538 366 -154 -178 362 -420 58 303 -301 -21 92 -470 373 183 -346 266
7187 266 -103 -137 427 -310 -180 361 -179 129 116 -537 218 254 -386 193 -69 -255 522 -200 -194 74 -332 221
7209 221 302 -427 5 290 -314 389 -39 -467 373 -38 -193 242 -257 -2 448 -320 -52 279 -339 325
7229 325 153 -497 311 -53 -160 427 -326 -199 343 -134 5 240 -376 180 269 -432 188 -51 -175 359
7249 359 -32 -204 405 -147 -103 225 -341 30 336 -376 91 25 -278 187 -97 -269 356 -18 -42 280 -330
7270 -330 92 354 -319 126 86 -274 205 81 -290 185 -9 -141 367 -276 -17 340 -354 74 207 -307
7290c07L73Lk63L52k15j65O28o71J54L67m41L37K0m77L79J4l13M62k49k80O54
7311C62m77j1M24m40J02K57m14Q5K27k90L31j0m76O45l86o3M52l17o6J48k32R0
7333e9K37m02L69k4k93L99k22j27L04k13m1L34k53j13K60l28K58M0l46K55J09
7354A44k76L10k52j3J81j13m1K69l21J26P3j87K84q6k05K57j08j42K24p5j54J87
7376H2j18k0K06k46K05j16j2J57j71J4J09r2j32K64k57K9K46l02K16j6j59J80
7398F7q3N9J7k3j11L02j99r7K80k64N2%j10Q6R6j99P3J43j73K22j96o5J09j9Q1
7423D8k1lN9p5j6J22M9j99J53J5j37J87k43K9Q3j71J78j24P7M3p0o1K09m5j48
7448f1J89r4L7j41j9N2J77j36o8J42k67J62lj2J51j45K9l6Q1o5N9O1j04P1n2J3
$$ plain form
7290 -307 66 69 -194 158 -57 -222 406 -265 -111 256 -185 152 172 -305 74 88 -225 237 -12 -292 362
7311 362 -115 -126 298 -142 -40 217 -197 -112 115 -175 156 146 -330 315 -71 -134 318 1 -65 83 -149 -59
7333 -59 178 -224 145 121 -172 227 5 -122 182 -31 -72 262 9 -104 156 -172 86 126 -220 35 144
7354 144 -132 178 -74 -87 94 -19 -60 209 -112 14 87 -100 184 98 -107 150 42 -100 124 49 -105 82
7376 82 -36 -56 150 -96 109 -7 -19 138 -33 -19 90 -2 -134 130 -127 -98 148 -154 62 46 -113 67
7398 67 -16 43 60 37 -74 228 29 -68 212 -52 0 0 -110 -24 72 -127 -54 89 -84 138 -58 -123 -14 -33 48
7423 48 27 24 83 8 -8 114 163 -36 117 132 -5 182 -61 -32 51 -120 58 -66 11 54 -16 -77 132 87 -61
7448 -61 128 34 71 -70 -89 -37 140 4 -64 78 -189 -27 -30 -42 109 -36 -7 -43 38 -27 32 93 -11 60 8 21
7474B1o1m9J82j21J36q3j1j4Rj17n6K76k19J12R9j67J98j62M8ro6M7OJ8q9O7n9
7501f4L8K8M3R7j39r9N5J2K2O8pp0J32k46J20O2j80K44k34J2J91k8p2L2kj01J98
7528A12j49N3j5l8R8k7p7l2R5o3M3L6k04L18p6q8Jk3O5J33K4k57N5j01K85n2l29
7555b13L32j50P2O8k51N7J37o5M8q6j18J74Q1j16J7l8n0K37j96jJ24p6q3K25k72
7580a43J89j7j07J96j81o7J71j52J96M0k03%K11k83J98R1l40K89J0k15J52j85
7602a50J73J07j36q2K48k85J34P0l34L46j09k10L37q2j00J58j21j11L11m47K17
7623f6J81j68K33k06j36K49N5k06K04q5j49L51k50l0L79n61L21J76n13L36j35
7644b0k17N23k69l71N32j81m1K69n06J90K48k58J81k0k07K28m3k89N02k71k7M02
$$ plain form
7474 21 -40 -89 93 -28 108 25 14 0 9 -108 -164 112 -107 5 104 -63 135 -27 21 12 -54 -7 -1 17 -72 -5 -64
7501 -64 -26 2 45 142 3 -96 -41 -29 -7 61 54 -16 116 -130 -10 52 -128 116 -118 -106 85 57 -15 17 15 -86 112
7528 112 -37 16 1 -37 61 34 -43 -75 20 -43 0 36 -168 150 74 -14 -13 -36 29 162 186 -71 -16 -117 168 116 -213
7555 -213 119 -31 41 109 -142 -85 52 -13 35 -51 -169 5 86 -30 -13 -51 -101 136 -60 -61 63 -13 -96 129 -143
7580 -143 46 29 -78 118 -63 -130 41 -111 85 125 -78 -78 133 -150 48 139 -201 88 98 -117 35 -150
7602 -150 23 130 -6 -88 160 -125 9 79 -255 91 -18 -228 109 27 -73 85 -36 -147 164 -283 -66
7623 -66 115 -53 180 -26 -162 87 142 -64 140 55 -94 257 7 -23 356 -205 116 292 -221 115 -20
7644 -20 -237 286 17 -354 178 -3 -44 225 -281 -91 157 -101 80 60 -147 81 38 -251 251 -20 -47 355
7666C55n64K56J35l38K65r2k20L13M7l26M09k94j30L89j64j47K35k10J53J22m93
7687b99L38j5k48K97q4j94N19l60j03L74l25J09J35l41J49K63n18M32j2m57O07
7708B67k55j37M01m38K1M70m68J55K94n37M45m4l91M10k10j74M60k84o1L05m55
7729b26K83K15n52L04J11l31M29j76k18L48j71j10K95l03oK77m04L11J52m07L41
7750A62j43r5K83k18k11M42p2k92M37m47J80K16m66K40P5k96L70j05l30N41j68
7771A03j95K58k77R8K14l72J98K6j52K67j1l74K95j39k02M65k47j71L74l20K51
7792H9J75m47J53K03k66J63J9l86N33k14j74K57k04R7K27k79M6Q2q8J58o9k43
7814a68L41n8j66K67j90n8Q9j35o0K23k73L61mm01L25j30LK31k96m8K07k5rJ10
$$ plain form
7666 355 -209 47 182 -156 109 17 -203 110 157 -169 240 -54 -184 205 41 -106 129 -81 72 194 -299
7687 -299 39 24 -224 73 -11 -205 314 -46 -149 225 -100 9 144 -197 -48 215 -303 129 117 -340 267
7708 267 12 -125 276 -162 -141 329 -139 16 310 -227 218 174 -217 193 -17 -191 269 -15 -76 229 -226
7729 -226 57 272 -280 24 135 -196 233 57 -161 187 16 -94 201 -102 -108 169 -235 76 228 -179 162
7750 162 19 -76 207 -11 -222 220 148 -144 293 -154 26 242 -224 16 91 -205 165 60 -270 271 103
7771 103 -92 166 -111 -13 201 -171 27 53 -99 168 157 -217 78 -61 -263 202 -45 -216 158 -162 89
7792 89 264 -183 -30 173 -93 70 89 -297 236 22 -152 105 -99 -2 225 -54 -8 74 -14 144 75 -168
7814 -168 173 115 -51 216 26 -32 57 -78 -138 85 -188 173 169 -232 93 -37 -34 197 -99 -147 60 35 26 136
7838A36k47O5K48l01J75j61j35M16k02j20J73l1pJ72l07L6K02j69J50q1q8J69
7860I3m1j50K10j11q7J86k01J01R1j35J49p3q3O1K6r5R6k3r5K08j45L8r1P4m1
7885c8L5j21J36R9j75O3o0j94L66j42R7l4j08J72pq4j5k8J1J14p3r9J30Rj98J73
7911B9j21O0k1J7Q1r7k9J66j13j18K63j75MJ56j24M9K9M3k4P7j72J9M9j50J07
7936EJ0%j2k6RJ6o6J41k4j57o3L80j93J1J5po2o3J38jk9q2Q7l5k6M1n9k5J11j04
7966g0J36j03rO4n8O3jN9K7k8l1Qo7n7N2J88o8n4L0p2l3Mj00J65j38O9or5J81
7995E6n5Pj21J71p3O6l0j43J38p8P8P6j16P0Q5j01k2R7o9pNq9J83j70P7Jl8K6
8023B4j05N1J59Pj26L5p3M2j8q5J19L1m1N6Ro2r4J46k10J45M4q6J02r6K1R8l9
$$ plain form
7838 136 -111 -46 202 -99 76 -85 -220 196 -6 -126 47 16 9 181 -126 -90 112 -57 93 12 -76 93
7860 93 52 -98 112 1 -86 100 -101 0 91 -44 105 32 -51 10 36 -59 37 14 -81 127 -18 20 -71 3 -38
7885 -38 -3 -124 12 111 -64 -1 -61 -255 111 -31 66 32 -76 96 89 5 -10 -38 -27 87 14 -85 45 54 -144 29
7911 29 -92 -32 -53 -36 45 -52 -81 85 -28 -146 117 -58 -54 102 -22 27 56 99 75 152 -20 -1 48 -102 5
7936 5 15 15 3 -23 -14 2 -64 77 53 -104 -167 213 20 31 46 39 -23 -86 52 51 22 -60 27 -8 -34 7 -52 -77 34 -70
7966 -70 66 -37 -46 18 -40 23 22 81 108 80 49 57 -10 -67 -15 173 105 51 81 9 -24 -20 -120 45 -93 -24 -30 -125 56
7995 56 1 8 -113 58 -15 51 21 -122 16 -62 16 92 -24 46 131 30 8 105 36 29 34 -55 128 -42 35 36 -2 24
8023 24 -81 -30 129 136 10 45 -28 14 -4 -89 30 61 20 76 85 23 -71 75 -135 10 54 -32 70 -26 -5 93 54
8050E4o2K6O6j59J43j16J3M5j76K60j76J17J8m3O6p8J24o6j08K2J09Mk25K83k20
8075g9N8J07r1jP8j20m8J82j70J25Q6k57J58r7kJ83k48J16J4J04k55K40j63Q2
8099BQ1j34P8k7k6J77j51P1j10N0q9J74j58Q4J65l80J98L4j67J98j28J6J37p1
8123B4p6J67k8q4Q2k70L04p8k1k4N4m4M2R5j58J01k5j60K68k75J28Ln7Q7Q0j65
8149c0O6O6j27Pl4l8J86j13J7J05j01MJ35q5l8n0n3J34l9jQ0j46j3N2Km9R1q6
8177e8Q4n7j01R8O3j31P3j09J56R0j25n1J95k00
$$ plain form
8050 54 -8 18 84 -75 68 -48 -35 10 -166 94 -82 35 53 10 76 -2 122 56 -52 -30 79 83 -142 141 -79
8075 -79 -21 86 -5 -6 72 -48 -96 86 -84 41 127 -130 28 -69 -71 112 -136 -20 -6 98 -157 83 -80 2
8099 2 83 -51 27 0 -26 151 0 71 -39 11 -78 96 -62 22 187 -193 5 39 -128 70 -58 -42 95 24
8123 24 -52 115 87 3 85 -185 119 41 20 -4 50 6 48 143 -15 86 61 -99 169 -106 22 25 -32 55 135 -30
8149 -30 36 102 -25 -18 -52 -90 96 -17 0 105 4 8 143 58 20 -30 -83 51 12 11 91 -55 -68 -16 -14 -63 28 -58
8177 -58 26 -31 -132 -34 29 -102 -29 -138 18 108 -17 -68 127 -73
8191g3
$$ Imaginary data points
##PAGE= N=2
##DATA TABLE= (X++(I..I)), XYDATA
0@%%%%%%qJ6j6J6k4L2m0N6p2Q8j07J31j60J93k33K81l36L99m65N39o28P31q45
29d52R68j104J259j434J626j836K069k327K608k914L252l623M027m472M955n479
45b877O053o680P369q121Q946r856J0855j1959J3190j4569J6119j7876J9889k2218
59a1735K4950k8212L2182l7136M3515n2071O4204q2832J15276j87280O11395r2217
71D00039q32384Q33626m40178J12241M85999o78392j07261L87133k07123K25555
81A79255m77723k32375Q02746l01108j48840M54455q20698K30110Q75426p55729
91a94481j06069N59338m31785K68427J78315o12115K07601J54619N4964K52448
101C31262n72715Q9204M99399n13668K24517K88177p24663N50610M36713q35779
$$ plain form
0 0 0 0 0 0 0 0 -8 8 -8 8 -16 16 -24 32 -40 48 -59 72 -88 105 -128 153 -183 216 -249 290 -338 393 -452
29 -452 516 -588 671 -763 863 -973 1096 -1231 1377 -1537 1715 -1908 2119 -2353 2602 -2877
45 -2877 3176 -3504 3865 -4256 4690 -5166 5689 -6270 6920 -7649 8470 -9406 10483 -11735
59 -11735 13215 -14997 17185 -19951 23564 -28507 35697 -47135 68141 -119139 492256 400039
71 400039 -432345 401281 -38897 73344 559343 -119049 -226310 160823 -46300 179255
81 179255 -298468 -530843 271903 -29205 -178045 276410 -544288 -314178 561248 -194481
91 -194481 -300550 258788 -172997 95430 273745 -338370 -130769 23850 78814 331262
101 331262 -241453 -152249 347150 -166518 57999 346176 -378487 172123 608836 -226943
111b26943K27043J65784l78062M22429o5663l17009J90833j50040J29201N6706
121E4279n13347M24360K05581n00971M99788q6627n72695O55087L3373m68528
131b69700M40294l3128k32826K93782j96730o8975J21527j43608L05231j29722
141H6145l17496M40698k11210k89245N46743k41625k61331N62837k63234k53352
151b01070L58947k12664k5535J83422j25198R5934j01711r6758K35766k68081
161a56948k9367M20576l63002k1741M19995m29058j2204L64809k93780M4591K47652
172A91523j83358L329J7046n6823J00927j49616R7172J72578l29077J55425J63058
183A82184m18375J87279K45696l40423J49599J82486l03197Q2321R5118j24191
$$ plain form
111 -226943 100 165884 -212178 210251 144588 -172421 18412 -131628 -2427 54279
121 54279 -459068 -34708 170873 -330098 169690 83063 -489632 165455 198828 -269700
131 -269700 170594 137466 -95360 198422 1692 -67283 54244 -89364 215867 86145
141 86145 -231351 209347 -1863 -291108 255635 14010 -247321 315516 52282 -201070
151 -201070 157877 -54787 -80322 103100 -22098 73836 -27875 -124633 111133 -156948
161 -156948 -186315 234261 -128741 -150482 269513 -159545 -171749 193060 -100720 -56129 191523
172 191523 8165 11494 28540 -28283 72644 -76972 20200 192778 -136299 19126 182184
183 182184 -236191 -48912 196784 -143639 5960 188446 -114751 -32430 62688 -61503
193f1503N6232n414P7427j2849j73714J55403k3138k24467K78978L6267k94353
204a91131K64358K6254k88065K00144N0588j43974J25101N8314o2265l8904q728
215h308P6744p5762m8478K16244j28949j32300K41582j59457j61224K54920n0907
226B4105j41091J78237k1198j44551O5907L0484k3130k4609P8976P2316j59635
237f4189L7426J22004j83472K6442K12543j53167m7660J91442j40838r2525J42946
248E0952k2359o4177O2825N8010q9302o2800R0575j9097j08979J25885O9460j79914
260h8921P4224Q6138j83477L6769J40337q6025k7552J22644m5159j02472O9479
271d015M8125p2724J5160J28175p6834r1033J23716m2780j15303J22706N5160
$$ plain form
193 -61503 -5271 -10685 66742 53893 -119821 35582 12444 -212023 66955 103222 -191131
204 -191131 73227 99481 -188584 11560 62148 -81826 43275 101589 39324 420 -8308
215 -8308 68436 -7326 -55804 160440 31491 -100809 140773 -18684 -179908 75012 24105
226 24105 -116986 61251 40053 -104498 -38591 -8107 -31237 -55846 23130 95446 -64189
237 -64189 -26763 95241 -88231 -61789 150754 -2413 -50073 141369 531 -91994 50952
248 50952 28593 -35584 27241 85251 -4051 -66851 23724 4627 -104352 21533 90993 -88921
260 -88921 -14697 71441 -112036 -75267 65070 -20955 -48507 74137 28978 -73494 -4015
271 -4015 44110 -28614 -13454 114721 37887 -53146 70570 27790 -87513 35193 90353
282I0353j33523M7322P5857j42639j8615J07929l9099o1577J01289J9909j35317
293h8111M2538P4721r7941O394J39876n1342q3427J15914k2765j12759R0442P3093
305H6633r1443J5661J01406j02921o5517J04052k1216q0526Q8157M9622j30301
316d6393J2575P3954j01089k1695J17592j9321q6890Q7403R417j23711N1564Q3298
328C6704p0979k512J14571n9012q5281R5790Q93q3584P4822P9201r9595q522Q7938
341H0434q8330m9069J05147J206q2860O3809L6780j24390P776Q3983o3527l1482
353f0523J12889k2408j09430Q1340J5790j04124N9933Q6403p5435j6896Q5607
364E3146o0136o4359P8494K8670o7438L6747Q1133j03695l3288J05546n7345n1854
$$ plain form
282 90353 -43170 4152 80009 -62630 -81245 26684 -12415 -73992 27297 47206 -88111
293 -88111 -45573 29148 -68793 -62399 77477 26135 -57292 58622 35857 -76902 13540 86633
305 86633 -4810 10851 112257 9336 -56181 47871 26655 -53871 34286 83908 -46393
316 -46393 -33818 40136 -60953 -82648 34944 15623 -71267 16136 25553 -98158 -46594 36704
328 36704 -34275 -36787 77784 18772 -66509 29281 30174 -53410 21412 100613 1018 -7504 80434
341 80434 -7896 -56965 48182 49388 -33472 30337 67117 -57273 -49497 34486 -29041 -60523
353 -60523 52366 29958 -79472 1868 17658 -86466 -26533 59870 -15565 -32461 53146
364 53146 -6990 -71349 7145 35815 -31623 5124 86257 -17438 -50726 54820 -2525 -54379
376e4379J20136m461j03944P2972J4168j01101L3651O2357l1331l2647N6680o549
388B5552r8192M5408O9139r1408J5526J23168j02915m3589J16162q1976m2821
399f5946J12154r489n9868L1429J7668n1330k7172N5610J8246p8938P5321N5157
411G2842j55476N4425R3386j25393M8941J10738j05395l072P9610p1404k1564
422b2362L3557K1073n185m8593O1065k6621j12067J10062K0353j33682J22776
433B0376M8126j60251R1622L7463j17861P9218L9035l8492J3666j1025J7479l3406
445a4050m7976J09626k7409r4155J55761n7618j30394J73097m9145j05428J58611
456G0920j5593p7617P0758m0553k3267K9151k4399O2813o4090m2839J39584j28513
$$ plain form
376 -54379 65757 61296 -42648 30324 44492 -56609 -22958 39399 8068 -24579 32101 25552
388 25552 -72640 -27232 41907 -49501 -33975 89193 -13722 -57311 58851 -23125 -65946
399 -65946 46208 36719 -23149 8280 25948 -25382 -52554 3056 21302 -57636 17685 72842
411 72842 -82634 -28209 65177 -60216 -11275 99463 -5932 -9004 70606 -798 -22362
422 -22362 11195 32268 27083 -21510 39555 12934 -99133 10929 31282 -102400 20376
433 20376 68502 -91749 -127 37336 -80525 -1307 37728 -764 12902 1877 19356 -14050
445 -14050 -62026 47600 20191 -73964 81797 24179 -106215 66882 17737 -87691 70920
456 70920 55327 -22290 48468 7915 -15352 13799 -10600 52213 -11877 -54716 84868 -43645
468d3645o6685J68707j15846k3789J91982j42438o2153J55734q3862K425O2096
479D2526o1917O3814j0939k4360N1042j33521L5385J61974j68476O173J32276
490I3977j91407P1325J27172k03720N7656J14706p6559M7817l5893o1359Q9616
501C3331l9160L2850M3755j75271J25059R4339k28445R5909N1465j57760J83710
512E9782K9979k08786J05677L4334n0033Q7781r1265J8278Q7774q9598Q6902n0931
524A9894j64095K21018J2687j89037J61199o1518j26368K22251q9656j25047J49176
535C0504l1338K6799L2714j31168P6029K5634n9941J45602j20268j01489K42653
546A35731j24647j11588J73844j43420K84J92020j58116m4825R2854o8041Q2708
$$ plain form
468 -43645 -110330 58377 -57469 -81258 110724 -31714 -93867 61867 -21995 -19570 42526
479 42526 -19391 44423 33484 9124 60166 -73355 -37970 124004 -44472 -38299 93977
490 93977 -97430 -26105 101067 -102653 -44997 69709 -6850 40967 5074 -56285 33331
501 33331 -5829 27021 70776 -104495 20564 114903 -113542 -17633 33832 -123928 59782
512 59782 89761 -119025 -13348 20986 -29047 58734 -32531 -14253 73521 -16077 70825 19894
524 19894 -144201 76817 89504 -99533 61666 148 -126220 96031 6375 -118672 30504
535 30504 -834 25965 58679 -72489 3540 29174 -30767 114835 -5433 -106922 135731
546 135731 11084 -100504 73340 -70080 -69796 122224 -35892 -80717 12137 -55904 26804
557B6804j1403q9212J36676o2568j2224J32173k04047K2089K13329j80140J2093
568a6430J24231j99679P8521J09260j75437O4624K8403m2737J01167j06419k0932
579e5428J04786j19154Q8394Q7836k21874J23223J03229k16914J17777L2541j56451
590a12035J59194Q610j20728P3688m3019J2237P8046j14166P3371M8430j32479
601f8851J48898k6525j77335J96086m46j40432J49910o1937j05054J45678o4419
612d427m7864P1042o5106P3538l067j10706J13663m3290o3428J80410j01723r2670
624i3628J95054j03089o6055J45412j14440L407J12211q9172R274n45m5891R4051
636D6589n6183l6533J24154j12536L658J37450j75338J5766J49350j29846K7786
$$ plain form
557 26804 15401 -73811 62865 297 -11927 120246 -83801 -61712 151617 -28523 -16430
568 -16430 107801 -91878 -13357 95903 -79534 -14910 13493 -29244 71923 -34496 -55428
579 -55428 49358 -69796 18598 106434 -115440 7783 111012 -105902 11875 44416 -112035
590 -112035 47159 55769 -64959 8729 -34290 -22053 55993 -58173 15198 63628 -68851
601 -68851 80047 53522 -123813 72273 71827 -68605 81305 19368 -85686 59992 -4427
612 -4427 -52291 18751 -46355 27183 24116 -86590 27073 -16217 -79645 100765 -958 -93628
624 -93628 101426 -1663 -67718 77694 -36746 -33339 78872 -10300 -1026 -1571 -47462 46589
636 46589 -9594 -46127 78027 -34509 -30851 106599 -68739 -52973 96377 -33469 -5683
647e683P7418j23668L8726M5583o7886M4682l0459O528P3370j10451L1025O4212
659D3397j24711R2355P2169j54545P8190O3880j31066P2036K3357p9695P2692
670B8059n703k2766J5918n8575M9275J9101q2464Q9061L689j09366J17319j4191
682B9357j16757J19685k937p1480Q1469k1591m6120L7622j7526J3033J590l2021
694b5676O9898m0942n4425R7991o3626m3810J20917n4593n2575R4480m8611m3355
706d4327O7988k6372n890K1404r070J9753m2537J169N1198o1821J2833P6208q3300
719b2764n547P9859q3111l146P2505m9624l02L5592k1436j3707k342J6432Q783
732A1192l1255L5359K1506p4086M0892L0775q1153M5857M4646o4978J6738L4780
$$ plain form
647 -5683 71735 -51933 -13207 32376 -35510 9172 -21287 -14759 58611 -51840 -20815 43397
659 43397 -81314 11041 83210 -71335 6855 70735 -60331 11705 35062 -44633 28059
670 28059 22356 -410 15508 -43067 6208 25309 -57155 31906 35595 -73771 43548 29357
682 29357 -87400 32285 29348 -42132 39337 17746 -28374 9248 -8278 4755 6345 -25676
694 -25676 44222 3280 -51145 46846 -16780 -60590 60327 5734 -46841 47639 -972 -44327
706 -44327 23661 -2711 -8601 12803 3733 23486 -19051 -17882 33316 -28505 -15672 60536 -22764
719 -22764 -28311 51548 -31563 -34709 37796 -11828 -12130 23462 2026 -11681 -14023 2409 11192
732 11192 -20063 15296 36802 -37284 3608 34383 -46770 -913 43733 -21245 -4507 30273
744C0273m9818j771L0745q303o443L443K5544k4259l0936N1042j6209l7562O1966
757B7712j253n9646M3981R854n9069L3328K5317k9702L882K0751j0760k9585K0140
770e050K2073k9940O489M3190l5445k5035N0679k7270k8855N1949k693l6308K1120
783D904J2672l9178K800L1021j3971j4489K8288M544m4173J9138K6613l8808J2073
796h566L9481k8804j9933L7064j5812l1772L6344J1080k8873Q691K4423l2546
808i223j5113L9138j1955k1054L2897P864m0195J1264K4996l5904L472L7176j6888
821F475k2639K7817k133l8688K5084K0649k8352N930K8646k4102k2713L3978n604
834D348k4251K9060J3988l1692R76K6569k9546q938L7492q461k2208K2884O441
$$ plain form
744 30273 -19545 -21316 9429 1126 -5317 -1874 23670 -589 -31525 19517 3308 -34254 27712
757 27712 26459 -33187 10794 20648 -38421 -5093 20224 -9478 -5596 15155 4395 -25190 -5050
770 -5050 17023 -12917 -6428 36762 1317 -23718 26961 -309 -29164 22785 20092 -16216 4904
783 4904 17576 -21602 -18802 12219 -1752 -16241 12047 16591 -27582 -8444 18169 -20639 -8566
796 -8566 30915 2111 -17822 19242 3430 -28342 8002 19082 -9791 -1100 23323 -9223
808 -9223 -24336 14802 2847 -18207 14690 22554 -17641 -6377 18619 -17285 -13813 23363 6475
821 6475 -16164 11653 9520 -29168 -4084 16565 -11787 -5857 22789 -1313 -24026 9952 4348
834 4348 -19903 9157 23145 -8547 -7571 18998 -10548 -19486 18006 9545 -12663 10221 16662
847A6662l8361J2183K6159k6594P89L0511j5423k7790K7266N78l0323K4982J8088
860A8727k5318k429K4729k0607j8686L3512J436k2959J8964J6336l6159M51L1890
873A9887k7671m390L3984j2176k4148J9034K423k7450J4205J9996j4488r600K2367
886A1973n583l2540K8346J2075l1754K1317K1483l6783o11K7555k6625k375K5782
899A2260o587j0826L080J1141j8274q641L2573o789k2658L3676j441m3258L4159
912H415P761l7616L0634R903k6626M828O078j0076o075P069J5755j2450j2624
925a5024L3874k4537k3900N2204k0856k2534M8435j6685k9911L1700r592j8355
937a5181K2328l976K715p893p546K2426l0010L58M2687l6273k731M8553m5663
$$ plain form
847 16662 -21699 -9516 16643 -9951 -9162 21349 5926 -21864 5402 5980 -24343 639 18727
860 18727 -6591 -9020 15709 -4898 -23584 9928 11364 -11595 7369 23705 -12454 -12003 19887
873 19887 -7784 -12174 21810 9634 -14514 4520 6943 -20507 -6302 13694 -794 -10394 11973
886 11973 6390 -26150 2196 14271 -17483 3834 25317 -11466 -12077 15478 -11147 -13522 12260
899 12260 5673 -5153 -2073 9068 -9206 -17847 14726 7937 -14721 18955 17514 -25744 8415
912 8415 16176 -21440 9194 19097 -7529 -2701 3377 -6699 -12774 -5705 10050 -2400 -15024
925 -15024 18850 -5687 -29587 22617 1761 -20773 27662 10977 -18934 12766 3174 -15181
937 -15181 7147 3171 5886 -2007 -9553 12873 -17137 -16779 25908 -10365 -13096 35457 -10206
950a0206j1255N0167l9096J006L5138k9382M533K491j2554J2272j8244P326K9385
963B1581m1270J2086L5564o2158K6046M1229n9711L1331K8481m8948K0887R532
975A4650k9653K3112o457l032K0396m1685K2227J6110n7183M8173J3542n8597
987c8397N5632O576o1957N0998J376l8014M8871j8023j2400K4922l3825K0663
999F422K033m1155N1802n897m9735O1707k5654m7084P9242l0317l1310O2160l4583
1012b369n686L3837l9886J3622J4046k6800M2796k6871l8256O7039m3254k0347
1024c2129O9132o2040j123P1244o2138m830M3029m5604L3346J8871m8138L6882
1036A6502j7755j0470N0422o4442J928O5992o1790J5130L8943q6620M2581N2315
$$ plain form
950 -10206 -21461 28706 -10390 -9384 25754 -3628 905 3396 -9158 3114 -15130 -7804 21581
963 21581 -19689 -7603 27961 -34197 -8151 33078 -26633 4698 33179 -15769 5118 14650
975 14650 -15003 8109 1652 -1380 19016 -22669 -442 15668 -41515 6658 20200 -38397
987 -38397 17235 23811 -38146 12852 14228 -23786 25085 7062 -5338 19584 -14241 6422
999 6422 8455 -32700 19102 13205 -36530 25177 -477 -47561 31681 1364 -29946 32214 -2369
1012 -2369 -8055 25782 -14104 -482 13564 -13236 29560 2689 -35567 31472 -11782 -32129
1024 -32129 37003 -25037 -26160 45084 -17054 -21884 21145 -24459 8887 27758 -20380 16502
1036 16502 -1253 -11723 38699 -25743 -23815 42177 -19613 -4483 34460 -52160 -9579 42736
1048D2736p1704L3558O223l4766N6130k5782k8247L7130l0791K9092L2156q7402
1060d1667L2594L9333o7195N5739m161p3247P8649O460n5720L6188k5534q04O0828
1073D1463m6933j501K0290m3783O4281p312p8491P0673J44m1209O5205n1928m4677
1086e3778Q8800k6805k1961L2855m9837L5542K7504n5759K8687j2955j7430P7089
1098E1952m7957m9734P2890l9494m937O1847p6851N912O2822m5990R642K600l7716
1111c5014N3436J61l2895L7326m3111N494O5652p2680K293N3949n6672L0447K7534
1124C5920p5309L1353K9681l8885L4249k0219k1343M9325l5928L005K7440n4692
1136c5403M1419L2685p0767L4929J6772n6728N7266j7n1263M8561j2225j5822
$$ plain form
1048 42736 -28968 4590 10813 -23953 32177 6395 -21852 15278 -15513 13579 45735 -41667
1060 -41667 -9073 30260 -36935 18804 14643 -58604 20045 26505 -29215 6973 -18561 -19365 41463
1073 41463 -5470 -6971 13319 -30464 33817 26505 -51986 18687 18831 -22378 42827 -9101 -53778
1086 -53778 35022 8217 -13744 19111 -30726 4816 32320 -23439 5248 -7707 -25137 51952
1098 51952 3995 -45739 27151 -12343 -17280 44567 -32284 -26372 36450 -9540 102 2702 -35014
1111 -35014 18422 18583 -14312 23014 -20097 -14603 51049 -21631 -19338 34611 -22061 8386 35920
1124 35920 -39389 -8036 21645 -17240 17009 -3210 -24553 24772 -11156 -8151 19289 -35403
1136 -35403 6016 38701 -32066 2863 19635 -37093 20173 20156 -31107 17454 5229 -10593
1148a0593K9474l5925R959K5718l5734L1059Q64n2932N5517m463m7242N8272j9985
1161C989l0375N3667k6260k1692L4415k2450Q183J9164l3625K4040n078k6715
1173b2737M5866k6759k1780N3766l0620j6756M4533l8531o053M3962l2409N217
1185b301J5752k5656K1056p858j4106K7318k2186K48L3984m1829Q5L8018m2577
1198b0052J3379K9459m0502J7518J5617k6635J2427P45p152J8673j5004R59J5712
1211A5144l2293J8598J5137l9537K6808J2798l5473K1163O063k8408K1777N964
1223G741j5230J4457q010K968M917j7767J8422o86j8239K5545o249k7296K7407
1236G980l508k3658K7166n534j3325J6876o808m202K739l51R642m658n984J6019
$$ plain form
1148 -10593 18881 -17044 -7085 18633 -17101 13958 14822 -38110 17407 12944 -34298 23974 3989
1161 3989 -26386 27281 1021 -20671 13744 -8706 -523 18641 -14984 9056 3978 -22737
1173 -22737 23129 -3630 -25410 28356 -2264 -19020 25513 -13018 -19071 24891 -7518 -2301
1185 -2301 13451 -12205 8851 993 -13113 14205 -7981 -7733 26251 -15578 -15493 22525 -20052
1198 -20052 -6673 22786 -17716 -198 15419 -11216 1211 1956 -5196 13477 -1527 -568 15144
1211 15144 -17149 1449 16586 -22951 3857 16655 -18818 2345 8408 -20000 1777 7741
1223 7741 -7489 6968 -1042 1926 6843 -10924 7498 6812 -11427 14118 7869 -19427 7980
1236 7980 4472 -19186 7980 2446 -10879 5997 -811 -5013 -2274 -2625 7017 2359 -3625 12394
1250A2394j2666r823K4744j7883p573K6048j5300r391J4929q476o861J1817j054
1263I05k125P46J213N293j3167N521J2129j6258P300J1904j9033p68J5122j4690
1277e908k102J4909q569k379M622l56m840r94J1098k498o154R827R20j4407Q931
1292B100O429j5847R170P238j2696o77O321n628n591R884J005o528L034N959p339
1307c166m175J3702m710n571J2301k300j0455N474N030j1234M004Q950q217k804
1321c171O106j683r429Q220N387r679M534N972q063m685R764l060p171J0587j12
1336C517q963K115O012q419q54J2220n544l758P742m79q662N419P238q940L129
1351A773O981o644n394O667n90q964Q716K713q761J192N136o216m459J1131k764
$$ plain form
1250 12394 -272 -10095 14649 -3234 -10807 15241 -59 -9450 5479 -2997 -9858 1959 905
1263 905 -1220 -474 739 6032 -7135 -1614 10515 -5743 1557 13461 -5572 -6340 8782 -5908
1277 -5908 -8010 6899 -1670 -4049 573 217 -4623 -5617 5481 2983 -3171 6656 7576 -6831 2100
1292 2100 8529 -7318 1852 9090 -3606 -4283 2038 -3590 -9181 703 1708 -4820 -1786 4173 -3166
1307 -3166 -7341 6361 1651 -3920 8381 6081 -4374 1100 6130 -5104 -1100 7850 -367 -3171
1321 -3171 2935 1252 -8177 43 5430 -4249 285 6257 -1806 -6491 3273 213 -6958 3629 3517
1336 3517 -5446 -3331 2681 -5738 -6592 5628 84 -3674 4068 3589 -5073 346 7584 -1356 1773
1351 1773 8754 2110 -3284 3383 2793 -6171 2545 5258 -3503 -2311 2825 -3391 -7850 3281 517
1366E17o048Q086M51r152K493P772q477J565Q659n956l715M673J317p528N050
1381b93O993p122p2O610m750p257J0909o59r320R823j40q452K311L625n883j33
1397c810P230j984m400Q70M977o935p90J1754r277j452J1584p888p156J0017k477
1412B63n408R356l025l321J185P02K555p319M924P444r417K727P568j4016J654
1427d128J4780j4284J062R723j0801K432K707n349J202J149L155K638r290L514
1441a490P749j4131J0101O878j8440J3093N497j6998P341L483j0288R635J67o707
1455d110O199p958O131L980j3762J4795P05j4096J6898k999j7727J9163k097j3364
1469h242J7992r571o626J1173j0194M729K148r939J3080j827j2013J7576j0336
$$ plain form
1366 517 -5531 2555 3006 -6146 -3653 4119 -4358 -2793 5866 -90 -3805 868 2185 -5343 -293
1381 -293 6700 -422 -494 6116 1366 -5891 5018 4359 -4961 4862 4722 -3730 -1419 2206 -3677 -3810
1397 -3810 3420 1436 -2964 -2094 2883 -4052 -4842 6912 -2365 -3817 7767 -121 -7277 2740 263
1412 263 -5145 4211 1186 -2135 -950 -248 2307 -5012 -88 7356 -2061 666 8234 -5782 -4128
1427 -4128 10652 -3632 -2570 7153 -3648 -1216 1491 -3858 -2656 -1507 1648 4286 -5004 -1490
1441 -1490 6259 -7872 2229 9107 -9333 3760 9257 -7741 -400 3083 -7205 2430 2597 -4110
1455 -4110 2089 -5869 262 4242 -9520 5275 5980 -8116 8782 5783 -11944 7219 5122 -8242
1469 -8242 9750 179 -6447 4726 -5468 -739 1409 -8530 4550 2723 -9290 8286 -2050
1482b050j1081K7754j3688q548K0207j7426O96J5672j6762J895Q111r879J3011
1495G912o319j5010K0617j0807j280K0409k6147K654K4385k1973K007J1975k1592
1508a3169J6886J0422k3653J0628n149k902K1260k0112l626J8197j6072J0819
1520C529J0084l3535J7598J9184k4033J5495n753j8431K8203n379j4544J1634
1532D052j2531R340J6882l0234O025J1629j8895K7610o164l1281L0412J32j5609
1545h632J9695j8755n432L1144j7210l360P299k1353K5752M194k7753K0505o069
1558B5j0334L0161k2087j7680L2855j4344r14J7358l0768J1084J7302k0339J2547
1571D866n410j3647K9087j0936j7099K3416j9430K752K8819l2819K837K0256k3233
$$ plain form
1482 -2050 -13131 14623 935 -7613 12594 -4832 -4136 11536 -5226 -3331 4780 -5099 7912
1495 7912 1593 -13417 7200 -3607 -4887 15522 -10625 -7971 16414 -5559 -3552 8423 -13169
1508 -13169 3717 14139 -9514 1114 -4035 -6937 14323 -5789 -9415 8782 -7290 3529
1520 3529 13613 -19922 -2324 16860 -7173 8322 2569 -15862 12341 6962 -7582 4052
1532 4052 -8479 861 17743 -12491 -6466 5163 -13732 13878 7714 -23567 6845 6977 -8632
1545 -8632 11063 -7692 -13124 18020 810 -2550 4749 -16604 9148 13342 -14411 6094 25
1558 25 -10309 19852 -2235 -19915 12940 -1404 -2318 15040 -15728 -4644 12658 -7681 4866
1571 4866 -544 -14191 14896 3960 -13139 10277 -9153 -6401 22418 -10401 -7564 12692 -10541
1584a0541J4778N032k5439K0794K476j5013J9572j8834m389K8309k3980M532J5960
1597A3257k8740J7859J2408l0372J7572M982k0468K5485r344j6573K3069j4989
1609e854K161J6561k4535J1028J3286k4153J7117K870k5468K7813k053k0812K3999
1622A1960j4077p716K2365j7713p02J4361j8584J2072O260k4445K0870p50j6918
1635a3017K6771j3818j2353K5944j5654m691J8947j9615N299J4534k1755J1495
1647B087J169j6043K2289q967j1058K1538j4994k775K0654k1054J972J9378k0952
1660f756R160O967k0290J5296o69j1966J4909r518m946J7325j6197m97J6214j9160
1674a0128J0319J1260k1773J3114M388j4898J4069k783j0534J4977p868m924J1857
$$ plain form
1584 -10541 4237 9269 -16170 4624 7100 -7913 11659 -7175 -11564 16745 -7235 -2703 13257
1597 13257 -15483 2376 14784 -15588 1984 6966 -13502 11983 2639 -13934 9135 -5854
1609 -5854 -3693 12868 -11667 -639 12647 -11506 5611 8481 -16987 10826 8773 -12039 11960
1622 11960 -2117 -9833 12532 -5181 -5883 8478 -10106 1966 8226 -16219 4651 3901 -13017
1635 -13017 13754 -64 -12417 13527 -2127 -6818 12129 -7486 -2187 12347 -9408 2087
1647 2087 3256 -12787 9502 535 -10523 11015 -3979 -6754 13900 -7154 -5182 14196 -6756
1660 -6756 2404 9371 -10919 4377 3708 -8258 6651 -2867 -7813 9512 -6685 -7182 9032 -10128
1674 -10128 191 11451 -10322 2792 7180 -7718 6351 3568 -6966 8011 143 -4781 7076
1687G076j5663N942J0320j7263J1158L071j4922J5223l61j3585J5459k986p564
1700d095J3901j1450j359R884j1496O392K046j1988J0740l94j1803J2690m170
1713a102p746J6882q825m575J2029r227K242O563r084M574L179q170P003l798
1727e5p435J2823p282l372J0639r991J200Q650q946J753P122o890M587J197p300
1742c300P059l298j979O286p696J242N688q277J121N500p461M642M395q338N364
1757I48P48l486M602k745R2L516l540M10J736o011L873K633p625N411j8m566M743
1774G21j276k629L672R16j343J995k438R98J750l724L875j651k478M555k677l165
1790b899L051j32k414L743j220j922K741j369O96n95P8K176j662J7O22j481j068
$$ plain form
1687 7076 -8587 -2645 7675 -9588 1570 4641 -10281 4942 4581 -9004 6455 3469 -4095
1700 -4095 9806 -1644 -3003 6881 -4615 1777 3823 -8165 2575 2181 -9622 3068 -1102
1713 -1102 -8848 8034 -791 -5366 6663 -2564 -322 6241 -2843 1731 4910 -3260 3743 -55
1727 -55 -7490 5333 -1949 -5321 5318 -4673 -3473 5177 -3769 -2016 5106 -1784 2803 4000 -3300
1742 -3300 3759 461 -1518 4768 -2928 -1686 4002 -4275 -3154 2346 -5115 -473 3922 -4416 948
1757 948 1696 -1790 2812 67 159 3675 135 545 2281 -3730 143 2776 -4849 562 544 -4022 721
1774 721 -555 -3184 488 1404 61 2056 -382 616 2366 -1358 2517 866 -1612 2943 266 -2899
1790 -2899 152 20 -2394 1349 129 -1793 948 -421 275 -320 -242 1934 272 289 911 -570 -1638
1807a638L122k094j360L574k786O2Q16n32j11R18J457j372J99J93N43j224N97
1824C64J668k641J639K04k145P3R26j90j224K250j080p94P55O6k97n55K486j466
1842C9k78J219j055m37O8J403j534P41R99j840J24J18N54j314J791L73j852J217
1860C36k42m30n73J674l27r70J644j158k54PR59r75lJ774j728m0J99K15p37L88
1880b41J682k149Q90M58j052k97J084N7j155K069j236p35M54j91N98j009J432
1897F59l64r86O19K73j242N9K506k373Q64J212k516J349M00m54j1M72j51L07n40
1916H3o07J493k442K181R99l518K610k75j998J820K43k057K123K10j771J940k277
1933a243R01J583k539K595q48k392K919l79k826L256o78k598M914l099j447L223
$$ plain form
1807 -1638 1484 -610 -1970 1604 -1182 -1120 -304 -836 -947 -29 1428 56 255 448 991 -233 364
1824 364 2032 -609 1030 1234 -911 -838 88 -102 -1326 924 -156 -950 -195 -129 -426 -981 1505 39
1842 39 -239 980 -75 -512 -444 959 -575 166 1165 -675 -551 -433 121 -1193 598 971 -881 336
1860 336 94 -336 -909 765 438 -532 1112 -46 -300 -293 666 -309 -312 1462 -266 -306 -107 108 -629 -241
1880 -241 1441 -708 182 640 -412 -709 375 432 -723 1346 110 -625 -171 -362 236 -773 659
1897 659 295 -691 -72 201 -1041 -982 1524 -849 15 1227 -1289 60 460 6 -5 467 316 623 83
1916 83 -524 969 -1473 708 1707 -1811 799 524 -1474 346 589 -1468 655 865 -906 1034 -1243
1933 -1243 -342 1241 -1298 1297 449 -1943 976 597 -2229 1027 349 -2249 2665 -434 -1881 1342
1949A342k837J977J080k892J763O81k727L392j524l417O559l375j501M481n418
1964b416J262L988m027O27K116l672L602N1n127N547k672n61N149o230L65M935
1980B937m823J475L186o641M547K757o739M869k100k184O837m773j223M364m603
1995b114K121M048q314L888M026p081O324k030n786Q128k366k984N048m619K94
2010a417O199p535J758L797p207P656q86p879Q009k009l675P209n299k589Q818
2025D950o430J31M788q173O497K002p822O359j802m336Q256m860m615R560o192
2040a687k06P110j0295M348N079p971N669l42n943Q440k598n982Q614o026m37
2055b227Q787j0945K506N884q537N815J275q485Q220M09o978Q167n180k290J0229
$$ plain form
1949 1342 -1495 482 1562 -1330 433 1114 -1613 1779 255 -3162 3397 22 -1479 3002 -2416
1964 -2416 -1154 2834 -1193 -566 1550 -2122 1480 1531 -3596 1951 -721 -1282 3867 -2363 -1998 2937
1980 2937 -1886 -411 2775 -3866 681 3438 -3301 1568 -532 -2716 4121 -652 -1875 2489 -2114
1995 -2114 7 4055 -4259 -371 3655 -3426 2898 868 -4918 3210 844 -2140 2908 -1711 -1417
2010 -1417 4782 -2753 -995 2802 -4405 3251 2365 -5514 2495 486 -3189 4020 -1279 -3868 4950
2025 4950 -1480 -1349 3439 -4734 1763 3765 -4057 2302 500 -3836 4420 -440 -5055 4505 -1687
2040 -1687 -1893 5217 -5078 -730 4349 -3622 2047 1705 -4238 4202 1604 -4378 4236 -1790 -2227
2055 -2227 6560 -4385 -1879 4005 -4532 1283 2558 -5927 2293 2702 -4276 3891 -1289 -3579 6650
2070F650q914P98N924q700N366K867r970O639K017p795Q795m033n392J0821o458
2085a385o74O637q052L817N103r273M780K585q370R038k561p491J0305n573k435
2100c549P707p698J508O927q808L389M233q486Q220p79p888J0002m201l860P871
2115D588p309l50Q304q456R35N434q412O893J216r021Q740j273l647P390o504
2130a472j811R236o409p63N148q854O237L679j0576N804Ll767Q069n024n164Q840
2146C176l341m09N146r693M803O541q523L665j186m798R124k054p448N790k315
2161a522o6O742r685J032P056n084M147j232o738Q003J616o166M072l498j285
2176b608Q871p179k793N118m220M559J007p935M097L249l642M075l236l617R126
$$ plain form
2070 6650 -2264 -1466 4458 -4242 1124 3991 -5979 660 2677 -5118 3677 -356 -5748 5073 -1385
2085 -1385 -2059 4578 -3474 343 5446 -3827 953 3538 -4832 4206 1645 -5846 4459 -1114 -3549
2100 -3549 4158 -3540 -2032 4895 -3913 -524 3709 -4777 3443 2664 -5224 4778 577 -3283 4588
2115 4588 -2721 -3071 5233 -3223 -2288 3146 -5266 1627 2843 -6178 2562 1289 -2358 5032 -1472
2130 -1472 -3283 5953 -456 -1219 3929 -4925 1312 4991 -5585 219 222 -3545 4524 -500 -5664 3176
2146 3176 -165 -574 4572 -5121 -318 6223 -2300 1365 179 -4619 4505 2451 -4997 793 -1522
2161 -1522 -1588 5154 -4531 -3499 3557 -1527 2620 1388 -5350 2653 4269 -1897 2175 -1323 -2608
2176 -2608 6263 -916 -3709 1409 -2811 1748 2755 -5180 -1083 2166 -1476 2599 -637 -4254 4872
2191D872l612k651L647n072L614L605o926J022K561l247M185j684n453O842j366
2206C37j636L616n316K293M581m615K57K343l539M002K3o088M908p93j571L407
2222B209m538K90M369l047m12K082l250L721J606n517L417k57j223L451l544j290
2238a933L694j439r90J232l341K296K778m410J871l82q34L722k125j774K333o
2254F92k39J567l498N13L257k846J189j173j475L178m82j965Q93j01R7K381k378
2271c90p72K570j526J428m59k031J862K62r50J6n26q43K476j266j159J412j385
2288a281J665J08j494P97M58P2K19j98j296J727k49q35Q96j372Q30L07q31J29
2306c48j9K70J58M60j029P76j1k67R01j214O14K13l35K4l76J54j61N33q74M14
$$ plain form
2191 4872 1260 -1391 2256 -2816 798 4403 -2523 -1501 1060 -2187 1998 314 -5139 1703 337
2206 337 -1299 2317 -2999 -706 3875 -740 -483 1860 -1679 2323 2346 -3742 1166 373 -1198 2209
2222 2209 -2329 -2039 2330 -717 -1129 953 -2297 1424 3030 -2487 930 673 -550 2901 -643 -1933
2238 -1933 1761 322 -668 564 -2777 -481 2297 -2113 -242 -624 -1458 2264 139 -1635 698 692
2254 692 453 2020 -1478 -965 2292 -554 635 -538 -2013 1165 683 -1282 -389 -490 -393 1988 -390
2271 -390 -1162 1408 -118 1310 851 -1180 682 944 -6 10 -516 -1359 1117 -149 -1308 104 -1281
2288 -1281 384 492 -1002 -205 253 325 544 346 -950 777 528 -307 589 -783 47 354 -477 -348
2306 -348 -367 -97 61 521 -508 268 257 -10 891 -323 291 504 169 193 -183 -29 -190 343 -531 -117
2326a17j00k23P36q50O06j60J24J66j37K69n03O62n79J47J58k69L53o75N39m29
2346b82K21J51m09N10m14M51l62L22M0k81N33n47M83o64L01N2n14Q39o65M64m63
2367b34K15q5j55N29o31O33m91K31J39m34N85n88N20l48J19j19k50O96o91N04
2387A45l66J85J62j75K27n16O61m44L12L9k99M83n00L48k53P4J64k66K53m95P22
2408D61q86M75K18n58N37m73K86j66K39l77P0M10o31R13q67K39K86n65O31m41
2428a99LK19K19n09J84L44p90J218p39k11O73q34Q71k15k83n7M65n08M34q0r87
2449g82J565o54m35P23j019N74L96m21k33N73p21P32M61j834J552o84p8J302j598
2468e81n7J006m21j31P00j565P53J263j581J255r76l75J991j094o12P03n07K54
$$ plain form
2326 -117 -217 -440 296 -554 52 -108 16 182 45 314 -189 473 -106 41 199 -70 283 -392 147 -282
2346 -282 -61 90 -319 191 -223 228 -134 188 228 -53 480 -67 416 -248 53 105 -409 430 -235 229 -234
2367 -234 -19 -104 -259 270 -361 272 -219 12 151 -283 302 -286 234 -114 5 -114 -364 332 -359 145
2387 145 -221 -36 126 -49 178 -338 323 -121 191 230 -69 414 -86 262 9 83 247 -19 234 -261 461
2408 461 -425 50 268 -290 247 -226 60 -106 133 -244 -174 236 -395 518 -349 -110 176 -389 242 -199
2428 -199 -196 23 242 -267 -83 261 -529 689 -50 -261 412 -422 449 234 -49 -106 359 -149 285 205 -782
2449 -782 783 129 -306 417 -602 -28 368 -53 -286 287 -434 298 759 -1075 477 -207 -285 1017 -581
2468 -581 -638 368 -53 -184 516 -1049 -296 967 -614 641 -335 -710 1281 187 -425 278 -229 25
2486B5J351k142M9J515j579J860q88j656J939m8l28N15j370j51K600j538m77O37
2504C14j894K606K33k462R62j46P5J599j490j692K532n37L4R94l087J936J630
2521A607j644O02r67p89K693k73k596J657j089O48K318l489K90J561q11J518q81
2538C55k223K291J007j682J161j886j26L495k759m09Q39j205J808M49k839J077
2554f47J225j439K027j705j165L510j784k19R01j826J532J258k779O71J109j618
2570i49K243j303k044L372j217l87R69k021J440J791k542J53J263j585K424r90
2586F17k801K891l12m24O88k449P08K887j949p76P20j359L171O2l669J795L47
2603A47N63J277k843j148L152j63q84J0k809K955K014l105L63q25Q18L083k074
$$ plain form
2486 25 1376 -766 -717 798 -781 1079 191 -1465 474 426 98 613 -757 -908 1692 154 -323 314
2504 314 -1580 1026 1259 -1203 -241 -387 -312 1287 -203 -1895 637 100 134 1128 -1959 -23 1607
2521 1607 -37 565 -402 -1191 1502 1229 -1367 290 -799 -151 2167 -1322 -1032 529 -282 1236 355
2538 355 -1868 423 1430 -252 909 -977 -1103 2392 -367 -776 63 -1142 666 1115 -1724 -647
2554 -647 578 -861 1166 -539 -1704 1806 22 -197 704 -1122 410 1668 -1111 -440 669 -949
2570 -949 1294 -9 -2053 1319 102 -285 684 -1337 103 1894 -648 -495 768 -817 1607 617
2586 617 -2184 707 395 -29 659 -1790 -1082 1805 -144 -920 -200 -1559 1612 1674 -1995 -200 147
2603 147 710 1987 -856 -2004 1148 985 101 111 -2698 257 2271 -834 -471 -1296 -478 2605 531
2620E31k578K028N30P54P66m395J350K779j275K42k076q17L341K43k470R7l64
2637a314J331K713l727n19J856j03J760j658k485K118J479j205nj607L6L403k025
2654D8j118N90q05K534k3k478P03J215l4O07j448j276K783p00m89N5j698J920
2672C86O75j537m01O65j99J424q66j704J977j78K1M84j754Q79J039o86n69J81
2690a63n18J296Lk009J290j73K15Q69j542J42J208j18m88L07r13J105O79j585
2708c95O29m36Q3J072j247m05N12J48N2L34j241N00J145j023P59o99j33J201o82
2727A74k69q4L3P4O37j030k05Q98o66P95n72m22P71M2J39l10P0j26O67l11m62
2748a57M93o54Q50l91m39J61P0K15r6Kn92P76p5j49J88n24O27j56j12L6k03Q1
$$ plain form
2620 531 -2047 -19 511 1265 2031 -2364 -1014 1765 490 732 -1344 -2161 1180 1423 -1047 -950 -1314
2637 -1314 17 2730 -997 -1516 340 237 1997 339 -2146 -28 1451 246 241 -1366 -1330 2073 48
2654 48 -1070 -480 -1285 1249 1226 -1252 -549 666 632 1239 -209 -1485 1298 598 109 164 -1534 386
2672 386 1061 -476 -877 -212 -411 1013 147 -1557 420 242 263 747 -1007 -128 911 225 -344 -163
2690 -163 -681 615 618 -1391 -101 -274 -59 810 -732 -590 618 500 12 319 -594 511 1190 -395
2708 -395 234 -202 -119 953 -294 -699 -187 -39 13 347 -894 -394 751 -272 487 -212 -345 856 174
2727 174 -95 -179 -146 -72 565 -465 -670 228 -438 357 -215 -637 134 176 315 5 75 -51 616 305 -157
2748 -157 336 -318 532 141 -298 -137 -67 148 52 54 -538 238 163 14 202 -322 305 149 37 73 -130 -49
2770d9rL34p10L79Kk18N83o95L96j13K50n3l65L71n9L94m29J47k40J09M87p73
2792b61L80k18K41J02l21J55l91N44m21J78j3p0L95m86L32m16K01J34j57J39l69
2813c22M48k06J72k49j17M01k64K48l79J82K00k20L63m92L73l07M74k67j87L68
2833B19l21M50m90K13o5j60M28m13K97k61K86l4j62J98m07N07m20J68Rj61L17
2854A98m86L94l10K99j49j14K27l56M60m08K24l5j44M34l90L42k41J76j11O6P5
2875A51k11M29m31J65M8k30L06k50K22k91L04j77j15K08l70L91k34J84j64j41
2895b06L48k90L44m44K73o1n0J57l98M23j84J02P7l28M00m01M48k94K02k07jM11
2917C21m73M01k38M4J04j83J25k40K16j88L11j85j27K87l14M80m21j3K21o5K87
$$ plain form
2770 -49 -58 276 -434 -55 -53 -271 312 -383 13 -100 150 97 -268 103 44 438 9 156 -84 25 512 -261
2792 -261 119 -99 142 244 -77 78 -313 231 -190 -12 -25 -95 300 -186 146 -270 -69 65 -92 47 -322
2813 -322 126 -80 92 -157 -274 127 -137 111 -268 -86 114 -106 257 -235 138 -169 305 38 -149 219
2833 219 -102 348 -142 71 6 -154 274 -139 158 -103 183 149 -13 185 -222 285 -135 33 42 -119 198
2854 198 -288 106 -204 95 -54 -168 59 -297 163 -245 -21 -56 -200 234 -156 186 -55 121 10 76 151
2875 151 -60 369 -62 103 151 -79 227 -23 199 -92 212 35 -80 128 -242 149 -85 99 -65 -206
2895 -206 142 -148 196 -248 25 -36 -86 71 -327 96 -88 14 91 -237 163 -238 210 -84 118 -89 -90 321
2917 321 -152 249 11 55 159 -24 101 -139 77 -111 200 15 -112 175 -139 341 -80 -93 128 63 350
2938C50l35M4l24M23n6k66J00m17O30j86o1l0j55L79r4K53n33J65J41J34K56q01
2960c83N12k06L17J7o28K91jM64m35J10j73Q0O55p53J54k98M12L37l09k13l43
2981c93N29j61J39m55k87R09k70K25p16J02N73J25j6o20L56l26R60m80n88M67
3001G3k22N41l71m60J72L36J71j92l7m79R20j44m00K66m88P95l3m87j18J60J22
3022A25p4J30p86P22j17j79L22p66O87K10l90mQ6J39O7J10q01O25K14m88M17p38
3044d89K91M87k88j49R8o0L77L93j165O56J38k23P31j099q7O84K0l07j47m38M46
3065a31Q88j148K08j35j30J309q58n35N50J09J45J63q93pJ274q82J66j83r37J605
3085E78q2q07J89k91M70R38r77q37J147n08Q21j41j463R75L07j67J36q28k06J585
$$ plain form
2938 350 15 59 -265 158 102 -164 -64 -481 149 -37 -98 -128 -283 96 2 255 -278 -113 28 162 418 -383
2960 -383 129 -77 240 257 -371 -80 -81 383 -52 58 -115 -35 620 -133 21 -277 135 472 163 -50 -393
2981 -393 136 -25 114 -341 -628 281 11 236 -480 -378 195 320 304 -316 40 -286 674 194 -394 73
3001 73 -149 392 21 -439 -267 69 240 48 11 -468 452 308 -92 174 -314 481 448 -39 -157 3 125
3022 125 51 181 -605 117 0 -179 143 -623 64 274 -116 -120 -34 105 172 282 -519 106 320 -168 249 -489
3044 -489 -198 289 1 -148 -50 -110 267 660 -505 151 289 66 797 -302 -389 295 315 8 -139 -577 -131
3065 -131 757 -391 -183 -318 -448 861 3 -532 18 127 272 435 -458 -465 809 -73 93 -90 -1027 578
3085 578 496 -311 -122 -413 57 995 18 -819 328 -180 641 500 -963 12 319 152 288 -540 -746 839
3105H39m52r18O22j068J314P83j707M07j6L27Q46q09j303J197M86m91N29j931
3123a345P37J589r86p4n48j64J445L19j821L03L79K38J490j951p30J500j68O85
3141H98q12j520J443J320j114k65p21j28K477r37j370L53k54J655J95k152j30
3158a062J438K5O06j254j696K423N03p63l72j456J427J767j346j227L76P1J786
3175A246p8k798J182P05M67L83k203o7K068kn92n87j247J883J376k119J18l56
3193f21N18J783j492j299Q83O01L23J46k075M91J706r27M98j287l50J896j58j044
3211d08P4j04L57J348j592m57J036o37J130n46j252J204L26n00L50n08m12J508
3229I17r40k81P21r98R79Q9j005P29k6m07M64k5p49J109p62k76R88r44N41O8q62
$$ plain form
3105 839 387 -531 91 -977 337 1120 -587 -180 -196 131 977 168 -1135 62 548 57 586 -1345
3123 -1345 -608 981 -5 -79 -627 -791 654 973 -848 -545 -166 72 1562 -389 -1119 381 213 898
3141 898 86 -1434 9 1329 215 -50 -771 -899 1578 641 -729 -376 -630 1025 1220 -932 -1062
3158 -1062 376 401 1007 -247 -1943 480 983 220 -152 -1608 -181 1586 240 -987 -611 -540 1246
3175 1246 1168 -1630 -448 257 724 1107 -1096 -1163 905 903 311 -276 -1523 360 1736 -383 -265 -621
3193 -621 -103 1680 188 -1111 -228 373 696 842 -1233 -742 964 37 535 -752 -1102 794 636 -408
3211 -408 -334 -438 -81 1267 -325 -782 254 -383 747 201 -1051 153 479 -21 329 -179 -591 917
3229 917 -23 -304 417 -581 398 487 -518 211 185 -222 242 217 -532 577 -185 -461 527 -417 124 192 -670
3250f70P25J95m94L15J17p15J169n88o84J040q81Q77jq71L25N29m36J83R2r64
3270g37J234j71o05M76o97O01L46m47m15N50j99L02J20j172J011J24l98N82j007
3289e02K57N97j43k40r8j86K27O88j093L85J65l55P72o44j01L02O9O0j43k07%
3310a90P57p41K12Qk63N76k95l2N3m9q4K70k75k83P36n67L04O4n44N83k47J2p5
3333g0j4j00K12M5n05P37o11L03J85m26K73j44J15r9J78j40J82N7m66N56m28J91
3355C1L4k15L48k46K16k95J24o4P7K29m08M15l52J69P8k72J43k1J15j15Q9k71
3377a91M3L33l79M00k37l4J25j72J15r0K88k27J71k39l9K97m54L73j58J26L3k01
3399a17J47j81K59j73J91k2n2J35k52L35m86K03J66j86K02j89N2j20P2j44J62
$$ plain form
3250 -670 55 250 -244 71 188 -527 642 54 -630 410 -471 406 405 -466 -141 388 -48 135 227 -737
3270 -737 497 326 -279 197 -500 101 447 0 -415 135 -64 238 358 -814 197 321 -77 505 -502
3289 -502 -245 352 209 -31 -129 -315 -88 600 -493 -108 57 -298 474 -170 -271 31 100 160 17 -190 -190
3310 -190 567 -174 38 46 -217 359 64 32 85 36 -48 222 -53 -336 400 -167 137 201 -343 240 -7 5 -70
3333 -70 -84 -184 28 73 -432 305 -306 -3 182 -244 29 -115 0 -99 79 -61 121 178 -288 268 -160 31
3355 31 65 -150 198 -48 168 -127 -3 -67 10 239 -169 246 -106 63 141 -131 12 -9 106 -9 80 -191
3377 -191 -148 185 -194 206 -31 -65 60 -112 3 -87 201 -26 145 -94 -133 164 -290 83 -75 51 84 -117
3399 -117 30 -151 108 -65 126 104 52 187 -65 270 -216 -13 153 -33 169 -20 32 -88 -16 -160 2
3420BJ79m13L35j13N9J13k68K17j01J09l22L30k53J9K78n44N10k33pK49k89J10
3442c3L2J44k30L02l22K1L98o15O35l75p6L09k29q0O0K02l73N86m18k9M06n88
3464b73N27j92l08N24j51k26K23o4n03Q29n62j76O71q05N51m5n00N67j05j72M12
3485B22k10m93R85n71j43O83r11N31L67p13K69J94m69N70J33r80J075n74k28J005
3505G42j198L60N08p42L73K14q79O25N73j246R19m45m56J477j239L9P40q11N30
3524H4N95j358M37R23j170R97n56p69J729q94l98P23o48L79Q94j489K60Q40j228
3543f49J298l69j532J939n91m32R06j232J57J755j436l89J025j414J644J9k084
3560a385J643j17m28J166j603l86K325j088n12R60j943J929R19k416R22j03k30
$$ plain form
3420 2 181 -232 103 -10 49 162 -106 111 10 119 -203 127 -126 -107 171 -373 137 -96 -103 146 -143 -33
3442 -33 -1 143 -87 215 -107 -86 312 -303 332 -43 -119 190 -39 -119 -59 143 -230 356 -62 -91 315 -273
3464 -273 254 62 -246 278 127 -99 124 60 -443 386 -176 -352 319 -486 65 20 -480 87 -18 -190 222
3485 222 12 -481 504 -67 -210 473 -438 93 460 -253 16 210 -259 311 444 -536 539 -35 -263 742
3505 742 -456 -96 412 -330 43 257 -622 3 576 -670 249 -196 -652 825 -414 -375 365 -446 84
3524 84 679 -679 -242 681 -489 508 -48 -817 912 18 -380 343 -305 74 968 -521 -261 579 -649
3543 -649 649 280 -1252 687 96 -336 570 -662 -505 1250 -186 -575 450 -964 680 699 -1385
3560 -1385 258 141 -287 879 -724 -1110 1215 127 -385 575 -1368 561 1480 -936 -14 -117 -347
3577c47J764j506j352K205n26j93R72k782J486J915k049O82p66o50K605n48k280
3594a370J244k47N02J881l503J85K250j053J181j092k303K958J052k218M83j049
3610a099J44L519k580j322J413q87K337j29l449J432J524p38J292k218j608M201
3626A832p53j304L08k057K347J953k838m56O86l49K755j521l206K942M8Q5J012
3643A484l451P04L065j488l67j40j874L106P22l194J404q03L67K880l025r07K105
3660E88q41P98O03l204J707J947k174J405j377j021L268j220j244J331j357Q28
3676C7J892l027P73J140j775K133o82k141K388n36q22J573j606j70K178k130N24
3693b51J186k332J976N7j821J924o23j228K154j067q44K122j996L95J590k126
$$ plain form
3577 -347 1417 -89 -1441 764 238 45 1017 -1765 -279 1636 -413 269 -497 -1147 1458 910 -1370
3594 -1370 -126 -373 129 2010 -1493 -1308 942 -111 1070 -22 -2325 633 1685 -533 -50 -1099
3610 -1099 -955 2564 -16 -1338 75 -812 1525 1396 -2053 -621 903 165 1457 -761 -2369 1832
3626 1832 1079 -225 83 -1974 373 2326 -512 -968 -282 -631 2124 603 -2603 339 387 472 1484
3643 1484 -1967 -1263 1802 314 -53 -193 -2067 1039 1761 -1433 -29 -832 -465 2415 -610 -1517 588
3660 588 -253 545 1148 -2056 -349 1598 -576 829 -548 -1569 1699 479 -765 566 -791 37
3676 37 1929 -1098 -325 815 -960 1173 491 -1650 738 202 -620 953 -653 -823 1355 -775 -251
3693 -251 935 -1397 579 636 -1185 739 116 -1112 1042 -25 -869 1253 -743 -348 1242 -884
3709h84R68N14j713J839j16j611J584n72q19K199j823n08J983j642P95N34j939
3726a211J383N57j357R87n52r14K370j348p78J734j790J068R82k225Q41Q13j139
3743e79J052j73j622K154n99p51J390j685O45J155j390K90N39j150J225L21j918
3760a096J513j14q59J579j380k11J127p82J89M97j171P07O94j487J061j65r16
3777h14J708j051m82J069o35k0Q13j071K01Q48j103Q25j5r92J346o08l74Q62o26
3796a19j27R12q80k16J010r43N50J50r41R59k78k39N01l54k87P08m45j46P47r75
3816d13M41K78p59M77P6l91M04j28l02M49j89k60N20n55L66K07o56N28J5l54L49
3837A03J79n58M40k9m29N75n41K69J22l83M31r0k67K98J05m02L04Lm91P42m76
$$ plain form
3709 -884 84 598 -1115 724 608 -1003 581 9 -810 1389 -434 -942 1041 -601 194 728 -1211
3726 -1211 172 729 -628 359 -193 -1107 1263 -85 -863 871 -919 149 1131 -1094 -253 560 -579
3743 -579 473 300 -1322 832 233 -518 872 -813 -168 987 -403 -113 426 -724 501 822 -1096
3760 -1096 417 303 -556 1023 -357 -568 559 -223 -34 463 -708 -1 693 -794 267 102 -814
3777 -814 894 -157 -639 430 -205 -225 588 -483 -282 566 -537 288 273 -719 627 19 -355 507 -119
3796 -119 -246 666 -214 -430 580 -363 187 337 -604 355 77 -162 339 -15 -302 406 -39 -185 562 -413
3816 -413 28 306 -453 24 100 -291 113 -15 -317 132 -57 -317 203 -352 14 221 -435 93 108 -246 103
3837 103 282 -276 164 135 -294 281 -260 9 131 -252 179 89 -178 120 225 -177 127 130 -361 381 -95
3858i5q1K90l91L35o8l3M9oj69J67K5k20N12m24m1L48k41L9P6l8j84L85j85r1
3882d1J54j02P8k33J65L5j17J31J8o9k65L72j42p9K98l29K37j00pl8k0J66j40
3905b8K2l8K37m25J52K69l80M50k27k07J94J2k9q3J94q6J80l85Q1L18n22O10l62
3928e3K4K62k69j08J37J76l59M14j32k05K34k28K46j52r7K54k53J7J36N3l93O44
3950C48m97k53N64m52K56J37k36K13j35n5K32j46l65P77n10N8O47j076M34L14
3970B55m72K63J20m78M68J99o27N28l35p6O97r39L67M79p45M59J75r18P28K16
3990C64q49P69l86m40J150q80J31M05o99N64J31q37N87M59j064J213n04p32J247
4009F29o78k16O91p84L40P91j170K67O21j197J422m56j137J584o45l49R22j061
$$ plain form
3858 -95 -176 114 -277 58 -10 -43 6 0 -169 -2 23 -197 315 -109 -150 198 -43 -4 72 34 -150 235 50 -41
3882 -41 113 11 89 -144 21 56 -61 70 88 19 -246 126 -16 -95 203 -126 111 11 4 -34 -54 112 -28
3905 -28 -6 -44 193 -232 -80 189 -191 259 32 -175 19 31 2 -81 113 27 207 -178 -97 221 -301 309 -53
3928 -53 -29 233 -36 -144 -7 169 -190 224 92 -113 121 -107 139 -13 -110 144 -109 -92 44 97 -296 348
3950 348 -149 -402 162 -290 -34 103 -133 80 -55 -110 122 -24 -389 388 -122 -64 583 -493 -59 255
3970 255 -217 46 166 -312 156 355 -272 256 -79 -155 542 -397 -30 449 -296 163 338 -580 148 364
3990 364 -485 284 -102 -542 608 -272 -141 264 -435 129 260 -577 10 469 -595 618 114 -618 629
4009 629 -49 -265 426 -358 -18 773 -397 -130 491 -706 716 260 -877 707 62 -287 635 -426
4027d26M4J352j268L8Q61j434J357M7j489J228l09l04J172j421k84J866j219j1
4045b00R89k011J435J012k148J180k62o55J850j073j081J546p25P4J383k644R69
4062c61J663j858R97k39j614K287o5j818J245q18J03K313k593O8J544j725J773
4079I02j73k477K080N35j642J835j496q94L115j849o73J273j897J927O94k655
4095a395J291N15j331K249j208k044L180j260l49J560k662J018K073k344P95M56
4111E44k032K625l53k363K588j400j61K420k764r3K463k265R79R82k940K167P63
4128A160k472K209j224r02K920k044n49J914k192J150J720l338J532J179k464
4143a401K558q70j970K926j089q40J890k242M78K345k842J105R21k677K726k03
$$ plain form
4027 -426 -382 970 -298 -260 601 -833 524 571 -918 310 1 -303 869 -552 -836 1030 -189 -200
4045 -200 789 -1222 213 1225 -923 257 -5 -660 1190 117 -964 582 -143 -69 1314 -1330 -361
4062 -361 1302 -556 441 202 -1412 875 810 -1008 237 -581 -478 1835 -758 -690 854 -871 902
4079 902 729 -1748 332 867 -775 1060 -436 -1330 1785 -64 -737 536 -1361 566 1260 -1395
4095 -1395 -104 411 -920 1329 121 -1923 1257 -3 -352 1208 -1454 -436 1637 -707 88 544
4111 544 -1488 1137 784 -1579 1009 -391 -552 1868 -896 -989 1474 -791 188 1170 -1770 397 1160
4128 1160 -1312 897 -327 -1229 1691 -353 -902 1012 -1180 -30 1690 -1648 -116 1063 -1401
4143 -1401 1157 287 -1683 1243 154 -686 1204 -1038 -560 1785 -1057 48 969 -1708 1018 815
4159H15k658K830q42j215K497j917p17K667k164M66J358k879K187O32k563K388
4175H85q18j476K949j455j495K851k174L41K209l174J297J077k063J893o07j705
4191a465K550p97j469K507k189P7K782k965O00J385k191J809K62k328J872j00
4207C40j309K362j878n69K582k183N65J075k401J504J102k423J568J11j762K546
4223A230j023j421K203j587L32J428k350Q52J227j845J476K44k475K493j09j763
4239a088K150j508l60K097j730N0J160j694J351O33k234J638r3j174K113j439
4255a28q82J977j131k36J176j615N50J208j709J077j26j326K029p81j008J409
4271D84r20k0J608j711j98J724j507P75L95j549J339k2p30Q03p22k98J516j200
$$ plain form
4159 815 -1843 987 145 -1070 1427 -490 -1207 1460 -704 -238 1120 -1759 428 1060 -1503 885
4175 885 67 -1409 1540 85 -1410 1441 -733 -392 1817 -1357 -60 1017 -1046 847 240 -1465
4191 -1465 1085 288 -1181 1326 -863 -786 1996 -969 -369 1016 -1175 634 896 -1432 440 340
4207 340 -969 1393 -485 -1054 1528 -655 -90 985 -1416 88 1190 -1233 335 446 -1316 1230
4223 1230 207 -1214 989 -598 -266 1162 -1188 -336 891 -954 522 766 -1709 784 675 -1088
4239 -1088 1062 -446 -806 1291 -439 -389 771 -923 428 1061 -1173 465 372 -802 1311 -128
4255 -128 -1010 967 -164 -400 776 -839 -289 919 -790 287 161 -1165 864 83 -925 484
4271 484 -436 -456 1152 -559 -757 967 -540 235 630 -919 420 398 -332 471 -251 -549 967 -233
4289b33k84J198j402Q88O03j632Q91K13p67Q83l37p72J059k81m51Q84j151N91
4307a00Q08j366P44J29q75J049j3r01Q72j95m85J002q48OP00q14M05O1n04N62
4327B37Q9q34Q56l34n35J079q25k56P89m41R0K53l13J08K04m43M44q8n08R12o39
4348a55K3O24p93K19M04m56%M13m58P4K48m53M58k74J01L15n39K53J14l00kM89
4370C05m75O0L49n04L99o3q2M2o9J33q4j9N9J91l62J43J05m69N10j24j89J72o3
4393c5p3p6K51j81N0j06J84l6m04N33j04j15K21k63L0J53K09m88L79Rk68K33j60
4416e7J90j45K2O5k46J97O9Nj94L93m44J9L58m92K38P7n9j83K38k9j32J57j91
4439a44K67l13J29L51o73M06J15l34J41J39j52NL11l84J57j1m1L32m24K11J09
$$ plain form
4289 -233 -517 681 -721 167 770 -862 29 242 -525 358 21 -751 308 27 -424 460 -691 -100
4307 -100 708 -658 86 215 -660 389 376 -525 347 152 -333 669 -179 -173 527 -287 118 179 -325 237
4327 237 326 -508 348 14 -521 558 -267 -523 266 -175 -85 168 -145 -37 167 -276 168 80 -428 484 -155
4348 -155 -132 492 -301 -82 322 -134 -134 279 -179 -105 143 -310 148 -126 -25 290 -249 4 118 -182 -184 305
4370 305 -170 -110 239 -265 134 71 -11 31 -38 95 11 -8 51 242 -120 23 128 -341 169 45 -144 28 -35
4393 -35 -108 -184 67 -114 -64 -170 14 -22 -426 107 3 -112 109 -154 -124 29 238 -250 129 138 -130 103 -57
4416 -57 133 -12 10 75 -171 26 95 100 -94 299 -145 -126 232 -260 -22 55 -4 -187 51 22 -110 47 -144
4439 -144 123 -190 -61 290 -383 23 138 -196 -55 84 -68 -63 248 -136 21 10 -31 301 -123 88 197
4460A97m97L71J4l84L37K37o91O27j73l32O60n31k2K36o8kJ55k87J76K69p18Q56
4482D30l14p15R85m81j32O09m69r2N67n62p0M92o10N66o3n67Q62o72r7Q15p53
4503b71j94J032q29J10O94r92N59M03j024Q76l73k09Q51p60k69J055r72MJ156
4522H47j638Q68N72j486J084O8r22R65k80o91J039o78k08J277j406N52O67j432
4540h02J143M4j228J374j82j025J439p59n41J606j425J94J097j719J247J35j517
4557i19J402k5j366J747p96j225K137j249l11J372j718Q82O39j565J040L10j482
4574a127J890m56j493K321j327l65K002k245M71J662j962Q50M64j798J811Q3j876
4591a095J921j192n06K270k122j61J828j882R26J109k754J737Q72k043K049j130
$$ plain form
4460 197 -300 71 85 -299 38 275 -416 211 38 -294 366 -165 -187 49 -19 -21 134 -153 23 292 -426 430
4482 430 116 -599 386 -95 -227 382 -87 -179 388 -174 -244 248 -362 204 141 -426 436 -236 -333 482 -271
4503 -271 -465 567 -262 -152 542 -450 109 512 -512 364 -9 -218 633 -127 -396 659 -313 -309 847
4522 847 -791 77 649 -837 247 315 -607 358 78 -613 426 -252 -460 817 -589 -37 630 -802
4540 -802 341 385 -843 531 349 -676 763 4 -537 1069 -356 -162 935 -784 463 598 -919
4557 -919 483 458 -908 839 43 -1182 955 -294 -605 767 -951 -69 570 -995 45 355 -1127
4574 -1127 763 307 -1186 1135 -192 -557 1445 -800 -329 1333 -629 221 685 -1113 698 781 -1095
4591 -1095 826 -366 -872 1398 -724 -885 943 -939 -13 1096 -1658 79 951 -1092 957 -173
4607a73j053K563j390n49J539k004R89J759k910J091R66k094K552p09k311K584
4623H50n67p92J696k168J78K400k215O14O00k405K760J45k569K090o27r67K730
4640A753j961j294K751j738O58J194l125J997J018k111J833j146j391L159j238
4655C59j589K236j973N34K234l009P09J153j740K126n17k348K636n21j097K317
$$ plain form
4607 -173 -1226 1337 -53 -602 937 -1067 -78 1681 -1229 -138 828 -1266 1286 577 -1734 850
4623 850 283 -509 1187 -981 -803 1597 -618 -4 596 -1809 951 1096 -1473 617 -10 -977 1753
4640 1753 -208 -1502 1249 -489 169 1363 -1762 235 1253 -858 975 -171 -1562 1597 359
4655 359 -1230 1006 -967 -433 1801 -1208 -499 654 -1086 1040 523 -1825 811 290 -807 1510
$$ [...]
8191g0
##END NTUPLES=NMR FID
##END=
