##TITLE=1H_24-2021
 CDCl3,8 sc, 
 1.04.2021
##JCAMPDX= 6.0         $$ Bruker NMR JCAMP-DX V2.0
##DATA TYPE= NMR FID
##DATA CLASS= NTUPLES
##ORIGIN= UXNMR, Bruker Analytische Messtechnik GmbH
##OWNER= root
$$ XWIN-NMR		Version 3.5
$$ Thu Apr  1 10:31:14 2021 Russian Standard Time (UT+4h)  she@DPX200
##.OBSERVE FREQUENCY= 200.131506
##.OBSERVE NUCLEUS= ^1H
##.DELAY= (6, 6)
##.ACQUISITION MODE= SIMULTANEOUS
##.ACQUISITION SCHEME= undefined
##.AVERAGES= 8
##.DIGITISER RES= 18
##SPECTROMETER/DATA SYSTEM= spect
##.PULSE SEQUENCE= zg30
##.SOLVENT NAME= CDCl3
##.SHIFT REFERENCE= (INTERNAL, CDCl3, 0, 15.7039)
##AUDIT TRAIL= $$ (NUMBER, WHEN, WHO, WHERE, WHAT)
$$ ##TITLE= Audit trail, XWIN-NMR		Version 3.5
$$ ##JCAMPDX= 5.01
$$ ##ORIGIN= Bruker BioSpin GmbH
$$ ##OWNER= she
$$ F:/spectra/data/she/nmr/H-F/1/audita.txt
$$ ##AUDIT TRAIL=  $$ (NUMBER, WHEN, WHO, WHERE, WHAT)
(   1,<2021-04-01 10:29:53.54 +0400>,<she>,<DPX200>,
      <created by zg, POWCHK disabled, PULCHK disabled
       configuration hash MD5:
       00 E9 B6 7A A2 85 ED C7 34 08 36 98 17 FE 4E 26
       data hash MD5: 16K
       00 30 87 03 21 32 A5 48 94 8B 99 34 F4 0C DB BA>)
$$ ##END=
$$ 
$$ hash MD5
$$ 27 9A 73 B8 45 C1 38 82 80 01 CB B8 16 5E 15 50
##$RELAX= 
##$RELAX= 
##$RELAX= 
##$RELAX= 
##$RELAX= 
##$RELAX= 
$$ Bruker specific parameters
$$ --------------------------
##$DU= <F:/spectra>
##$EXPNO= 1
##$NAME= <H-F>
##$PROCNO= 1
##$TYPE= <nmr>
##$USER= <she>
##$AMP= (0..31)
100 100 100 100 100 100 100 100 100 100 100 100 100 100 100 100 100 100 
100 100 100 100 100 100 100 100 100 100 100 100 100 100 
##$AQSEQ= 0
##$AQ_mod= 1
##$AUNM= <au_zg>
##$AUTOPOS= <>
##$BF1= 200.13
##$BF2= 200.13
##$BF3= 200.13
##$BF4= 200.13
##$BF5= 200.13
##$BF6= 200.13
##$BF7= 200.13
##$BF8= 200.13
##$BYTORDA= 1
##$CFDGTYP= 0
##$CFRGTYP= 5
##$CHEMSTR= <none>
##$CNST= (0..31)
1 1 145 1 1 1 1 1 1 1 1 1 1 1 1 1 1 1 1 1 1 1 1 1 1 1 1 1 1 1 1 1 
##$CPDPRG= <>
##$CPDPRG1= <>
##$CPDPRG2= <>
##$CPDPRG3= <>
##$CPDPRG4= <mlev>
##$CPDPRG5= <mlev>
##$CPDPRG6= <mlev>
##$CPDPRG7= <mlev>
##$CPDPRG8= <mlev>
##$CPDPRGB= <>
##$CPDPRGT= <>
##$D= (0..31)
0 1.2 0 0 0 0 0 0 0 0.06 0 0.03 0 0 0 0 0.0002 0 0 0 0 0 0 0 0 0 0 0 0 
0 0 0 
##$DATE= 1617258592
##$DBL= (0..7)
120 120 120 120 120 120 120 120 
##$DBP= (0..7)
150 150 150 150 150 150 150 150 
##$DBP07= 0
##$DBPNAM0= <>
##$DBPNAM1= <>
##$DBPNAM2= <>
##$DBPNAM3= <>
##$DBPNAM4= <>
##$DBPNAM5= <>
##$DBPNAM6= <>
##$DBPNAM7= <>
##$DBPOAL= (0..7)
0.5 0.5 0.5 0.5 0.5 0.5 0.5 0.5 
##$DBPOFFS= (0..7)
0 0 0 0 0 0 0 0 
##$DE= 6
##$DECBNUC= <off>
##$DECIM= 32
##$DECNUC= <off>
##$DECSTAT= 4
##$DIGMOD= 1
##$DIGTYP= 9
##$DL= (0..7)
0 120 120 120 120 120 120 120 
##$DP= (0..7)
150 150 150 150 150 150 150 150 
##$DP07= 0
##$DPNAME0= <>
##$DPNAME1= <>
##$DPNAME2= <>
##$DPNAME3= <>
##$DPNAME4= <>
##$DPNAME5= <>
##$DPNAME6= <>
##$DPNAME7= <>
##$DPOAL= (0..7)
0.5 0.5 0.5 0.5 0.5 0.5 0.5 0.5 
##$DPOFFS= (0..7)
0 0 0 0 0 0 0 0 
##$DQDMODE= 0
##$DR= 18
##$DS= 0
##$DSLIST= <SSSSSSSSSSSSSSS>
$$ [...]
##$SUBNAM2= <"">
##$SUBNAM3= <"">
##$SUBNAM4= <"">
##$SUBNAM5= <"">
##$SUBNAM6= <"">
##$SUBNAM7= <"">
##$SUBNAM8= <"">
##$SUBNAM9= <"">
##$SW= 16.9725357007746
##$SWIBOX= (0..15)
0 0 2 0 0 0 0 0 0 0 0 0 0 0 0 0 
##$SW_h= 3396.73913043478
##$TD= 16384
##$TD0= 1
##$TE= 0
##$TE2= 300
##$TE3= 300
##$TEG= 300
##$TL= (0..7)
0 120 120 120 120 120 120 120 
##$TP= (0..7)
150 150 150 150 150 150 150 150 
##$TP07= 0
##$TPNAME0= <>
##$TPNAME1= <>
##$TPNAME2= <>
##$TPNAME3= <>
##$TPNAME4= <>
##$TPNAME5= <>
##$TPNAME6= <>
##$TPNAME7= <>
##$TPOAL= (0..7)
0.5 0.5 0.5 0.5 0.5 0.5 0.5 0.5 
##$TPOFFS= (0..7)
0 0 0 0 0 0 0 0 
##$TUNHIN= 0
##$TUNHOUT= 0
##$TUNXOUT= 0
##$USERA1= <user>
##$USERA2= <user>
##$USERA3= <user>
##$USERA4= <user>
##$USERA5= <user>
##$V9= 5
##$VALIST= <valist>
##$VCLIST= <CCCCCCCCCCCCCCC>
##$VD= 0
##$VDLIST= <DDDDDDDDDDDDDDD>
##$VPLIST= <PPPPPPPPPPPPPPP>
##$VTLIST= <TTTTTTTTTTTTTTT>
##$WBST= 1024
##$WBSW= 4
##$XGAIN= (0..3)
0 0 0 0 
##$XL= 0
##$YL= 0
##$YMAX_a= 317647
##$YMIN_a= -220941
##$ZGOPTNS= <>
##$ZL1= 120
##$ZL2= 120
##$ZL3= 120
##$ZL4= 120
##$ABSF1= 10
##$ABSF2= 0
##$ABSG= 5
##$ABSL= 3
##$ALPHA= 0
##$AQORDER= 0
##$ASSFAC= 0
##$ASSFACI= 0
##$ASSFACX= 0
##$ASSWID= 0
##$AUNMP= <proc_1d>
##$AZFE= 0.1
##$AZFW= 0.1
##$BCFW= 1
##$BC_mod= 2
##$BYTORDP= 1
##$COROFFS= 0
##$CY= 11.3945322036743
##$DATMOD= 1
##$DC= 2
##$DFILT= <>
##$DTYPP= 0
##$F1P= 15.9154993809931
##$F2P= -4.1035820241983
##$FCOR= 0.5
##$FTSIZE= 0
##$FT_mod= 4
##$GAMMA= 1
##$GB= 0.15
##$INTBC= 1
##$INTSCL= 1
##$ISEN= 128
##$LB= 0.24
##$LEV0= 0
##$LPBIN= 0
##$MAXI= 10000
##$MC2= 0
##$MEAN= 0
##$ME_mod= 0
##$MI= 1.114404
##$NCOEF= 0
##$NC_proc= 0
##$NLEV= 6
##$NOISF1= 3.799351
##$NOISF2= 2.8
##$NSP= 1
##$NTH_PI= 0
##$NZP= 0
##$OFFSET= 15.70392
##$PC= 1
##$PHC0= -11121.17
##$PHC1= 11.60093
##$PH_mod= 1
##$PKNL= yes
##$PPARMOD= 0
##$PSCAL= 0
##$PSIGN= 0
##$REVERSE= no
##$SF= 200.130013532006
##$SI= 16384
##$SIGF1= 3
##$SIGF2= 2
##$SINO= 400
##$SIOLD= 16384
##$SREGLST= <1H.CDCl3>
##$SSB= 0
##$STSI= 0
##$STSR= 0
##$SW_p= 3612.71676300578
##$SYMM= 0
##$S_DEV= 0
##$TDeff= 0
##$TDoff= 0
##$TI= <>
##$TILT= no
##$TM1= 0
##$TM2= 0
##$TOPLEV= 0
##$USERP1= <user>
##$USERP2= <user>
##$USERP3= <user>
##$USERP4= <user>
##$USERP5= <user>
##$WDW= 1
##$XDIM= 8192
##$YMAX_p= 0
##$YMIN_p= 0
$$ End of Bruker specific parameters
$$ ---------------------------------
##NTUPLES= NMR FID
##VAR_NAME=  TIME,          FID/REAL,        FID/IMAG
##SYMBOL=    X,             R,               I
##VAR_TYPE=  INDEPENDENT,   DEPENDENT,       DEPENDENT
##VAR_FORM=  AFFN,          ASDF,            ASDF
##VAR_DIM=   8192,          8192,            8192
##UNITS=     SECONDS,       ARBITRARY UNITS, ARBITRARY UNITS
##FACTOR=    0.0002944,     1,               1
##FIRST=     0,             0,               0
##LAST=      2.4114304,     0,               0
##MIN=       0,             -220941,         0
##MAX=       2.4114304,     317647,          0
$$ Real data points
##PAGE= N=1
##DATA TABLE= (X++(R..R)), XYDATA
$$ [...]
1959b778K980k43J264j284j228K91O87J126j415J25r83K451j505M78o20j649L562
1976A259k246J396r71n4J595j983J521r37M53P8J59j280J053m82Q1O22k888L773
1994A149j704J348r81j348J475l43J211j639j88J73J199N14o08j694q47L243r72
2011a2K006l593O77P15O98K135m503P75j44K458N1j068j913R11J313J20Q73m881
2029c382K797R82O56o4k944J496l7J338%j084q99O71J371k97j81j514J769j322
2047f44J652p78j020J688k677K734o77k08K10j208R71O8O34q35K26j498K244n96
2065B86O20m02k268K518p94K259j744j498O32Q23J693j547n09j266J985O49L10
2082A747k249n30J458O6K494l771k00L9J367K244k893j031l94J929P45l6k785
$$ plain form
1959 -2778 202 -41 1223 -61 -1289 -998 -311 815 -600 -475 -1458 993 -512 -34 -654 -2303 1259
1976 1259 -987 409 -562 -616 979 -1004 517 -420 33 111 270 -1010 43 -439 -358 264 -2624 1149
1994 1149 -555 793 -188 -1536 -61 -404 807 -832 -1020 -847 352 866 258 -1436 -2283 960 -12
2011 -12 1994 -1599 -922 -207 491 2626 -1877 -1102 -1246 1212 1263 195 -1718 -807 506 626 1499 -3382
2029 -3382 -585 397 1053 989 -1955 -459 -496 842 842 -242 -1141 -470 901 604 423 -1091 678 -644
2047 -644 1008 230 -790 898 -1779 955 278 70 280 -928 43 111 745 -90 136 -1362 882 286
2065 286 906 504 -1764 754 -40 2219 475 -1023 -391 432 2125 578 69 -1197 788 1437 1747
2082 1747 -502 -1032 426 492 2986 -785 -985 -946 421 2665 -228 -1259 -1653 276 1021 985 -1800
2099a800R4J103P71J476l680J071p66K248Q65k050L7p47K345J43J05j532M07P99
2117H89O13M70j682Q62j412K376r10l16N03k427K391j336J127l51j320J18K62
2134a43N45J4l87j978J817m74J508o14j952J077m09K770j323q64p95Q11J651o0
2152A194p36j973J483M74J891k096j134J38N42K820k533J32j639J379K051j375
2168F18n29j441R40J207Q17k037M2p14J476J494k586J010j897J991M25p43j51
2185g8j234J417j78M49j053J21l26O41L09o91Q35j829J771j181J197l0j136J094
2203I8j343J992n75J87p37l9N72R45n0j390R82j599K860q12p27Q0j188K393q05
2222H44j22j285L4R58P15n86j654K92l27K449j643m65o13J52K060j534P18k036
$$ plain form
2099 -1800 -1706 -603 168 1644 -2036 -965 -1731 517 1382 -668 -631 -1378 967 1110 1215 -317 90 889
2117 889 1502 1972 290 1152 -260 2116 1206 890 1393 -1034 1357 21 1148 797 -523 -405 -143
2134 -143 402 416 29 -1949 -132 -606 902 288 -1664 -587 -996 1774 451 -413 -1208 -397 1254 1194
2152 1194 458 -1515 -32 442 2333 237 -897 -759 -217 2603 70 202 -1437 -58 1993 618
2168 618 89 -1352 -412 795 1612 -425 -383 -1097 379 1873 -713 297 -1600 391 816 73 -78
2185 -78 -1312 105 -73 376 -677 -556 -882 -241 68 -623 212 -1617 154 -1027 170 140 -996 98
2203 98 -1245 747 172 359 -378 -417 155 1100 1050 -340 642 -957 1903 1091 364 444 -744 1649 844
2222 844 722 -563 -529 429 1144 558 -1096 -804 -1131 1318 -325 -790 -1403 -1251 809 -725 -7 -2043
2240b043J396P76j07r0j119O22L23J163j052L59j141J263O65j171J091j973J703
2257F65k43k53J15p80Q75l67O44p90K64j55M45l50J30K66p22J269j759J281k40
2276B95j6O13j653J080n06O16m59k85m18P45K90n88L73j718K038p08M76l12j024
2295a161J515m56R71j117j2K18P78K30n54k21l73J467q16L38j308N29Q89j027
2313a10J153k178J166j11L05k33o71L10J57N35r17N95j038J272j02m51N11j200
2331a007J711p59M49p96NR16n76L77q82M77k78Q86j093M40k90pJ170j656J135
2350B22q47O77M90q10K49m56R51k00K86j017P90P8P1L68j272R26p27J195r01m01
2370c28M65m28J178j360J14l66O10L88n10o34J5R14o40Q87j540P06L35k45R34
$$ plain form
2240 -2043 -647 129 22 -68 -1187 -565 -242 921 -131 228 -913 350 1015 -156 935 -1038 665
2257 665 422 169 284 -496 379 12 656 -134 130 -25 420 70 200 466 -256 1013 -746 535 295
2276 295 279 892 -761 319 -187 429 -30 -315 -733 12 302 -286 87 -1631 407 -301 175 -137 -1161
2295 -1161 354 -102 869 -248 -260 -42 736 966 412 191 -182 1285 469 807 -501 28 917 -110
2313 -110 1043 -1135 31 -80 225 -8 -679 -369 -212 323 -594 1 -1037 235 133 -318 193 -1007
2331 -1007 704 -55 394 -402 -397 519 -57 320 -562 -85 -363 523 -570 -130 -420 -427 743 -913 222
2350 222 -625 52 542 -268 -19 -475 476 276 562 -455 335 413 484 852 -420 506 -221 974 73 -328
2370 -328 137 -291 887 -473 -359 -725 -115 273 -237 -871 -856 58 -582 305 -1235 -529 -194 -439 495
2389D95j566Q28j19P17l72n82K44L29L27o34O52j143J176m54Q4Q9r47J391r09
2408c94J034j377N14K63j70J20q18K50O5J000j254L53j79M33Q20j467R73j189
2426a023J043L74o57L59o08J022k66K05q62M12k68R03k63r06N68p20J597j230
2444c20K2k72l27J277q38N3q41R91J63R8m82l59N83k13R82j438R07o92Q10M03
2464E07j089R82r43P22J62k07p44M12J89O4L38j437J288r85P97J13p08P69j048
2483h18Q35p31O37k04L52l96k92N03n4P09j126N11p72J099L0p43O62j220J506
2502D88k53k2l00p20J101J39J47r09R0N2J394p49o14R8p28K083j122J22p09j61
2522e73J116k05m4j075M01J63R61l79o90l48L08J457j132O01j407R45M88m03N36
$$ plain form
2389 495 -1071 -243 -362 355 -17 -599 -355 -26 301 -333 319 -824 352 -102 -18 71 -876 515 -394
2408 -394 640 -737 -223 40 -130 -10 -828 -578 -513 487 -767 -414 -593 -160 660 -807 166 -1023
2426 -1023 20 394 -263 96 -512 510 244 449 -413 -1 -269 634 371 -535 33 -687 910 -320
2444 -320 -298 -570 -897 380 -458 -405 -1246 -255 -92 6 -476 -835 -252 -465 517 -921 -14 -706 104 507
2464 507 -582 400 -543 179 341 134 -610 -198 -9 55 393 -1044 244 -741 56 169 -539 230 -818
2483 -818 17 -714 -77 -281 71 -325 -617 -114 -168 541 -585 -74 -846 253 283 -460 202 -1018 488
2502 488 235 213 -87 -807 294 433 580 -329 -239 -187 1207 458 -156 -58 -786 1297 175 297 -412 -573
2522 -573 543 338 294 -781 -380 -217 744 365 -325 -673 -365 1092 -40 561 -846 99 587 184 720
2541G20j435R88j14L64o64J44p00M82L83n33N49j011N69l28L5O46p59O71o56Q94
2561B45k72L84m57Q8K41L10Q55j212L73r40J369J71n85k58r12J442l52O4q34m58
2581g38N44L46L57j117N1p58J702m03K1o11n52J807l48L92j055k61P35Q67j25
2600H54j062l4j7J225o58K33q91o0R24k08L62j435P53l05L53M26j103N65j60L65
2620A27j22J95p21M25K3J88N79r54P36r32N79M26m56R3q16N01pO91m53o28j8M47
2642i7P25q03O6j010J359L1K48n24j065J106p8Q58o89m39k69R19L84j95o12r24
2662a009J616j62M65j104n33R84K25M95j306L3j92R01K79n63k45o02R63j92N17
2681E70j363L40L60j98R68j330N13m64Q05K15l87K3n92P37k78M73n00K58m67M77
$$ plain form
2541 720 -715 273 159 523 -141 3 -697 -215 168 -365 184 -827 -258 -586 -551 95 -664 7 -649 245
2561 245 -27 357 -100 -12 229 539 1394 182 555 -385 984 1155 570 312 -600 842 490 554 -280 -738
2581 -738 -194 152 509 -608 -557 -1315 387 -16 5 -606 -1158 649 301 693 -362 -623 112 979 854
2600 854 -208 -242 -259 966 308 541 -350 -410 514 306 668 -767 -14 -319 34 460 -643 -78 -238 127
2620 127 5 200 -521 -96 -73 115 694 -260 476 -456 123 549 93 186 -630 -129 -136 555 102 -526 -544 -97
2642 -97 628 -175 -109 -1119 240 271 519 -5 -1070 36 -42 816 127 -312 -581 338 722 527 -85 -1009
2662 -1009 607 445 910 -194 -727 257 482 977 -329 -296 -488 413 692 129 -116 -718 245 53 570
2681 570 -793 -453 -93 -291 677 -653 -140 -604 201 416 29 52 -540 197 -81 392 -108 150 -317 160
2701A60L51p12N61q87N61l3J92J25p50J69j95J014n45J86q58N44N81q0%j079P76
2722H1j68R93l84q73K68k66J220q73p1p05Q12K53J39o64o76P05q6J149j294j43
2742e83K81J91R19p60j15j85M24L17m1k42k63M73l33Q45j012K60j12J24L35r74
2762d51Q45r58O03j59J2K3l44L52l04L27m86P80o77L16P5N6P63j083O35n22M90
2783B93Q7k79J67q56P53k06M67r69K79NL64K47j016N89p25J142n48k9L12o72R12
2804C17j91L11o98K40J90M75n89l45N33m36R87q87L70l46K13O48q21K55m70M04
2824A60N2j50l6k59M45o19P28j056P60k71K34J31p67Q02m27O09n70Q8n2L31o3
2845G0k02L09n27P70m66M94o56k9P29p01O98j229R15k11J74j25l29l4K7P06r96
$$ plain form
2701 160 511 -201 360 -527 34 1 193 318 -432 -263 -458 556 11 197 -661 -117 464 384 384 -695 81
2722 81 -87 906 522 -351 -83 -349 871 -2 -73 -778 34 287 426 -238 -914 -209 -295 854 -440 -583
2742 -583 -302 -111 808 48 -67 -252 172 489 448 206 -57 416 83 928 -84 176 64 188 523 -451
2762 -451 394 -564 39 -120 -108 -85 -429 -77 -381 -54 -540 240 -437 -121 -46 10 773 -310 325 -197 293
2783 293 380 101 268 -588 165 -41 426 -543 -264 -259 105 352 -664 -75 -800 342 -206 -235 77 -595 317
2804 317 126 437 -261 -21 169 644 55 -290 243 -193 794 -93 277 -69 144 792 -29 226 -244 160
2824 160 212 62 26 -233 212 -407 321 -735 25 -246 -12 119 -648 154 -273 336 -234 -146 -198 133 70
2845 70 -132 177 -350 420 -46 448 -208 -237 492 -209 489 -740 175 -36 138 13 -316 -350 -323 383 -613
2866f13L89k41N13r8k99M81q69R90k41J12r8l84N50N8K65p26N72m51M69k15j84
2887b0J40k56R75j103O81q72L84J73l04L29p20N58j32M91p57M36j86J99M89j058
2907e53P44l42M53k87k32L71n16R70o23J90l18J44P6j94J42o58Q35o24Q55r49
2927e16J59N14j22M83j024P13m41N28r0m29K01mM54o08K59o17P82l09L2J08q06
2948g33J153p67O63o48M0K76R8M60o74L09k77O80m13K45m11k34R03p78P87j091
2968d12M09Lm0J77o36M62l30O10o39K06m4R7K18m84P87o64P88m36O2J43j20L92
2990E49n23M22n48N43k76L5m07q8M91m86O38j097M21l0J01L28q89N89q5O03m95
3011b04J91l50L15L14k1J08r53R54j26N69m73n79M82k57N59o07j15r5J47M91j80
$$ plain form
2866 -613 -224 -465 48 -50 -349 132 -737 253 12 124 26 -358 192 250 515 -211 361 -90 379 164 -20
2887 -20 120 -136 839 -264 417 -455 -71 102 -202 127 -593 -35 -167 324 -433 3 -183 16 505 -553
2907 -553 191 -151 302 15 -217 154 -362 608 -15 175 -143 1 77 -117 25 -633 202 -422 433 -516
2927 -516 -357 157 35 518 -506 207 -234 294 204 -225 -24 -28 426 -182 77 -540 242 -67 -35 73 -733
2948 -733 420 -347 316 -332 -292 -16 82 542 -132 177 -100 580 167 412 1 -233 670 -108 679 -412
2968 -412 -3 0 -40 137 -499 -37 -367 243 -396 -190 -234 -137 81 -403 384 -280 508 72 134 277 157 549
2990 549 26 448 -100 443 167 202 -205 -293 198 -288 350 -747 -326 -356 -255 73 -816 -227 -312 291 -204
3011 -204 -13 -363 -48 266 245 353 -600 354 228 797 324 -255 227 -30 529 -78 -193 -288 -141 350 170
3032A70k50m67O82m50O20m97j56K07l22J057q55M90k94K44K53q7K6m73L24l26
3052a04O35o89K76j71k29O36l93L06p07K88k19K0O48n91R8k84P45l02L54o81P3
3073b91M60j17O46j207N17j10M72J34p00J37l38Q31j83l13n81K70N90J19Pj050
3093g07P29m26J022k71n84O6j66R00m06K13o64K03J44J97J21q61N76l29P73l90
3113A40r9p6l71Q17l35J23n62M63l74M12K13n40K27k89O73l25K65n03j69M21l53
3134b42Q42q72L40l93K50O78m23j25o19M94J94L37n90j73K34K15M40j074L40l34
3154d81M85L71k92l02n79Q18n3M56j010M61l6N25j29n81N59p64J222m89M8j37
3174I2m46P45j51L7m83J70j47M50j07l53J70l85M87l94N00k99m5L38k54L10l62
$$ plain form
3032 170 -80 -547 135 -315 305 -192 -348 -141 -463 594 -261 229 -65 179 432 345 371 -102 222 -104
3052 -104 531 -158 118 -53 -282 354 -39 267 -440 -152 -371 -351 297 -294 -196 -480 265 -37 317 -364 -291
3073 -291 169 52 698 -509 8 -102 370 504 -196 -59 -397 434 251 -62 -643 -373 217 336 343 -707
3093 -707 22 -404 618 347 -237 -171 -337 563 157 370 -294 -91 53 250 371 -490 86 -243 530 140
3113 140 41 -35 -406 411 76 199 -363 100 -274 138 351 -189 38 -251 422 97 362 -141 -310 111 -242
3134 -242 600 -272 68 -325 -75 603 180 55 -564 -70 124 461 -129 -302 -68 147 587 -487 -147 -481
3154 -481 4 375 83 -219 -798 20 -33 423 -587 -126 -162 363 234 -347 212 -552 670 181 229 92
3174 92 -354 391 240 277 -206 -36 -183 267 160 -193 -23 -408 79 -315 185 -114 -159 179 -75 235 -127
3195a27J23k08K71O5rmm69O26k91P29p19n0J20k89Q22o81K60p74N90J51n8j11
3217c3k57K37j03N31o25Nl55O53N14q90M89q26Q83j4K92k99n61L53q6N08o88M10
3239A38o10N61J18k72K77q06O76j74K91m06j01L98k58M46n05K53k39L46r2Jlo1
3261b2M59p50O70n52K26p1k2M31o47N70m63L81l75N43k45l87K61k68O81n58K34
3282I6j37L4k0k3K39p05L96n5K46r5j78R7J3O09n64M77r78N32L37j90K54r68Q41
3305B58l47L87k01j36m4m9J70j28K58p56P80l93J86pn14P91m17J77q0m3J57O6
3327A15J66j75M12n56N20n03R1K8OK68o47N89o82N91nk95K68l81O20m67L89m58
3349a06K19j66K73M6n56Q19m51N06n82jJ52j94O05q19L35k29L48r5j94k66k9M85
$$ plain form
3195 -127 -4 -212 59 124 115 111 -358 268 -23 706 -13 -63 57 -232 590 -91 169 -605 -15 136 78 -33
3217 -33 -290 -53 -156 375 -250 -245 -600 53 567 -323 166 -660 223 209 501 202 -359 -6 -92 416 -272 138
3239 138 -472 89 207 -65 212 -594 82 -92 199 -207 -308 90 -168 278 -227 26 -213 133 41 42 39 -22
3261 -22 437 -313 357 -195 31 -40 -62 369 -278 292 -171 210 -165 378 133 -254 7 -261 420 -138 96
3282 96 -41 -7 -27 -50 189 -516 -120 -175 71 -24 -202 -105 -92 517 -47 430 -548 -16 321 131 385 -583 258
3305 258 -89 298 97 -39 -83 -132 38 -90 168 -588 192 -201 -15 -22 -536 255 -162 15 -65 -108 49 115
3327 115 281 106 518 -38 482 -21 70 98 104 372 -275 314 -368 223 218 -77 191 -190 430 -37 352 -106
3349 -106 113 -53 220 266 -290 529 78 584 2 1 153 -41 564 -255 80 -149 199 104 -90 -356 -385 100
3371A00j55K36o63O24j28K6K37o19N90k99L81k97J02j58M1L71m61O09p36L95n01
3392c05M94k60k78P72o34N33o89K11K9j19J38R7j72K00L37l81K31j76L25J5l14
3413E4M99o93O10k65K3P7m59N90o89L68l70K40l61N35j56l04N39n48O00m00K92
3434A82k21M6M47m13L10m14L53J17R2m17o3K55k78K65o96P19o78M88on72L61k18
3456c41K50k41J82j52K04Q8J16Lp5K93m54L91l55J0M09n13O04n20N14m26q0L54
3478B61n10K91k59O12n35J64k85K80J57l74J78n09R06k45j23K0k04L96j47K85
3498C59m36K56j57J46j96m0O2j69N82m58l1j72R2K2j2K52n58L62n0M02k48J04
3520A12k71L6P53m80n9m71O77k46J87m0m13L78k79L84m76J45j72O0Q7k41M27n68
$$ plain form
3371 100 -55 181 -482 142 14 40 277 -342 248 -51 330 33 135 -23 18 389 -72 537 -199 196 -305
3392 -305 189 -71 -349 423 -211 322 -367 -156 -127 -246 -108 -11 -183 17 354 -27 204 28 353 368 54
3413 54 553 -140 470 205 228 305 -154 436 -253 115 -255 -15 -376 159 3 -301 238 -310 290 -110 182
3434 182 -39 7 454 41 351 -63 290 407 499 82 19 274 -4 261 -435 284 -394 94 88 -484 -123 -341
3456 -341 -91 -332 -150 -302 -98 -10 106 109 34 327 -127 264 -91 -81 328 -185 419 -101 413 -13 -93 261
3478 261 -249 42 -217 395 -140 24 -261 19 176 -198 -20 -529 377 132 9 29 -175 221 74 359
3498 359 -77 179 22 168 -28 -68 -6 -175 407 -51 -82 -254 -162 -140 -152 100 -458 -96 -146 256 8 112
3520 112 -159 -123 630 150 91 -380 297 51 238 198 -215 163 -116 268 -208 -63 -235 -175 -88 -329 98 -470
3542d70P00m11K71o0j23K21k41K56k05Q0q3J63mn6J44k81L24m47N07l22K03j14
3564E2n75R54m21L15o81J72L03j39K89m72J31m5N36l06N5k83j02N70k79K20o37
3585c43L11J9L59k25m01M13k34N96m05P1m82J04L96j63K2n00M74j52K90o9l10
3606b29J47j71N42m99K76r9p3R0O5K24o20M43n19P38k30j16Q7k91L69NK96p10
3628b75P9K09J50J13l65N3n04Q68j92p8k04j56N15l48M27l59%P1K31nl11Q5l87
3651c83O19j39K23n39k4K91oK06n19J92j45M91J53m44k54j7M39q9J00m01J88N
3673e3j31M61o33M10l04L81l3k62k8j70O40k82J14m93J12R8L17P5m00K49n28O24
3695A64k31R8j00j66K79P7J20m16j24K2L06Q5J5j3n56N14j27K61k94j08K00l33
$$ plain form
3542 -470 230 -181 90 30 -93 128 -113 143 -62 18 -65 98 94 38 182 -99 225 -222 285 -37 166 52
3564 52 -523 431 10 325 -356 -184 119 -20 269 -203 -72 -117 419 113 168 -115 -217 353 74 294 -343
3585 -343 -32 -13 346 121 -280 133 -101 495 90 161 -321 -217 179 16 38 -462 12 -140 150 81 -229
3606 -229 -82 -253 289 -210 66 -33 -106 -16 49 273 -347 96 -423 315 85 -31 56 -235 134 139 435 -275
3628 -275 -196 13 163 276 -89 -36 -540 328 136 58 -146 -302 213 -135 292 -67 -67 4 235 230 -81 4 -383
3651 -383 236 97 320 -219 -243 48 42 248 -271 -79 -224 267 420 -24 -278 -295 144 55 155 -246 -58 -53
3673 -53 -184 277 -356 54 -250 131 98 -164 -192 -362 278 -4 110 -383 -271 -173 144 219 -181 68 -460 164
3695 164 -67 31 -69 -235 44 121 241 -175 -299 -277 29 114 129 116 -440 74 -53 208 -86 -194 6 -327
3717c27Q41m88Q5j24O1j20K6P9l96M86j55N00o49K6j00N9M62l22N9j06J67r9n0
3740h5j3m4K35k60M87n95L52l78K38M23l47L69p37M73k17K81l14k0J48n8K77m28
3762b13L98m64J32K36k75L41l98M02m39N20j69k28K70m08M40j42L07l03J73j60
3782B0K11N4n01L78k46L34k80N5M8k27L00j52J73m47J41K46J86l91J01K06l89
3803a80O69m89J66j96K53M4k70J89j31P4j95L61l05k36L20j72M17o27L10j93K69
3824G8M3l29M72m81N88n08P2J61m5J63k56K52l60M02m06K68l9K2O2m38L36l77
3846c20K75j53K08j27j10K28m3J24l92M83j57J5K84m04K58n69P69n52L27j1l14
3867a81L60l60K82n4l4l56M35m10K06P7k54N24m93L91l31J34K27j21J40l58M63
$$ plain form
3717 -327 514 26 111 -13 48 -72 -46 33 -363 123 -32 468 -181 -155 -255 -196 266 -56 3 -103 64 -35 -85
3740 -85 -98 -142 93 -167 320 -275 77 -301 -63 360 13 382 -355 118 -99 182 -132 -152 -4 -62 215 -213
3762 -213 185 -279 -147 89 -186 155 -243 159 -280 240 71 -157 113 -295 145 3 310 7 180 20
3782 20 231 285 -216 162 -84 250 -30 25 73 -154 146 -6 167 -280 -139 107 293 -98 3 209 -180
3803 -180 489 0 166 -30 223 267 -3 186 55 129 -66 295 -10 -246 74 -98 319 -308 2 -191 78
3824 78 121 -208 264 -217 371 -137 -65 96 51 214 -42 210 -150 252 -154 114 75 97 159 -279 57 -320
3846 -320 -45 -198 10 -117 -227 1 -42 82 -310 173 16 31 315 -89 169 -400 369 -183 144 133 -181
3867 -181 179 -181 101 47 13 -343 92 -318 -112 -35 -289 235 -258 133 -198 -64 163 42 182 -176 287
3888B87k48J56q4Q0j46j01L30n23M13l87K83k7j63K70l31J68k45L43m12L39o7
3909f5Loj27Q1j09L31l03M00j81k2K64n07L35k11O9j2P6p6l2K79m25K90m73K58
3933a63K9P6J89k68K97l68N34r8k51K50k64J25k14L16j85L13m28J53N7k70M73
3954C03m06M41m63J84j00k99M53j98J28j45K97n40L51o0j0K11j82L42l95L13j87
3975C8N6J29k75J67j94Q8k41L13j92J59j71n2L04m52M30m73M55j91J71M4k11K05
3997A07j78L67k45N8j85n6L94n35L94k52K68j73J70l40q0M17k95N78m04N5r8J01
4019F8L7k65M07o72P02l49K32r7j51K76l20M64l02J07k74J30M7k5J55l19K27j82
4041a04N69l60J77l45j12L15k86J08j25J03rM1J34k54M19m10M58l21o0Q9L3k7
$$ plain form
3888 287 39 195 111 191 45 -56 274 -249 164 -223 60 33 -130 140 -191 -23 -268 75 -337 2 -65
3909 -65 -62 -68 -195 -114 -223 108 -195 205 24 2 266 -241 94 -117 -48 -60 16 -60 -92 187 -238 52 -421 -163
3933 -163 -134 -58 131 -137 160 -208 326 228 -23 227 -37 88 -126 190 5 318 -110 43 100 -170 303
3954 303 -103 338 -125 59 -41 -340 113 -85 43 -102 195 -345 6 -54 -64 147 -35 307 -88 225 38
3975 38 94 223 -52 115 -79 9 -232 81 -111 48 -123 -175 129 -323 107 -366 89 -102 69 113 -98 107
3997 107 -71 296 51 109 -76 -132 262 -273 121 -131 137 -36 134 -206 -286 131 -164 414 10 65 -33 68
4019 68 105 -160 247 -425 277 -72 160 63 -88 188 -132 332 30 137 -137 -7 40 15 170 -149 78 -104
4041 -104 465 105 282 -63 -175 140 -146 -38 -163 -60 -69 -28 106 -148 271 -139 319 -2 -62 27 60 33
4063C3k98N43p07M21n3K05n6j01J5k42M75k14J86k70k9J41j5K3l04L81k56K95
4085A73q3k24L57m21M83l59J20k41L4J04K04Q0l70L19j52K79l21O4q3n9J99k08
4107a05L82m64J82R1m7j7j66J59r2K25j65J95n59J79N15m33N05o12N63m58N5J46
4129G9k68K15k69M60m34L47l64K40k41J96K84m62P5p8M57j54n7J07k43l9K07p3
4151a5k20K65j23J56L2l67N58n58N49j23r9K8j25J76j02L38o17K88j11L59r8l94
4173b03M42o16O18j62O6q2j63J34p1L50p26L35O9O0j05K2L7q7K05l26L47l25j6
4196a97J26r8N45m47J96l23L48j46Q6j90k22N07k55K64l53K52k01Q4K25k32J59
4217A28l30J99L8k0J99l55K57m15M08k09L26l47K36j93l0L99o40P35m53K44j28
$$ plain form
4063 33 -265 278 -429 -8 -61 144 88 -13 2 -240 235 21 207 -63 -92 49 34 57 -247 134 -122 173
4085 173 90 -134 223 -198 285 -74 46 -195 -161 -57 147 227 -143 176 24 303 -18 46 -37 -96 103 -105
4107 -105 277 -187 -5 86 39 22 -144 15 -77 148 -17 178 -381 -202 313 -120 385 -227 336 -122 -67 79
4129 79 -189 26 -243 217 -217 130 -234 6 -235 -39 245 -217 -142 -220 237 83 26 133 -110 -149 58 -15
4151 -15 -235 30 -93 63 95 -272 286 -272 277 154 55 83 -42 134 32 370 -247 41 -70 289 191 -203
4173 -203 239 -377 241 79 145 63 -100 34 -37 313 -413 -78 -9 51 -54 -32 5 -82 123 -203 144 -181 -197
4196 -197 -71 -169 376 -71 125 -198 150 4 90 -100 -322 185 -70 194 -159 93 -108 -24 201 -31 128
4217 128 -202 -3 35 15 214 -141 116 -299 109 -100 226 -121 115 -78 -108 291 -349 386 -67 177 49
4238D9l41r9L78J62j23k82m1K66K12k23J10j79L47k98L35k08m6o2M2L06j95O5
4260A75l46O8L33o6j61q3k9R7K37l02K2j15OL70m07M58n10K59j43J84K0J3j87
4283a07J42R2j23o1j07K3K19k69L77n28O29l67J24r7q6o8J79J09Pj8j96R4p2K28
4307A24j23r5L39l63L27r9r4N1j41L10l00J04k82L57k93L05j63PJ32k16L32l06
4329h7R0j17N1J03j74M30n56L68k53L15k06K30J01k56J58l20K95m66L95k73J25
4350d7J64k93K45j15P3n0N0j59l8L23k70J64j23J82j76J6J11j82J93l07J60J15
4372C6j15R2k3Pk22N03m76L67k19J61p2p0J14j96L17j86Mn9o6PJ43Q2k63J65j02
4397g1J34P0j85Q3k6R7k38K39l52L73o8o7J26k32K60k69L51l05m4J76P5j98j14
$$ plain form
4238 49 -292 -391 -13 149 26 -256 -297 -31 181 -42 68 -111 236 -62 273 65 19 -43 -1 305 110 175
4260 175 -171 -103 230 164 3 -80 -109 -12 225 -77 -55 -170 -164 206 -201 257 -253 6 -137 47 67 80 -107
4283 -107 35 127 4 -57 -164 -141 78 -191 186 -342 287 -80 44 -53 -139 -207 -28 81 88 70 -126 -32 -104 124
4307 124 1 -94 245 -118 209 110 16 67 -74 236 -64 40 -242 115 -178 127 -36 -29 103 -113 219 -87
4329 -87 3 -114 -63 40 -134 296 -260 108 -145 170 -36 194 295 39 197 -123 172 -294 101 -172 -47
4350 -47 117 -176 69 -46 27 -23 27 -132 -170 153 -117 47 -76 106 -70 -54 57 -125 68 -239 -79 36
4372 36 -79 13 -10 -3 -225 278 -198 169 -50 111 39 -31 83 -113 204 18 22 -37 -103 -96 47 129 -134 31 -71
4397 -71 63 133 -52 31 5 102 -136 103 -249 124 56 -11 115 -117 143 -126 225 -80 -124 52 127 -71 -185
4420a85K06j27P4Or1J60j40L15l72L36m37K53J44j21L8j24K08l42J71j04J97L2
4442I7m65M31j62M16j59j25q5P4j71J79R2j79M6p0J58m8M1l2j44L64l68L69k88
4465b9q2j9K18pj26P5k5K68n09N60j65l28J27m7K24k72N6k18M54k26l79R81n75
4488d4q6L6M71j86j04J4j70J44l57M02kK5m9k39L79L33p87J49M09K70J89p50K59
4511C06o5k05k07n3J28J94j41P0k73L40k44J83m2R6k20J64J05j85J46j34L85m14
4533f6J49O4j92J07k42L27j99M8m6J06o7pJ32k36L9j38K68j21J17r6m9L05r3L2
4557A42k92K68M7k14K13k48J91k86L47j70o5J07p0J99l63M54l87l7J45J36r9j31
4579a13L14k61J80k61J93j60N7r3j2K42k58J72j01J86P8l14K00j84K65k0P5k36
$$ plain form
4420 -185 21 -106 -32 -26 -117 43 -97 218 -154 182 -255 -2 142 21 59 -65 143 -199 -28 -132 65 97
4442 97 -368 63 -99 317 158 33 -52 22 -149 30 122 -57 -11 -81 77 29 70 38 -106 258 -110 259 -29
4465 -29 -111 -130 88 81 -45 30 5 273 -236 324 159 -169 -42 -89 135 -137 -81 -299 155 -71 -450 531 -44
4488 -44 -130 -94 377 191 87 101 -69 75 -282 120 118 143 94 -145 234 567 -220 -71 338 608 797 47 306
4511 306 241 36 -171 -224 -96 98 -43 27 -246 94 -150 33 -9 87 -133 31 136 -49 97 -37 348 -66
4533 -66 83 147 -45 62 -180 147 -52 -4 -50 56 -11 -18 114 -122 -83 -221 47 -74 43 -53 -102 203 110 142
4557 142 -150 118 165 -49 164 -84 107 -179 168 -2 -67 40 -30 169 -194 260 -127 -164 -19 117 18 -113
4579 -113 201 -60 120 -141 52 -108 -51 -144 -156 86 -172 0 -101 85 163 -151 49 -135 130 110 185 -51
4601e1n9P0k1K16j95K95k98J13j48j01K9J18Q3j23k1R3N7k6K03n4l91L86k76L42
4625B41m70J88R4q0J56r6N0l36M45j19j34K53r3J28j42J37m33N74m77k8L40k14
4647a6J49k73K21q1K41j89j45K23k96J32r8L74r1n2K1j18L31m87J02m1J72j9N6
4670A16j30k66L15j83K33k18Q1j04J11J58j46K0m7K83k67O9n6k21L64q0j25k40
4692c33L83k68K22J79j71M2l18K58o8K28p7j79J57k51K70j84J49n3J77n3r5Q0
4714I5Q5j19QJ18k00j0j9J49Ljk88O4K43k49J19j51j18M52j08N6l81L12j58L0
4738f8JJ70L0l03L74p8j28Q0j76K01k44M23m01J94K3Q4J3l94J15j31K88k21L34
4761A86m38L8J92jr8n6L29q8j9j41qJ52j87K53k75L75k67N7l6q5K62k97K40j5
$$ plain form
4601 -51 -110 -40 -61 155 -40 255 -43 70 -78 -179 -150 -32 51 -72 -93 0 57 31 234 180 -211 175 -101 241
4625 241 -229 -41 53 -27 129 33 83 -253 192 73 -61 192 99 227 85 222 -211 363 -114 -142 198 -16
4647 -16 133 -140 81 0 241 52 -93 130 -166 -34 -132 242 151 99 120 2 333 -154 -52 -93 79 60 116
4670 116 -14 -280 35 -148 85 -133 -52 -156 -45 113 -33 -13 -60 223 -44 25 -31 -252 112 32 -93 -333
4692 -333 50 -218 4 183 12 54 -264 -6 -74 154 77 -102 55 -196 74 -110 39 -14 163 110 15 95
4714 95 180 61 69 187 -13 -23 -42 107 110 109 -179 -115 128 -121 -2 -153 -271 181 73 129 -252 60 -98 -68
4738 -68 -67 103 133 -170 204 126 -2 78 -98 103 -141 282 -119 75 98 182 195 -199 -84 -215 73 -148 186
4761 186 -252 -214 -22 -23 -121 -177 152 64 45 -96 -104 48 -139 114 -161 214 -53 4 -32 -117 145 -152 88 73
4785G3k37J36j4N9J4j8k04L71q8j01J2N2p0J8K13l37K30k03J28M2j27Qp1K55j57
4810a6M9pn8K11j82j6o9J78k68K36L8k81M1N5R6j08K28k76K38j3r9Q8l38K96j51
4835a28K95l16Q7jK9N9o9K6j15L84l19q2M53m63K65j29R9l0L9O1j40J0N1J1j30
4860e3J14o8p3J10K7m4j66J05j3L04k08JL6j63L73l40J94k81K05o5P6j61j02L74
4884A82l05L27m02K07j79K05J21l15J22J7L3kj1m0j00K13j90L03l88M55l16J23
4906F0m7r5L36j05r2qk6j00M6J64j05j05M3J35j81P6k34J92J6j16J51q7K07k76
4930a51J65lm3M8j66K20q7R3j08K1Rk8J26k29L82n70J73O6P0O2p0K20j63L6j07
4955c4K18k75N3p1P5J04k04M4M9J10O8j81J88k85L40j92J41j71J72Ql06L48m15
$$ plain form
4785 73 -164 -28 -42 17 31 13 -191 180 92 -9 3 55 -15 3 216 -121 109 -94 34 76 -51 -43 -114 141 -16
4810 -16 33 26 -32 179 -3 -19 -88 90 -178 58 96 -185 -144 -89 7 -101 127 -149 89 76 -23 65 -273 23 -128
4835 -128 167 -149 -62 -63 -34 25 -44 -18 -133 251 -68 -150 303 -160 105 -24 75 45 84 145 5 15 66 77 -53
4860 -53 61 -7 -80 30 57 13 -153 -48 -61 243 35 36 72 -91 282 -58 136 -145 60 -5 71 -90 -192 182
4884 182 -123 204 -198 9 -170 35 156 -159 -37 -20 13 11 0 -40 -140 73 -117 186 -202 253 -63 60
4906 60 13 -82 254 149 57 49 23 -77 -31 133 28 -77 -34 101 -80 -4 -238 -46 -30 -146 5 -82 125 -151
4930 -151 14 11 -32 16 -150 70 -17 76 -32 -11 -2 -30 96 -133 249 -321 -148 -82 -12 50 -20 200 37 73 -34
4955 -34 184 -91 -38 -109 -34 70 -134 -90 -41 69 137 -44 144 -141 199 7 148 -23 149 157 -149 199 -216
4978b16J43J30j09j53P5J01j10P4J6k1m7J02N0k9o9r5L10l02M12l04J74k95P2
5001i1J39j78L02k87P3O4n8q4M7Q5p2j22J93J96j02n6k5n2N1j80K85k18N1K3J84
5026A68k20M0R6k02M17l41pj82O0J93O3P3l54J41O0q6j0p2L79k68J53j03j00L1
5050g1N0M5l19M34l26J86N2j14K2K7J44l11K28k23K88q3j21M2l5O6m7J38k73L43
5074A42R9k35J21l00J42j19K46r6j20J23j3p5R0ro0L41k14j08J47k48K10J55n2
5097A67k84L20j39j1K5m7j73K32J47l42M22m01K2K46j81L2j47L32l64K77k05N1
5119b1O8r0R1Rj2L5j3j63P8P7p5J25m95M75q1j74K76k63K90j30Q4l59K58P2lP1
5145A30j94Q9j96L11o8j52J16j57P7L2Q4j62j7J53j18R7O0O1k06K47L1j21j47
$$ plain form
4978 -216 -73 57 -52 -205 -130 -29 -139 -65 -49 -70 -117 -15 35 6 -63 -158 152 -150 262 -42 132 -163 -91
5001 -91 48 -130 172 -115 -42 22 -36 -120 -73 12 -60 -182 11 207 105 49 24 -28 23 -157 128 -90 -39 -16 168
5026 168 -52 -12 84 -118 299 -42 -49 -231 -171 22 85 158 -196 -55 5 -81 -91 -163 216 -52 101 -2 -102 -71
5050 -71 -21 24 -295 139 -187 -1 51 -63 -41 -14 130 -181 47 -176 112 29 -92 -50 -85 -19 -66 72 -201 142
5074 142 241 6 127 -173 -31 -150 96 0 -120 3 -10 -85 5 -4 -64 277 63 -45 102 -146 64 219 167
5097 167 -117 203 64 53 78 31 -142 90 237 -105 317 -84 -62 184 3 35 -112 220 -144 133 -72 -21
5119 -21 47 -43 48 57 45 80 67 -96 -18 59 -16 109 -386 89 8 -166 110 -153 137 7 91 -268 -10 62 59 130
5145 130 -64 25 -171 140 72 -80 36 -121 -44 -12 72 -90 -107 46 -72 25 85 146 -60 187 218 97 -50
5168e0P7J27j92J51k75L91k41J45J21l79l%J48j10K15k36R5J0o2J84l56L23j12
5191b9J68r9J37j92p5K66l03L46l28K20j52J29l4m0k24J21k6N8J8Q1k56K79j09
5214d4K97j10q5o8J10r8j21L38k14J86j63r8j5p2L32k90K00j41O1j15m8L7K85
5237A64l69PL74j56L6k76K85j93J94J31k52K41k51J64j2l3J8N1Pl6L3M2k0l01
5261a52K43K01m68K59l15L17K4j41N1p3o8L7J52j00J13j48R0J0j97L53k88J18
5283A8o8K14k08N4K7k65K26r0J74j95K30k19K90r7k81L23k49M41l53L5j8l6j9
5306f6K65k12m1N8O1J90k43l19J79j4L49k57L4j49J99q5Rl3j22K48j00L16l51
5329h4m7M42m19J24j8L3m2J73j02k22K87j97K42k70l5Q2p5L6j01L09j81n1O3j89
$$ plain form
5168 -50 27 154 -38 113 -162 229 -12 133 254 -125 -128 -128 20 -90 125 -111 -16 -6 -68 116 -240 83 -29
5191 -29 139 40 177 -15 -90 176 -127 219 -109 111 -41 88 54 14 -210 -89 -115 -57 -39 42 -214 65 -44
5214 -44 253 143 58 -10 100 2 -119 219 5 191 28 -70 -85 -157 175 -115 85 -56 5 -110 -158 -121 164
5237 164 -205 -198 176 20 56 -220 65 -128 66 197 -55 186 -65 99 87 54 72 123 130 94 127 169 149 -152
5261 -152 91 292 -176 83 -232 85 109 -32 19 -54 -122 -85 67 -33 80 -68 22 32 -165 188 -100 18
5283 18 -50 164 -44 10 37 -228 -2 -92 82 -113 117 -102 188 91 -190 133 -116 325 -28 7 -11 -47 -66
5306 -66 199 -13 -54 4 65 255 12 -307 -128 -142 207 -50 -16 -165 34 -51 -42 -75 -197 51 -49 267 -84
5329 -84 -131 311 -108 16 -2 31 -11 162 60 -162 125 -72 170 -100 -135 -53 -128 -92 -193 116 -65 -116 -53 -242
5353b42J76J0J42k03J58q6O7kN7j33J32l1m0K11k18Q2j62L14j60j90N8q8qJ29
5377b7q9J41k19K05j2j04K2P1J38j58k8p9K49k48M11m68L68k37J62J49k35K50
5399B62l53J98k65K27k18K89J7j9J40k36L8j14R5N2k00k2q3j6R2l0J83K4J27l73
5423a85J53j47K57j2j08j35J18O8J08J24l85J24J02J52k22Q2l11K29j6J8q6p2
5445a44N4n0N9J32l01L17J6L6l28L93j63j18L27k18J34l02L71o3k27J59jK14k70
5468B7J68j30pJ38k45K62p7O4k65R9j59O1q3J80o4J1J44n8m2n1q3R7L5L4J9j09
5494c4k62M24p1j40J09Q1k48K11o3j30K41q7J0K07l60K31j09J55j92lJ20l2q2
5517b4l3N1p1M2J01nJ5k48K13J65j96L6j09J93j6j21l7J30k58J59o3O5p6MJ85
$$ plain form
5353 -242 -66 -56 86 -117 41 -45 22 20 77 -56 76 45 5 216 -2 80 -82 232 72 -118 -60 -148 -156 -27
5377 -27 -116 25 -194 11 -1 -105 -83 -12 126 -32 -60 -139 110 -138 273 -195 173 -64 98 247 12 262
5399 262 -91 107 -158 69 -149 140 157 138 278 42 80 -34 61 113 -87 -109 -192 -208 -116 -146 37 61 188 -185
5423 -185 -32 -179 78 66 -42 -177 -59 9 117 241 -144 -20 82 234 12 94 -217 12 -4 14 -72 -144
5445 -144 -90 -140 -81 51 -250 67 83 119 -209 184 21 -97 230 12 146 -156 215 152 -75 84 83 297 27
5468 27 195 65 58 196 -49 213 136 200 -65 34 -125 -64 -147 33 -31 -20 124 66 24 -27 -110 -13 22 56 75 -34
5494 -34 -296 128 57 -83 26 107 -141 70 7 -123 118 31 41 248 -112 119 10 165 -27 -30 90 58 -24
5517 -24 -57 -6 -77 -35 66 61 76 -172 41 206 10 46 -63 130 114 -7 -44 86 -172 -13 -76 -11 -87 -83 102
5542A02l12N2K0k1O8J98L8l83N84n56K04m3J41j02L1O1nP2j35R4p1J05j53mJ64
5567A49k11J04k62M82j85J5o8k1j98J94K43m29J43N0Q7k31J85N6l21L22k9l9o0
5590b4r4J42j35L07j91l5j37K34m9k37K88j83O6N5p8K10q5J38j62L7p8L47k77
5613E9l0j24L09J98n01J55P7K02l61J37Kl77J56J49m6k27J19l9J54n7j30K24k72
5636b23K02j74L42j51L0m6LJ2q0J88r7K43o5j19J71l74K32k30J88k17J12L5QJ48
5660A38k97K58n8j34L2k5L5K47K1k23L0k6Pr2L26j58j3J34q5P1m15L90l2j59K
5685b6Q8k10N2K67j7k23J16OJ33l11J50j30K18r3J26K03j11j95M6M1j64K98l35
5708g1Q5J64j85J73j26M4kj11l0J06j23O3k25K22l0J12K7k02J35j5r1J79j29J29
$$ plain form
5542 102 -210 -158 -138 -159 -91 107 145 -238 346 -210 -6 -49 92 -10 21 82 77 149 14 108 37 142 -11 -15 149
5567 149 -62 42 -220 262 77 92 24 3 -195 -1 242 -187 -44 6 93 -138 47 103 -218 104 75 36 -24
5590 -24 -118 24 -111 196 5 -30 -167 67 18 -219 69 -114 -48 7 -71 139 54 192 30 67 -11 336 59
5613 59 29 -95 214 412 -89 66 143 345 -16 121 123 -254 -98 51 5 -222 -103 -142 12 -45 -175 49 -223
5636 -223 -21 -195 147 -4 26 -20 -17 -5 -85 103 6 249 184 65 236 -138 94 -136 52 -165 -53 -18 -10 138
5660 138 -159 99 41 -93 -61 -86 -51 196 217 -6 24 -2 5 -87 239 81 68 202 117 188 -227 163 131 -28 -26
5685 -26 62 -148 -96 171 154 -69 47 53 186 -125 25 -105 113 20 146 349 238 43 89 130 -34 264 -71
5708 -71 14 178 -7 166 40 84 82 -29 -59 47 -76 -13 -238 -16 -46 66 93 -109 26 11 -80 99 -30 99
5732I9j20P1j25M9J69p4N0j40r8J83Q6j3p1L0N5Lk32m6L90k74R5j17l3P4J87k25
5758b7M0N2q0mN0jj46Mk87L55K42l33K06j56J03r5J11r6J77Nj51Nk4L0J24Q2n0
5785A36k21J73Q4J46m41J06j50K45j9K1p5o2J03k35J40pp2K78j50K2J44j6j28
5808B2k6j83l4L28k6L2l05J99j4q4o8R6l9j30M02j78QQ0p8J01r3J8j50K03j51
5833g0P9j05j70K45M6O6j87P4q1P4L91l94K95l90K04j86J33j63K6K47k13P7j13
5856a15J87N9j2l08J05J55j81J30j75K92k42K18rj85K00k73L44k90J10k2J94j78
5878Dj09L35l67K71k47J75l1r3J10j07K26l12L71k02rp7N2j62L09l9l74J30O3
5901h3J22K46k88j72l2K79r3k1kq3l1K39J59l86J93rJ67j96j00O8k4J87nK72m87
$$ plain form
5732 99 -21 50 -75 -26 143 69 119 -21 -119 64 150 137 66 96 151 154 -78 -124 266 -8 87 -30 -63 11 198 -27
5758 -27 13 65 -15 -19 31 30 -116 -112 -399 -44 198 -135 71 -85 18 -77 34 -62 115 120 -31 -26 -50 -20 104 186 136
5785 136 -85 88 172 318 -123 -17 -167 78 59 80 5 -57 46 -189 -49 -56 -128 150 0 22 166 150 22
5808 22 -4 -187 -221 107 81 113 -192 7 -7 -91 -159 -63 -102 -232 170 -8 0 80 2 103 10 28 -122 81 -70
5833 -70 9 -96 -266 -21 25 91 -96 -22 -103 -29 362 -32 263 -127 77 -109 24 -139 -113 134 -79 -2 -115
5856 -115 72 131 119 -189 -84 71 -110 20 -155 137 -105 113 104 -81 119 -154 190 -100 10 -12 182 4
5878 4 -105 230 -137 134 -113 62 31 -62 48 -59 167 -145 226 24 15 -62 -10 -172 137 98 -276 -146 -83
5901 -83 39 285 -3 -175 -207 72 -21 -42 -44 -127 -158 81 240 -146 47 38 205 9 -91 -23 -47 140 135 407 -80
5926h0p4kj28N14l71Lp9L53l16O5J04j69J82J64o3j49k2J64m5P8j53K7q1J39k67
5951b06K88r7J73p7j67J17K2R9k22P6O6p8pJ23K5j85J21j24J9k9k2J43j66K63
5975A55l41J17m6R3j44k8J57p2N6K07k11j09J75K24k71j00n8Q2K8J93j22r2R7
5998a0M0J45j57O4k30L64j53J26k44J75p9K03Mk45K55j86P2k59L6K65k85N5J04
6021F0m9P3j93K01k42oJ83q2J5j7Oj87K72p8j0J15j73K88j12J48j54j9N1j10j14
6046a34mK42k38K26k21jL45k25J49k48J96q0J50k78R6M1K54r3r2O3l04J74K9K47
6070B94k47m00L06j12K95j56P7k98J92q1J41J18l68L40j81O4j84J13J24j14J12
6091C5k9N0k5K29k74K27j23j02K06j95L63l74m4J14j64J57l78M68pj86k8m6K76
$$ plain form
5926 -80 -154 -156 -284 230 -141 -138 -217 136 -180 -115 -11 -180 2 166 103 -46 -68 96 51 129 -24 3 -78 61 -206
5951 -206 82 -15 158 81 -86 31 53 152 -70 6 72 -6 -13 110 135 -50 71 -53 -34 -63 -85 58 -108 155
5975 155 -186 -69 -115 -22 -166 -194 -37 -109 -53 154 -57 -166 9 233 -38 -138 -196 -114 -86 107 -15 -107 -10
5998 -10 30 175 18 82 -148 216 63 189 -55 120 41 244 248 3 258 72 144 -115 -79 186 -99 -44 60
6021 60 11 84 -109 92 -150 -156 27 -55 -40 -57 -51 -238 34 -44 -54 61 -112 176 64 212 58 39 90 -20 -134
6046 -134 -138 104 -134 92 -129 -130 215 -10 139 -109 87 7 157 -121 -25 16 270 177 85 148 -156 18 47 294
6070 294 47 -353 -47 -159 136 -20 57 -241 -49 -130 11 129 -239 101 -80 -16 -200 -87 37 -77 35
6091 35 6 56 31 260 -14 213 90 -12 194 -1 362 -12 -56 58 -106 51 -327 141 134 -52 -80 -126 150
6114A50k56P5k62J38J09M1J7R7j65R0o2j69J62j06L39j12j29J40k46M11k92L1
6136Aj3R6Rk76J49q4K32j14J22j42m7k6J24J19j31J56k94P0K11J8j55r9L46j40
6160A32j08j21M9J25k9J18j77K33l65L33J0l00K17j46J24j1O2j81J21l0q2K62
6182B36j04J06k53J73l68J73L1M1J50l38L25k23R6l12K18p2K62j68k43L34r9J89
6204A54p1J00O5k61K04k04l4n2O4Q1j35k33m3L24l1k6K27q9m5m25l06O08r0m64
6228f82O42K29j54l72M27N3M2q8r6O6p8J8l1J84j91q8J81k77K53j07J03l8n9o3
6252a26M3J73J18l07j96J42QO14l27J06K20p42M48m8j58p03M16M93p15L76M68
6273C03l30m5L58k25k14O13m66K96o76M76j9k42K57l38J07p0OJ14k01r7O14l50
$$ plain form
6114 150 -106 -31 -293 -155 -46 -5 12 109 -56 34 -28 -197 -35 -141 198 86 -43 97 -149 262 -30 1
6136 1 -12 84 93 -183 -34 -118 114 0 122 -20 -67 -93 31 150 19 175 -119 -49 162 180 25 -74 272 132
6160 132 24 -97 -48 77 48 166 -11 222 -143 190 200 -100 117 -29 95 84 146 -35 86 56 -26 236
6182 236 132 238 -15 158 -210 -37 -6 35 185 -153 172 -51 45 -267 -49 -121 141 -27 -270 64 -35 154
6204 154 83 183 248 -13 191 -13 -47 -99 -35 46 -89 -322 -365 -41 -72 -98 129 40 -5 -430 -736 -128 -218 -682
6228 -682 -40 189 35 -337 90 143 185 97 1 67 -11 7 -24 160 -31 -119 62 -215 38 -69 34 -4 -63 -126
6252 -126 -83 90 208 -99 -295 -153 -145 469 142 248 468 -274 174 126 -32 -735 -319 174 -541 -165 303
6273 303 -27 -72 286 61 -153 460 -6 290 -386 90 71 -171 86 -252 -145 -215 -209 -95 -296 -393 221 -129
6295a29J28k33N67k29j43j94j59M52l9P61q09l52J03K80O3k48N6M35j54j49k08
6316b01k15M82o3J0N8Jj90N2Q5l7Q0n7j58L05k36K1P5K8k0J41l30L17j92r1K27
6341I2j58J17j16K57j12J07k64K01j25r7Q6n2K02M5o3K9j39m9R0J26l70K02k8
6364a9r4J52j3j7O3j6k30l8J62P5j95Q6M6J7O7j87K34k58K78j84J33q2R3p0j46
6389a43K98j40m7M0M6p0NP5qm7P8%N3m19L34o4J52o1Mk6q7J33k29J41q0J70j91
6416h3L2N7j53L42k11qq9R4M3R6n3j28J86j50O2k72J79r8K24L7l55K05k00M08
6440A65k59J47j53j09K17J08p7m9J15n5L0J02j04K1J10j42lJ04n1r6J3j22jj3
6464a02J96k2o5l2J43j2k23K54j97J0M7PQ8j06Rk6K0M1n1j12J19KrK2O6J04l2
$$ plain form
6295 -129 -1 -234 333 104 -39 -233 -392 60 21 782 -27 -379 -276 4 67 -181 -125 310 156 7 -201
6316 -201 -416 66 3 13 71 72 -118 -66 19 -18 62 5 -153 152 -84 -63 12 40 20 161 -169 148 -44 -135 92
6341 92 -66 51 -65 192 80 187 -77 124 -1 -98 -12 -64 138 183 120 149 10 -39 51 177 -193 9 -19
6364 -19 -113 39 26 9 72 56 -174 -212 -50 25 -170 -84 -38 -21 46 -141 93 -165 113 -71 62 -20 73 3 -143
6389 -143 155 15 -32 8 54 -16 -11 64 56 9 87 87 140 -279 55 -9 143 82 86 60 -27 106 -123 18 -62 108 -83
6416 -83 -51 6 -147 195 -16 -24 -113 -19 24 120 67 -61 125 -25 37 -235 -56 -154 70 107 -248 -43 -243 165
6440 165 -94 53 -100 -209 8 116 39 -10 105 50 80 182 78 99 209 67 64 168 117 21 34 -88 -89 -102
6464 -102 94 72 7 -25 118 106 -117 137 -60 -50 -3 4 92 -14 -5 -31 -11 30 -21 -133 -14 -12 -21 1 67 171 139
6491A39p9P1k33J65j17L26j69k55JP5L53k00l35J94L78m89K49j67K72j73K8J27
6513A61r2K0j34k6M7j8J82k65J81k31K74P1m0l0k32K11k46M89n01J97k3j8J00
6536G7l7q5Q9o1j55J99k5j15J58Q4j40j24J23K9J36j40M2Q0q0J47k16r4J13J20
6560A25m8r0L0j28J40n9j60J3J84j35j06J86j35P5Q5J77n6j03j64J16O9j87L01
6583A30k76K41j53Q8M1k12J50J8k4j48L7J09J96j31P0j16k2J41k22j5L2P1K93
6606B98k99K65l41J45L4j95Q4mL9l7q5r1K95k25K30k3k18K05j36L69k25k4j08
6629d7j19K12j26R0O7K6k75K72k53Q8J60J4j68o1o6K17j42P5Q2m7J6J63k51J55
6653H2%j5p8J09J72k83k5O2J59j40O5J14m31Q4L7P5K6o0q1J85q1l6R0k20J86M5
$$ plain form
6491 139 60 131 -102 63 -54 272 103 -152 -151 -76 277 77 -258 -64 314 -175 74 -93 179 6 34 161
6513 161 69 89 -45 -71 -24 -42 140 -125 56 -175 99 170 130 100 -132 79 -167 322 -179 18 -5 -23 77
6536 77 40 -45 44 -17 -172 27 2 -113 45 129 -11 -135 -12 17 153 13 55 135 55 202 -14 -108 5 125
6560 125 77 -13 17 -111 29 -30 -190 -177 7 -128 -234 -48 -183 -108 -23 154 98 -5 -169 -53 16 -171 130
6583 130 -146 95 -58 30 71 -141 9 27 3 -145 -108 1 197 66 136 20 -2 139 -83 -98 -66 5 298
6606 298 -1 264 -77 68 102 -93 -9 -13 26 -11 -96 -187 108 -117 113 90 -128 77 -59 310 85 61 -47
6629 -47 -166 46 -80 10 77 103 -172 100 -153 -65 95 109 -59 -120 -186 31 -111 -36 46 -1 15 178 -73 82
6653 82 82 67 -11 98 270 -13 -38 24 183 43 108 222 -209 -125 -88 -13 13 -47 -128 57 -24 -60 30 -190 -4 41
6679D1q7k35L72Q8k04J5m9J32%kQQ2%j40J7n0j59M87l88OJ77j32J3p3m4o3J80
6706hm1K33k21L0j33K71k11L0om5J90L1j31j60L35J76m19J50k99K17k3R0j71o
6730a21L2RJ10l0o0M8J34k21n7Rm7J81J05Kk19J45k7M8oq2N3j05J06n3J3J49m31
6757c15L56j30K43j14oM8k31K44j47J97j48mj5J31k95K02N1j50J29k15K22J81
6779B34j74K02m38J28nK86j45K19m09o5K22m1J37k09r4L10j99r1M53k98Kj98P6
6802i7J58k43R9Q1j80K28j84K29k16KOJ95j22M6K19k65J1O8J38r3r3r3K28j43
6826b1L3R8k46J46K16k96j23K40p1J50j57m3J8j24L26j50J08q8M4j0j18R9j32
6849a01j54K96l0N0r4J53l1N0o9j64K7K5p2j10K31r3N1M2M5O4j45O4j20J32q7
$$ plain form
6679 41 -46 -281 91 179 -25 -10 -59 73 73 71 79 161 161 21 38 -12 -171 316 -72 -66 111 -21 -8 -81 -125 -188 -8
6706 -8 -49 184 -37 -7 -140 131 -80 -50 -56 -101 89 120 -11 -171 164 340 -79 71 -228 -11 -34 56 -115 -121
6730 -121 -89 -80 30 0 -60 -12 122 -99 -156 -147 -194 -13 92 94 -125 20 -7 41 35 -47 6 -99 7 -46 -33 116 -315
6757 -315 41 -89 154 40 34 82 -149 95 -52 145 -3 -7 -22 109 -186 16 67 -83 46 -169 53 234
6779 234 60 262 -176 -48 -53 233 88 307 -102 -167 55 14 151 -58 -152 158 -41 -132 321 23 25 -173 -97
6802 -97 61 -182 -83 -2 -182 46 -138 91 -125 -123 -117 78 -44 2 221 -44 -33 35 173 80 -13 -106 122 -21
6826 -21 12 110 -136 10 226 -70 -193 47 -24 126 -31 -74 -56 -180 146 -4 104 16 60 50 -68 31 -101
6849 -101 -255 41 11 61 -33 120 89 139 70 -94 -67 -42 -114 -224 7 -86 -35 7 52 116 -29 35 -85 47 -40
6874d0lj9P7N3q1Q8j01j02J23k07J94l00L47R2j94j9J84k6j13Rm6M0L0J47k67
6899a34Q9j24J82o8l4J04k7J41k89j21L88j99J48k06M7jJ70ok18N1nN6l5L7J12
6924E8p0p1O4J09n3p8L0Rr5R5J21q9J06k19K5J58l0K3L3m7j71P6m1L7K7O3k48
6951a78L31j23nq2JJ93k18k8J09j8J41j89J26or9J3M3M6k57K63N2n2l7l9m0l9
6977i2m6n9J98J6j21Mn9N1J30j89O9J97k07J84J09k80L92n60L49p0J1j25R0p3
7001h1j6Q6J48p0j10J37j36R5M5OJ16l51L65k15k6m1P6J7p7K00j71Q5k02J59L2
7026G1L3r4p1J82j40J55r9Q1j44N2r3J06kK5o5m1n9J27L5n2j11K20o3j16J02j84
7052a45J60J14k20j4O1J32l2pj16r6J45K5j76N4J24m5L61k48j77K1J41L4L9j15
$$ plain form
6874 -40 -43 -62 15 68 -13 75 -26 -128 -5 -212 -18 -318 29 121 -73 -92 92 66 -47 -38 -84 -44 -14 133 -134
6899 -134 -45 -169 13 -55 -89 15 -12 129 -160 -281 107 -92 56 -150 -103 -104 66 60 -158 -107 -112 -56 -91 -54 58
6924 58 -12 -83 -19 90 37 -41 -11 -2 -97 -2 119 30 136 -83 -58 100 70 93 126 79 -92 -16 -57 -20 7 70 -178
6951 -178 153 30 25 -57 -56 137 -81 -109 0 -18 123 -66 60 54 -45 -32 11 57 -200 63 115 63 26 -13 -53 -92
6977 -92 -138 -197 1 17 -104 -100 -159 -108 22 -167 -98 99 -108 76 185 -95 297 -263 86 16 27 -98 -8 -81
7001 -81 -97 -11 137 67 -43 94 -42 53 98 104 220 -131 234 19 -7 -48 28 45 -32 168 -3 82 -120 39 71
7026 71 104 10 -61 121 -19 136 37 118 -26 26 -67 39 37 62 -3 -44 -103 24 59 7 -104 116 53 -63 39 -145
7052 -145 15 129 -91 -105 -44 88 56 49 -67 -163 -18 7 -169 -115 9 -36 325 77 -100 -79 62 96 135 20
7076B0Q7M7j30lN6J41k28l8p1J90O5m0k25J63r1R5N7k12K04l27L77j75K31l75
7100a82J64j5N2J33q9k4J4q5j33J17j21K97l9J31k00o7j53J76j4o5p5J83M1o7
7124b1o6R3O2l6L7Lj38M4J3J66j60pQ3p6Q6l1j65J51k52K63o3k13J15N7q2J55
7150A8j49J75J81k90K96l77R1J22R3r1K33k57J83k65j14L2J90J90k82k2L1K05
7172A93j89o9J55k04K59k77J60K11k42q2J90Mj23o6J07j72J60j85K8J49K45k58
7194fj00p7J02J45q3L4j36J42m3J42j39p9L7Lj05J64j15R3J40J23n2k35k31M22
7218A46j61K74k22K2q0M0nL5j7J11k77L04l32L63j62L5l46J38oL5L03J59l84k37
7242b64M81r5j3k27R5Jj68R0J08J3j04m2RO6J49k31N0N6qK12p5J35j34Q0j21J18
$$ plain form
7076 20 107 154 24 21 77 218 -10 -48 -119 71 136 96 -129 34 -57 38 95 -117 87 -240 137 -38 193 -182
7100 -182 -18 -33 19 152 63 39 53 -32 -165 -48 -169 128 89 220 20 -47 -200 -24 -38 -103 -178 5 46 -21
7124 -21 -87 6 68 32 69 72 -66 -22 -9 157 -3 -10 73 -3 83 52 -113 38 -214 49 -14 -227 -112 -55 -137 18
7150 18 -131 44 225 -65 231 -146 -55 67 160 69 302 45 228 -37 -151 -119 71 261 -21 -43 -12 193
7172 193 4 -65 90 -114 145 -132 28 239 -3 -85 105 109 -14 -80 27 -145 15 -170 -142 7 252 -6
7194 -6 -106 -183 -81 64 -19 15 -121 21 -22 120 -19 -98 -61 -58 -163 1 -114 -21 119 242 190 -45 -276 146
7218 146 -15 259 37 59 -21 19 14 49 32 143 -134 170 -162 201 39 74 -272 -134 -140 -105 198 357 -27 -264
7242 -264 217 122 109 -118 -23 -22 -190 -100 8 21 -83 -125 -116 -50 99 -132 -82 -26 -34 178 103 238 104 184 63 181
7268A81J2j53k22L22n9p6Q9j51rMM2J7RJ57j03j80J14o01O20j47k14J83j38l26
7292f29J109o94R9K62k34j62K98k20N64J23l29j6k15K70l36N67k47k72K55m64
7312b71J45O4L18o18L03K1j69L19l42M65Rm82O43m89K13j66%J47m38n3M49j99
7334a31L18k03k45o0K20j05R8O9O2J10k7K51o82L95O2N6l02J66j20O2M3Nn3j78
7358a89J62KL5K9j78L34q9j54K1J24j89K43o8M6q0j41L47k31kq4M1L3M7k70K90
7383G9rk20R6k15K77p2R0p6n1Q3j17J07J67q5Q5j15o8O9j85q4J49N7K92j79j45
7408g0nM4K13j62j39J78j0J8j39J67O0j43J98k18R3K8j22k30M22k94J84L7j64
7431e4j8J77J76l23K10m69L08k07J44P4n2j5M4j04J47j11j35Q5R7pj6M9rl8Q6
$$ plain form
7268 181 193 40 -182 140 81 5 94 -57 -66 -62 -20 -3 6 163 60 -120 -6 -607 13 -134 -348 -165 -303 -629
7292 -629 480 -214 -115 147 -87 -249 49 -171 393 516 187 171 -44 226 -110 457 210 -62 193 -271
7312 -271 -126 -62 256 -362 -59 -38 -207 112 -230 235 244 -238 405 -84 129 -37 -37 110 -328 -381 68 -131
7334 -131 187 -16 -261 -321 -101 -206 -108 -39 23 133 106 357 -325 70 132 188 -114 52 -68 -6 37 42 -11 -189
7358 -189 -27 -25 10 39 -139 195 106 -48 -27 97 -92 151 83 129 49 -92 255 24 22 -62 -21 12 59 -211 79
7383 79 70 -150 -54 -269 8 -64 26 -50 -101 -18 -135 -28 139 54 139 24 -44 25 -160 -244 -95 -38 254 75 -70
7408 -70 -75 -31 182 20 -119 59 49 67 -72 95 155 12 210 -8 85 113 -9 -239 183 -111 73 110 -54
7431 -54 -72 105 281 -42 168 -301 7 -200 -56 18 -34 -49 -5 -109 38 -73 -208 -123 -26 -33 -49 0 -9 -47 39
7456C9q7o1K6RK74j16N0j75J43O2j78R8m5J71j58l3r6O7O7j09J35p5M9J2j23O1
7482GO0kj63J05j42J04k2Q5O6j6m2k09J68k8J28k31J79n5J3J54r7O8O6k78J04
7507B2Q5j76P4p2P1J53o2k03n8J87J06k26J54k64J23J62K0j23K2n4J04O6k82K00
7531B9j68O4J84k09kJ49k04O0K25Q1j62ll0L82k93N4o26Q58m66K82K49m80n6r0
7555a72M95k35n6n8M6k3J22O2l04J04P5P8k99J26op6J52J1Q0j31pN7n6K03l11
7580a23J62M8L20l68j54J14m7L91m84K77r6K9q9J05k4K50L24j079R2J08j00N65
7602B21o65N52k74L53L92o00Jk63L36N6p1q5L12k54K21j66o1K13l35N2J81R9l4
7625A81k02J07j06JM6L8j54L4n2J15o0O7k21L16N9p1l01P3J31k9L47J12k86l40
$$ plain form
7456 39 -48 -109 -83 -74 200 84 134 -41 102 164 -14 84 39 210 52 19 -77 -10 57 -52 83 8 57 69 -54 7
7482 7 67 65 -98 7 -135 -31 -53 32 98 82 40 -169 -1 -29 99 -132 47 -8 5 159 62 130 196 -82 22
7507 22 107 -69 5 -67 4 157 95 -108 -166 21 127 -99 55 -209 -86 76 96 -27 -5 -59 45 111 -171 29
7531 29 -139 -75 109 -100 -102 47 -157 -97 128 209 47 44 14 396 103 157 -469 389 -77 205 454 -26 -82 -172
7555 -172 323 88 32 -26 20 -3 119 181 -123 -19 56 134 -165 -39 -45 -121 31 42 122 -9 -16 41 -15 188 -123
7580 -123 39 87 407 39 -115 -1 -48 343 -141 136 40 69 -20 85 61 311 635 -444 -352 -244 -344 221
7602 221 -444 108 -166 187 579 -21 -20 -283 53 109 38 -47 265 11 232 66 5 218 -117 -65 116 215 181
7625 181 -21 86 -20 -19 27 65 -89 -55 -107 8 -52 15 -206 110 169 98 -203 -130 1 -28 319 431 145 -195
7649a95L24k39J69j58J79K1j16j2J1P4j21J56j57K29k04J66j00R8j09j42P4Q7
7671C5J43j04o9l1J85n3k37J57p5j48K09j45N3K96k82K17k49L0K76l00J70MJ19
7694B01k31J23k55J19J39n5J3j5j3J4j69L26l60N7P2M1J66k36LJ50m1J27o1k09
7718i4J70O7j80M8j44K47j12Q9j17J25j94J00R9k09N2kJ31o5P8j33N9k0j22K02
7742G5k4J8J3j86J07p6J61l1k1N6p7k27L10m6j02K0J53k16K13p2q7k3P8j65K68
7767A19j90J12Q0m1m9jj08j0K7J05Qj66oL3J72M5Q4n0j48k01J73P4q4p1L37n08
7793b64J28O8p5m9J74m5N5j61P9J23J40j68k4J25k09mJ55R9j63k6N6Rj71J18k92
7818c22J69J02J04k1Q2k08K95l4k13J52j27n6N0m6L22k29J7m5P9r9k1M1P1j24
$$ plain form
7649 -195 129 -110 59 -99 80 101 -15 -27 -16 58 -63 93 -64 165 -39 127 27 125 16 -126 -52 35
7671 35 178 74 5 -26 159 106 -131 26 -49 -197 12 -133 -80 216 -66 151 -98 -68 208 -92 78 82 201
7694 201 -30 93 -162 -43 96 41 54 39 26 40 -129 197 -163 -106 -34 7 173 -63 -60 90 49 176 115 -94
7718 -94 76 143 -37 11 -133 114 2 91 -26 99 -95 5 104 -105 -53 -55 76 11 89 -44 15 -5 -127 75
7742 75 51 69 82 -104 3 -73 88 57 36 92 15 -212 98 52 -50 -30 123 -93 120 48 -39 -62 16 -149 119
7767 119 -71 41 121 80 31 30 -78 -88 -61 44 52 -114 -120 -87 85 130 214 164 16 -185 -12 62 -22 -93 244 -264
7793 -264 -136 -68 -143 -192 -18 -63 -8 -169 -90 33 173 5 -19 106 -103 -107 48 147 -16 -42 14 23 -148 -30 -322
7818 -322 -153 -51 53 32 114 -94 201 167 -46 106 -21 -77 -27 -73 249 20 37 -8 71 -28 -49 -8 63 -61
7842f1LJ57N6k30J67l81K66Q1j67q9J67J37k16L31l01L9P9N2j9k36J82oJ06N2
7866A69l65K28q6J38l9j06J08n5K7k29K0R1J86j89J55O8q0p1K30k33o3R8O8Mk7
7891D7j04j33M79k23j02k9jpJ11K26j85p8o4m8L09q9O3k3Ml12J13j45K60P3k4
7916A18j59R9k44J46j27J35P7K37k32n9j10J78J74k03nq6J19N5k54J19P6k20k8
7939a94J57L9j5k9LK32l43L06j96M4n7Q8M4Rq6L8Q1j88m2J75o1j24K66j58J35
7964A24k27k2R8R2J13m16L31L4K7J10m17J26O2k2n6J27p9k14J48pJ38R1k80l2
7988a51J92p1JJ25j29O7j90K59r3j13P2l6l7NK9j38J65Pm7k8K09p2o7R4J39j82
8014A0p6K53j21j36K65k26n4K01r4K19l40K71l68J33J49j56m5J89j27M9N5m0o2
$$ plain form
7842 -61 -58 99 155 -75 92 -289 -23 58 -109 -198 -31 106 -110 221 -80 -41 38 90 71 -165 17 11 117 169
7866 169 -196 32 -54 84 45 -61 47 -8 19 -210 -190 -99 87 -102 53 121 41 -30 200 -33 -96 2 70 74 47
7891 47 -57 -190 289 66 -36 -65 -66 -73 38 264 79 1 -63 -111 198 109 172 149 153 -159 -46 -191 69 142 118
7916 118 -41 58 -186 -40 -167 -32 45 282 50 -9 -119 59 233 30 25 -61 58 113 -141 -22 54 -166 -194
7939 -194 -37 2 -13 -42 -39 193 -150 156 -40 4 -53 35 79 88 2 40 121 -67 -109 66 5 -119 147 -11 124
7964 124 -103 -125 -27 65 178 -238 93 127 154 264 -153 -27 35 13 -43 84 5 -209 -61 -68 70 161 -119 -151
7988 -151 41 -30 -29 96 -33 34 -156 103 10 -103 -31 -67 -104 -99 -70 -208 -43 -36 -83 -111 98 26 -41 53 192 10
8014 10 -66 187 66 -70 195 -31 -85 116 22 241 -99 172 -196 -63 86 -70 -115 74 -53 -4 51 11 -51
8037e1L8Q1l7J65l48J53%pP9j30N0Qj73J52m4K72k64m7P7J83Mq9j90l8K19j45
8063h2L5J46K2j9j13K48k01l7k1R8n0k31J81K92k0k70J15j15R5q7q9J67l3j33
8087a02J82Jj73J31R9k1q6j99P9K2O2R7r6J39k02J07J4n6j25K85j62n8O5J01j55
8112e1Q9m7P6k18J17N0q1j26K57l0r3M1o3O5N5N0j03k4k13K90K0m5j8p1K85l8
8138A74k80KK85j36j15J65l71L22J5J75j63k6P9M3r4j59K34j49K0L9r0j69J14
8161h5K05j45L1n2R7J91k49J50j04m0L3l8l5j0L2m1K8J0R2m8J43k6k49M7K26k33
8187g0L5q1J15k4
$$ plain form
8037 -51 -13 68 31 196 -152 1 1 -6 73 -57 -7 1 -172 -20 -64 208 -56 -103 -26 157 161 72 -118 -156 63 -82
8063 -82 -47 99 121 102 -11 237 36 -1 -22 76 26 -205 -24 268 248 -22 93 -22 73 -14 -103 64 31 -102
8087 -102 80 81 -92 39 138 117 31 -168 -89 -67 -5 92 -4 135 -67 40 54 -2 -127 158 -4 -62 3 104 -51
8112 -51 38 -9 67 -151 -34 16 -65 -191 66 36 -57 -16 -79 -14 41 91 -12 -36 -249 41 61 16 -2 -73 212 174
8138 174 -106 -104 181 45 -70 95 -276 46 61 236 73 47 126 169 75 -84 150 1 21 60 -30 -199 -85
8161 -85 120 -25 6 -46 51 242 -7 143 39 -1 32 -6 -41 -51 -19 -60 -32 -22 70 22 165 139 -110 -63 163 -70
8187 -70 -35 -116 -1 -25
8191b5
$$ Imaginary data points
##PAGE= N=2
##DATA TABLE= (X++(I..I)), XYDATA
0@%%%%%%%%%%qJ6j6J6k4L2m0N6o5P4r4J17j37J62j94K26k64L10l58M13m77N46
32B91o24P09q01R07j024J149j287J440j609J793j992K213k454K716l002L310l649
49a914M024m434M882n376N925o533P211p975Q839r826J0968j2305J3897j5829
63h446J8229k1313K5446l1329M0525n7903J51863k87735K91006J2430l22727N07601
75C17647l11817j42466K56993k08072J04384J47210l20092J26461K6336k7102
85c0518J09013p3045r8320M7763J18666n7218M0414p7206o4890J90976j02133
96C502O3901k2461j84480K27038k9202j35463K20316k65524L2623K66393l31655
107a55012K17933l4713k40195L46920j66256m9320J93195k17172O7502J38893
$$ plain form
0 0 0 0 0 0 0 0 0 0 0 0 -8 8 -8 8 -16 16 -24 32 -33 41 -53 64 -73 89 -105 121 -143 167 -191 222 -255 291
32 291 -333 376 -425 482 -542 607 -680 760 -849 944 -1048 1165 -1289 1427 -1575 1735 -1914
49 -1914 2110 -2324 2558 -2818 3107 -3426 3785 -4190 4649 -5177 5791 -6514 7383 -8446
63 -8446 9783 -11530 13916 -17413 23112 -34791 117072 -170663 120343 132773 -189954 317647
75 317647 5830 -136636 120357 -87715 16669 163879 -156213 -29752 -3416 -30518
85 -30518 78495 5450 -92870 -45107 73559 16341 56755 -20451 -85341 105635 3502
96 3502 67403 44942 -139538 87500 58298 -77165 143151 -122373 -89750 176643 -155012
107 -155012 62921 28208 -211987 134933 -31323 -80643 112552 -104620 -37118 101775
117A01775j53170R2360m730p6447Q5776j7263K9905m4872J2972j7902O81O8169
129G7254q2003M1818n5249j1919Q5090n8378J2892l2152n4384J12410l7274k8308
141c0203O2822j75903J56506N0009j61465J61707j46773N710J72027j29276K6297
152h542N515q4916J28248L547p8880M5866o8879O1824M3205l8115j5088m7670
164e3885Q2218j5215J3304r818o2806N5131J2729P926k0600l3522K4763J2851
176A3076r587L1226p4265K3195M2916p4534R2008q2919n320P9668j03113P1305
188C656K571p0393O9957j9049l8253P5886m9454O607K7312n1382O5367k4946M748
201B627J495k1510K7641M92K0587m2578K329J5353L999J6191k3814k8268K2632
$$ plain form
117 101775 -51395 40965 36235 -40212 45564 28301 58206 13334 26306 8404 9085 77254
129 77254 -4749 37069 -18180 -30099 54991 -3387 9505 -22647 -77031 35379 -1895 -30203
141 -30203 32619 -143284 13222 63231 -98234 63473 -83300 -77590 94437 -34839 -8542
152 -8542 -3027 -87943 40305 43852 -35028 10838 -58041 3783 46988 8873 -6215 -53885
164 -53885 28333 13118 26422 16604 -46202 8929 21658 29584 8984 -24538 225 13076
176 13076 3489 34715 -39550 -16355 26561 -47973 44035 -38884 -44204 35464 -67649 3656
188 3656 6227 -64166 5791 -13258 -51511 24375 -25079 -18472 8840 -42542 22825 -2121 2627
201 2627 4122 -17388 10253 10745 31332 -11246 -8917 6436 10435 26626 2812 -25456 -2824
214b824J2629P30J1656p5103N4571P859k2638N3863q5620K5193L7084j9787K2614
227B0227l0285k3962M9934k404j2999J6812n5982M4637J3416j6095r4k8970L0333
240D568p784J8626k2490j4745J8564n97J3462j9415p463J0493J2546j5882J8639
253H522k7254P376L2549l7765K7579k6626J4155J8819k6004J2678q613K171J3995
266A1582j0k7034J9174m409J0891J452k7208K1254j3197K5052j1124j2769L50
279e996M420K4365k5151L574r369Q020J3361j093k0621P8J2675j566J8948m2119
293b0474J8835K016m352K4983l6165L473R212J0267o487l265j4577J3237J3440
306A0143j3802J0630k7376K0870Q824k666j0011n899J5553p053K0693k6279O20
$$ plain form
214 -2824 9805 10535 22191 -52912 1659 9518 -13120 40743 -44877 -19684 17400 -2387 20227
227 20227 -10058 -34020 15914 13510 511 17323 -38659 5978 19394 3299 3205 -25765 4568
240 4568 -3216 15410 -7080 -21825 -3261 -3858 9604 -9811 -17274 -6781 5765 -10117 8522
253 8522 -18732 -11356 21193 -16572 11007 -15619 -1464 17355 -8649 4029 -4584 -2413 11582
266 11582 11572 -15462 3712 -697 10194 11646 -15562 5692 -7505 17547 6423 -6346 -5996
279 -5996 -1576 22789 -2362 1212 -8157 -137 13224 12131 -8490 -8412 4263 2697 21645 -20474
293 -20474 -1639 377 -3975 21008 -15157 -11684 -2472 7795 1308 -1957 -16534 -3297 10143
306 10143 -3659 6971 -20405 465 9289 6623 -3388 -9287 6266 -787 19906 -6373 -5753
319e753Q322L771Q403j9964j196N573J2767j4336J0030k3603P524K5044k4077
332g495J0103k0273J3649R630n529l985o559M182Q797J2915k9576J1630j69R264
346F584N094j6403L913p162K2923r808k810j3791P113J7673j7658O843j7393N461
360i421J0769N207j8687j778N918L665J7254k9610J4491p394R362J9468k3444
373d200O12L152J4842l237K281j5676O967R009p65M538k5214J3559R91O116j2538
388D37l296J960r122K3372k2955j068J068J890N958q587m553L684P531r428J5460
403B351k3732J2365J4711j5514Q978j4023J6463o39K335l811q296R542R225L185
417A3140j8811O210j141J7871n361p476m175o419L1558j2798m001j6560P359J8477
$$ plain form
319 -5753 2569 6340 14743 -5221 -6417 -844 11923 -2413 7617 -15986 -8462 16582 -7495
332 -7495 2608 -17665 -4016 5614 85 -3900 -10459 -6277 2520 15435 -14141 -2511 -2680 6584
346 6584 11678 -4725 -812 -7974 14949 5141 2331 -11460 -4347 13326 -4332 2511 -14882 -9421
360 -9421 1348 6555 -12132 -13910 -7992 -4327 12927 -16683 -2192 -9586 -224 19244 -4200
373 -4200 -3588 -436 14406 11169 13450 -2226 4741 13750 12985 17523 -7691 5868 6859 12975 437
388 437 -2859 -899 -10021 13351 -9604 -10672 -9604 -7714 -1756 -10343 -14896 -11212 -3681 -13109 2351
403 2351 -21381 -9016 5695 -9819 -841 -14864 1599 960 3295 -516 -8812 730 9955 13140
417 13140 -5671 539 -602 17269 11908 4432 257 -6162 25396 12598 8597 -7963 -604 17873
431A7873q739K276k2199q23J9423Q784k3156j263q711J0723K1308k5292O077j9688
445b3407J6513J9886j4344l262r311J4493N112P010r785o100P53J8218j386j3217
459A173J0752j8007J7860l644j280k974j0746J5854j4487R621m655k404L940q026
473g023K948J3484p965l401J4164k8766L4924M669k3179J4076j5555J6653Q372
486B3401l516j6013n185P838J0822J174k3174q151J428K1124r529r36k4577p397
500c2691M1125j1298k08j9547Q1K0222J1390P300k6899k380K4774J2274k807K959
514B4295l1470K2800K2596j8648J8451l8756O074K6530j3077k496q127j3816K655
527b989K1777j6617q302m170P77J060J2011l751k1455K2025j5282J7701O810j9497
$$ plain form
431 17873 9134 11410 -10789 -11612 7811 16595 -6561 -7824 -16535 -5812 15496 -9796 -3719 -23407
445 -23407 -6894 12992 -1352 -4614 -13925 568 5680 12690 2905 -3195 -2442 15776 14390 1173
459 1173 11925 -6082 11778 8134 6854 3880 -6866 8988 -5499 4122 -533 -2937 1003 -7023
473 -7023 -4075 9409 1444 -1957 12207 -16559 18365 23034 -145 13931 -1624 15029 23401
486 23401 19885 3872 -1313 6525 17347 18521 -4653 -12804 -11376 9748 219 -717 -25294 -32691
500 -32691 8434 -2864 -3072 -22619 -22538 -2316 9074 16374 -10525 -12905 11869 24143 21336 24295
514 24295 -7175 15625 38221 19573 38024 -732 5342 31872 18795 16299 8172 -5644 -2989
527 -2989 18788 2171 -6131 -10301 -9524 -8464 3547 -204 -21659 366 -14916 2785 9595 -9902
541i902J5778j1311O810J2072L86r707l156K38J2899L90j602p816k5002L9997
555B0074p560p960N961l2156K2093J4492l735r143j1748l194K5516Q633j7145
568D128r535o007J9315Q615R399l7369l600K9634r525K1162k5578j9997J7342
581b016J3751M502j2884j8052K145K0050K393J595k7017P041Q102P138J4287l7205
595a6170J4458K453j087J9552j5018j2965Q274O842j419P479j5981J486r39R118
609F083L127j1940Q793j8697J7680k37m330J1456k2218M844J1834J881j695l604
623B977j5494J3133R596P39o573k3118K0774k542J3028m734k7433J1947K804J4686
637I790k892k0087o893J7320O358M588j1160k0058J8038Q137J3418k0538p693
$$ plain form
541 -9902 5876 -5435 1375 13447 13833 4126 970 1208 14107 14497 12895 5079 -19923 20074
555 20074 12514 4554 10515 -21641 452 14944 11209 2066 -9682 -12876 12640 21273 4128
568 4128 -5407 -11414 7901 16516 25915 -11454 -15054 14580 5055 26217 639 -19358 -2016
581 -2016 11735 16237 3353 -14699 -12554 7496 9889 11484 -15533 -8492 -390 6748 21035 -16170
595 -16170 -1712 741 -346 19206 4188 -8777 -503 6339 4920 12399 -3582 -2096 -3035 6083
609 6083 9210 -2730 6063 -12634 5046 4809 479 11935 -10283 -5439 6395 8276 6581 2977
623 2977 -12517 616 10212 10951 4378 -18740 2034 -508 12520 7786 -19647 -7700 -4896 9790
637 9790 6898 -13189 -20082 -2762 3596 8184 -2976 -23034 -4996 3141 16559 -3979 -11672
650a1672O337M203K3605k0263q216o12P978J5039o470j5896R12O130L258J2488
664A6821k4363L741K138J564J1845j7768O494o657L705P764m677k828p72J269
678a724n02O502p001O241r404M028M070m443J0208j3791M999n382R278N820j2320
693c421O41l694Q399N842k293j4335N248J066J1797O13k1257J0927o767J4894
707G660K517j5356k269L51J3897o02n468j1902O033M924Q792o044j3666O847N35
722c751J5436j1719l623j287J649J4114q170j833p910R323N067k460m176k324
736a664K177K518O630j5373Q752m588K900N009j3500R925n497K824L08k636k947
751e162N988N02o368M707n992J0673n502J238k400j926J0336m247K838j1156Q926
$$ plain form
650 -11672 -5335 -1132 22473 2210 -6006 -6618 1360 16399 9929 -5967 -5055 1075 4333 16821
664 16821 -7542 -3801 -1663 -99 11746 -6022 472 -6185 -2480 5284 607 -2221 -2993 -1724
678 -1724 -2226 4276 -2725 3516 -5888 -1860 2210 -2233 7975 -5816 -817 -6199 3079 8899 -3421
693 -3421 -2780 -6474 1925 7767 5474 -8861 -3613 -2547 9250 9863 -11394 -467 -7234 7660
707 7660 10177 -5179 -7448 -7097 6800 6198 730 -11172 -5139 -215 8577 2533 -11133 -4286 -3751
722 -3751 11685 -34 -3657 -4944 -3295 10819 2649 816 -7094 2229 7296 4836 660 -1664
736 -1664 513 3031 9661 -5712 3040 -1548 1352 6361 -7139 2786 -2711 113 421 -2215 -5162
751 -5162 826 1328 -5040 -333 -6325 4348 -1154 84 -2316 -4242 6094 1847 4685 -6471 2455
766B455K493r0L96r186M790K740N643q539j152m852J0645L98q868N338j4065J4146
782B292J568o145k742l475O963K310k40r190N410l082J0690k070r857N632p30
797b666R208o893J623n372M406P149o368R83q115R609J23j711m036l37N52L449
813A604L441j4346Q828l719O877r69r367P259l937Q156k188l663l795Q762J440
828D383k808Ro558J0110k970M815q002k534P190n68L149j1961N691j881M087J616
844C768q250q93K595O308o013Q80p667Q678M08j865K727j2711J2667m62O81m398
860c547k121N029J388L137o560P48j638J0848m816l196N82j206R235p153N018
875E748r428L987P219n655J62n635M770K65J734o249Q89k780N139K874j2327P741
$$ plain form
766 2455 4948 4858 5254 -3932 858 3598 9241 702 -450 -5302 5343 5741 -3127 2211 -11854 2292
782 2292 3860 -2285 -5027 -8502 -1539 771 531 -8659 -3249 -6331 4359 2289 -7568 -1936 -2666
797 -2666 6542 -351 1272 -4100 306 7455 1087 2070 -6045 3564 3687 1976 -2060 -2397 -1845 1604
813 1604 5045 -9301 -473 -4192 2685 1716 -7651 -392 -4329 3827 1639 -2024 -5819 2943 4383
828 4383 1575 1584 -4974 5136 2166 6981 -1021 -3555 3635 3067 6216 -5745 -54 -1935 2152 3768
844 3768 -4482 -5375 -2780 3528 -2485 -1605 -9272 -594 -186 -2051 676 -12035 632 170 851 -3547
860 -3547 -5668 -639 749 3886 -2674 -1926 -3564 7284 2468 -728 -146 -1352 7883 730 5748
875 5748 -3680 307 7526 1871 2033 -3602 1168 1433 3167 -3082 -2193 -4973 166 3040 -9287 -1546
891a546m980O978j793l769K576l237J0002m198j120k313O035J890rk708k382O143
907E569j570P718j3984K757M089j046N338j3272L572j476M405J945p931n513O414
922b985M104k930K015j2715J0521J379L184k99j2206J0340J262N708n887k208
936g17J76K458P664o033m727j494P056l712M543q870k058O784o168J0139j3140
951h099K369M978m233M853l503M39J248K482k159M703n403P207j373o843J1629
966H295q068O778l473l277J929p8N370o597j547l877O077J931k105o506p91K877
982c062M239O498j9012P391P02L698R272j4948J059j62Q609M719o860q645M907
997a595M400N063q19j5708P744j882J0614j690j4258N666k050Q886p22m841o766
$$ plain form
891 -1546 -6526 452 -1341 -5110 -2534 -5771 4231 33 -1087 -3400 2635 4525 4516 1808 -574 5569
907 5569 3999 11717 -2267 490 4579 3533 8871 -4401 -829 -2305 2100 4045 -3886 -9399 -2985
922 -2985 1119 -1811 204 -12511 -1990 -611 2573 2274 -9932 408 1670 7378 1491 -717
936 -717 -541 1917 9581 3548 -1179 -2673 4383 671 5214 -3656 -5714 1070 -5098 5041 -8099
951 -8099 -5730 -752 -4985 -132 -3635 -3196 -1948 534 -1625 3078 -2325 4882 3509 -3334 8295
966 8295 227 7005 3532 255 2184 2106 7476 879 -668 -4545 1532 3463 1358 -5148 -5939 -3062
982 -3062 1177 7675 -11337 -3946 -3244 454 9726 -5222 -4163 -4325 4284 9003 2143 -6502 -1595
997 -1595 2805 7868 7049 -8659 -915 -2797 7817 6127 -8131 -2465 -4515 4371 3649 -1192 -7958
1012g958L732P378m17k016n990K278J036R601r025N21o88l546J3948j1906M377
1027A325n97n673O256R4j104O5j815l279P098l774O942p879l850Q799n505J1404
1043H507q883l231J348J831Q423m094n879m483P899K873L557r455m605K073Q191
1058D072O611j5881L198p251J0142J0572j3088j549o018P980J0309l914j1383
1071f200J717L99J0467L309j4874L094m551J3005P41q060l00o378J0627J901j505
1086C392o790j740L465N502j149m480j172l167J0725n668L032l870l886R299p934
1101d441R079l462n261K836J6K171L516m799m862N583l091J0988p478n097L103
1116a199k505J1634n164k514o222L310R061j168l599p340J523O239P002q689k547
$$ plain form
1012 -7958 -4226 3152 2735 719 -5271 -2993 -1957 7644 -1381 -860 -1548 -5094 8854 -3052 1325
1027 1325 728 -4945 1311 1405 301 366 -1449 -4728 2370 -1404 5538 -2341 -6191 2608 -2897 8507
1043 8507 -376 -3607 -2259 -428 7995 3901 -1978 -6461 1438 4311 7868 -1587 -6192 -4119 4072
1058 4072 10683 -5198 -2000 -9251 891 11463 -1625 -3174 -9192 -1212 9097 5183 -6200
1071 -6200 -4483 -4084 6383 9692 -5182 -2088 -6639 6366 7107 -953 -1253 -7631 2996 4897 3392
1086 3392 -3398 -5138 -1673 3829 2680 -1800 -2972 -6139 4586 -1082 1950 -1920 -5806 3493 -4441
1101 -4441 4638 1176 -4085 -1249 -1233 938 4454 -345 -5207 376 -2715 8273 795 -4302 -1199
1116 -1199 -3704 7930 2766 252 -5970 -2660 6401 5233 1634 -5706 -4183 2056 9058 369 -2178
1131b178n724P593J0927j1123J634j0518O744J0165l457l977q186M870P010K771
1145F551p456k029l835R983L676p299J225q782J1012M39j037j429p044N934J484
1160A393K997n464j601j36L575l50O83k439l938Q104p086O645k421l131M407o354
1176e116P171q04n73k493k18Q52M190K53m566m6k576J0151m455L78l547m460J0706
1193D847j812J044p383m36M346M102o39o396j376P82Q504k547j674q416N167O281
1209D394l466M192j2700M625N751N27r67o281M99M076M034m661M79o125O606K460
1225C443l357Q08o281P244k375K664k229l291L529k80K018m174K396j053J770
1240H32j540M97m35J46M040p219N628l305L080J639p129N081j791K514O2k096
$$ plain form
1131 -2178 -7902 -309 10618 -505 1129 -9389 -2645 7520 4063 86 -8100 -3230 3780 6551
1145 6551 -905 -2934 -6769 3214 6890 -409 816 -7966 3046 3485 2448 1019 -6025 -91 1393
1160 1393 4390 -1074 -2675 -2811 764 414 1097 -1342 -5280 2824 -4262 2383 -38 -3169 1238 -5116
1176 -5116 2055 1251 678 -1815 -2033 -1181 3009 3262 -1304 -1350 -3926 6225 1770 2148 -1399 -5859 4847
1193 4847 3035 4079 -3304 -3740 606 4708 4069 -2327 -3703 -2921 5583 3036 1362 -7054 -1887 4394
1209 4394 928 5120 -7580 -2955 2796 3323 2356 -3925 -3426 650 4684 23 502 -5623 983 3443
1225 3443 86 894 -5387 1857 -518 2146 -83 -3374 155 -125 1893 -2281 115 -938 832
1240 832 -708 -211 -646 -500 3540 -3679 1949 -1356 1724 3363 -3766 1315 -476 2038 2100 4
1256Dm136N351P79j336l05o100O828j955L601l973l754L882N21M566p033P15n84
1273b929L761K264k940k504o83N968j054J753o933L919J287L98L792r629M844
1288A314M92J753l23l839K43J953J817k769R64n467O494p89k189M72l819N494
1304A801k811K253m030ML167n71O79m277K960k95K698k643j16j564K602L873n761
1321b031L426m706N675O21l284J866m043N118O24j070l781K366j29K691p71n048
1337b476M009k981O159m074j986R10K3M093m189R03k946L447J407r72k577o68
1353a918L582q40K465o199L425j251K288K079p300M480j744L232j079k642K16
1368a206J065J723p09q99l843O333k372J339j230k671N027k313L479m978Q62K147
$$ plain form
1256 4 -4132 1219 1998 662 357 -5743 1085 -870 2731 -1242 -4996 -1114 -593 3973 -3060 -2345 -2929
1273 -2929 832 3096 156 -2348 -3031 2937 1883 3636 -3297 622 1909 2307 6099 -3530 1314
1288 1314 1806 3559 3236 -603 -360 1593 3410 641 1605 -3862 2632 1843 -346 126 -3693 1801
1304 1801 -1010 1243 -2787 -2783 384 -187 492 -3785 -825 -1120 1578 -1065 -1181 -2745 -143 3730 -2031
1321 -2031 1395 -3311 2364 2985 -299 1567 -2476 2642 3266 2196 -1585 781 652 3343 2572 -2476
1337 -2476 1533 -1448 4711 637 -1349 -439 -416 3677 -512 391 -2555 892 2299 1327 -1250 -1918
1353 -1918 1664 824 3289 -2910 515 -736 1552 3631 -3669 811 -933 2299 1220 -1422 -1206
1368 -1206 -141 1582 873 -26 -3869 2464 92 1431 201 -2470 2557 244 3723 -1255 -393 1754
1384A754M69P64l606J279l22L025k433m8l063L116J967m145K268n425N536o66
1400D70j087m18l748M582Q13n52l395J277n58M654j623l263J534j601P182m172
1416I5n27j221O30M719k860J026m282K669K341P59l099q33J33J673L231n830K457
1433A081l338M036J850n073K541l269L593j26r26j699L73J010Q15n73k716L699
1449A278l783L922k694m91K277k874L869m636K381N22j50N64k299P11J189J670
1465A456k174O61l785N827J68k767J739n737O758k81j32k429k955M074K247k8
1481B642m051n15l11O290k039k033k466q38P473l524R76m918L23M792j44P11n852
1498c484N78K848K900k156j154l208L194L621l337K088o150M468J537j466J967
$$ plain form
1384 1754 2223 2987 -619 660 338 3363 930 882 -2181 935 2902 -1243 1025 -4400 1136 470
1400 470 -617 -1035 -4783 -201 612 60 -3335 -2058 -2616 2038 415 -2848 -1314 -2915 4267 95
1416 95 -432 -1653 -1023 3696 836 1862 -2420 249 2590 3349 250 -583 -450 1223 4454 -1376 1081
1433 1081 -2257 1779 3629 -1444 1097 -2172 1421 1295 369 -1330 -957 53 868 295 -2421 1278
1449 1278 -2505 1417 -1277 -1768 509 -2365 1504 -3132 -751 -229 -379 185 -2114 -1403 -214 1456
1465 1456 -718 -57 -3842 1985 2153 -614 1125 -4612 2146 1865 1733 -696 -3651 423 2670 2642
1481 2642 -1409 -1924 -2235 4055 2016 -17 -2483 -3321 4152 628 1604 -3314 -2991 1801 1657 2368 -3484
1498 -3484 -2906 -58 2842 686 -468 -3676 -482 3139 -198 1890 -4260 208 1745 279 2246
1513B246m577K058O61J306p80nj826J690J82o11K681m437L025k428J774J418k297
1530H0J606m462L873L07P87j341k857R56K320J409j909r30m772P214m66l32q87
1547E96o384O739Q38J419l256m100K471M330R01l312k555j572P108m98j43m184
1563a602k265N986O4K437o342o28J745L256K220n803p53K52L488J178o36n667
1579c070K519K132o61L545p076K685O4P75K569l391j31q05K352r1R79k495N91
1596D91r04J371K267l307K134m368K823J226o2K33m470K216K26L114j651k671
1612a332j247J944K501M64k114n721N640q9L084j673o837L716J679L846k447m108
1628b694q65M030K965j278k634l527M449J261K901n115k402K875L97M992n033
$$ plain form
1513 2246 -2331 -273 388 1694 914 909 -917 773 955 344 3025 -1412 1613 -815 959 2377 80
1530 80 1686 -2776 1097 1404 2191 850 -2007 -1051 1269 2678 769 -161 -4933 2281 1815 1483 596
1547 596 -5788 951 1789 3208 -48 -4148 -1677 2653 3554 242 -2313 -3885 3223 2725 2582 -1602
1563 -1602 -3867 2119 2183 4620 -1722 -2350 -605 2651 4871 -932 -1685 -1433 2055 3233 2597 -3070
1579 -3070 -551 1581 920 4465 -2611 74 138 913 3482 91 -40 -845 1507 1416 2395 -100 491
1596 491 -413 958 3225 -82 2052 -2316 507 1733 1671 1904 -2566 -350 -124 2990 1339 -1332
1612 -1332 -2579 -635 1866 2330 216 -5505 135 46 3130 1457 -5380 -1664 15 3861 1414 -2694
1628 -2694 -3559 471 3436 2158 -476 -4003 446 1707 4608 -507 -2909 -34 363 5355 322
1643C22j983k13L163K249k332j838j692L100Q10R91m204J228n83J160K599n098
1659b321L109k756J306J934j631Q9p96K02m18K336j528P29k241P87J473k54K098
1676B118m695K091l42J973J659l889M59l90L284J23o98l612J310J846K125j058
1692B304m531J635n81N186j831m739P69J10M542j433k669j736J156K098J454k298
1708e64l533K651k50L882l779l26j1J44M194l501N79j705K179J582n21q77p32
1725e88J363j4K155l463K200j287J077O28k200K919l112K147r58p23J276l87n28
1742E05p59N15n99K399k988O26q79M86K574l260J013k269K483J102j167k67k294
1759b779K192Q90Q63k608R4k95K832N98k692O46k082M629j131q80n95j572M196
$$ plain form
1643 322 -1661 -1874 1289 3538 1206 -632 -2324 776 1586 2577 -1627 -399 -982 178 2777 -2321
1659 -2321 788 -1968 -662 1272 -359 -270 -1066 -864 -1282 1054 -474 255 -1986 -1199 274 20 2118
1676 2118 -2577 -486 -828 1145 2804 -1085 -626 -1016 2268 2391 1693 -1919 -609 1237 3362 2304
1692 2304 -2227 -592 -1173 4013 2182 -2557 -1788 -1678 2864 1431 -1238 -2974 -1818 280 1734 -564
1708 -564 -4097 -1446 -1696 2186 -1593 -1919 -1930 -1786 2408 -1093 -514 -2219 -40 1542 1021 144 -588
1725 -588 775 761 2916 -547 1653 366 1443 2071 -129 2790 -322 1825 867 144 1420 1033 505
1742 505 -254 261 -338 2061 -927 -301 -1180 -694 1880 -1380 -367 -2636 -153 949 -218 -485 -2779
1759 -2779 -587 303 1166 -1442 -1348 -1643 1189 1787 -905 -259 -2341 2288 1157 277 -318 -1890 2306
1776B306r37l36j553L37O61K316j795r94P24j087L724l211P10j115M81K514k825
1793h0J066j800J642j7m01q73m40N44L11L59k706K829j869J919n22k225K604j708
1811a367K757k166J2M89P79O39n77l85o30K747j536J626k577N46K127j604J768
1828B648l380J521L35M19Q5k340J033J08J240j779J48j663K259N0p50L24k777
1845b519L668j484O57j105j130K132n98Q16j923M60J34J761j601j98N4l84K841
1862A581k868J519j719J650J445j935J033j837K353N9j28j143L40K75J286j58
1878A753k364K275j955K491j325j382P00r52K656j890k81j098J292N38o51r21
1894a114j31J666p31J567l202J212O83K58J423l670K021l20J571j33j830J98N12
$$ plain form
1776 2306 1369 1033 -520 -183 478 2794 999 5 729 -358 3366 155 865 -250 231 2745 -80
1793 -80 986 -814 828 811 410 -463 -903 -359 -48 311 -2395 434 -1435 484 -38 -2263 341 -1367
1811 -1367 1390 -776 -764 -275 504 1143 566 181 -449 2298 762 2388 -189 357 2484 880 2648
1828 2648 -732 789 1124 1543 1628 -712 321 429 1669 -110 38 -1625 634 684 -66 258 -2519
1845 -2519 1149 -335 322 -783 -1913 219 -379 437 -1486 -1026 -892 869 -732 -930 -876 -1260 1581
1862 1581 -1287 232 -1487 163 1608 -327 706 -1131 1222 1281 1153 10 350 625 1911 1753
1878 1753 -611 1664 -291 2200 875 -507 193 -759 1897 7 -274 -1372 -80 458 -193 -1114
1894 -1114 -1245 421 -310 1257 -1945 -733 -50 208 1631 -2039 -18 -338 1233 1100 -730 -532 -20
1911b0J089q55M05k538K540k92J63P0l044L583j416J547j510r27R38M23J133j740
1929d51k0j61J633q83J71j021n2K217j977J727k577J573N1q09R71j724J757o78
1947b53N21j412J367j715J701K73j227J304j559K543j849k21M95n63K651k001
1963E5j56q08K159j99j71j134l98J663l48J820l921J741J36Q54R56l113Q23r33
1981i74J958p5n92j581M80J390Q12om123K807n34K082o46k586J496q96K700q95
1999H17r78m05l60K325n98l17r36J298l30J242j856O28K94j223K601k958J803
2016A047r21j12O79q98R59o20k84n22J487q77J445j640p19J357o13K761k357n06
2034c34R8J004K059k322L2o29J243R34J98k254n38P81J449J240m019J040o50J861
$$ plain form
1911 -20 1069 214 619 -1919 621 329 492 562 -2482 1101 -315 1232 -278 -1205 -267 156 1289 -451
1929 -451 -471 -632 1001 118 289 -732 -784 1433 -544 1183 -1394 179 230 -579 392 -1332 425 -253
1947 -253 268 -1144 223 -1492 209 482 -745 559 -1000 1543 -306 -527 -32 -595 2056 55
1963 55 -101 -909 1250 1051 880 -254 -652 1011 663 2483 -1438 303 439 1293 2249 -864 -41 -974
1981 -974 984 909 317 -1264 -784 606 1418 1412 -2711 96 -438 1644 998 -1588 -92 -988 1712 817
1999 817 -161 -566 -926 1399 801 484 -452 846 516 1758 -98 530 824 -399 2202 -756 1047
2016 1047 126 14 693 -205 754 134 -150 -672 815 -62 1383 -257 -976 381 -232 2529 172 -334
2034 -334 -236 768 2827 505 537 -92 1151 2085 2283 29 -509 272 1721 2961 -1058 -18 -668 1193
2052A193J897l028k18j471K386J090q14k418N7J026K020k10l185J168q83L025
2068A635l98j858K10r76K774o52K56j585j44J233Q02j20j061K41m27K131j944
2085A17J449j011j295K484k114K227j406p17N62l75J006m91m83j133J224m73K006
2102A577j959o79O23m12L037k191L0j439R60K279r09o16j901J488O88J656k131
2119A01q46m58J802J865k528J82k563K887J624j407n48j994J742J521L48j988
2135b60l70k50K360L50j892N93j941K962l88k05r59j644K300m42O49j379l99k47
2153a162J073j32m02l28j115J824j043J539j169k65O92p83K245j424N57o71r1
2170f55J117N40k73p56L28q37K840j472k93o27n92K638j190K83j867M13J227L71
$$ plain form
2052 1193 3090 62 -156 -1627 759 1849 1035 -1383 -1326 -300 1720 1510 -1675 -507 -1390 1635
2068 1635 1237 -621 -411 -1387 1387 735 991 -594 -738 495 1297 1177 116 357 -70 2061 117
2085 117 1566 555 -740 1744 -370 1857 451 -266 296 -79 927 436 -47 -1180 44 -429 1577
2102 1577 -382 -1061 -438 -850 2187 -4 26 -1413 -453 1826 917 301 -1600 -112 576 2232 101
2119 101 -745 -1203 599 2464 -64 118 -2445 442 2066 659 111 -1883 -141 1380 1728 -260
2135 -260 -630 -880 1480 1830 -62 531 -1410 1552 1164 959 0 -1644 656 214 863 -516 -915 -1162
2153 -1162 -89 -221 -623 -951 -2066 -242 -1285 254 -915 -1180 -488 -1271 974 -450 107 -564 -655
2170 -655 462 1002 729 -27 301 -536 2304 832 539 -88 -680 1958 768 1051 -816 -403 824 1195
2188A195m75j473n6L77K025j849n8j488J111J551p37J28k545J693N70Q58o76j842
2206a691J206N26R93p73o26r17J842j65P8n1k067K511p68O91o25j152J017J21
2224A50O82r04K13o60O98k21K83J66r60J305j273J235q37N33K3j077J342j124
2242d26J370j408p6J49N03K63k68p67o34J874j120J096j499o13J842o17J017j768
2260a082M41J35J275O0o82m22k70J796m14K97j814R54N08J42M05k196J669r58
2278a56J294m78j288K73J56P36o86P6j089J517n53M72l40j064J591j037J066p66
2296b76j65N99l63L90r38P26m13M60n17K68l32J15J007j616J097j240J418p2p80
2315f32M73p42J424n52K90p15P85l5N83l62p89R32p55J355j336k0K42n56J400
$$ plain form
2188 1195 720 -753 -809 -432 1593 -256 -314 -1802 -691 860 123 251 -2294 -601 -31 827 151 -1691
2206 -1691 -485 41 1034 261 -365 -1282 560 395 473 422 -1645 866 98 789 164 -988 29 150
2224 150 832 -72 141 -519 179 -42 241 407 -553 752 -521 714 -123 410 433 -644 698 -426
2242 -426 944 -464 -540 -391 112 375 107 -660 -1294 580 -540 556 -943 -1556 286 -331 686 -1082
2260 -1082 -641 -506 769 829 147 -275 -545 1251 837 1134 -680 274 782 924 1329 -867 802 -156
2278 -156 1138 660 -628 -355 -199 537 -149 -73 -1162 355 -198 274 -66 -1130 461 -576 490 -276
2296 -276 -441 158 -205 185 -753 -27 -440 20 -497 -229 -561 -446 561 -1055 42 -1198 220 148 -632
2315 -632 -159 -901 523 -29 261 -454 331 296 879 517 -272 660 -95 1260 -76 -96 146 -410 990
2334I90j486O75j187R60R1k77m84r0O72k02P72j737J326n72Q21K13j388J250n83
2353b36R61m74l13Q8Q1M95n64K31j016J408p71L76n57n03J169q42Q81j385N00
2372d71K58J85K25j054N73j95R03p62N40q63P88K95n33N13j345J427m57M7J76
2391B50j067J261l96L81p92J77q0P03m75k46K26o79J752j512N81o64J63Q43o40
2410b14K76r21R54m9L11n26j87M31J23O55j314J051r26J077j69n63N15j114J725
2429A135p03j20n20K64K87k4j22p63Q42r49J269j066K06L12n97J220j375N87j94
2448c11M57J7l16K40j50Q32q98M97q67J028k03k37K38j098J409p61O68p93l48
2467e96Q50k38K62p43K0p4J388q29O6m23j07J496r47N72j418N86Q63j29J12j176
$$ plain form
2334 990 -496 179 -1008 -48 43 -234 -718 -808 -136 -338 434 -1303 23 -549 272 485 -903 347 -236
2353 -236 725 251 -62 26 107 602 38 269 -747 661 -110 266 -291 -794 375 -467 414 -971 -471
2372 -471 -213 -28 197 -857 -284 -479 424 -338 202 -661 127 422 -111 402 -943 484 27 74 250
2391 250 -817 444 48 429 -363 -186 -266 437 -38 -284 -58 -737 1015 -497 84 -580 -417 426 -214
2410 -214 62 -859 95 46 357 -169 -356 75 198 853 -461 590 -336 741 572 9 524 -590 1135
2429 1135 432 312 -208 56 343 319 197 -566 276 -673 596 -470 -264 48 -549 671 -704 -117 -311
2448 -311 146 163 -153 87 -63 769 -129 368 -499 529 326 89 327 -771 638 -123 545 -248 -596
2467 -596 254 16 278 -465 -445 -519 869 40 106 -317 -424 1072 125 697 -721 -135 728 599 711 -465
2487d65P60k32J014p08j66m76M51Q41r70N52j408J383q1j21J71j307J283l34M22
2506F09o93K0j54M27l44L51J38j146J482j175P72l32l06O32r18Q05j50K99m55
2525a38QK22J49P45r33M12p42J316l69nl61q69J589o75O48j471jM98K39L24j051
2546d65m78J14J200n68L11j190R0J536m23O52j610L92Q80L41L08j177m8K82J133
2565A280n32j40j035M49N54j27K45j570R36l83P61k04r40N16l82P79j55n1k75
2584b74N59k89M29rn97P72q44J290n29m69N06r27O46l00O39p91j05l80M98L88
2604B13m19m9j140J530m63P91q65r41J065M3J244j386j67l9P97P46p83l87m74
2623f84J291j78Q48j591j65Q83J13N16j428L67o26J253K14p20l99m35J063l7M21
$$ plain form
2487 -465 295 63 1077 369 203 -273 178 1019 49 601 -807 576 495 374 545 -762 521 187 609
2506 609 -84 -64 -218 209 -135 216 354 -792 690 -485 287 -45 -351 281 -637 168 18 317 -138
2525 -138 -130 92 241 986 53 465 -277 1039 670 665 304 -565 1024 349 997 -474 -475 23 262 586 -465
2546 -465 -943 -829 371 -197 114 -1076 -986 550 127 779 -831 -439 441 782 1090 -87 -135 147 1280
2565 1280 748 608 -427 22 576 449 694 -876 60 -323 438 234 -706 -190 -572 207 52 1 -274
2584 -274 285 -4 425 416 -181 591 -253 1037 508 39 545 -382 264 -36 603 -188 -293 -673 -175 213
2604 213 -206 -255 -1395 135 -328 463 -402 -1343 -278 -235 1009 -377 -544 -583 214 960 177 -210 -684
2623 -684 607 429 1277 -314 -479 404 517 1033 -395 -28 -654 599 813 93 -306 -741 322 285 706
2642G06j594N52R3L27N29j283O26o70J220k98l17J15m14Q10l14K05o59M25m07
2661c48N29N4k94L63j016J138n20N78j40q71O46k32N90m51O6p59N19L10K84l56
2681I0r00Q25m37J240p75n19N0J09J186p43k34q21Q99N48M7o34p17O10R4Q97j312
2702d97K63k74L47R07r50J06o59R51K81R2n84l16N29P1N01r85M74n12N82K71p85
2723a87M51n83P12n58K59j65j62L67k89M05o97M87o15Q31m74K13M13p60P83p75
2743c44O68k02j24O4j99K09q2L82p92M10m73Q44k48q25L26k41J041n97J25n19
2763e77RJ043o59L15n67L05K16M89m42l64K10r9R53p15K32p39N04M85p03L50r60
2784g14O62K11o2l83O2j51K05O58r81N89o22P63k41j32L83p05R94o65K67l70M03
$$ plain form
2642 706 -888 -336 -243 84 613 -670 -44 -714 506 208 -109 6 -408 402 88 293 -366 59 -348
2661 -348 181 235 -59 304 -712 426 -94 484 344 -527 119 -113 477 26 92 -667 -148 162 446 90
2681 90 -810 15 -422 818 43 -476 -426 -317 869 126 -108 -929 -30 518 565 -69 -786 -176 -82 815 -497
2702 -497 -234 -508 -161 746 -204 -98 -757 194 475 567 -17 -333 196 267 768 -217 257 -255 327 598 -187
2723 -187 264 -319 393 -165 94 -71 -233 134 -155 250 -447 40 -575 256 -218 -5 408 -352 431 -344
2743 -344 324 122 -2 62 -137 72 -10 372 -420 -10 -483 361 113 -712 -386 -627 414 -183 -58 -577
2763 -577 -568 475 -184 131 -436 -131 85 574 132 -232 -22 -121 832 117 349 -390 114 599 -104 246 -714
2784 -714 -52 159 97 -286 -224 -375 -170 488 -493 96 -526 237 -4 -136 247 -458 536 -129 138 -232 171
2805A71J02j76lj72O24n78L34p08M74P1k34L86q69N19k00M34j71l65K72j53M72
2826B30n35J96m35O74j73j21J02p58J095n75N85m82n1N70k80M99p76M31m64Q07
2846E39k91l71J4l26J150q91M03j055Q34M6k95K88o84Q71m90K92l57J54J81qJ98
2867B02m90O31o06Q71o13M8K26l74Q80p12O9k36L16N5j00k7m56N70m07M90q66
2888e29M80j62J56L43r50Q66n86M87k80N4q6K5O01k89Q6r61J037l33M53m40k71
2909b99N97o46R01q99L31j91J95K22m92J78m81P86m81M49m91O7M88k69N23r47
2929d59O19k71K18L24p72L47j55M76o23M29m27M15k90j00M54o52R95o95L11l15
2949a71r8N49m07N80m98L33j13K35l43o0KO9L65q15M16n75O19n8m94L58l40N78
$$ plain form
2805 171 273 97 94 -78 546 -32 302 -406 68 139 -95 291 -578 -59 -259 175 4 -361 -89 -242 230
2826 230 -305 -109 -544 130 -43 -164 -62 -820 275 -300 285 -197 -248 322 42 541 -235 196 -268 539
2846 539 248 -123 -109 -435 715 -176 227 -828 6 52 -243 45 -639 232 -258 34 -323 -169 12 4 202
2867 202 -288 343 -263 608 -5 43 269 -105 775 63 132 -104 212 267 167 140 -316 254 -153 337 -529
2888 -529 -49 -211 -55 288 -662 204 -382 105 -175 -121 -207 -182 419 130 216 -745 292 -41 412 -28 -299
2909 -299 298 -348 553 -346 -15 -206 -11 211 -281 -103 -584 202 -279 170 -321 -254 234 -35 488 -459
2929 -459 160 -111 107 431 -341 6 -149 327 -296 133 -294 121 -169 -269 185 -467 528 -167 144 -171
2949 -171 -269 280 -127 453 -45 288 175 410 67 7 9 78 443 -372 44 -531 88 30 -464 -106 -446 132
2971A32l30J61m35K72J02J80J28p65P95k15P57p50l17M07j22N43n32J21n60M03
2991b5K77k58j82m38O98l52N98r21L68o0o6O63r58Q74p74P66J12j97J89l37O29
3012F06l31L52n64L31k81J13pn54P92j019P52m69K62J88n92L16n94N75j40M09
3032A45n70K78K03K61K15j010O84l58R13j92o69K15m72J073n52J27q87K11N14
3051A29K62j96q72N36n37J211q61J66r5l73J074l79N9p96M21L19M51m41l07O3
3071a66rQ38r68L25m57L29L99n94N12p83O41k14K52r7k34J81j27M64l81P11r79
3092c57N16j44N2N15p93M46l91M64q8j9j84l31O24k23K87q98L58j59O08K53p37
3113b01L19p55J119l29P2l64k68O08k4L80p77J16k43Q64j06o63J5l94J266o57
$$ plain form
2971 132 -198 -37 -472 -200 -98 82 210 -555 240 25 782 32 -285 122 0 543 11 132 -428 -25
2991 -25 252 -6 -188 -626 72 -280 318 -603 -235 -295 -361 302 -656 218 -556 210 322 125 314 -23 606
3012 606 275 627 63 394 113 226 219 -335 457 -562 190 -279 -17 171 -421 -105 -699 -124 -264 145
3032 145 -425 -147 56 317 532 -478 206 -152 761 569 -100 115 -357 716 164 291 -596 -385 129
3051 129 391 195 -677 -141 -678 533 -328 -162 -257 -630 444 65 124 -672 -251 68 519 78 -229 -166
3071 -166 -175 663 -305 20 -437 -108 291 -303 209 -574 67 -147 105 8 -226 -45 -172 292 -89 622 -357
3092 -357 159 15 67 582 -211 235 -156 308 220 201 17 -314 310 87 374 -524 -166 -325 283 536 -201
3113 -201 118 -637 482 153 225 -139 -407 201 177 557 -220 -104 -347 517 411 -252 -237 -631 635 -22
3133b2K15n67j49R28l70M11q77K26j21O43p0l19n8k49P10m30O20p66J04K54j17
3154dK95p65N86k47M55r1J7k17l45L16O6K74l42J93l12R5O71q73N61r82N66K08
3176A25J96l87m20M48m5N71p89K99n72R37J40o01K80o66Q54k03M13n17l69K00
3196a06J02P83q37n0l74O35Q1j73m10l33J011l70K95p75J80j18L89N39p21J68
3216h4l94O83k01L16o03O7M54l70N56n85K56r2n4N78n30K19o23M40J4K38j32j39
3238A4J53l90O96p76N07n80L37J14r0N18p92M49k07O08n30j29QM2O53o12L41q91
3260e57P87p9N0L42q64O59m31O11j53m13l1P4K25k61K56o61P33n69M50j49m21
3281d02O16n15O77o67L33p3n8M66n93L81n32O96l41M57o83K33K42k83N26q79Q11
$$ plain form
3133 -22 193 -374 -523 405 35 446 -431 -205 -326 317 247 -72 -130 -379 331 -99 521 -245 -141 113 -4
3154 -4 291 -474 112 -135 320 229 246 29 -316 0 66 340 -2 191 -121 -26 645 -228 333 -649 -83 125
3176 125 321 -66 -486 -38 -83 488 -301 -2 -574 363 503 -98 182 -484 370 167 580 63 -306 -106
3196 -106 -4 779 -58 -108 -482 153 234 61 -349 -682 329 -41 254 -521 -341 -459 -70 469 -252 -84
3216 -84 -478 205 4 320 -283 -216 238 -132 424 -161 95 3 -51 527 -3 216 -407 33 47 285 153 14
3238 14 167 -223 473 -303 204 -376 -39 75 -15 503 -289 160 -47 561 31 -98 -90 -48 605 -7 334 -557
3260 -557 230 151 201 543 -321 338 -93 518 365 -48 -79 -5 220 -41 215 -446 287 -282 168 19 -402
3281 -402 214 -301 376 -291 42 -31 -89 377 -216 165 -367 329 -12 445 -238 -5 237 -46 480 -399 412
3302D12m70N5J72m51N19m96M54l81K38k37L19o9k07K89l93Q04q56N13l24L83Q8
3323C62m64L32l48N41l30J04k49J73j77L5M71q67N41m21N36j75k90L74p06R68
3343D10n46J00r2J60J90l28N35p64N79l83N82o27M0L76m43N14o23L57j96J15l2
3364g6p9k0p3K58k92K69l67N51j62m0K26n03P26l96J66k36j30M90n04N02n71R1
3386a70p0L96k20j5k0l24P99p70P09o22L34J63K1j2k82N12j63N2l07K04r1j07
3408A7M12m38R1m08M95m50P8J17k53M86m25K32k06J09N3O3j7l66O72l22N24o34
3430a70K73j11j9M67n44M02l58R6O0k48J77j84K82m45M25l51M4q5K34k34j36M00
3452b5m35P13l90L5J63j61N68o33L41l31O74m56K98k04j08M38p87N81o94M98o0
$$ plain form
3302 412 -58 -3 169 -282 237 -259 195 -186 52 -185 134 65 -142 147 -246 558 -298 215 -109 274 362
3323 362 -102 230 -118 423 93 197 -52 121 -56 -21 450 -417 124 -297 239 64 -226 148 -558 410
3343 410 -136 -36 -128 32 222 -106 429 -335 244 -139 443 -184 -144 232 -211 303 -320 37 -159 -44 -76
3364 -76 -155 -175 -248 10 -282 -13 -380 171 9 -31 195 -308 418 22 188 -48 -178 312 -192 310 -261 -170
3386 -170 -240 156 -64 -79 -99 -423 376 -394 315 -307 27 190 211 199 -83 429 266 318 11 215 124 17
3408 17 429 -9 82 -326 169 -281 -203 -86 -339 147 -278 -46 -252 -143 -90 -27 -44 -410 262 -60 464 -170
3430 -170 103 -8 -27 440 -104 298 -60 36 96 -152 25 -159 123 -322 103 -248 -204 -289 -55 -289 -425 -25
3452 -25 -460 253 -137 -102 61 -100 468 -165 176 -155 519 63 361 157 49 487 -300 281 -413 85 25
3473B5p7r7l37L43K9K15k40Nj02L2M53l36J92k21N83m99K15J27n68M85k72M81
3495D36n58K67j97K36p7j73J34m90L00j60L90m36k5M56m31L41j68L08m88M27m2
3516E0L7J38k46J29l36L40l33L39j73l81O07m64M88o26J29K10K5J37l76L27k95
3537b74N65k02O6k31p5M34k98K95m70L92j76K28J75n33K22k58N03n73K42l53L31
3558A0J44kO7n97N27j89K97j69j11J17j21L91o11M89n49K21P7K21k11l26L45j49
3580a29M26k82J09r4k15N43l45J78k98j6k2L90j04j72k01K7O06m97L37n11m1O39
3602C28l76M20p13L01r2K93P1k68j06j96M54j1O6m12J10L53j7J48n69L76m26O79
3624D13j80j76k5j59L41l04M99o43L40j72M41k51k87K15l36Q35l85j34o4j07M21
$$ plain form
3473 25 -52 -149 -486 -143 -114 101 -139 -134 -236 -204 249 -87 105 -116 467 -32 183 310 -258 227 -45 436
3495 436 -122 145 -52 184 107 -66 68 -422 -122 -282 108 -328 -353 103 -328 13 -155 153 -335 92 50
3516 50 87 225 -21 108 -228 112 -221 118 -55 -436 171 -293 195 -431 -302 -92 -67 70 -306 21 -274
3537 -274 291 89 155 -76 -151 283 -15 280 -190 202 26 254 429 -104 118 -140 363 -210 32 -321 10
3558 10 154 152 219 -378 149 -40 257 88 -23 94 -27 364 -247 242 -307 -86 -9 212 1 -325 20 -129
3580 -129 297 15 124 30 -185 358 13 191 -107 -123 -145 245 141 -31 -232 -205 401 -96 241 -270 -311 328
3602 328 -48 372 -341 -40 -132 161 232 -36 -142 -338 116 105 171 -241 -131 222 205 353 -216 160 -266 413
3624 413 233 57 32 -127 214 -90 409 -234 106 -66 375 124 -163 52 -284 551 166 32 -32 -139 282
3645B82k74M6l32J55KJ34L5j65P7m01P60j70L6k30l47K88j9L00m29M40m30M28
3667A86m2k26K09m12M61l78L89l24p3M6M3N61n43K40l73K21J85j93O9m25N27k9
3689A19L82r31O20l71J58L05m48L81n20N30j4q4k12n0K08J7J83l51J11j34K42
3710A41K29l53J93m63M29j42O6k01M1j2K13K66o31K82k77K57O6j6Q3o95O88l76
3732b12L03p9j85J39m2M03l56K00l84K13J40J91j98m70K58k04N77l01m1k4JK69
3754A98m75L66o26Q46m23K37pk66N0k2N41l71J50m51M54J54l37K51n18N16l58
3775i1L06k06N1J54k84L67n06L65n12N27j06r8P0l69N01k87L31j02K3k00P6K19
3797B29j44L56o67O81q18O91j13j65J6l04N98n76K19j67J10J8j1J32k90J58j66
$$ plain form
3645 282 8 54 -278 -123 -121 13 48 -117 -40 -441 319 149 185 -45 -392 -104 -123 177 -252 188 -242 186
3667 186 144 -82 127 -285 176 -202 187 -137 -210 -164 -121 440 -103 137 -236 -15 170 -23 46 -379 148 119
3689 119 501 -430 190 -181 -23 282 -166 215 -305 225 211 127 -85 -135 73 90 273 -78 33 -101 141
3710 141 370 17 210 -253 176 34 100 -101 -60 -72 141 407 -224 58 -219 38 104 88 171 -524 164 -212
3732 -212 91 12 -173 -34 -76 327 -29 171 -213 0 140 331 133 -337 -79 -283 294 -7 -48 -72 -71 198
3754 198 -277 89 -537 309 -114 123 116 -150 -100 -122 419 48 198 -253 201 355 18 269 -249 267 -91
3775 -91 215 9 60 214 -70 297 -209 156 -356 171 65 -33 37 -332 169 -118 213 111 134 -66 10 229
3797 229 85 441 -226 455 -363 328 215 50 66 -238 360 -216 3 -164 -54 -36 -47 85 -205 -47 -213
3818b13K07l33P8M76m07M90m74O98p12J90L4j54N86o27O7J34J59m30J07K5J18
3839A9J82n33M67n73N26k12J00J94l33L29j38J51l09J94m9j38K32j3K5j42K71
3860B50k99J1R8j61L65n51K41k16P0k3O4N3l0Lj44N80o13M37K9k44K83k39L98
3883C62m11K44r6m7pq9J12j69J0j02K08l67L59j71j87N45m69M11k83M8j2R1m2
3906f2k00K26j45L27j17K03l40K75n1l37L89o03L88J1K77j99l29K90j81K63k23
3927a38K07k05J39k14J60L7l27O74l64K21j90r1K25k53M11k99J36l6j44k8J22
3948D3J72l69M12m80K27k55K99J42l79L64m26N81m03J96k83J09L05j95j1l03L86
3969A32k49K72m5j62K22n42N98k04J63n55M22j1j22J15m42M45l37L05j87P1Jn9
$$ plain form
3818 -213 -6 -339 -261 215 -192 298 -176 522 -190 0 34 -120 466 -161 -94 40 199 -231 -124 -99 19
3839 19 201 -332 135 -438 88 -124 -24 170 -163 166 28 179 -130 64 15 -123 109 96 121 -21 250
3860 250 -49 -38 60 -101 264 -287 -46 -262 -192 -215 -151 -98 -128 -125 -269 311 -302 135 164 -80 203 -36 362
3883 362 -49 195 99 52 45 -44 68 -101 -91 -193 15 -352 7 -164 -351 194 -275 136 -147 -99 -111 -20 -62
3906 -62 -262 -36 -181 146 29 232 -108 167 116 -221 168 -435 -47 -36 241 42 -287 3 -178 85 -138
3927 -138 69 -136 3 -211 -51 -14 -341 333 -31 190 0 -91 134 -119 292 -7 129 93 -51 -79 43
3948 43 215 -154 258 -222 5 -250 49 191 -188 176 -250 331 -72 124 -159 -50 255 60 49 -254 132
3969 132 -117 155 110 -52 170 -372 226 22 185 -370 52 41 -81 34 -408 37 -300 5 -182 -111 -110 -169
3991a69L91m10L32j17P2j26Q5J48j36P5k22L78m48K01o9Q8J55m27L47l12L71k83
4013g6m7J37k65K41oJ97k88K30k76L8O4M7J15r6L16l04o1Q5p4k16J18J89j50J55
4037G3j77L16l39K98nm35M11m79P15l93k85J90j61N72o52N77n45K58J26p0K8j07
4059h4K10j91K54k50K27l16J34K09l41K65m92M08J5L1oj86j38N0M23l79K48l29
4081b38K19j69J25K22m50N68l75L84k47k6q0K2L13l21N8l76N69m52L74J62m61
4102a79N5q9M69k50j28Q3o3K24j60J28k12K02j92L92j79r0K60m70L14k51J38m8
4124d6k38L05k69M61l17J77k51K69lJ0j83p7L18j92L00n19R3J18J49N9l95K99
4146F8j07J69J08j57j39l42N73l28L63m23L88j37L3J26j82Qj29J94o4K18j53j09
$$ plain form
3991 -169 222 -188 144 27 99 -27 58 206 70 145 -77 301 -147 54 -15 73 228 -199 148 -164 207 -76
4013 -76 -123 14 -251 -10 -16 181 -107 123 -153 -115 -51 -4 111 15 331 27 -34 51 -23 -239 -121 68 -82 73
4037 73 -104 212 -127 171 166 -269 142 -337 378 -15 -300 -110 -271 301 -351 226 -319 -61 65 -5 23 -84
4059 -84 126 -65 189 -61 166 -150 -16 193 -148 117 -375 33 48 79 73 -113 -251 -201 222 -157 91 -238
4081 -238 -19 -188 -63 159 -291 277 -98 286 39 13 -67 -45 268 -53 5 -371 198 -254 120 282 -179
4102 -179 -124 -213 256 6 -122 -39 -102 122 -38 90 -122 80 -112 280 101 11 271 -199 115 -136 2 -46
4124 -46 -284 21 -248 213 -104 73 -178 91 88 98 -85 -162 156 -36 264 -255 -162 -44 105 164 -231 68
4146 68 -39 130 238 81 -58 -400 173 -155 208 -215 173 36 69 195 13 21 -108 86 22 240 87 -22
4168b2J73kK10l81Mk07K63K39m35L24l48L84j48K3q1j26J26K4M65o98J29j06L21
4191A31k00o3M9k01K95k63M00k93m4J29O5Ok23J22k91N45k24J31k22J35J6mJ95
4214A91m62L06N8k08L12j45j24L1NJ16P8r0j07J15k01K15k64L46l33J70P6m33
4236c48L77l40M67j47J31k01J48o8Q8Q4k98L35m05K45j81J75L0m38N15l37L20
4257A52j91o3J21j80L56m0k22N9J9j18J10p3n3J99j54K95l86K37j27N3n6O3J0
4280A1r6L92m82J75lm9n3M8J42j91K17l14J19M0J48P4n06M15k69L29l65J89J1
4303a8K3R2k79L96l24K11j54J11M2k58K58n9J62j04M8r0j11K65k41K52l99K16
4325C9L1o3J00L7q4k92M42k09J04j59N4K22j49Q6k07J52m53M73j84m5j21M4K70
$$ plain form
4168 -22 151 149 359 -22 -18 -225 38 277 -158 166 -182 202 54 77 -4 -130 -4 20 485 -213 -84 -190 131
4191 131 -69 -132 -83 -284 11 -252 148 -145 -189 -60 5 11 -212 -90 -381 164 -60 71 -151 -16 0 -4 191
4214 191 -271 35 93 -115 197 52 -72 -41 -36 80 158 68 -39 76 -125 90 -174 172 -161 9 85 -348
4236 -348 29 -311 156 9 140 -61 87 19 107 191 -107 228 -177 68 -113 62 92 -346 169 -168 152
4257 152 -39 -102 19 -161 195 155 -67 -8 11 -107 3 -70 -123 76 -78 217 -169 68 -59 -6 -62 1 11
4280 11 -85 307 -175 0 -3 -52 -105 -57 85 -106 111 -203 -84 -44 104 178 -328 87 -182 147 -218 -29 -18
4303 -18 5 97 -182 214 -110 101 -53 58 100 -158 100 41 203 99 147 57 -54 211 -30 222 -177 39
4325 39 70 7 107 144 60 -232 210 1 105 -54 0 222 73 159 -48 104 -349 124 -60 -105 -226 -182 88
4348H8l18L06j2m9P3j17k1j95K83p4L9n0m7J52p0M7j48L12k22K41l68K85j9m11
4372b95M38k41P9k26M43k34p5Pl5K63n53O01k21R3j71P0K51l65K30k12K22k65
4394a96K14j7K8J2l0K76m42K36q4N3J35k42J53j92K53k67KJ80j7M7p7J92l14K19
4418A22P4q8j13p5J29l24L04J8n2M8K7j12j69M27m33M31l37L0k9j14L52l95L94
4441A15j92K47k91J9J56k05K19j48K07q0K9L0K09k65j99K84m08M71l72L84j71
4462C9PO6k52K97p5K3k96M36l00OJ83j71K32k99K21k80J00K65k88o8j53M07m02
4485c02J08K21J84K27q22L53k41L93k92N48k55k33K82k68l0j08M00j42K86n37
4505b28L03k59%J59o3L81l36M39m07j06K76m12L46j47M7Q7J6k3j4lj24L79m79
$$ plain form
4348 88 -230 76 64 15 88 -29 -50 -245 38 -36 3 -47 -94 58 -12 35 -113 199 -23 218 -150 135 116 -295
4372 -295 143 -98 -19 -245 198 -36 -111 -104 -139 124 -429 172 -49 44 -127 -57 194 -171 59 -153 69 -196
4394 -196 18 1 29 41 11 287 -155 81 -3 50 185 -57 96 -96 157 -110 -108 72 55 102 25 217 -97 122
4418 122 196 108 -5 -80 49 -275 29 47 -5 43 70 -42 -211 216 -217 214 -123 -93 -122 -236 116 -279 115
4441 115 -77 170 -121 -102 54 -151 68 -80 127 47 76 106 315 50 -149 135 -273 198 -174 210 39
4462 39 46 112 -140 157 82 105 -191 245 -55 -49 134 -37 195 -104 117 -163 -63 202 -86 -154 -307 100 -302
4485 -302 -194 27 211 438 -384 -31 -272 121 -171 377 122 -111 171 -97 -127 -235 165 23 309 -228
4505 -228 75 -184 -184 -25 -88 293 -43 396 -11 -117 159 -253 93 -54 -7 80 96 73 59 56 -68 311 -168
4528a68L09k43Q4l2j04K72k24M60n35K81r0j59J80j19L14l00K78l19R3R0J8N4
4550A40l33K93J2jk5K1m5k21J32k35K10l9K23k08Q8p2m7J68l09K63k21J66J4O
4574b0L17l86K3J84l15L3J51j06o5J18q1M34l56J93j92LJ76j35R3j85K7O6N5M4
4598G6k50L29l00O2j0L01l08P2J28k59K89l20L33o1j13J96k56J10j00J51j99J72
4620D3p1R4J22k91K33j85O3l38N30j64J07l81K14l1o4L5J8Po3J27J28o5j15l8
4644h5K56k66J15j24J10M7l8Q2l64K57J67m3j40lo3l8K96l34K23k89J95L1k25
4667b33K27j39K52j91J28P6r8J3o1K07l03K62p0o3o4P7L69m01J20j78O6K34k19
4690A1N4r7q8J63k0k28K09l9p9N8m9K13k57P1j0J49j8j05P9nJ44k22q7K21M3k43
$$ plain form
4528 -168 141 -102 -18 -50 -154 118 -106 354 -181 100 10 -149 31 -88 226 -74 204 -115 -22 68 86 140
4550 140 -193 100 112 111 86 107 62 -159 -27 -262 -52 -91 132 -76 12 -60 -107 61 -248 15 -206 -40 -26 -20
4574 -20 297 -89 -66 118 -197 -164 -13 -119 -184 -66 -147 287 -69 124 -68 -65 111 -24 69 -116 -89 -23 32 76
4598 76 -174 155 -145 -83 -93 208 -100 -28 100 -159 130 -190 143 82 -31 165 -91 19 -81 70 -129 43
4620 43 -28 66 188 -103 130 -55 8 -330 200 36 143 -238 -24 -55 -119 -84 -66 -59 -122 5 133 68 -47 -85
4644 -85 171 -95 20 -104 6 53 15 97 -267 -10 157 114 -26 -29 -92 -130 166 -168 55 -234 -39 -8 -233
4667 -233 -6 -145 107 -84 44 120 22 35 -26 181 -122 140 70 7 -57 20 389 -12 108 -70 -4 230 11
4690 11 65 -32 -120 43 23 -205 4 -35 -114 -56 -105 108 -149 -78 -88 61 43 -62 17 12 156 -66 -153 68 111 -132
4716a32K07L2l05J04l0J47n5j58K38Jj7j88J41j24J80J0j16K53k79K11k58O0J76
4739I8j12j7j99M31l76J81l0L8k14L52l39P9R8r7L52l11L97m30J01O6j37Q4p1
4762e6K40k47L7J67r4NJ01J0k49L39l63k0P6K25M3m71K18l1J44o7r7J86k21K35
4786A10k6n6k81J68p8J35o0O3J05k44M19l84mk1J40J44l83K99j72K34k00J04j3
4809aj18Q6j11L60l63L24k15J96j97q9K87k54J73J1O8m08K93q9P3K17k90K25n17
4832c39M66j31O4q5j85K94j41J85ml92L16r4P3M5J16k32J58j85m5J75k68J52Q4
4855B7lj68J57n3M2J32l42L29l02J13N6J00Qm66L62L0J05n8R0j47P9j61o1L47
4879B16k72J10j14K22k92N7q2Q7K13j61K09k79k8R3j45o1K52r1q6P2k43M92k40
$$ plain form
4716 -132 75 107 -198 -94 -124 23 -32 -190 48 49 32 -156 -15 -139 41 51 -65 188 -91 120 -138 -78 98
4739 98 -14 -31 -230 201 -175 6 -24 14 -200 152 -187 -108 -10 -107 245 -66 331 -99 2 68 -69 15 -56
4762 -56 184 -63 -26 141 47 52 153 163 -86 253 -110 -130 -54 171 214 -257 -39 -70 74 7 -90 96 -125 110
4786 110 84 28 -253 -85 -163 -28 -88 -25 80 -164 255 -129 -133 -154 -14 130 -253 46 -126 108 -92 12 -1
4809 -1 -119 -33 -144 216 -147 177 -38 158 -39 -128 159 -95 78 89 157 -251 42 -47 26 243 -47 178 -339
4832 -339 127 -4 60 -25 -210 84 -57 128 124 -268 48 -46 27 72 188 -44 114 -71 -116 59 -209 -57 27
4855 27 24 -144 13 -40 2 134 -208 121 -181 -68 -12 88 96 -370 -8 22 127 69 159 12 91 -70 -131 216
4879 216 -56 54 -60 162 -130 -73 -155 -68 145 -16 193 -86 -114 -21 -166 -227 25 -66 -152 -80 -323 169 -71
4902g1nR1p1L72m05P1n4J10j07J02J83m84J42l2L02k13R5j07J16R2k56K02j11
4925c8P8l3J6j50k7K42l6K07k84J84j01o8J0K1J62l84L15P7l3NP7l20J2J24k61
4950b05K61K2r0j2n9J15j18J10q2J15n8j52K3r9K96j34J55r0Q2q0n0K10n0J6k79
4975a53L38j85P1o4N4mj65RJ3l1M9r0K34p9j7j48J61PJ12k00J97N0k21J22k27
5000a67J15M8J8P7q5O0j11L69l41J26J7p5o1k25P0J2K07p0j78k9Q6K06k52L42
5024A59l11J96j95K55j58K44j36j65L18l32K30L1or0j20K23k60M30m29J52K9j39
5046g4J16m9M3j66L27j66L2j10QJ91j76K85l62K24k09J04j86J09j2L48j23Mj18
5069D0Q6k34K53k18L50l57K06k21L58k88j8J03l1J97k80K50k11J88q7J06k57q9
$$ plain form
4902 -71 -76 15 -56 316 -89 -18 -72 38 -69 33 216 -268 -126 -158 144 -69 26 -81 35 127 -129 73 -38
4925 -38 40 7 23 -127 -154 88 52 259 -25 159 58 -10 0 21 183 -201 114 191 158 163 240 -80 -68 56 -205
4950 -205 56 78 -12 -24 -83 32 -86 24 -58 57 -1 -153 -130 -229 67 -67 88 -2 80 0 -50 160 110 126 -153
4975 -153 185 0 71 7 61 57 -108 -99 -86 -117 -68 -158 76 -3 -20 -168 -7 0 112 -88 109 159 -62 60 -167
5000 -167 -52 -4 14 91 6 66 -45 324 -17 109 126 51 -10 -235 -165 -153 54 -16 -194 -223 -137 69 -183 159
5024 159 -152 44 -151 104 -54 190 54 -111 207 -125 105 136 130 40 -80 143 -117 313 -116 36 65 -74
5046 -74 42 -7 36 -130 197 31 63 -47 -39 152 -24 261 -101 123 -86 18 -168 -59 -71 277 154 158 40
5069 40 126 -108 145 -73 277 -80 126 -95 263 -25 -43 60 29 226 -54 196 -15 173 86 192 -65 -154
5091a54L50l44K06M7q6j21K5L00k73K09j54J49j68l2m1P4M1l80K78j48K41l08
5113b89O6L25k13K57l53n6J66m3N6J25m0j10J34l3K83m33o5L19p0K14j89O9rk03
5137i2J75j11J70l84M08l13J34o4R6j01M8Jo6j6K26k5k60J27J49o7J75l27K00
5160H3n7O5j13J25K17n63K84q2L71n85K65k2j29K53j18J95k54J58m5q8M8K9J37
5183A74j19K8k32K57j57m6J32l2Q7oqk40R0K7Q3j85q0J67j20L6RN2j79K27L6n9
5209e8Oj17K59p0R5m9j27K56l42K32n4N1J1j4L8m02M98l11O1Kn7L0j82L59k83
5234a68J21O1N7k36K93k03K28N9m57L09k26K83k11K04j56M8J02j43R1l1k20R6
5256i9J22j50O1k1M9J80p6L1k86J61K53l14K01j06N6j10m0J5k3P0j39L77l96J92
$$ plain form
5091 -154 196 -148 58 105 19 -102 -77 223 -50 159 5 154 -14 -46 -87 -13 28 -352 -74 -222 19 -289
5113 -289 -223 102 -111 146 -207 -263 -97 -140 -84 41 1 -109 25 -8 275 -158 -223 96 26 240 51 120 111 -92
5137 -92 83 -28 142 -242 166 -147 -13 -77 19 -82 -34 -33 -99 -115 111 86 -174 -47 102 35 210 -117 83
5160 83 26 91 -22 103 320 -243 41 -41 330 -255 10 -12 -141 112 -6 189 -65 93 48 -40 8 37 174
5183 174 55 83 -149 108 -49 -95 37 5 92 86 78 -162 -72 -45 38 -147 -227 -60 -180 -144 -135 -83 -262 -35 1 -58
5209 -58 -52 -169 90 20 115 66 -61 195 -147 85 31 82 93 79 117 -285 213 -98 -37 -35 -92 -62 -244 115 -168
5234 -168 -47 14 71 -165 128 -75 153 212 -245 64 -162 121 -90 114 -42 6 108 -35 56 25 -195 -99
5256 -99 23 -127 -66 -87 -38 142 66 97 -189 -28 225 -89 112 6 62 -48 -88 -73 -96 -26 -165 212 -184 8
5280Hp1K33j30r7J84k34L21l96Q5M0j56J76O2L7j53J67k34K50k2p3j17j4N31l72
5304B5J72j90J4Q0j36J06r0Om8J7o6J29J58k19Pj74K32ML37k03k37J28j89L76
5328B39m27o3J74J83J30l33J84j33J6k8J31l17R8J10j56K18j35J31j80L48j52
5349C8J06j82q7K06j14Rj57K96k00L6O6J31l1m2K24l09K00k06J38j21M9L0k87
5372b07K48j53k1R4l9J4R5j05j03K74q0J37n6o0Q1j49K66k92J47r1J4J11k55J94
$$ plain form
5280 8 -63 170 40 -57 127 -107 214 -182 -97 -57 -213 -37 25 62 -91 76 -158 92 70 -3 -120 -134 397 25
5304 25 197 7 21 101 -35 71 -19 -13 -61 -44 -110 19 177 -42 -35 -209 23 27 364 161 -76 52 -137 239
5328 239 -188 -251 -77 106 236 -97 87 -46 -30 -58 73 -244 -146 -36 -192 26 -109 22 -158 190 38
5349 38 144 -38 -125 81 -33 -24 -181 115 -85 -49 17 148 117 75 299 -10 190 -16 122 1 50 80 -207
5372 -207 41 -112 -133 -39 -78 -64 31 -74 -177 97 17 154 98 38 119 -30 236 -56 91 0 14 125 -130 64
$$ [...]
8191A3
##END NTUPLES=NMR FID
##END=
