##TITLE=1H_23_2024_Bay
 DMSO-d6
 8 sc, 
 2.4.2024
##JCAMPDX= 6.0         $$ Bruker NMR JCAMP-DX V2.0
##DATA TYPE= NMR FID
##DATA CLASS= NTUPLES
##ORIGIN= UXNMR, Bruker Analytische Messtechnik GmbH
##OWNER= root
$$ XWIN-NMR		Version 3.5
$$ Tue Apr  2 13:54:07 2024 Russian Standard Time (UT+4h)  she@DPX200
##.OBSERVE FREQUENCY= 200.1311
##.OBSERVE NUCLEUS= ^1H
##.DELAY= (6, 6)
##.ACQUISITION MODE= SIMULTANEOUS
##.ACQUISITION SCHEME= undefined
##.AVERAGES= 8
##.DIGITISER RES= 18
##SPECTROMETER/DATA SYSTEM= spect
##.PULSE SEQUENCE= zg30
##.SOLVENT NAME= MeOD
##.SHIFT REFERENCE= (INTERNAL, MeOD, 0, 15.7039)
##AUDIT TRAIL= $$ (NUMBER, WHEN, WHO, WHERE, WHAT)
$$ ##TITLE= Audit trail, XWIN-NMR		Version 3.5
$$ ##JCAMPDX= 5.01
$$ ##ORIGIN= Bruker BioSpin GmbH
$$ ##OWNER= she
$$ F:/spectra/data/she/nmr/H-F/1/audita.txt
$$ ##AUDIT TRAIL=  $$ (NUMBER, WHEN, WHO, WHERE, WHAT)
(   1,<2024-04-02 13:52:43.90 +0400>,<she>,<DPX200>,
      <created by zg, POWCHK disabled, PULCHK disabled
       configuration hash MD5:
       00 E9 B6 7A A2 85 ED C7 34 08 36 98 17 FE 4E 26
       data hash MD5: 16K
       73 28 06 E2 96 4D CC 02 C7 EB F6 21 17 F9 76 D7>)
$$ ##END=
$$ 
$$ hash MD5
$$ D0 A6 66 A0 D6 8D 7A 70 30 F3 04 02 29 04 EF 59
##$RELAX= 
##$RELAX= 
##$RELAX= 
##$RELAX= 
##$RELAX= 
##$RELAX= 
$$ Bruker specific parameters
$$ --------------------------
##$DU= <F:/spectra>
##$EXPNO= 1
##$NAME= <H-F>
##$PROCNO= 1
##$TYPE= <nmr>
##$USER= <she>
##$AMP= (0..31)
100 100 100 100 100 100 100 100 100 100 100 100 100 100 100 100 100 100 
100 100 100 100 100 100 100 100 100 100 100 100 100 100 
##$AQSEQ= 0
##$AQ_mod= 1
##$AUNM= <au_zg>
##$AUTOPOS= <>
##$BF1= 200.13
##$BF2= 200.13
##$BF3= 200.13
##$BF4= 200.13
##$BF5= 200.13
##$BF6= 200.13
##$BF7= 200.13
##$BF8= 200.13
##$BYTORDA= 1
##$CFDGTYP= 0
##$CFRGTYP= 5
##$CHEMSTR= <none>
##$CNST= (0..31)
1 1 145 1 1 1 1 1 1 1 1 1 1 1 1 1 1 1 1 1 1 1 1 1 1 1 1 1 1 1 1 1 
##$CPDPRG= <>
##$CPDPRG1= <>
##$CPDPRG2= <>
##$CPDPRG3= <>
##$CPDPRG4= <mlev>
##$CPDPRG5= <mlev>
##$CPDPRG6= <mlev>
##$CPDPRG7= <mlev>
##$CPDPRG8= <mlev>
##$CPDPRGB= <>
##$CPDPRGT= <>
##$D= (0..31)
0 1.2 0 0 0 0 0 0 0 0.06 0 0.03 0 0 0 0 0.0002 0 0 0 0 0 0 0 0 0 0 0 0 
0 0 0 
##$DATE= 1712051563
##$DBL= (0..7)
120 120 120 120 120 120 120 120 
##$DBP= (0..7)
150 150 150 150 150 150 150 150 
##$DBP07= 0
##$DBPNAM0= <>
##$DBPNAM1= <>
##$DBPNAM2= <>
##$DBPNAM3= <>
##$DBPNAM4= <>
##$DBPNAM5= <>
##$DBPNAM6= <>
##$DBPNAM7= <>
##$DBPOAL= (0..7)
0.5 0.5 0.5 0.5 0.5 0.5 0.5 0.5 
##$DBPOFFS= (0..7)
0 0 0 0 0 0 0 0 
##$DE= 6
##$DECBNUC= <off>
##$DECIM= 32
##$DECNUC= <off>
##$DECSTAT= 4
##$DIGMOD= 1
##$DIGTYP= 9
##$DL= (0..7)
0 120 120 120 120 120 120 120 
##$DP= (0..7)
150 150 150 150 150 150 150 150 
##$DP07= 0
##$DPNAME0= <>
##$DPNAME1= <>
##$DPNAME2= <>
##$DPNAME3= <>
##$DPNAME4= <>
##$DPNAME5= <>
##$DPNAME6= <>
##$DPNAME7= <>
##$DPOAL= (0..7)
0.5 0.5 0.5 0.5 0.5 0.5 0.5 0.5 
##$DPOFFS= (0..7)
0 0 0 0 0 0 0 0 
##$DQDMODE= 0
##$DR= 18
##$DS= 0
##$DSLIST= <SSSSSSSSSSSSSSS>
$$ [...]
##$SUBNAM2= <"">
##$SUBNAM3= <"">
##$SUBNAM4= <"">
##$SUBNAM5= <"">
##$SUBNAM6= <"">
##$SUBNAM7= <"">
##$SUBNAM8= <"">
##$SUBNAM9= <"">
##$SW= 18.051750892319
##$SWIBOX= (0..15)
0 0 2 0 0 0 0 0 0 0 0 0 0 0 0 0 
##$SW_h= 3612.71676300578
##$TD= 16384
##$TD0= 1
##$TE= 0
##$TE2= 300
##$TE3= 300
##$TEG= 300
##$TL= (0..7)
0 120 120 120 120 120 120 120 
##$TP= (0..7)
150 150 150 150 150 150 150 150 
##$TP07= 0
##$TPNAME0= <>
##$TPNAME1= <>
##$TPNAME2= <>
##$TPNAME3= <>
##$TPNAME4= <>
##$TPNAME5= <>
##$TPNAME6= <>
##$TPNAME7= <>
##$TPOAL= (0..7)
0.5 0.5 0.5 0.5 0.5 0.5 0.5 0.5 
##$TPOFFS= (0..7)
0 0 0 0 0 0 0 0 
##$TUNHIN= 0
##$TUNHOUT= 0
##$TUNXOUT= 0
##$USERA1= <user>
##$USERA2= <user>
##$USERA3= <user>
##$USERA4= <user>
##$USERA5= <user>
##$V9= 5
##$VALIST= <valist>
##$VCLIST= <CCCCCCCCCCCCCCC>
##$VD= 0
##$VDLIST= <DDDDDDDDDDDDDDD>
##$VPLIST= <PPPPPPPPPPPPPPP>
##$VTLIST= <TTTTTTTTTTTTTTT>
##$WBST= 1024
##$WBSW= 4
##$XGAIN= (0..3)
0 0 0 0 
##$XL= 0
##$YL= 0
##$YMAX_a= 30762
##$YMIN_a= -73517
##$ZGOPTNS= <>
##$ZL1= 120
##$ZL2= 120
##$ZL3= 120
##$ZL4= 120
##$ABSF1= 10
##$ABSF2= 0
##$ABSG= 5
##$ABSL= 3
##$ALPHA= 0
##$AQORDER= 0
##$ASSFAC= 0
##$ASSFACI= 0
##$ASSFACX= 0
##$ASSWID= 0
##$AUNMP= <proc_1d>
##$AZFE= 0.1
##$AZFW= 0.1
##$BCFW= 1
##$BC_mod= 2
##$BYTORDP= 1
##$COROFFS= 0
##$CY= 11.3945322036743
##$DATMOD= 1
##$DC= 2
##$DFILT= <>
##$DTYPP= 0
##$F1P= 15.7292609196834
##$F2P= 12.9074282941183
##$FCOR= 0.5
##$FTSIZE= 0
##$FT_mod= 4
##$GAMMA= 1
##$GB= 0.15
##$INTBC= 1
##$INTSCL= 1
##$ISEN= 128
##$LB= 0.24
##$LEV0= 0
##$LPBIN= 0
##$MAXI= 10000
##$MC2= 0
##$MEAN= 0
##$ME_mod= 0
##$MI= 1.114404
##$NCOEF= 0
##$NC_proc= 0
##$NLEV= 6
##$NOISF1= 3.799351
##$NOISF2= 2.8
##$NSP= 1
##$NTH_PI= 0
##$NZP= 0
##$OFFSET= 15.70392
##$PC= 1
##$PHC0= -25303.36
##$PHC1= 13.58731
##$PH_mod= 1
##$PKNL= yes
##$PPARMOD= 0
##$PSCAL= 0
##$PSIGN= 0
##$REVERSE= no
##$SF= 200.130013532006
##$SI= 16384
##$SIGF1= 3
##$SIGF2= 2
##$SINO= 400
##$SIOLD= 16384
##$SREGLST= <1H.CDCl3>
##$SSB= 0
##$STSI= 0
##$STSR= 0
##$SW_p= 3612.71676300578
##$SYMM= 0
##$S_DEV= 0
##$TDeff= 0
##$TDoff= 0
##$TI= <>
##$TILT= no
##$TM1= 0
##$TM2= 0
##$TOPLEV= 0
##$USERP1= <user>
##$USERP2= <user>
##$USERP3= <user>
##$USERP4= <user>
##$USERP5= <user>
##$WDW= 1
##$XDIM= 8192
##$YMAX_p= 0
##$YMIN_p= 0
$$ End of Bruker specific parameters
$$ ---------------------------------
##NTUPLES= NMR FID
##VAR_NAME=  TIME,          FID/REAL,        FID/IMAG
##SYMBOL=    X,             R,               I
##VAR_TYPE=  INDEPENDENT,   DEPENDENT,       DEPENDENT
##VAR_FORM=  AFFN,          ASDF,            ASDF
##VAR_DIM=   8192,          8192,            8192
##UNITS=     SECONDS,       ARBITRARY UNITS, ARBITRARY UNITS
##FACTOR=    0.0002768,     1,               1
##FIRST=     0,             0,               0
##LAST=      2.2672688,     0,               0
##MIN=       0,             -73517,          0
##MAX=       2.2672688,     30762,           0
$$ Real data points
##PAGE= N=1
##DATA TABLE= (X++(R..R)), XYDATA
$$ [...]
1349b23M20K4n19o02J149L59j124K9R18J88p15LM97J21K0m77N3N05m0p70j45R00
1371E71%j105Q3J097l51m07j06N33K60p9o35K54O63J52j005k6Q21m10n35J64O78
1392F17l89l84L7J87K21p0m53J87Q72m12p52P70O92n45r04O09J38j10j66k08O8
1413EM86n52n72M58Q73n45o40N89O07n93j80K45J65O7l64l38L57M55m34q29Q05
1434F5L96q94j73O74j8l21l5J99J07L46l72l98O19J37o40k34P61L1o59o4M43j68
1456a98j78j36O1L10J1m55L4N75J99q24NO78j42m64r8L03q8m3k32j73O49Mo67
1479h69r6Q67Rp93L10N27j06l26o0J50K25j50k63r8Q40k70p87J79Q96k38r49M40
1501e62M53j86r9J01J91L9k04m73N38M47l83n17K80L94k50k44J00K59n6k94j12
$$ plain form
1349 -223 197 221 -298 -900 249 608 -516 -487 431 619 -96 -93 404 525 545 68 121 626 586 -184 -329 571
1371 571 571 -534 -451 646 295 -112 -218 315 575 496 -139 115 778 930 -75 -101 720 310 -225 -61 617
1392 617 228 -156 -119 68 289 219 -234 -47 825 413 -339 431 1123 578 -326 283 421 311 145 -63 5
1413 5 491 -61 -633 -175 698 153 -487 102 709 116 -64 181 346 413 49 -289 68 523 89 -740 65
1434 65 461 -433 -606 68 50 -271 -306 -107 0 346 -26 -424 195 332 -308 -542 219 250 -409 -473 -30 -198
1456 -198 -376 -512 -451 -141 -130 -585 -551 24 223 -601 -596 82 -60 -524 -622 -319 -407 -450 -682 -855 -206 -202 -869
1479 -869 -965 -98 -89 -882 -572 -45 -151 -477 -537 -387 -162 -312 -575 -673 167 -103 -890 -711 185 -53 -1002 -562
1501 -562 -109 -295 -394 -293 -102 -63 -267 -740 -202 245 -138 -655 -375 19 -231 -475 -375 -116 -172 -466 -578
1522e78K82M00k71m88L06N73m91l44O45J47n31j43L34O2J18j96l30K98N52n70
1542b25m68O73P6l70l35O71J19k82RmlR0n9l00L06L67m61j83M02L08n85j01M81
1565A26M6l62m6J66J92K16m75j21N66p0n01lM12k4k52j24J48L38j02k62J28M36
1587D32k05p73N08K49r5k58J71R1j27j33p3J77K70o5k94L8L54j08n37K20O13l43
1609A12m24O49j63j37k35J28m9K54K0l82O6M09j07m42K84M62m43l36M47O0j14
1630E9j44j16M03l8k11j87L20K06m82j2K22J89p5l41O5j9M19m59k23M59K67l55
1652e3l53N57J9m06q3M04j88P1j13KkL95m06r1L35J17n20L9N45N4n40K09R7j5
1676G4j36k1Q1P3M5p4j17L8L07n05j53N95M9m48O4L11j01j10j14J12J77p3j90
$$ plain form
1522 -578 -296 104 -167 -655 -349 224 -267 -611 34 181 -350 -493 -159 -97 21 -175 -505 -207 345 -225
1542 -225 -693 -20 56 -314 -649 22 141 -141 -132 -136 -139 -49 -108 -408 -102 265 -196 -379 23 331 -254 -355 126
1565 126 172 -190 -236 -70 122 338 -137 -258 308 238 -263 -266 146 122 -130 -254 -106 232 130 -132 -4 432
1587 432 227 -546 -38 211 116 -142 29 120 -7 -140 -213 -36 234 169 -125 -87 267 159 -378 -158 455 112
1609 112 -312 337 174 37 -198 -70 -119 135 155 -227 -161 248 141 -301 -17 445 2 -334 113 173 59
1630 59 -85 -201 202 164 -47 -234 86 292 -190 -202 20 209 134 -207 -142 -161 258 -201 -424 35 302 -53
1652 -53 -406 151 170 -236 -319 85 -103 -32 -145 -143 -145 250 -156 -247 88 205 -315 -276 269 323 -217 -8 89 74
1676 74 -62 -83 -2 71 116 42 -75 -37 270 -235 -388 207 256 -192 -128 183 82 -28 -142 -30 147 74 -116
1699a16J19J14k0l51K48J67j2l84K4L51K4k06m35M32J81k75j21J57L52m37j26
1720c14J53M0P7q2j87J88K54j50n38L72L22l90j88M11K52n11nJ35P9j32Q6l2j22
1743b82L88j79k86J43L94k66k45J22M67l93j63K15L40l11j29J96q8NJ1o5l5K85
1765A24m8j38o5K70O3m75J78L87j30k80J82J54j80j11O6K41o2m15L86l3J03qj38
1788G1k42L86L5l43J82M33l62j39J45K81j97j71K20j52N6j23m4Q1R2K43l82m2
1810B8L93J96n79M1M93k52l57K87L01l51P0J55k43J19jj13R6J27J72n20M6K75
1832C83k6k29N1K76K33o02J94J98L8p3j40K92j74j44k8J49n0L71l62j98L00K67
1854G26o78l23P41O3m03J98J08nj86K47j14j02R2J27l01J77K96l74k82M90R7l00
$$ plain form
1699 -116 3 117 97 -254 -6 161 149 -235 -211 140 164 -42 -477 -45 136 -139 -260 -103 249 -188 -314
1720 -314 -161 -121 -44 -126 -313 -125 129 -21 -559 -187 135 -255 -443 -32 220 -291 -296 -161 -82 -214 -128 -160 -282
1743 -282 106 -73 -359 -216 178 -88 -333 -211 256 -137 -300 -85 255 -56 -185 11 -77 -72 -61 -126 -161 124
1765 124 76 -62 -127 143 206 -269 -91 296 166 -114 68 222 42 -69 -3 238 176 -239 147 114 217 209 71
1788 71 -171 215 250 -93 89 522 160 21 166 447 250 79 299 147 203 80 36 117 209 452 70 28
1810 28 421 617 38 79 572 320 -37 250 551 200 270 425 182 301 300 187 283 410 582 62 108 383
1832 383 357 128 179 455 688 86 280 478 516 443 303 595 421 277 249 398 348 719 357 159 459 726
1854 726 48 -275 466 529 126 324 432 427 241 488 374 272 364 491 190 367 663 289 7 497 594 294
1876B94j53M48L8m15K32l5O7k24L03p3k79K71j61M2k0P5j22k39M32K42m87k9K52
1899D59O1l37M3K90j35k76J11K00j68M6O2p8KJ81j91m35J05N58l58k92L69K87
1921E04m75J07J23P0k31O1J95l30K28p3k39oL18J01o36L07N10n08j72J42M69m72
1943gj54K65Q0k32L05k1l08J53R3j25j56L27m3m56R5K82Q0l02m2M24l42L8J03
1966E7O5k32N7r0O6Q1J42p6k20M7J01k18p3M29J20m93J91L18q8l41L70m0k64Q0
1990a1J84r7PO4m16J79J37J76m43P1K56J16k77j16L33m4j27J38J06k40J12j01
2012Gj97K48J5j90j09M19lj94k20M61M5l81K6K55O9k92R8j0o4R4m8J25k75K57
2036A36j3k94K93J71k62k71M77j7l47o7L00P6l33L46Q2k38N7L9j3MJ09M4l05p6
$$ plain form
1876 294 141 589 627 212 444 409 476 252 555 482 203 474 313 355 335 410 288 49 481 723 236 207 459
1899 459 520 183 226 516 381 105 216 416 248 294 356 278 280 461 270 -165 -60 498 140 -152 217 504
1921 504 29 136 259 329 98 159 354 24 252 179 -60 -66 252 353 -283 24 534 26 -146 -4 465 -7
1943 -7 -161 104 184 -48 257 236 -72 81 174 49 -107 220 177 -279 -184 98 178 -124 -166 258 -84 -46 57
1966 57 122 -110 -53 -143 -77 4 146 70 -150 -103 -2 -220 -293 136 256 -237 -46 272 184 -157 213 173 -91 -11
1990 -11 173 76 83 147 -269 -90 47 223 -220 -149 107 223 -54 -170 163 119 -8 130 236 -4 108 7
2012 7 -190 58 73 -117 -226 193 190 -4 -224 237 282 -99 -73 182 251 -41 57 47 -17 77 29 154 -121 136
2036 136 123 -171 122 293 31 -240 237 220 -127 -194 106 182 -151 195 277 39 96 135 122 126 235 279 -26 -102
2060a02L66k24k35L34K05l89j26N17j80j88j00M00k35o3O2R2j20R9J50l46J92
2081A09J17k84n0J52K93k79m04N10N9l17j95K50L4j05K96k23N2m8koj55L24j17
2104A1k49J09L96k07q9J52J09l37j08K65n1l6Mj86N7L07J3m17O3M62k61j95K96
2127A08P2k68l8J41K43n13J21L19r8k79J44J52q1M7l4j44l1L76k26m4J02j9k14
2150a64q5M09j46j27J02o8k3K1M4J59j92P1O1j61j5J56J20k05p5R1Jk04J44J57
2174G1l31J67M7Jn0J50P8k88Q9J62j86l4j1K08j68n7J79j63r7P2J84k75j9lJ04
2199a70%K12o5p5L3O0l29P5R2L82n31k5L17J4q0qn2j30J83j17Q9q5O0q9o1J64
2225a36K26l13P7J78j83J21k38L11o7k58O0J23l9j00R1k1p4J79R4j60K40R9r2
$$ plain form
2060 -102 264 40 -195 139 344 -45 -171 346 166 -22 -122 278 43 -20 42 134 14 113 263 -83 109
2081 109 226 -58 -108 44 337 58 -346 164 223 -94 -289 -39 -5 -110 186 -37 15 -33 -35 -41 -196 128 11
2104 11 -238 -129 267 60 -29 123 232 -105 -213 52 1 -35 -31 -217 -160 147 160 -257 -194 268 7 -188 108
2127 108 180 -88 -126 15 258 -255 -134 185 87 -192 -48 104 23 70 36 -108 -139 237 11 -33 69 50 -164
2150 -164 -249 160 14 -113 -11 -79 -102 -81 -37 122 -70 1 62 -99 -114 42 162 -43 -118 -27 -26 -230 -86 71
2174 71 -260 -93 -46 -45 -95 55 133 -155 -66 96 -90 -124 -135 73 -95 -152 27 -136 -233 -161 23 -252 -271 -274 -170
2199 -170 -170 42 -23 -98 -65 -5 -334 -259 -167 215 -316 -341 -24 -10 -90 -98 -150 -280 -97 -214 -125 -210 -150 -239 -300 -136
2225 -136 90 -223 -146 32 -151 -30 -268 43 -24 -282 -222 -99 -138 -238 -147 -168 -242 -63 31 -129 111 210 118
2248A18l27K36J43k84O7N8M0j87O0J45q1p9J06p9k59M54k25l3K63j27J14k20J81
2271H4lj39k7J07j5L8Q9j41m4k2P9q1J69M6j79pqL85k08j02P0L6j13j5j6K24k54
2298d7R5N0L6j21J69k03J76j10J25k09l9L08P8k53o4K32j85q1J3R3q6J10p1l1
2322a5J53K6j04j51O1J48j39J35M3q8r6P8J33k19pM9J19k10J23l2p6QK14rk07
2347f3J55n0J7L1n5J34j97Q4m0J8K00k40J22j15l5J15M5l9o1J10j10J5J62k18
2371a5N0P5M4q4j80K95j37K00j22rj2nk8P5k04J90J1j70O0L06k68r0Q8J3J14p3
2397A24k8O6l1q1J90j70J02mj11Pq0k3o4K00km8k7J07q9Q7j25N6P2l7j82K32J8
2424A59k21K58l44J73P9q6j5O6p8m3l5J32N3p6N0l9j6lo2m4Koo2M9K05M7j13L
$$ plain form
2248 118 -209 27 170 -114 -47 11 51 -136 -76 69 -12 -91 15 -64 -323 131 -94 -127 136 9 123 -97 84
2271 84 81 -58 -85 22 7 45 134 -7 -51 -73 6 -75 94 140 -39 -46 -54 331 123 21 91 127 14 -1 -17 207 -47
2298 -47 48 98 134 13 182 -21 155 45 170 -39 -78 230 308 55 -9 223 38 -43 -30 63 -23 87 16 -15
2322 -15 138 164 60 -91 -30 118 -21 114 157 69 -27 51 184 -35 -42 7 126 -84 39 7 -69 -61 153 144 -63
2347 -63 92 42 59 90 35 169 -28 56 16 34 234 -6 116 1 -34 81 126 87 26 136 26 41 203 -15
2371 -15 35 110 154 70 -110 185 48 248 126 117 105 100 72 147 -57 133 144 -26 34 340 72 -18 70 83 197 124
2397 124 96 162 131 50 240 70 172 168 57 64 -16 -39 -103 97 95 47 20 127 38 125 0 56 128 91 -91 141 159
2424 159 -62 196 -148 25 104 18 3 69 -9 -52 -87 45 98 22 72 33 17 14 -48 -92 -90 -96 -158 -109 96 143 30 33
2452C3LQJ0k87M25j51j7%j8R6n6L5j3n2Nk17J58K91k44q8N1L7n8J61k17O3M3o1
2480f0K1j01J31J13k2j14KK38k21L0l0K6r9K3J46o0J09p3J66j47j56J24j13J59
2504I2K5j20m0Q4K01l41K60o0j72K6M2K94l37J44m0j41J23N3R1k65J74m6j46N4
2528d5n2J92p2J3j33J65P1j38J13l5m1n3R4Q5q3j35Q2P0K4p3l1n1J9l3K53k10
2554dr0L13k62N2L3p3L2k2j0j5J9J1R8K6r0P8M6k6r5N6o7j16K15j89R0j13J26
2581B3j8j4n4n4J10j43K02K7j54K6l8J11p2n9J61j06J7K3r6P4N5R4k52J85j19
2606g1J14k62J99J3J01j09n5K71k22j15M4M7m6k2R2J12q1p5O5K3j15J01j54K10
2630F5o0M3Q1p3j13N8m5j81L29o6m1M7p8J75j12K8k3K9K9j85J6m8J30n0O7j71
$$ plain form
2452 33 36 44 54 -233 192 41 24 24 6 102 46 81 68 16 21 -196 -38 253 9 -79 -28 9 -49 112 -105 -42 1 -60
2480 -60 -39 -140 -9 104 82 -32 -30 208 -13 17 -13 13 -86 -63 83 23 132 59 225 78 -78 46 -67 92
2504 92 117 -3 -43 41 242 -99 161 101 -71 -45 -3 291 -46 98 58 -83 40 93 184 -81 93 47 -99 -45
2528 -45 -97 95 23 36 -97 68 139 1 114 79 38 -15 79 164 81 -54 28 98 122 49 18 -33 -14 -47 206 -4
2554 -4 -94 219 -43 9 42 -31 1 -21 -31 -46 -27 -16 82 108 18 96 142 116 21 77 10 -106 109 -80 10 -103 23
2581 23 5 -9 -63 -117 -7 -150 52 79 -75 -49 -87 24 -48 -107 54 -52 -35 -12 -108 -34 21 115 -137 48 -71
2606 -71 43 -219 -20 -7 94 -15 -70 201 -21 -136 -92 -45 -91 -113 -21 91 10 -65 0 23 -92 9 -145 65
2630 65 5 48 129 56 -57 1 -44 -225 104 38 -3 44 -34 141 29 57 34 63 92 -93 -77 -125 5 -45 22 -149
2656a49J36K02l17K49o5l9J33j95M0P5j72j6K99q1p1o1J8K41j72p0R8L9j04P8
2680I6K7j4o3QK7j3k40J98J40K6k22k5n3j44L72l36L20j75J52r9J9O7j21N6p1
2705f8J05K7r2o4l5J36O3q6l4Q7j0j00m2P4j6j17O0J01NJ6J44j51K7r3j89J12
2731a40O2N0k3N1l7q7O3j1n7K23k85J33J62j10P4k38J43j7O6K3J2o0Kj12K0l2
2757a25J62j22Q1n7J45K7j74j09J76M6k60K85j77J71q1j43K29o9j1n2K05k26n2
2780a31J08j4j40J13j0k4JN2J94k70P8R6j21P2J11l7k28O9Jj12K23m0k5q9J34
2805A1L7j13J39j30J27p3j32K03lj00n0p3J82k38K57P1k33J37J7j87J70l5J16
2828A00r8Q5J43k14n2j06J49j14J90P5l48J42pM7Q0P2j59M0L4j94OL8J44j30r9
$$ plain form
2656 -149 -13 189 -128 121 56 17 150 -45 -5 70 -102 -118 181 100 29 -32 -14 227 55 -15 83 122 18 96
2680 96 123 109 46 54 81 68 -172 26 166 192 -30 -55 -108 -252 120 -216 104 -71 81 -18 1 68 -53 3 -68
2705 -68 37 64 -28 -92 -127 9 72 -14 -48 39 29 -71 -113 -39 -55 -172 -112 -11 -6 10 154 3 30 -63 -252 -140
2731 -140 -78 -28 -51 0 -37 -124 -61 -72 -129 94 -191 -58 104 -6 68 -170 -27 -44 22 45 57 -3 -1 -113 -93 -125
2757 -125 37 -85 -4 -61 84 111 -63 -172 4 50 -210 75 -102 69 -12 -155 74 5 -6 -58 147 -79 -131
2780 -131 -23 -37 -177 -64 -74 -98 -97 -45 149 -121 -43 53 -68 4 115 78 -150 -81 -80 -192 31 -9 -34 -123 11
2805 11 48 -65 74 -56 71 -2 -134 69 66 -34 -84 -157 25 -213 44 115 -118 19 36 -151 19 -16 100
2828 100 2 87 230 16 -36 -142 7 -107 83 158 -190 -48 -55 -8 72 144 -15 25 59 -135 -129 -91 53 -77 -176
2853a76K1J19L8K7r6K0l1K8M1lj5j65J11L5J27m2m1J39j59K9Lj48J8K3J22j48
2879a23M7kJ2o1L5R4l0J05k56J00mQ5k31K67m4jKM2J18l1k13J47l9k33M5P9K05
2906A15j30J4OK15k22j45J64K8j5r3J45j20qJ9J54o4J28j99j36J80j7j12O5K4
2930dM8N%o2kJ7JQm8o6P5M2L4j69O8j05J5O5L4J7Oj44J32qJ8j8j0kM3q7P5j15
2962a37J36J10j51m0J36mj39R7K4L5rp4J9p6J61j68J48m8J3J8M3j2j21N5p6J7
2988d3K9K22k85J7N1L2J11k32Q3j89K69K2m6P8j38L6j88K40j73n0Q1L4j4o1m2
3013a56Q0R2%J56k34P0N4O3j50O0J24j42O1k0n2m5o4J00J44k22m5J54l2j77K63
3038H2o7L8j54M5J39q9m2j01K6Q5j13J68L3j72J66j13l8K08k7r6L2k27J21J2R
$$ plain form
2853 -176 -155 -36 2 29 -67 -47 -78 -50 -9 -12 -27 -192 -81 -46 81 39 -2 137 -22 7 10 -138 -120 -97 25 -123
2879 -123 -76 -78 -66 -127 -92 2 -28 77 -179 -79 -83 2 -229 38 -6 -7 -5 37 155 124 -89 58 19 -214 -169 -90 115
2906 115 -15 -1 5 220 -2 -147 17 45 30 -63 82 -38 -46 -27 127 63 191 -8 -144 36 19 -93 -28 -4
2930 -4 44 49 49 -13 -15 2 3 11 -37 -103 -28 14 48 -121 -53 -158 -143 -78 -44 -27 -21 -165 -33 -41 -23 -41 -51 -53 -10 -97 -22 -137
2962 -137 -1 109 -42 -82 54 50 -89 8 32 67 58 -16 3 -73 88 -80 68 20 33 51 94 82 -39 16 -60 -43
2988 -43 -14 208 -77 -60 -9 23 134 -98 -15 -204 65 87 41 119 -19 17 -171 69 -104 -154 -73 -39 -53 -114 -156
3013 -156 -76 16 16 172 -62 8 62 125 -25 35 159 17 78 58 6 -39 -103 -3 141 -81 -126 28 -4 -181 82
3038 82 15 53 -101 -56 83 -6 -48 -149 -123 -38 -151 17 50 -122 44 -69 -107 101 74 -22 10 -217 -96 -84 -75
3063g5M9N6k1j59J14J06j9l7j23J87j45J58j04m3j1J39j20L9M3j51Q9RJ19k03
3087a03J34p0n7J33q2rj21K48J9j4M8m5j75K17q9l2J36k68J48j74K36j00N8l6
3111BJ2L6k3r6J80q4N9j91R1N5l6k6P3q1K01m8k4l5q6L4pO9%n6r5L5j22L11j59
3140a1nM8MJ96k73P2J60j07j6Nl6J21j75M5M3o1j11P2R6j1k1n9N4nR0j23O4Q7
3168A43j4m5M3Rj32kO8j06N2l2K1M6j2J6m0j23J0J30k5NK0l3p3N7m0N8j32M4M
3197h3P8K2r0J33r5J56o6r7J5k3q7K23q5j23J48k9n2j07J66P0j71J38m5k8J07
3222G5q9O8j13J90j56j24K03j71P7j07J16l8o9J95N0l8j21J04J25k26J07k29K12
3245D1j05P2P9N6k14K08K8j93oP7l0L2J6L9j59j06K46j19J22o9j21K99%k58J07
$$ plain form
3063 -75 -26 30 9 -150 -36 70 51 14 -109 78 -67 91 -13 -56 -67 72 -48 -9 34 -117 -28 -19 100 -103
3087 -103 31 -39 -96 37 -45 -54 -175 73 92 78 126 81 -94 123 34 2 138 -130 18 -156 80 -20 38 2
3111 2 14 50 27 -69 111 27 86 -105 -14 41 5 -21 52 -29 172 124 100 65 -21 13 6 75 75 19 -76 -41 -163 148 -11
3140 -11 -16 32 36 232 -41 31 191 84 68 73 37 158 -17 28 71 10 -101 -29 67 56 35 -24 30 25 115 -8 56 143
3168 143 129 84 127 136 4 2 70 -36 16 -16 5 51 39 55 15 -108 -98 32 7 12 32 -1 -74 -17 -57 1 -131 -87 -83
3197 -83 -5 17 -73 60 -35 121 55 -42 -27 -50 -137 86 1 -122 26 -3 -55 -162 4 74 -97 41 -4 -32 75
3222 75 -14 54 -59 131 -25 -149 54 -117 -40 -147 -31 -69 -138 57 107 69 -52 52 177 -49 58 -171 41
3245 41 -64 8 87 143 -71 137 165 -28 -34 43 13 45 61 100 -59 -165 81 -38 84 15 -106 193 193 -65 42
3270D2J44k56j9J20j85J11J87j11k48J86m3J70k30J75p9K6Pq5J17j36K55k21N3
3293b0QJ26k6k21K85K5k97l9J88N7kK9l6O9m4j09J55j64L8m8J11o8N8L9j75J15
3319E4k03mJ61n0R8p2O3j25K6n1K48k2j59J51j35k5j02K23N5j67pJ94l37J93r
3344bn3J96k25J26K0r2rM2j2K84l87k5K0K07k8Ro7J21l4k6Q1p8j12J62q0n6O8
3371E0Pj0j68R7Nk6M4O4m9qJ56k08J2m7J56j66J58j54J9K41k23J70j77o4P1K3
3397b7Q4r5L5R8Rj81P4N9r3O4J3l4j7J87j69r4K3J06j15N5J11P9L7rj92K6j22
3424h8j4J22q5PL5k1N0K3oM6m9r8J38j23l5L4l5J11l5J10j10O9j00Pj78R1K00
3451F6J2o0p9k5K26l06K16k8r4K22j47O6k02J96R6k15l9K58j80j61Q4R7m6k3J18
$$ plain form
3270 42 186 -70 -89 31 -154 -43 144 33 -215 -29 -72 98 -132 43 -36 -10 -3 -88 29 -107 148 -73 -20
3293 -20 -12 114 88 -133 152 177 -120 -159 29 86 84 113 77 146 102 -7 148 -16 22 -26 85 17 75 114 -61 54
3319 54 -149 -153 8 -42 56 -16 47 -78 -52 -103 145 123 -36 115 -20 -45 -147 76 131 -36 -43 151 -186 7 -2
3344 -2 -55 141 -84 42 62 -30 -39 3 -9 275 -112 -137 -117 90 62 71 4 125 91 65 146 68 -44 118 38 -18 50
3371 50 57 47 -121 -24 -19 -45 -1 63 14 6 162 -46 -34 -81 75 -91 67 -87 -68 173 -50 120 -57 -121 -50 -27
3397 -27 57 -38 -3 95 104 -77 -3 56 -37 27 40 6 -11 176 7 -87 -64 42 -73 -18 93 172 209 200 8 34 -88
3424 -88 -102 20 -65 -58 -23 -44 6 29 23 69 20 -78 60 -63 -98 -64 -99 12 -23 87 -23 46 -54 -47 -225 -134 66
3451 66 78 18 -61 -86 140 -166 50 22 -72 150 3 69 -133 63 159 -56 -95 163 -17 -178 -94 3 -43 -66 52
3476E2q0k1K3p0J09N8L7k6K1k39J60M8j65J67Q6j65J23o3j55K1R8m5j26J09J67
3501A24j70pk07J37K24Jq9J46j08p6N4N7j48L5J10j36p0N1P5J1j22R6J37kk44
3526a21K01j42J35j97p0L56k75J81j02J11j29J47j71j4M8r1J56J0j91J38n7M8
3548b9m6J49m2j0n1J58k67L62k14P7j82J45j80J44N7j21P8n5j07J76o8j04P0Q3
3572B3O6r9j28J94j66K1n5J34J26l65J89Nk0J91p6q3l3J10j34L0k7P0K09j82M2
3597D2j48j1J98l6j75J85j25N7M6j93K1J09M5Q7k53K78j31k27K48p5O9m0j33L13
3621A51k7j97P9Qj48J74j30l3K09j0j30j08K30o8l5R2l3j33O2NJ44k72K41Rm1
3646C9Rj02nJ6P4o3m2J47o7R6r7J10k91K56j5k6l6J51j03l9j06J77j58P7J7n6
$$ plain form
3476 52 -28 -49 -26 -96 13 71 108 82 103 -136 24 72 -93 74 160 -5 118 55 -100 -79 19 -26 -152 -43 124
3501 124 -46 -53 -260 -123 101 102 13 159 51 -25 29 86 -62 -27 83 -53 -123 -72 3 14 -108 -12 125 123 -121
3526 -121 80 -62 73 -124 -194 162 -113 68 -34 77 -52 95 -76 -90 -42 -133 23 33 -158 -20 -77 -29
3548 -29 -75 74 32 22 -29 129 -138 224 10 87 -95 50 -130 14 71 -50 28 -27 -134 42 -26 -130 -60 23
3572 23 89 -10 -138 56 -110 -89 -144 -10 116 -249 -60 -55 -75 116 40 -43 -76 34 -100 -70 -97 -27 182 0 42
3597 42 -106 -117 81 45 -130 55 -70 -13 33 -160 -139 -30 15 102 -151 127 -4 -231 17 -58 11 -29 -162 151
3621 151 124 -73 6 14 -134 40 -90 -123 86 76 -54 -162 68 0 -35 57 24 -109 -47 -42 102 -170 71 80 39
3646 39 48 -54 -59 -43 31 -32 -74 73 6 102 5 115 -176 80 65 39 3 154 51 12 -94 83 -75 2 19 -37
3672c7J65l22K81j8r3m4J16L2j7q6J09j63J77K9j51K27j20l05K53r3n2J01N4k06
3696a63K15l5J02m3m1Lj92K6R5J9Qj11J24N0j12jj30Q3L2J06k39J87J30k8j45
3721f0M7lj9J52k85J20O8k2k2K6k02K02P0j52J28J56j11k2k9p8K9m3J7O6j01J7
3747e1K00lk42J66j74Q9J23k14N8k0J41J03j87q1J42l1l2O5Jl6J47k84J10O5p
3772D8M4j06L3j9o5q3n0K00P6j05m1p6J12pN5PO9j13j40J2R5%p4K16o1R0n1k74
3800b08K56jRm9K1J74k33L8RMMj16k0J8J50k52K40k1j3j7M3N4j60M6J97k62l2
3827a21J30p2k6L4NJ2o1J47M5j07QM5m4O0m9j5q6J36N7r4K9k9L2pj55J89j83J81
3855F1L5j72n4J64j11R0j12l2K34Nk55J18K0J45l8j08M0k9J41k07N5P2o5N5K8
$$ plain form
3672 -37 128 -194 87 69 -24 -68 48 80 63 -23 86 -77 100 129 -22 205 85 -220 33 -60 -112 -11 43 -163
3696 -163 52 17 119 76 35 38 -154 -128 -33 -14 -6 -117 7 57 -55 -56 -186 -103 -71 35 -204 -17 113 85 -60
3721 -60 -13 -16 -35 117 -168 -48 20 -2 -24 2 -200 2 72 -80 48 204 93 71 42 -36 -7 -50 -33 33 -68 -51
3747 -51 149 146 -96 70 -104 -15 108 -106 -48 -68 73 176 -11 -92 50 19 -13 52 53 17 164 -120 -10 55 48
3772 48 92 -14 19 0 -65 -148 -198 2 78 -27 -68 -144 -32 -39 16 23 92 -21 -161 -149 -54 -54 -128 88 27 117 66 -208
3800 -208 48 47 56 7 28 202 -31 7 16 20 24 -92 -112 -94 56 -196 44 23 10 -7 36 90 -70 -24 173 -89 -121
3827 -121 9 -63 -89 -55 -50 -38 -99 48 93 -14 -6 39 -5 55 6 -9 -95 41 98 4 33 4 36 29 -126 63 -120 61
3855 61 96 -76 -130 34 -77 13 -99 -131 103 108 -147 -29 -9 136 98 -10 30 1 142 -65 -10 62 -3 52 80
3880H0p7j33K39q2o7M6o2om4J1J05M6r3j5j2R8M3K9l7m9jM5o2k0p3J08j11N0J56
3909A12R9j58j76J23J6M8K3l6k17o3K48j2l9O9J8k13J07J51p0J77j81K6j32J85
3933A05r7j15j2J04Q4K02l04J7P0L9j03J56j87j2R0m4j9N1O7ok87K95nj37R4Q4
3959A30m8m4l1J07r1j52J05l8n2M1L9o8J60m6P5o3O0j51J25j18k8J59k6l3j08
3984i6R9j68L00j56%J8J7l4J40m7q1O3R1l41K54k9j39L35j78j04k83K05K40l2
4008G4j40o9J28Q3k32J13K6M9k0N2j86J69Rk51K40j23P5J60j05k3r3L6J99o7r9
4033EM3k2l5J15k11p8K17j0k5K0K3j23J31l4L9m2Kl0M4M3n7J08j30j08oR8N7J47
4061A81k62J49j47m2J51l8R9j95J26n9n2K08j94M8J86j26j23j23J01N9Q7q5J37
$$ plain form
3880 80 3 -130 109 27 -40 6 -56 -62 -106 -95 10 56 -37 -52 -64 34 77 106 69 20 19 64 2 -18 -91 17 -94 -44 112
3909 112 211 53 -123 0 16 64 87 51 -166 -229 19 7 -32 37 55 -158 -51 100 30 207 26 52 -80 105
3933 105 8 -107 -119 -15 69 271 -33 -16 54 93 -10 146 -41 -53 37 -7 -26 25 92 86 -201 94 89 -48 46 130
3959 130 82 38 7 114 23 -129 -24 -62 -114 -73 -34 -102 58 12 87 24 84 -67 58 -60 -88 71 45 12 -96
3984 -96 3 -165 135 -21 -21 -3 14 -20 120 73 -8 55 146 -195 59 30 -109 226 48 -56 -339 -134 106 74
4008 74 -66 -135 -7 76 -156 -43 -17 32 12 64 -122 47 56 -195 45 -78 -3 157 52 29 -64 -28 171 104 5
4033 5 48 26 -9 106 -105 -183 34 24 -1 19 42 -81 50 16 55 13 15 -15 29 72 15 123 -7 -115 -121 -23 34 181
4061 181 -81 68 -79 -121 30 -8 91 -104 22 -37 -89 119 -75 -27 159 33 -90 -213 -112 -53 34 -51 86
4084H6j48jk6J69r3n3nP9L3j49J47n9j7NJ40j97K1K1L0j32J51N7k1m1Q4N1j25
4111GK4p3J79j13n2O0j41K4J20J0J72k57m5O8r6N4J30J16j59k6k0M1Q8j99K44
4136A56k38J4k8M8J16M8j06p6J42j42J49LJ13k38J15j24R0m9j31K8J74j21J4k37
4160b80L24p0o9K59N3j82j74K45k79P6J74r7O1m0J4M1j85J72K3j74J05p6P3r9
4184a05P9n2J32P5j71N9j0J04j27J3p6K49j83J37j94J70j77j2J87M4J5j51p1k6
4208i1K45j65%P0j60J67J43k20RP8j58O0P1j6j42l5K28k8j3k37J9K97p9r9M6K02
4234A92l77J11R4j3j9j16Q1m2J13q6Q5J23R6k21%O8J9n6j5o4NK8J67k59P5l3j37
4261a81L8L34j02k0O8p3j81K54q2j90P7J27j38m1Q3J95j60j07M3J33j3j78K39
$$ plain form
4084 86 -62 -63 -89 80 -13 -66 -71 8 41 -108 39 -20 -37 -32 108 -89 -68 -47 -17 -149 2 59 38 -3 81 132 7
4111 7 31 -42 137 24 -28 32 -109 -85 35 45 217 -40 -85 -17 -113 -59 71 187 28 2 -18 23 111 -88 156
4136 156 -82 -68 -96 -48 68 116 10 -66 76 -66 83 86 199 -39 76 -48 42 -7 -138 -110 64 -57 -43 -280
4160 -280 44 -26 -95 164 217 35 -139 106 -173 -97 77 -20 41 1 15 56 -129 43 66 -108 -3 -79 -6 -105
4184 -105 -26 -78 54 129 -42 17 7 111 -16 -3 -79 170 -13 124 -70 100 -77 -89 98 142 157 6 -65 -91
4208 -91 154 -11 -11 59 -101 66 209 -11 -2 76 -82 -22 49 33 -109 -144 84 56 43 -194 -175 122 43 -56 -10 192
4234 192 -185 -74 20 7 -12 -128 -47 -89 24 -62 23 146 242 21 21 89 108 52 37 -27 -22 6 173 -86 -11 -44 -181
4261 -181 -143 191 89 69 137 64 -117 137 55 -135 -58 69 -69 -110 -27 168 8 -99 -56 77 64 -114 125
4284A25P5k27q2J49O4o0J03k43K3K5L32j74K0j52L9P3j26O9k1L9j16o1R7p0J0
4309h9O8lrk9Qj28J72J3k16J0J60KJ1Oj03oJ73o8J36j21o8O8j25K64k62J85q2
4336c3L0R5k17k6K12RK2j53P1q6R4j03m9O1q4K66k49J77j48j5q8J61LQ6n4K7j99
4363a90M1K86j09k9J25j73O0n9J57k43J36M7l1j09K02j14J4m1J12j49J25j02j32
4386a76J05M0L9p3J81n8R3r8m3l3k1k3K19j17q6MJ04j09K00j08J3P9j09J3R6q1
4412E1l7N0p1M4M2L9j15k8M4M4j21p9J95p7Q4k35J53p2Q3J36q1j89P1J6J02R1
4438A40j82Pn7M5K9K1j74K32k0m5K3L8j60n9K74o2L6n8j04Q2l7J62j81J26o0j47
4464a31K59k73J42O7J9lj82K9J54q7J5P6m5l2j50K06O4l32J49p6J21Q4r9J22m4
$$ plain form
4284 125 200 -27 -109 40 104 44 147 -96 -73 -48 284 110 130 -22 17 90 -36 33 12 51 -65 -126 -29 -99 -89
4309 -89 -21 -24 -33 -62 -54 -182 -10 3 -213 -203 -43 -41 -30 -24 -127 -133 40 -28 108 -13 -81 -13 -138 126 -136 49 -33
4336 -33 -3 92 -125 -151 61 70 92 -61 10 -76 18 -85 -134 -73 -157 109 -140 37 -111 -126 -214 -53 -50 36 -18 9 -190
4363 -190 -149 137 28 -1 124 -49 11 -48 109 -134 2 49 18 -91 111 -3 11 -30 82 -67 58 -44 -176
4386 -176 -71 -31 8 -65 116 58 151 53 10 -23 -44 -67 152 35 -51 -47 57 -52 148 40 53 132 23 36 132 51
4412 51 14 64 -7 37 79 118 3 -25 19 63 -58 -137 58 -19 65 -170 -17 -89 -6 130 49 -140 -69 -53 49 140
4438 140 -42 -35 -92 -47 -18 3 -171 61 41 -4 19 57 -103 -162 112 50 86 28 -76 6 -31 131 -50 76 16 -131
4464 -131 128 -145 -3 64 83 80 -102 -73 81 -6 9 85 40 8 -142 64 128 -204 -55 -131 -10 74 -25 97 53
4489E3j56l1J48l40K25K43j65p5N2R7n8j22K73k36J69q9O4Kj22J03L8K7m0o4J6
4514A2q4P7J44k69R6j50K68J0mj74p8P2j2J82l5l4p5NJ11Jn4r4L9jp0K09q9j05
4542a02N5K85j52r5J54k65J87q1n8P8K0j02j21J19J78N9j64l4M7J25j95K7%M8
4566A3J11j34k7J04j27R8n7k2P0j25J26k07J15J57j90J55j93O5J60j22p6j12Q3
4589a35R8P3K3K3j93p0K55k36R9M0r7K21N8l06Q5L4m0P1l4j6mJ05j26J57j59J7
4615e7N0M6k37J25j29J67K6rJ4M5N6j34l5j36K52n1j6j7J06p3Q9k6p8O3j6q7J98
4642A36k34M1pQ9Q0k44J85J06j73j4P4l5OJ41j94J1L0L1j03l8J23K1Q7j93R3j49
4668a30O1J42j40L6j4J96p0q9k5K79l16K0L7r8Q5k14K32j0N9j56P5k1N2R5j26
$$ plain form
4489 53 -103 -134 14 -326 -101 142 -23 -98 -46 51 -7 -129 144 -92 77 -12 52 54 -68 35 73 100 60 -4 12
4514 12 -72 5 149 -120 -24 -174 94 104 100 -74 -152 -80 -92 90 55 21 -54 -49 62 63 9 -85 -46 -47 -117 92 3 -102
4542 -102 -47 238 86 -9 145 -120 67 -14 -72 6 26 -76 -197 -78 100 159 -5 -39 8 133 -62 -35 -35 13
4566 13 124 -10 -37 67 -60 38 -19 -41 29 -96 30 -177 -62 95 -95 60 -133 -68 92 -30 -106 -218 -135
4589 -135 -37 36 59 82 -111 -181 74 -162 -63 -23 -120 101 159 -147 -62 -28 -68 3 -31 -47 -51 54 -72 85 -74 -57
4615 -57 -7 39 -198 -73 -202 -35 -9 -18 -4 41 97 -37 -72 -208 44 -7 -23 -40 66 -7 82 56 -22 41 25 -62 136
4642 136 -98 -57 -64 25 105 -139 46 152 -21 -35 39 4 10 151 -43 -32 -2 29 -74 -112 11 32 119 -74 19 -130
4668 -130 -69 73 -67 -31 -45 151 81 -8 -33 246 -70 -50 -13 -111 -26 -240 -8 -18 41 -115 -40 -61 -9 86 -40
4693d0m9L5J8J09qj03J3mq2R7j3Q4n3K9m7l2j41K71j16J47r1J03j54l1n8J14o2
4720f4L3J76o5p7r0J49J1j9j29K66j92L5m0j13O4Q6O9j29j50J43J90r5l3j29J13
4745A0j4q5l7L00j13kk13K27J09r1L1j99J36r7J8oO3j98M3K43j45pj39K53p3m3
4771b9R3j26K14k03o7O1L4K22k44K9J03l0m6P9k34J92j50J76j25PJ95o6k2J06
4795A69j67pj31J93j49J43p8j14J96j64J13Mj04K12K8q8j20J7P0n0j31K03k4j07
4819h6R9L8k6P4j86J16nn3r5Q9rJ90N4j07j60j12K16j27m2L00k37J66k21Q9Q5
4844E0L3l7p6q1R9l6J26j23M5L1j04J24l2n7m1K37k68J7J77N4j96j12J93J41k31
4869f7n6O6N4J5J67q2j07Q4j32J7Q5j28O9J98j49r7J13J0L3j70Q3n8n2N9K69k2
$$ plain form
4693 -40 -89 -54 -36 73 65 -38 -25 -29 -111 -14 -27 57 4 33 -14 -46 -187 84 -32 115 24 127 -27 -58 -116 -2 -64
4720 -64 -31 145 80 3 -87 62 73 54 -75 191 -1 34 -6 -119 -55 31 100 -29 -179 -36 154 59 26 -103 10
4745 10 -4 -89 -126 174 61 59 -154 73 182 91 122 -77 59 -38 -20 -26 37 -161 -118 125 -20 -27 -166 87 14 -29
4771 -29 64 -62 152 -51 -118 -57 -23 199 -45 -16 87 57 11 90 -144 48 -102 74 -51 -44 151 85 63 169
4795 169 2 -5 -136 57 -92 51 -27 -141 55 -109 4 8 -96 116 144 56 -64 -47 23 -27 -158 45 21 -86
4819 -86 13 51 25 99 -87 29 24 -29 -124 -35 -44 146 200 93 -67 -179 37 -90 -132 168 -69 97 -124 -35 50
4844 50 83 46 -30 -111 -12 -48 78 -45 0 31 -73 51 19 -38 -79 158 -110 -93 84 138 -58 -170 23 164 -67
4869 -67 -123 -57 -3 12 179 97 -10 74 -58 -41 44 -84 -15 183 34 -63 50 60 93 -77 6 -52 -104 -45 224 202
4895B02l99J31L2J27J8p2L3nq2P5k1J06k30J10P3j78Q6R6j07n1n5M7J28o5k3k5
4921d9J83k02l0K92j96q5K69k61J51L5m2j76O8O9J14p6J10j34p8K9p7J67jj59
4945g9p7K79j54J65j59L1k2R1j8q3q7J95q7n5O3n0J03j10LM0J00j39J3K1j02J12
4971fk7P0o6M1L8j61L38l84J52n9j9J41m9J50p1r8J84q3o1p4P9r5O8n4J19Q1r4
4998F0PO1p2J7J7j22j52J54Q1j07nK25j68R2j80J42j24R1O1j52l3N6p1R6J33j30
5024b3MJ20j18m4L3kJ91j20q2n9K9J88j06j1M1j8qm6P1o3o0K0l5J05k9M4K5j00
5052e3J04m5K2j22J32j12K55k20kk5K0J40l1j26J5oN3P4Pp0M1j8r1J89j32j02
5078a03lK46j05N2m8j19J00O5n8J04j25J15j55J83Ok59J41k06J09Q6m0N4r3L8
$$ plain form
4895 202 -197 -66 -34 93 111 39 72 67 -15 60 39 145 -85 25 98 -80 6 102 -5 -56 -111 -64 64 -1 -24 -49
4921 -49 134 -68 -98 194 -2 -87 182 -79 72 107 65 -111 -43 26 140 64 174 40 -38 -9 -86 81 80 -79
4945 -79 -156 123 -31 134 -25 6 -16 75 57 -26 -113 82 -5 -60 3 -47 56 -54 -51 -11 89 -50 -37 -16 -118 -6
4971 -6 -33 37 -29 12 50 -111 227 -157 -5 -64 -83 58 9 159 88 -10 174 91 30 -44 35 -60 8 -46 73 154 60
4998 60 67 128 56 73 90 -32 -184 -30 51 -56 -61 164 -4 88 -92 50 -74 17 78 -74 -107 -51 -122 -26 107 -23
5024 -23 -19 101 -17 -61 -28 -30 161 41 -41 -100 -71 117 11 0 41 23 15 -31 40 -23 -83 -63 -98 7 -22 22 47 -53
5052 -53 51 6 28 -94 38 -74 181 -39 -41 -66 -46 94 63 -63 -48 -54 -1 73 80 10 51 33 -58 131 -1 -103
5078 -103 -106 140 35 87 39 -80 20 85 27 131 6 121 -34 149 155 -104 37 -169 -60 26 -14 40 -53 -15
5102a5L5j71Q5r9J73k1j38R2J16k3n3j1N0P2l6oj91J18J89j36j25P6L1L9o5J05
5128I1M9l09L06K1o7lK8j56J24l4k7j01jJ05j42Q4j38O5K7n5Q6J44mm8rj35J73
5155G4P2j76mO4m6j5L7q4K18j35J37j84o8K33L5j04k1M6K32l70P4m9Q5q3R7k17
5181a52Q8R6j34J00M5O7j78m8J82k51Q5%j11J91m1k7L5Q3O4o7nP0j94O7J26j35
5207d4m3M0J43J09k40K1J10j17r1J72l6j09O8P4j93J01j8m2J51p5N9L9L9k37J81
5232F2m6j69J10n8J62j23Q2J16j67pLJ47k31P5P2j68M4K00Km6p7O1j4Q1k14M1
5258f2J54k11L7J22o4j11O2l8J64j8pl5M9m9m2L0M4j13O2R0m9O5j10r5P9J06q4
5285b4Q7q9K0j5j4O5j82J40R0q6j63K46J4l3j72K45j58KQ0j35K33k61J87L1k27
$$ plain form
5102 -15 20 -151 -66 -165 8 -13 -151 -59 57 34 -19 -30 20 92 56 50 -141 -23 166 30 -95 -19 12 51 -14 91
5128 91 140 -169 137 158 91 88 116 -40 84 50 23 -78 -79 26 -116 -32 -170 -105 -78 -133 -47 97 93 45 36 -99 74
5155 74 146 -30 -34 30 -16 -31 6 -78 140 5 142 -42 -110 123 158 54 33 79 311 -59 15 -34 51 -32 65 -152
5181 -152 -64 32 -102 -2 43 110 -68 -116 66 -185 -100 -100 -211 -20 -61 -88 -53 30 94 27 22 92 -102 -35 91 -44
5207 -44 -87 -47 96 205 -35 -14 96 -21 -112 60 24 -85 -17 57 -136 -35 -53 -95 56 -19 40 79 118 -119 62
5232 62 16 -153 -43 -101 61 -62 20 136 -31 -38 -35 112 -119 -44 28 -140 -96 104 106 60 -17 44 30 111 -103 -62
5258 -62 92 -119 -82 40 -24 -135 -73 -111 53 35 28 -7 42 -7 -49 -19 25 -88 -26 64 15 80 -30 -125 -46 60 -24
5285 -24 63 -26 -6 -21 -35 30 -152 -12 78 -8 -171 75 89 56 -116 129 -29 -27 53 -82 151 -110 77 108 -119
5310a19J66Mj11q7L12n4j35O9OLk18J95j67M5J17j18Q8n7K8N1J37k11n5K90k57
5335g8K02m6n6k0N9q2L4q9Q8k0M6m3P9M6j25P9j1m9L1q1n3J04j16M9R4L7L3J5
5363A27j44K10k90J59p6O8j01R8j27J7J15j09J18j88L2J74j12kJ5j16J44J04k02
5386h6J58j5j89o5L04q8r0j9J32p2j4K3M8M2N8k38m2K40M6k26M7J2N7J56l46J14
5412e3m3l0K05rj65k4O7K59j64L5J02k17J86j62J30%j38n4j44K01%o5J52n7Jo8
5438e5jM4k8J58k15J08k1K5J22j1j39R8Lo7m5mJ50j04J2j6qj62K25j86J04R6k2
5465F1P5j85O0k10K33r6k2Q7N0p4Q8J37j30l4j23J06j09R5k9P9j18K7M0j64J13
5490d3J06k19K31L6r7n9O6N0O0j82J00r3r2J96n2P1L4r2O2j26J12o4j21J42L4
$$ plain form
5310 -119 47 51 -60 -147 165 111 -24 45 51 54 -164 31 -136 -91 26 -92 -4 -61 -33 18 155 -56 -111 179 -78
5335 -78 124 78 22 2 61 -21 13 -76 12 -8 38 -5 74 120 -5 74 63 14 45 -36 -89 15 -101 -52 42 79 112 127
5363 127 -17 193 -97 62 -14 54 -47 51 -76 -59 56 -53 65 -123 -91 83 -29 -31 -16 -132 12 116 -86
5386 -86 72 57 -132 -197 107 19 -71 -90 42 -30 -44 -21 27 69 127 -111 -153 87 133 -93 -46 -34 23 179 -167 -53
5412 -53 -96 -126 79 70 -95 -119 -52 207 43 78 180 -37 149 -13 117 117 -21 -75 -219 -18 -18 -83 69 12 13 -55
5438 -55 -56 -12 -40 118 -97 11 -10 15 137 126 -13 85 88 21 -24 -28 122 18 30 14 6 -156 69 -117 -13 83 61
5465 61 136 -49 11 -199 34 -62 -84 3 53 -21 67 204 74 40 -83 23 -86 9 -20 59 -59 -32 8 -156 -43
5490 -43 63 -156 75 111 14 -45 21 71 131 -51 49 -44 -136 60 8 79 113 21 83 -43 69 5 -116 26 60
5515F0O2j16m0Q0j0m5J52j30J68j01m3J3j2J44l46K80M2j77N3P7j30J4J5Pj56
5540a39O1n9J58j45K79r9k40K55O2j5k23j0M6J83j41K01l8n2k84j4K47K1n5J99
5564A98j93j81O9N8J17n8K8p3J9JK8Q9j44O6Q0r4j10K61j89K2J2p7mP7N2j30K5
5591e1O0m1L5j10K01j67%P0%J17q0J31k09l8J09n8j6Q7j54M1J2R6j25j7J32l6
5617a1J40jj78J01n4k3J23p6j8j96J02J23p2j4M8M6j01j0k7P3o0j38K39L3j93
5642a44J69j34J22O5k7Rp1l1M9k9n0QJ72o9J06k43Q5M7J04j18j01o8J31R3j85
5667a10J27P9k63Q2J09L6Q4j46j44K94r8j46J69p0J19r9P5j70M3m0J92j59J19
5690H3j72Q5j32J05J80o2p0jjpj56J51J95k16j5O3p9J16p9j56K00p3J59m5J11
$$ plain form
5515 60 122 6 -34 46 36 -9 143 13 181 80 37 50 38 182 -164 116 158 -19 34 111 -19 -5 10 17 -139
5540 -139 -78 -137 21 -124 155 56 -184 71 133 118 -105 -115 -69 114 -27 174 136 84 -200 -214 33 54 -1 198
5564 198 5 -176 -107 -49 68 10 38 -35 -16 -15 13 102 -42 24 104 10 -100 161 -28 -6 6 -71 -75 2 54 -76 -51
5591 -51 9 -32 3 -107 94 -73 -73 -3 -3 114 34 165 -44 -82 27 -31 -47 40 -114 -73 -61 35 -90 -107 25 -11
5617 -11 129 128 -50 51 -3 -26 97 21 3 -193 -91 32 -40 -54 -6 40 -61 -71 -98 -25 -85 -223 16 49 -144
5642 -144 25 -109 13 78 51 60 -11 -42 7 -22 -72 -64 108 39 145 -98 -13 34 138 20 -81 -149 -18 75 -110
5667 -110 17 96 -167 -85 24 60 144 -2 -146 148 50 -96 73 3 122 23 98 -72 -29 -69 123 -36 83
5690 83 -89 -4 -136 -31 149 87 17 16 15 8 -148 3 198 -18 -33 30 -49 67 -12 -168 32 -41 118 73 184
5715A84j61O4mj16k3K7j22P3J46k24J46J00r4n1r0J5J73K9l04J46m4J40M3o7j3
5740b7J37j32j6J2n9K33j16Qp8J87q5q8J04M1j06j18K2K2J01j96K32j61J40P5
5764A32Lj60o5J72j8j09k5J25P0j04l9K3N2n7J85j15j34J11j6P2k4j55J05j42
5788a13OL70k34mk9J62j6j77MO0J36j80P4k49J49k4l4K30j72r7J47J0J6n3p8J07
5814A1L5M0J8r3q3j1j00J11N0j40K08j09K1L9J66j80J98j51j03Q9j83K79l6m2
5838C4L5j88J12P1j13K1P6k9N2k31J60j11j2J47knp1J59j88R9j4O0p0J23j3j14
5864a2j9J9K04q2k3J9k15J29m8mk4K93k42J01j0nk33k5J5J10N6Kj69J79M5k2j39
5891a00Q2O0r8Q1m4j67L9K07m6P4k8O1LN4j46j12M5J47q1j64J14j04M4J28k8R5
$$ plain form
5715 184 23 87 83 -33 -56 -29 -151 -78 68 -156 -10 90 -4 -55 -145 -130 43 72 -232 -86 -130 10 53 -14 -27
5740 -27 110 -22 -38 -26 -85 148 32 40 -38 149 64 -24 80 121 15 -103 -81 -59 42 -154 78 -83 57 132
5764 132 135 -25 -90 82 64 -45 -70 55 125 21 -18 5 57 0 185 70 -64 47 31 103 79 -76 29 -113
5788 -113 -107 263 29 25 -4 158 142 -35 -31 29 165 -15 59 -190 -41 -65 -99 131 -41 -138 9 19 35 -18 -96 11
5814 11 46 86 104 11 -72 -83 -183 -72 -22 -162 46 -63 -42 -3 163 -17 181 30 -73 16 -167 112 76 34
5838 34 69 -119 -7 64 -49 -28 48 19 71 -160 0 -111 -123 24 22 17 -54 105 -83 16 2 62 -8 115 102 -12
5864 -12 -31 -12 192 110 87 106 -109 20 -28 -32 -56 237 -5 96 86 81 -152 -177 -162 -52 4 6 -163 16 61 39 -100
5891 -100 -18 42 -56 25 -19 -186 -147 60 14 88 60 121 124 178 32 -80 -35 112 31 -133 -19 -123 -79 49 21 116
5917A16j76P7J63j30j05J55p1m8N4m9j20P0J27j29q6J37q2O1n1O2n0J16j88O8
5941g9J24n8j7J6n4J61k95L75M9j81q3J16J1k88K8J60R0Ko5O3N2m9j85K6J24l1
5967A2p5K46o5j79j35J71N2p4J91k51l1J62k0p8l1N1n0J57J9k6l2m2R3j34PJ1
5993e1K30m20L61k65J33P2k31R2K9j0L1j52K91j02J3K49l76P9j03J36j7nJ18q4
6017A8P1j35j07J47J19k20K31j29j66K28j34Q2NL8k8l0j30K12lm9O5j15l0J26
6041F6j47o3K56j34K06l57J60p1P3K8OrJ86j57J1N9j03J33k17J98j98J29m4N2
6065F3k23J02n3K55k00M4J56o6j44J15o5J07k08L8J23j29J0jK17j70n1P5l7K12
6089A70l56J05J22j80J81k0j40R0l7M8ll2J16J23l0k98N9Q1Mqk5k7J10j70R5J54
$$ plain form
5917 116 -60 17 180 50 -55 100 29 -19 35 -14 -134 -64 63 -66 -152 -15 -97 -36 -87 -25 -75 41 -147 -79
5941 -79 45 -13 -30 -14 -68 93 -202 173 222 41 -42 74 85 -203 -175 -15 75 77 12 75 127 78 -107 -81 43 12
5967 12 -63 183 118 -61 -196 -25 27 -47 144 -107 -138 24 4 -74 -105 -54 -104 53 72 46 14 -28 65 -69 -62 -51
5993 -51 179 -241 120 -145 -12 60 -171 -79 -50 -60 -29 -181 110 8 21 270 -106 -27 -130 6 -11 -16 102 18
6017 18 89 -46 -153 -6 113 -107 124 -5 -171 57 -77 5 10 48 20 -10 -140 72 69 20 85 -30 -60 66
6041 66 -81 -144 112 -22 184 -173 -13 -84 -11 17 23 14 200 43 54 113 10 143 -74 124 -74 55 11 63
6065 63 -160 -58 -111 144 -56 -12 144 78 -66 49 -16 91 -117 -79 44 -85 -75 -76 141 -29 -80 -5 -42 170
6089 170 -186 -81 41 -139 42 22 -118 -28 -65 -17 -20 -52 64 187 157 -141 -82 -1 3 -5 -30 -57 53 -117 -22 132
6115A32p2j58J49r1J20k7m9Q6m5j7pQ9r3k64J37n5J46J01j17J31l13K38j16J00
6139Eo9R0j2K10j53o9k6J40J6m1K9j01o5n0J12p2l5j1P6j08J60K4j36K29K2j28
6165C7r0R3o0j09J72o3Q4P3j93M5k9Q5q5KJ58j71Q1j26P9k5N9K1M6j31q5K08O4
6192A40Qj01j20J6K02kj93J8o9L18j92n9j56K50o6k2O0j80J45M6o0P9jj16J07
6217E2nq4K11m4j09J78j99L1N5k1R0k34J43O0r8L3k6k5Q1r9R7j48M4j01oL9P2
6244a3j6M8Q0r8R4R9l00L55k50K4J10j87Q6R7k51J38M7j04K6J42r8p9L8oj01p8
6270a97J45l9M5J68j16M6j8R9j44o8J08m0j08J43r9j89L52j53J24j27J91r7j69
6293a43O7O4l1m4K5k3J49j43j7R9o7N3O1m3n7J40n5j53J19j8j01K54r7j55J44
$$ plain form
6115 132 60 -98 51 -40 80 53 4 90 45 28 21 110 17 -247 -110 -165 -19 82 -35 96 -217 21 -95 5
6139 5 -64 26 14 224 71 2 -24 116 132 91 120 19 -46 -96 16 -56 -91 -102 -26 -134 26 50 -86 143 165 37
6165 37 -53 40 -20 -129 43 -20 64 137 -56 -11 -40 45 -40 -38 120 -51 30 -96 -17 -42 17 38 84 -47 -132 76 140
6192 140 148 47 -73 -57 145 143 -50 -32 -101 217 25 -34 -190 60 -6 -28 32 -148 -3 43 -17 62 61 -55 52
6217 52 47 -37 174 130 21 199 0 31 86 65 155 -79 64 124 26 59 33 8 89 -10 87 -61 -17 -118 -124 -85 -13
6244 -13 -29 19 99 1 95 194 -106 249 -1 23 133 -54 32 129 -122 16 63 -41 -15 127 29 -50 -12 -18 -119 -197
6270 -197 -52 -91 -46 122 6 52 34 133 -11 -79 29 -11 -119 24 -75 -264 88 -65 59 -68 123 26 -143
6293 -143 -76 -12 -43 -87 -62 -85 64 -79 -96 3 -64 -11 50 7 -50 90 35 -118 1 -17 -118 136 39 -116 28
6318B8J0n9j3J17j11q0R2K2OL1J27j84R4k2j22o7K57r2j36O4O3n0M1m7j91M65
6344B43j70j83J54o3k4O3M8ln4r1j00R8L9J09Mj47J50k46K71j71O4o2K2J37j06
6369a8m2L7j02O1R2J51k06k3m0L5P3j04R0o0Q2r7N7j5Q3m9k8m5L9l5L3j8J03j63
6397a09M0J96j60q1n2J66Qom0J10k00k1J08p8MM1K12k07R1j8J70k58K76j22O8
6422A38j60L6j13K44k47j3K4J08j30J29m6r0K17q9j58K31j94J20J3qm1O4J97l53
6446a21O7j2K20k92O7K5Q8r7P8Nj86J41O3q2J31k72K04j02J12P2r8j01j67J93
6470f4m0P4l3Q7L1J98k18O9L1n3k5L3Q0k15R5j17J1lO6o3J38nj29K1M2p7n3L4
6498h5K16j35j7Q8o3O5n6%m6p1J76k41J76j2j65J15P0P7l09K11m5K2%o7J96o8
$$ plain form
6318 28 38 -21 -34 83 -28 -108 -16 6 12 43 170 -14 80 58 -64 -131 126 34 -102 -38 25 -25 16 -31 -222 243
6344 243 73 -110 44 -19 -43 20 68 65 11 -80 -180 -82 -43 66 70 -77 73 -173 98 -73 -9 -71 -49 88 -18
6369 -18 -60 -23 -125 -64 28 179 -27 -50 -90 -55 18 -86 4 -56 26 -71 -14 -29 54 5 -23 -68 -29 -64 -31 -49 54 -109
6397 -109 -69 127 -33 -114 -166 0 8 2 -38 72 -128 -149 -41 -119 -115 -74 138 -69 22 4 174 -84 192 70 138
6422 138 -22 14 -99 145 -102 -115 -91 17 -113 16 -30 -120 97 8 -150 81 -113 7 20 12 -29 35 232 -121
6446 -121 -54 -66 154 -138 -71 -46 42 -55 23 28 -158 -17 46 -36 95 -177 27 -75 37 109 11 -90 -257 -64
6470 -64 -104 -30 -63 24 55 253 35 104 135 82 57 90 170 -45 50 -67 -56 -59 7 -56 82 77 -52 -31 11 -66 -119 -85
6498 -85 131 -4 -21 67 4 69 13 13 -33 -104 72 -169 7 -5 -170 -55 15 92 -217 -6 -51 -29 -29 -96 100 32
6524C2l0J27j83O0j46J35J38o0k07R8J26q5K6j5J23l04K56p7J46j11n2n8q2K04
6548F1j88K76k00L5lj33K02k01O4N8m9P3j19J58p2o7L3J8R6j50K6J76j95RJ60
6573F8o1L3p2J9O4K5j29L5m1K06k20P1n8J99J3k41J65nok2j02J78k4j29K2K1K
6600A1l3J34j36M8P2k3r0j76K37k4j69K2O7J35l7N1j17j18Q8R3j46J36LO6j46
6625e2l3P8M1J8R4j91J48m8j65J53o4L5M5j06J37o9j27J47j48j1rK24n4r5P8r7
6651g1L3N2j7M3l3Q0mj09k9K01l2j58r1L5k7Q6J43k4q4J12J13k67J46Q2r2j55
6677f7M9m0J43M7k70J18J69j62J34j22n9L5j7qj2M0LK09j02nN4o3j57L35m56J99
6703ek9Q3M8q0Q6q6m1J04J4m9k0j42J70m1n0J82m2n2J9j33J14r0J24j77l7J06
$$ plain form
6524 32 2 129 -54 6 -140 -5 133 73 -134 -36 90 5 31 16 139 -165 91 14 160 49 -3 -61 -143 61
6548 61 -127 149 -51 -16 -19 -152 50 -151 -87 -29 -78 -5 -124 34 -38 -105 -72 -54 42 -108 -82 94 -101 -92 68
6573 68 7 40 -32 -13 51 76 -53 -18 -59 147 -73 -2 -60 139 152 -89 76 71 65 43 -59 119 95 -34 -12 9 11
6600 11 -22 112 -24 24 96 73 -17 -193 44 20 -149 -127 -60 75 38 89 -28 -146 -58 35 -111 25 28 94 -52
6625 -52 -85 -7 34 52 146 -45 103 55 -110 43 -21 14 59 -47 90 21 -106 41 -107 -118 -127 97 43 -52 26 -71
6651 -71 -38 14 -3 40 7 87 83 -26 -55 146 114 -44 -135 -100 -127 -41 102 78 -6 106 219 -48 98 180 88 -67
6677 -67 -18 -58 85 132 -138 -20 149 -13 121 -1 -60 -25 -42 -50 -62 -22 -19 190 88 83 137 74 -83 252 -204 -5
6703 -5 -34 49 97 17 103 17 -24 80 94 45 25 -117 53 12 -38 144 102 50 69 -64 50 -40 84 -93 -130 -24
6729b4m6K0P6J70k69M0L6M4NM1j47N8lP6k4j92O3J73l5q8om1J18r8M6R0j58J80
6757A05m8Jj25K05j33P8j64K8O6M4m6r8Q3o4Q4J7m2Lk7j2J01jj01O3n7n5NJ8K8
6786d4J21r5l5J48k55J67L3k43N0J78n0J9q3N2J05p8j41Q2J12N3l1k42Q3L5J11
6811E2l9on7K8q5LQ7j29N9K7p5K09j65L8J24j34P9k4J92k25R9j2m6j3P4n3Ln6
6839d5j4N0r7J25o9J64m2j9K1j47Q8QJL1j65K1J34j2L5j99J03J11n7J19j74k4
6865e3JL8P5l4J72k36LM3j7K46j92R8j14L7j99R8r0J01rN5j2pj5mM1rJ53j71J28
6894A27p8l0Q1o7j23J01n2M7j26J26mJ1KJ01r5j51Q4J52k62K98j31J22j79N9l7
6919b4n8K0j15J53P9q6KO4K8j28k8p5J13QJ02m7J9p8K20l0k8o4J0k4K4j61N1j14
$$ plain form
6729 -24 -70 -50 26 196 -73 -33 3 47 52 93 -54 4 1 77 53 -139 -76 97 62 -26 -32 -73 45 -53 -7 83 -75 105
6757 105 57 58 -67 138 5 83 -81 -53 13 57 11 -87 -4 -68 16 33 -9 -6 -33 -45 56 55 -46 17 -40 -95 -90 -72 -44
6786 -44 77 -18 -53 95 -160 7 40 -203 -153 25 -25 -6 -89 -37 68 -10 -151 -69 43 96 65 -177 -94 -59 52
6811 52 13 7 -50 -22 -107 -104 -17 -146 -87 -60 -135 74 -91 -53 71 -63 16 -8 184 -41 58 46 0 -13 61 8 11 -45
6839 -45 -59 -9 -106 19 -50 114 72 53 74 -73 15 23 24 55 -110 -89 45 33 68 -131 -28 83 26 145 -29 -53
6865 -53 -52 -14 61 27 199 -37 -34 9 -8 238 46 144 30 67 -132 -34 -124 -23 -32 23 11 4 -11 -15 26 17 170 -1 127
6894 127 49 19 100 33 -90 11 -41 6 -120 6 2 13 15 116 21 -130 -46 106 -156 142 11 133 -46 13 -24
6919 -24 -82 -62 -177 -24 55 -31 -29 35 63 -65 -93 -168 -55 -47 55 8 27 -51 169 139 111 47 57 33 57 -104 -53 -167
6947a67J98K8o2N7k0Kj23Qj3L5K07k14J75j49j3J08npj85J17j8L0j59R5P7K8n1
6974b1L7K14k45J42m6j04MJ30l9k51L38j27P5j20Q8o5j12J16Q1mj2j41K32j68
6998BJ36j31j70r0K69p2p8J23m6J18j57K9J80p0n0rn8Q2J2nR4r8k0j12Q9l5L0
7025c7K26o0k48R6R5k4P6j14M7m5J2l7l19K42J34n9o4qK06j71l2m4J28j24J28
7050Dj80K72m1j11K29j38o8J40q7M4n5q3n7J05LR9O8k10K21j49n3L3J02j64J09
7075C3j4j51K55j12j10l9J57j35M8K02k08J0K7J9P9k17J76k7p7r2R9OQk9K4J02
7101C4o7J2Rk1J24j31K4k8o6P4P2J58k21J62j27J3j8j0l9k6J75j12mj44J67Po6
7128d9R9o7J1J09j22P3pj25O1L3N4Nl0k4Q5l2l8m8K3K8k22J82J40j44no4l5Q7
$$ plain form
6947 -167 31 59 -3 54 34 36 -87 -79 -92 -57 150 -64 111 -38 -51 57 52 45 -140 -23 -41 -11 -170 -75 2 30 -21
6974 -21 16 230 -15 127 81 -23 -19 111 72 -179 159 32 107 -13 75 10 -102 14 95 91 79 -62 170 2
6998 2 138 7 -163 -253 16 -56 -134 -11 -57 61 -96 -67 113 43 -7 -16 -74 8 20 15 109 11 -9 -121 -32 -67 -37
7025 -37 189 129 -119 -23 72 48 124 10 57 12 24 -13 -332 -90 44 -15 -79 -87 119 -52 -84 -128 0 -124 4
7050 4 -176 96 55 -56 173 35 -33 107 20 64 9 -74 -131 -26 -23 76 144 -66 155 6 -47 -14 88 -76 33
7075 33 19 -132 123 11 -99 -138 19 -116 -68 134 -74 -64 -37 -18 61 -156 20 -7 -84 -176 -77 -71 -63 -92 -68 34
7101 34 -33 -21 -12 -33 91 -40 -16 -44 -110 -36 36 194 -27 135 8 21 3 -7 -46 -72 103 -9 -13 -157 10 17 -49
7128 -49 50 -17 -6 103 -19 54 47 -78 -17 16 70 75 45 21 106 74 36 -12 11 39 -183 -1 139 -5 -10 -74 -109 -22
7156b2J22K7k7r6J7J19j60P3p0L7n1J83N7l17j17K18J34k77L30j73J77l18J70
7179C6K41l57J8J06n0J0K9o5m1M8R5k94J65R8j59J79m9Nn6J17j02n3P7j41J72
7204B9j56O6J70j34L8J2k05J88L1m6l5j23J18P0l7o7j12J39J77k6j41L7j23J42
7228A2l3M4J1j84J82q3O2JP1J7j49K05k46O5R0r7J53k5j04j02R2N8P8n7k1j47
7254a07OJ70m6J35k54K05j48k10K08l2OQ3P7o0L7j33J15J1O9j30j13J81q0R4q
7279G6m8l0m8J42n3l0M6j80M1J91j89RK32j34j7o3KP1o0m7J28M6j31k4l2P7Nn2
7307g2J28m2PR0r8r0J61j84J74j90J78N1j70N0J24k14P7j66K78l4k6k4k6KJ52
7332A36k24J35M6r4k2M2j02O0J09p6j53J11q0J37O4O4m8R7j79j5K9j3N8k16o8
$$ plain form
7156 -22 100 127 100 4 21 140 -20 53 -17 20 -31 152 209 -108 -225 -7 127 -150 180 7 184 -134 36
7179 36 277 -80 -62 44 -6 4 33 -32 -73 -25 70 -224 -59 39 -120 59 10 15 -41 76 -26 -79 -2 -143 29
7204 29 -127 -61 109 -25 13 25 -180 8 39 -7 -42 -165 -47 23 -14 -81 -193 -54 123 97 -44 -7 -130 12
7228 12 -21 23 34 -150 32 -51 11 12 83 100 -49 156 -90 -25 65 -32 121 96 -8 -110 -18 40 118 61 40 -107
7254 -107 -101 69 23 158 -96 109 -39 -249 -41 -73 -67 16 93 33 70 -63 52 63 132 2 -111 70 -10 84 76
7279 76 28 -2 -50 92 39 9 55 -125 -84 107 -82 -73 159 25 8 -55 -53 18 -42 -89 39 85 -46 -70 -102 -25 -20 -72
7307 -72 56 14 21 111 13 -77 84 -100 74 -116 62 113 -57 -7 117 -97 -20 -186 92 58 32 8 -18 -16 136
7332 136 -88 47 93 -1 -23 19 -83 -23 86 10 -143 -32 -112 25 89 153 105 202 23 8 37 24 82 -134 -202
7357b02J39R3O5j5J29m4j65J1k5K15j06K3p3q3K9l7m0j8J48N1j23Q9N8j23l3o5
7383a02J84pk0j23J79j66QJ42lj08mj25K17n6LJ9r1M2N1P5j6j46P4P7K9j22p4
7410f3J40p8R4j79O3J29r2o8jR7n0Q5p1k1j24J63J3nJ7l9J54k16J79N1j64J0j2
7437A2RM0J4m3k4k0m3K10k19L07k62J2K8q8K0M0k9J02o7j3p1J37j67J69j13q2
7463a41J76m7k1l9J91o4j17J93p6n9J29l18J63J61j84j34K98j18n6L6K7O0j12
7486e2K3kJ34j71N2Rj15R1k9J1J14m4j09J95o6L0L1r4r7J8J50j96R8K51j55j41
7512f4p0M5kJ46o6l1Q7Q1n1J1m0p2J25jl6k25J32o5N4PJ59J12l65Q5M9j06O0j
7540d2P4o4J08p1J4K00k86N0NrN2M6P6Nj32r4J74r6J20j54Q3K3j8j08M2nO7q2
$$ plain form
7357 -202 -63 30 95 80 209 165 0 11 -14 201 95 118 45 -38 -9 -46 -86 -104 44 95 -28 61 119 -4 -37 -102
7383 -102 82 75 55 -68 111 -55 -47 95 92 -16 -20 -145 72 16 19 38 -53 -11 40 115 99 -47 27 104 133 11 -63
7410 -63 77 -1 93 -86 -23 106 14 -54 -55 42 -8 77 6 -15 -139 24 37 32 49 10 164 -52 127 178 14 24 12
7437 12 21 61 75 32 8 -12 -55 155 -64 243 -19 -7 21 -67 -47 -7 -36 66 -1 -14 -85 52 -115 54 -59 -141
7463 -141 35 -12 -33 -72 119 55 -62 131 55 -4 125 -193 -30 131 -53 -187 111 -7 -63 -27 0 60 -52
7486 -52 -29 -31 103 -68 -16 -7 -122 -31 -60 -49 65 21 -88 107 41 71 102 8 -89 -71 79 -117 -19 232 77 -64
7512 -64 -134 -89 -91 55 -11 -42 45 126 75 86 46 -26 99 98 62 -163 -31 -96 -42 -35 124 236 -129 -44 5 -101 -41 -42
7540 -42 32 -32 76 5 19 219 -67 -17 -12 -21 31 77 153 158 26 -68 106 10 130 -24 59 82 64 -44 -2 -7 60 -22
7568b2R6p1P5K27k15M1q0o3m3k9Q9J15j73K7O3N2o3M0L4j53O9j10l6J07J55K7
7594A59j83J42o5q9O0r1Q7m1kK3J03j35K07j72J06m9j03O3L9j51q0K56mr4QM9
7620D3o3K10k17Rj1J40j01o3Jq3K3Q5M4J09j09j73J17L5M2oN9r3q2J11K4l6L8
7647E3Kj3j23J68k8j11J9q7K63j46J16l1o5K46l60Q2J3Q4l5n8J55k08J42p6NK21
7673B28j36J07p4j32r1J39l8j38J79p1m1J36p1J21j21j06K96l32K13j80J23L0
7695D1j74J97j07J01m5K5L0k5l1p4l6Q5P3J4j28K6K9r4J15p9J20j43J50k6N7j81
7721h0J03rq3K13k03K8K50l65L2O8J49m1Pj45L1m6K2P1J2j07L9J5J08j92M1J31
7747D9j38M6o1J48j38J88J2J6m9Oj95J62j34K15m2j92l8M4M3J43l5L3j63P1q3
$$ plain form
7568 -22 74 3 78 305 90 131 51 -12 -55 -84 5 120 -53 -26 37 89 26 66 100 -53 16 -94 -130 -23 132 159
7594 159 -24 118 53 -36 24 -67 20 -21 -23 0 103 -32 175 3 109 60 -43 20 59 -92 -172 84 80 -14 -6 43
7620 43 -20 190 -27 -18 -29 111 10 -53 -52 -135 -112 -27 17 126 17 -156 -39 -4 38 32 91 -2 -84 27 51 15 53
7647 53 55 42 -81 87 59 -52 -33 -120 143 -3 113 82 17 263 -97 -15 -2 82 47 -11 144 -64 78 2 7 228
7673 228 92 199 125 -7 -98 41 3 -135 44 -27 -68 68 -3 118 -3 -109 187 -145 68 -112 11 41
7695 41 -133 64 -43 58 13 38 68 43 12 -62 -98 -13 60 74 -54 -28 1 -93 22 -57 63 -80 70 44 101 -80
7721 -80 23 14 -69 144 -59 -31 219 -146 -114 -46 103 62 69 -76 -45 -91 -69 2 14 -93 -54 -39 69 -123 -82 49
7747 49 -89 -43 -104 44 -94 94 106 122 73 79 -116 46 -88 127 85 -107 -145 -101 -58 85 50 83 -80 -9 -92
7772i2J21L2n3m5P1Mo9J36n8P5k83K26m1j35R4j26J57J0j01kJ54p7r8J27N2j79
7798a00oJ35K2q5N9J21j48n9OK18j33n0L6p4J20j01L4M8k07K27R1j86j1R5L5m3
7824D4j34m9L0J05L0p9k3J7l6K40n3j97K09j29q5J9Q3O7j08P2j03O3R8N2p9N8
7850A12j69JK5J91j81k1K2k5J61j15RQ3q8p7m6M1O9M9r4M9Q5m8k74o3O48l86j84
7877b26J72J02L6r9O4q2j9k0J18j10P4k7j14J03J38j68N4J3j3N8Nj18L0J23Qj20
7903a8J03j61N3n3J40n5j1k7k5J63n1K6k72J33J29j0j74K31j91J43j9j0o0M8J84
7928B16k46lP7j06K5o1K13l37Q3N7R1n3J9nj2n2O5P5j46J45K6p4j31J86k08L28
7954A72l31P4J92j94L00k49J31j56K62k63R5l6M4Ko2J90k75J33o2m9oK43p8n1
$$ plain form
7772 -92 29 61 8 -37 34 38 -31 105 47 122 -161 65 24 -111 -17 -143 14 24 -77 -79 75 -2 -100 27 79 -100
7798 -100 -106 29 51 -34 25 146 -2 -61 -55 163 30 -20 16 -58 62 -39 -5 43 -164 63 154 -32 -43 52 87 44
7824 44 -90 -139 -109 -4 26 -53 -76 -59 -95 145 92 -105 104 -25 -110 -91 -8 59 -49 23 -80 -17 81 133 54 112
7850 112 -57 -56 -31 160 -21 -42 -20 -45 116 1 10 93 5 -72 -118 -77 -8 41 -53 -4 81 33 -241 -304 344 -42 -226
7877 -226 -54 48 84 -15 49 -33 -52 -72 46 -64 10 -17 -131 -28 110 -58 -4 9 -4 54 59 -59 -29 94 102 -18
7903 -18 85 -76 -23 -76 64 9 -2 -29 -54 109 58 84 -188 -55 74 64 -110 121 -70 73 54 44 -16 32 216
7928 216 -30 -33 44 -62 -37 -98 115 -222 -139 -82 9 -44 -25 -30 -42 -94 -29 46 -100 45 71 -3 -134 52 -156 172
7954 172 -159 -85 107 -87 213 -36 95 -61 201 -62 33 -3 41 43 -19 171 -104 29 -33 -82 -88 155 77 26
7978B6j19M3M1J07L4j19n7R9n6m8J13j6j14N2N1j35J69p4L4J1k33L52k28J12p6
8003c1l9J56k8L3j02M5k06K24r9k9q5K14R8k49K07j32n7n3K44k11K11J3j82QJ87
8028A37k57Q1o2K2J35n7p4J29l3l8q7J89j07O2j38M9R6j44L3J8K2q7J69k07J18
8053c1J47l1j34NQ0K8Q1p2J8j35j7l3J25J58l45K3M01k72QN6j20R8Nj30k6J75
8079F2m4J9j09J71L8pj32Q1k10O3jK71p1l22J80J70j67N7J9j06M1M0J80j58o6
8104ao6j3J05j75J88P9k31K15qLr4Pj16K61k16J6P6K9K1m8J47j84J09j89J44l1
8130B8p6Q6M3K7j21j96M51k79l6Q9j56J52l3j0o1J64l9n2J17j16j3P0j63l5J55
8155dQO2j00J63k55J26nl9L3L5j3%P3Kj48R2k85K06j63L45k58K7M8Pko9l7K30
$$ plain form
7978 26 -93 -50 -9 98 132 13 -44 55 -1 -49 64 48 -66 -14 37 -98 71 -3 31 42 -191 161 -67 45 -31
8003 -31 -70 86 58 91 -11 34 -172 52 -47 -76 -161 53 151 -98 109 -23 -80 -133 111 -100 111 124 -58 -50 137
8028 137 -120 -39 -101 -79 56 -1 -75 54 21 -17 -104 85 -22 40 -98 -49 47 -97 -64 -46 -24 -111 58 -149 -31
8053 -31 116 85 -49 -44 36 64 145 73 91 -44 -61 -94 31 189 -156 -133 268 -4 4 60 -60 38 43 -87 -113 62
8079 62 18 37 -72 99 137 130 -2 79 -131 -68 -69 202 131 -191 -11 159 -8 49 68 -38 3 43 223 65 -1
8104 -1 -67 -80 25 -150 38 117 -114 101 93 96 2 9 -107 154 -62 -46 30 59 80 32 179 -5 104 -85 59 28
8130 28 -48 38 81 108 -13 -209 242 -37 -73 16 -140 12 -21 -31 -92 72 33 -19 98 -18 -31 39 -124 -159 -4
8155 -4 4 66 -34 129 -126 0 -5 -44 -11 24 11 11 84 86 -62 30 -255 -49 -212 133 -125 -98 -50 -43 -45 -114 -151 79
8183G9p8m5N7j2J24k3k86J10
$$ plain form
8183 79 1 -44 13 1 125 102 -184 -74
8191g4
$$ Imaginary data points
##PAGE= N=2
##DATA TABLE= (X++(I..I)), XYDATA
0@%%%%%%%%%%%%%%KrJ4j4J4j4K1k8K8l5M2m9N6o3P7q9J01j15J30j46J65j87K08
37A09k32K61k92L27l62L99m45M94n46O01o62P31q07Q90r80J078j190J317j456
56g65J614j795K003k247K539k892L332l899M659n737P399j0325J6998o2873r145
71f1134O3102n7593j7892L4134J9574k6776j656L533J6750J6376j8045l4719K9284
84c5062L8713l3322l5403M2371K6286l7304k4061L2534K3071j1874j9895J641
96c2305K4513R269k6742r235L4736J3284l7020j2994K8303J3815j8513j5879P473
109b1295K0338j641l1261K27M3271J247m4153K775M3564n522l1019J0806K0869
122H206l769r030p613j112K2721P501l6840n023M4250j923m6704J1786M5666j5121
$$ plain form
0 0 0 0 0 0 0 0 0 0 0 0 0 0 0 0 2 -7 7 -7 7 -7 14 -14 14 -21 21 -28 28 -35 42 -47 54 -61 69 -77 88 -99 109
37 109 -123 138 -154 173 -189 210 -235 259 -287 314 -348 383 -424 466 -514 564 -626 691 -765
56 -765 849 -946 1057 -1190 1349 -1543 1789 -2110 2549 -3188 4211 -6114 10884 -51989 -61134
71 -61134 1968 -55625 -73517 -39383 -19809 -46585 -48241 -44708 -27958 -11582 -29627 -64346 -35062
84 -35062 3651 -29671 -65074 -22703 3583 -33721 -57782 -25248 -2177 -14051 -33946 -32305
96 -32305 -7792 1477 -25265 -34500 236 13520 -23500 -36494 -8191 5624 -12889 -28768 -21295
109 -21295 -957 -2598 -33859 -33632 9639 10886 -33267 -30492 13072 7550 -23469 -12663 8206
122 8206 4437 -4593 -12206 -13318 9403 16904 -19936 -24959 19291 17368 -29336 -17550 28116 12995
136A2995l3148J4619K0621n650o193l003j689J7182J260l0615J547L7278o410
149A8794m0704R577L2735j1568k4860Q084J9263r39j3637q659J1921J8965j1480
162G492k1478J2168K2198j3548k0945J1577J7361n087j6689m156J5734J1536j6972
175h09j6527K2404J8436k6162j5329K6785J2705k2026o599J2297L059j513o074
188F47r188J0679J6529k1027k1526K7863J8076l1360j2782L0396N408k4951m5
201a1281J4411J082k772n045p189J0703J3610j9168j4381K5072J1565k8197q473
214b0063K6609N060j9558l565J1750O049m187r535k7J6009K802k0151k448K1088
228I833J680j8664k069J4734K723r815q588O505J4538n310j9648N650K2495q588
$$ plain form
136 12995 -20153 -5534 15087 9437 3244 241 -1448 15734 16994 -13621 -12074 25204 18794
149 18794 -21910 -12333 20402 8834 -16026 -7942 11321 10382 -3255 -11914 7 18972 7492
162 7492 -13986 -1818 20380 6832 -14113 -2536 14825 9738 -6951 -11107 4627 16163 -809
175 -809 -17336 5068 23504 -2658 -17987 8798 21503 -523 -7122 5175 8234 6721 647
188 647 -8541 2138 18667 -2360 -23886 3977 22053 -9307 -22089 8307 13715 -11236 -11281
201 -11281 3130 4212 1440 -3605 -10794 -91 13519 -5649 -20030 5042 16607 -11590 -20063
214 -20063 6546 11606 -7952 -11517 233 6282 2095 -7440 -7467 8542 11344 -8807 -11255 9833
228 9833 11513 -7151 -9220 5514 8237 -1578 -10166 -3661 10877 5567 -14081 -8431 14064 5476
242E476k0857J0409J6695r151j1815N266N449K200j680j1417J818J8498m817k3808
256a7734J0138K5286j4935k0989J5991J5235j3473p651Q214K523J212j341r543
269g067L075J7355o744k1124J1924K0126j4510j6404J4317J2485j1328p905M460
282a340O797K313p202p460R049J1445j2233j1921J3857J0452j2299r053Q630Q011
296I046l723q349j890J1641M814j5614n911J7758N365j8732k588J5329M47j0074
310b481j186M011L464K324r093o199J5098O204j9556m500K1871L38k0782K821
324g666J5770l637r349K060K344K541L179r085m257J5166L865j9012j208K0994
338A1705k117j7504L877J3001k431p889j81L574N575j211j0403J559J3820k110
$$ plain form
242 5476 -15381 -4972 11723 2572 -9243 -3977 1472 3672 1992 -9425 -7607 10891 6074 -17734
256 -17734 -7596 17690 2755 -18234 -2243 12992 -481 -8132 82 2605 3817 2476 -7067
269 -7067 -3992 13363 6619 -14505 -2581 17545 3035 -13369 948 13433 2105 -5800 -1340
282 -1340 5457 7770 568 -6892 2157 13602 1369 -10552 3305 13757 1458 -7595 1035 9046
296 9046 5323 -3026 -4916 6725 11539 -4075 -9986 7772 13137 -5595 -8183 7146 7593 -2481
310 -2481 -3667 344 3808 6132 -2961 -9160 5938 12142 -7414 -11914 9957 10295 -10487 -7666
324 -7666 8104 4467 -4882 -2822 -478 2063 5242 -3843 -8100 7066 10931 -8081 -9289 11705
338 11705 9588 -7916 -4039 8962 6531 -1358 -1539 2035 7610 6399 -4004 -2445 11375 9265
352I265j5196M171J3988m499j0785K319P924J429n974n916N102J0047p181j2208
366g514Q551J2033r991j0521R309O819n903m266Q39L325M377m057j0164P362J2768
381A2967j0914j2679J3269J0549j3976o525J1533K996o397j395M33K115N510m691
395B795r764Q861J0779j2206r717J3868P155j3459m094R453K439m521l051k46
409a708M680M279q435n775J1019N665j2398m567J1710K621q994j979M524M066
423D708j667o203q43R590J891j2307j17J2564o92j1087J406Q474j219m552j227
438a281J117N196L33r149r54J2778j467j4067L503J2766m663j0107M933N544k832
453A650j936j999K22N864j32j0465J108J2769m301j2620N695J0335n945p533M931
$$ plain form
352 9265 -5931 -1760 12228 7729 -3056 -737 7187 8616 2642 -3274 1828 11875 4694 -7514
366 -7514 1037 13070 3079 -7442 1867 8686 2783 -1483 -644 2681 7058 3001 -7163 199 12967
381 12967 2053 -10626 2643 13192 -784 -7309 4224 7220 823 -572 -139 1976 7486 2795
395 2795 -6969 1892 12671 465 -9252 4616 11771 -1688 -5782 3671 6110 1589 -1462 -1708
409 -1708 2972 7251 -1184 -6959 4060 9725 -2673 -7240 4470 7091 -1903 -3882 642 4708
423 4708 3041 -3162 -4005 5585 7476 -4831 -4948 7616 6924 -4163 -2757 5717 4498 -54 -1281
438 -1281 -164 5032 5365 -3784 -4738 8040 6573 -7494 -3991 8775 4112 -5995 -1062 4482 1650
453 1650 -286 -2285 -2063 3801 3669 -6796 -5688 7081 2780 -9840 -4145 6190 245 -7288 -2357
468b357M053o95k347k816K310O782k801r418N178R769o420q308O219O650n033
483G66m489J924L258K179m047m611N400P056p194p037Q701N672p965m307O190
498A496K414l358k257j412L493M069o242n657Q017O097j0336m007J0425K180q214
513c292n43N303N22j064j804k294M903L698p592m554J0001L207j0930j179R593
528C975J05o626N56L589J110J25l668j369O496J951q646j441R655o64r114J066
544b900O374j081m387o31J791K988l87o009O81P880j098q961K530Q424l337o310
560d433K189L826j121k031k063O08N193j906p300K864Q389l914p793N369O077
575C954m517l531K800K013K81j216l570J324O017l651p228M918O884o357n432
$$ plain form
468 -2357 1696 1001 -1346 -4162 -1852 4930 2129 -7289 -2111 7658 1238 -7070 -851 5799 766
483 766 -3723 -1799 1459 3638 -409 -5020 380 7436 242 -6795 1906 7578 -387 -4694 1496
498 1496 3910 552 -1705 -3117 376 4445 -1797 -7454 563 6660 -3676 -7683 2742 4922 -3292
513 -3292 -3835 1468 1990 926 -878 -3172 1731 5429 -2163 -6717 3284 6491 -4439 -5618 3975
528 3975 4080 -2546 -1990 1599 2709 2834 -834 -2203 4293 6244 -2402 -3843 5812 5148 -3966 -2900
544 -2900 3474 2393 -1994 -2625 -834 2154 1767 -4242 -3561 4319 3221 -5740 -3210 5214 1877 -4433
560 -4433 -2244 1582 461 -1570 -3633 -3025 2168 262 -7038 -4174 4215 301 -7492 -2123 3954
575 3954 -563 -4094 -1294 719 1000 -216 -3786 -2462 3555 -96 -7324 -2406 4478 -1879 -7311
590g311N849L465l885k180K017J596J552k050l946L752N380n730m903O225M277
605D108o826k689M897J487k515j631K43K178K793l963l436O249L437o746k665
620e079P210J250n903k76L081Q21j113k208j433L967K433o263j965P487Q96p115
636d210l7O465r65l778K81J601J138nl061j422N329Q07p058J05P055j275o166
653e196J633M835j273k281l05J098K263N2m288L48O339j596o546K091N815k670
669C19m582K389K657q69j294j438J050L421r82n186K317N998l728m854L805L924
685B947l577k316J847J068L72j147k703J820M272l043m816M492M014m635l233
700d638M463K081l099q60O30J042J391j974k845L199L721m761l279N453K025m766
$$ plain form
590 -7311 -1462 2003 -1882 -4062 -2045 -449 1103 -947 -4893 -1141 4239 -1491 -6394 -169 4108
605 4108 -2718 -5407 -510 977 -1538 -3169 -2926 -748 2045 -1918 -5354 895 4332 -2414 -5079
620 -5079 2131 3381 -2522 -2798 283 1104 -9 -2217 -3650 317 2750 -3513 -5478 2009 2905 -4210
636 -4210 -4247 2218 1253 -2525 -2244 -643 495 490 -2571 -3993 1336 2143 -4915 -4810 2245 970 -5196
653 -5196 -3563 1272 -1 -2282 -2587 -1489 774 826 -3462 -3114 3225 1629 -4917 -2826 2989 319
669 319 -4263 -1874 783 -86 -1380 -2818 -1768 1653 671 -4515 -2198 3800 72 -4782 -977 2947
685 2947 -630 -2946 -1099 -31 341 -806 -3509 -1689 2583 -460 -5276 -784 3230 -1405 -4638
700 -4638 -175 1906 -1193 -2053 -1423 -381 1010 -964 -3809 -610 3111 -1650 -4929 524 2549 -2217
716b217j357L791P63j911q44k43J933J718l180k397M562K540n715j216N431L31
732A989m082n7K439J94k81j608q32L137J235m432j398N678K03n309P08M242o56
749A170k785N38Q53J007L00k660n39M214J30n309P85N049j746m081J691K795r90
766D22j725J39M03K047k45l389R88M453j704m721K629L937k803k565J776J662
782A304q43p03j090N59K844j473l674K270M173k912l439L457K232k523j432J404
798A54Q21J11p80k209J720K979k847l273L420K842m015j526L408Q24j764p13N53
815b95R59J138j679k238K963K154l803k144M278J032l905m82K524L61j263m55
831h55j57J581J563k942j417L974J084l929p87M100m38k840J57J470n2l56j070
$$ plain form
716 -2217 -3574 217 980 -931 -1775 -2018 -85 1633 -1547 -3944 618 3158 -2557 -3773 1658 1989
732 1989 -2093 -2150 289 483 202 -1406 -2238 899 2134 -2298 -3696 1982 2185 -3124 -2416 1826 1170
749 1170 -1615 -1077 -224 783 1083 -1577 -2116 2098 2228 -3081 -2296 2753 1007 -3074 -1383 1412 422
766 422 -1303 -1164 -761 1286 1041 -2348 -1360 3093 1389 -3332 -703 3234 431 -2134 -358 1304
782 1304 461 -242 -1332 -773 2071 598 -3076 -806 3367 455 -2984 473 2705 182 -1250 154
798 154 975 1086 306 -1903 -183 2796 -51 -3324 96 2938 -1077 -2603 805 1629 -135 -848 -295
815 -295 664 1802 123 -2115 848 3002 -801 -2945 1333 2365 -1540 -2022 502 863 -400 -855
831 -855 -1012 569 2132 -810 -2227 1747 2831 -1098 -1885 2215 1777 -1063 -906 564 512 156 -914
848i14p29K572Q24l626k19L992J94m040Q89L293j007j868K50P47N40j12k078k09
866a501L153m67l755R76L389j269k995J761J931p62r00j94N56J324k74k837R68
883h96L220j827l236K068K540k260j752J723P07k9o03q19P31K064q83l026K344
900F6K640k565k248K637J274k356o13Q73N61K60j059j211J322K092j990k301L036
917D18J842k849j014K587M29j642q4q0P73N20j298j432K245J432l212q81L001
934G55O77k464P4J826Jn58n90l06J477Q00k161j024K986K91l158K07K617k95k142
953i87M73R09J39J98j300j10K020L21k803K63L224r21k662O95K156r12j233L54
971a76K72O59k4j798L65K270k71k814J009K627j226j925J230J331j035m69k06
$$ plain form
848 -914 -1643 929 1753 -1873 -2092 1900 2094 -1946 -1057 2236 1229 -639 -389 358 898 786 -1292 -1501
866 -1501 1652 1185 -2570 -1594 1795 526 -2469 -708 1223 461 -439 -633 -77 1247 973 -1864 -896
883 -896 2324 497 -2739 -671 1869 -391 -2143 -420 287 258 -345 -1164 -433 1631 748 -2278 66
900 66 2706 141 -2107 530 1804 -552 -1165 -292 269 529 -530 -1741 -419 1673 -317 -2618 418
917 418 2260 -589 -1603 984 1413 -229 -313 -393 380 900 -398 -1830 415 1847 -1365 -2246 755
934 755 1432 -1032 -958 868 869 311 -279 -585 892 1692 -469 -1493 1493 1784 -1374 -1167 1450 1155 -987
953 -987 -514 395 534 732 -568 -678 1342 1663 -1140 -877 2347 1426 -1236 -541 1615 703 -530 -176
971 -176 96 755 731 -1067 -702 1568 1297 -1517 -508 2119 893 -1032 198 1529 494 25 -181
988a81J29J325m73k090Q64K359j461k379J926J553j367r70Q83O61j03n18p74O74
1006E8J438j308j715J581J731k170j394K132M54j300m05O23M28K19n83j260J515
1023D4J220j576j528K329R78k719j44J819J25r69k66K00L79P71j353q91J970Q54
1041A243k158q25K510J55k006oJ377r8n59k11k29R02N03j773m59K233Q3k364K61
1060a421K206o80j239J76Q30o4j59o15j99J620L1j956J28K163l01j958Q25J289
1078F76p03o13J01L10O72o1j510K73J943p61j956J144J840j314j382J413N48m63
1096A57k15j59J60Q33m54j533R48J799j342j532J457J113j473o15Q35L87R4m91
1114c1m43K89J332r55j183J256J128j513r65J515N05r02l17L72L20K72o63o49
$$ plain form
988 -181 -52 1273 800 -1290 -426 1933 472 -1907 19 1572 205 -765 118 779 676 158 -616 58
1006 58 1496 188 -1527 54 1785 -385 -1779 353 807 -493 -898 -275 153 372 -211 -1471 44
1023 44 1264 -312 -1840 489 1467 -1252 -1396 423 548 -421 -687 -487 -108 663 -690 -1581 389 1243
1041 1243 -915 -1740 770 925 -1081 -1087 290 192 -367 -578 -807 95 598 -1175 -1634 599 682 -1682 -1421
1060 -1421 785 105 -1134 -958 -128 -192 -351 -966 -1165 455 486 -1470 -1342 821 520 -1438 -613 676
1078 676 -27 -640 -539 -229 443 382 -1128 -855 1088 327 -1629 -485 1355 41 -1341 72 620 157
1096 157 -58 -217 -57 776 322 -1211 -263 1536 194 -1338 119 1232 -241 -856 -21 366 460 -31
1114 -31 -474 -185 1147 192 -991 265 1393 -120 -1085 430 935 33 -284 88 408 680 17 -632
1132f32J096Q37j465r54J946L73j603j54J502r7p33j40j5N91L21q26q73J729N38
1151A441j981R8J443Pj510L46J126l23j81m67j14J092L8j425o9J800l65j486L72
1170a58J382o08r93M56K50J83j62o71N2J146j67j646N67J529p23j226O11J007
1188H29p06l14k93N05L81j95r40M06J207p29j329Q76J208j019p31Q15M37m68j42
1207b02k90L84P43m92q94O07J172j160q76J168M17o11n66O03R1K20l35p60O19
1226a62R24p03r20J157Q13j356m03J313J05o94j34K47M6K15m65n62P93O02j056
1245b40o35J489L82j224j38J048J42o32l0m6M33K54r35k14J116Jj234k17J409
1264G29k07q66P2M33J63q0l59j9J013k21j147J08J131j26j257K83J118n63o10
$$ plain form
1132 -632 464 1301 -164 -1118 828 1201 -402 -556 946 849 116 -24 -39 552 873 47 -826 903 1441
1151 1441 -540 -442 1001 1008 -502 -156 970 647 466 -1 -115 977 1015 -410 -479 1321 956 -530 -158
1170 -158 1224 616 -377 79 329 512 350 -321 -269 877 710 -936 -369 1160 437 -789 -178 829
1188 829 123 -191 -484 21 402 207 -733 -327 880 151 -1178 -302 906 -113 -844 -29 408 -60 -202
1207 -202 -492 -108 635 143 -751 -144 1028 -132 -1008 160 577 -34 -600 3 94 314 -21 -781 -162
1226 -162 762 59 -861 296 1109 -247 -650 663 768 74 -60 187 233 448 -17 -579 214 816 -240
1245 -240 -875 614 996 -228 -366 682 824 192 162 116 549 803 -132 -346 770 771 -463 -680 729
1264 729 522 -344 -272 161 324 244 -115 -134 879 658 -489 -381 750 624 -633 -350 768 205 -405
1283d05K33K28K03l09n23O3J158k57j098N34J094m69j084O61N03j79m83k8J22
1302c6M09k93r19O80Q80p39r83P33J086q82l67N78K87k66l82l3J59N68k23r25
1322f68P05O16q96p76R89M85p89j85N02K19K6j77k27N47O43q52n73J028K87q74
1342C0l30Q96j0n29k06J55L21K57m63k75O88M46r81K9Q34J19q25M5N41k44j74
1363C24l11R5L20k0n66l38R09J29q18qR20l6q77K75L93K09j67m72J56M01n1r41
1385d74K55R30m02r38K94O80m58j21n0L16K75L9m46nP54j97q41K64Q71o53o61
1406e68L77K91n04%m4J72M14l49l31K65P21l73q07Q36L33m77l97K29L33n5l52
1427b86l27L27L94m55o54O19O42p43k51P10J36l43k25L69J31n3k04l82M94K82
$$ plain form
1283 -405 -172 56 259 -50 -573 -510 648 391 -707 -173 921 452 -632 29 532 353 -130 -158 -36
1302 -36 373 80 -839 -159 721 -18 -1001 -268 818 -64 -431 147 434 168 -214 -247 -88 480 257 -668
1322 -668 37 653 -243 -1019 -30 455 -334 -519 -17 202 228 51 -176 371 1014 162 -411 617 904 30
1342 30 -300 596 586 57 -149 6 327 584 121 -154 534 980 -1 28 862 981 156 201 742 498 324
1363 324 13 108 428 408 -158 -496 413 542 -276 -284 636 600 -277 -2 391 600 433 -39 117 518 467 -474
1385 -474 -219 711 309 -629 -335 345 -113 -234 -284 32 307 346 -100 -105 649 452 -389 -125 746 93 -568
1406 -568 -191 100 -404 -404 -448 -276 138 -211 -542 -277 444 71 -736 100 433 -44 -441 -212 121 66 -286
1427 -286 -613 -286 108 -347 -1001 -382 260 -483 -734 -24 112 -231 -456 -87 44 -9 -213 -595 -101 181
1447A81o28m18P28J39p21K1L70J55l80J13M8K92J16m41j77O68J29q88J19Q19j30
1468A15o96J48N12j24j58j42k3M23N2m96q0P52j7p77K06P79k75l41O6J19M5J4
1490A02l27j05N38j83m44J52O28j37n11J99M38l48j05J23M4R0L4m35K36K40m0
1511A89o68M23L74l80l95M57K67k64j09m3J72L78j94o49N82L12m61k58L80L65
1531D78n87k58L22J35M9k03j83K53K92m23l13M53M17o82j05N05J72m28n8R7L13
1552B46j30j06m21N34K72n96j28M44L75q49Q2K69J98k93k04J72K56o1k52r3M15
1573A30O6m86p1O23j80l65J9L92k0k37j61K5J37L01n78l3P06j74n02K29K79j07
1595gk55K05r5P1P1k93J83L24j35o34L06N72l04l76J60M57l45k29J90j79K38J18
$$ plain form
1447 181 -447 -865 -137 2 -719 -698 -328 -173 -553 -440 -392 -100 16 -425 -602 66 195 -693 -574 245 115
1468 115 -581 -433 79 -45 -203 -345 -368 55 107 -389 -469 283 266 -511 -305 474 199 -142 -76 43 88 102
1490 102 -225 -330 208 25 -419 -267 361 224 -287 -88 350 2 -103 20 64 154 188 -247 -11 229 189
1511 189 -479 -56 318 -62 -457 0 267 3 -106 -149 23 401 207 -442 140 452 -9 -267 113 478
1531 478 -109 -367 -45 90 139 -64 -247 6 298 -125 -438 15 432 -250 -355 150 322 -106 -164 -67 246
1552 246 116 10 -411 123 395 -201 -329 115 490 -359 -277 -8 190 -103 -307 -135 121 60 -192 -285 130
1573 130 196 -290 -361 262 82 -283 -264 128 108 -129 -290 -265 -128 173 -405 -438 268 94 -408 -179 100 -7
1595 -7 -262 -57 -152 -81 -10 -303 -120 204 69 -565 -259 313 9 -367 -207 250 -95 -324 -134 -313 -75 43
1617D3l06Q9K71k6m74J73M64k99l18P5M48m12k25K69N5J09k63P6O3L73n19m1M91
1640A16j05K3l22J91j61K97l21k7M08p3m25M1N74Qm31j52M16rj82K0P3R3K41n04
1664b11j03L40K22p17kN74o3m21J63K62O5l53J41P2j33J94l90J0L04K91m74k33
1686d62N42j8m74l1N23q7k87J45n4J25J9l56K73J44M5m18J97R3o8j03k05L43K18
1709A04k35m22M70J93k74k76L37J36l60q9N16k61k1M8p0r4L55k25l06K95L04k66
1731a41l77M86M66m62l07L59j2o4k9J24k5J86j98j00J77P8q0l52M19J86n17l7
1753b20L54J15l63j0K01p5J36j63K6J23k9J15l43L07N8j33j44K9L28l21m9rL38
1776B71j03m00L36J43l48J32J16m2M9Ql9j59J66J48k88o6N21r9n13K78M85m72
$$ plain form
1617 43 -263 -174 97 71 -403 -230 234 -65 -383 -308 140 -272 -497 -228 -173 -64 -327 -251 -188 185 -334 -375 116
1640 116 11 34 -288 -97 -258 39 -282 -309 99 26 -399 -358 216 224 -207 -359 57 48 -134 -114 -41 52 293 -211
1664 -211 -314 26 248 -469 -471 103 40 -381 -218 44 109 -244 -103 -31 -164 30 -360 -350 -46 245 -229 -462
1686 -462 80 62 -412 -443 80 -7 -294 -149 -203 -78 -59 -415 -142 2 47 -371 -174 -81 -149 -252 -457 -114 104
1709 104 -131 -553 -83 110 -164 -440 -103 33 -327 -416 100 -161 -182 -134 -204 -298 57 -168 -474 -179 125 -141
1731 -141 -518 -32 434 -28 -335 24 12 -52 -81 43 18 204 6 -94 83 161 81 -271 148 334 -183 -220
1753 -220 134 249 -114 -124 77 2 138 -25 1 124 95 210 -133 174 232 99 -45 -16 312 -9 -58 -67 271
1776 271 168 -232 104 247 -101 31 147 105 154 162 123 -36 130 278 -10 -76 445 346 -167 111 596 124
1798A24j68L57j28k33K59r2R4r4J15l91j13P11l01j25j47M23%k27J34J23k14j51
1820d4J67J58o2R2l70J56K11j2j91j42L24M8l34l5L34kk82n6L73J13l91j4K31
1843B72q2q4J8N4k91L25L3m40L40J98j93k11L94O6m12J38L95j74k25RKN7j8l2
1867A39j79O4M03j36n95N51J79m44K0L13J33m61r1L75q2k55M8J10j79J68K1k74
1889a72K63p1J24k39K83J13l98j07L65R3k45r9K00N8l10p6L32j94J3J76l28J30
1911h9K15mr4j50N54l00l82L17K12k30l38N94j27j56J70j25k41J50L61l96j30
1932a89M44r2n42L41M42k58l44L93J73l95j11K52L9l29J65O4k9r0J08j18j6M04
1954C12j75k20j6L85n4k48Q5M04k64k55J25Q4k04p7K03L6k44K17J9j90K62J25
$$ plain form
1798 124 -44 313 185 -48 211 119 213 119 234 -157 -270 441 140 15 -132 291 291 64 198 321 107 -44
1820 -44 123 281 219 311 -59 97 308 296 105 -37 287 335 1 -34 300 298 16 -40 333 446 55 41 272
1843 272 190 106 124 178 -113 212 245 -195 145 343 150 -61 333 399 -13 125 520 346 121 130 132 189 171 139
1867 139 -40 24 427 291 -304 247 426 -18 2 315 448 -13 -104 271 189 -66 -18 92 -87 81 102 -172
1889 -172 91 20 144 -95 188 301 -97 -204 161 254 9 -90 110 168 -142 -218 114 -80 -67 109 -219 -89
1911 -89 126 122 28 -122 432 132 -250 67 279 49 -289 305 178 22 192 67 -174 -24 337 -59 -189
1932 -189 255 163 -379 -38 404 146 -198 195 368 -27 -138 114 153 -176 -11 53 24 -66 42 -76 -92 312
1954 312 137 -83 -99 286 232 -16 69 473 209 -46 79 163 -41 -118 85 121 -123 94 113 -77 185 310
1976C10m30qN18j80k35J22K38j39k61J86jp6J74n5j15j5K12o6j81R6K42l65PJ59
2000A37K83o89K15K82j9l09J92J71k48M1J57l14K60n0o7o8L8J44k25J2J99J91
2022C33m45M4J70K2k10O0J77pl9M8k20K2J44j39q9R4K44j68j39R5K78m43k29N01
2046A04o6l31K00J24j68j7J50m0j69J31R8m57K82L20m31j26K76R4j73o5L95j15
2068A6k69L0L20j52j71K53k61O0J82O2m48J37K91j63m66M73R1l15J2K34J8j90
2090b56q7L36k12M3m2j56L49j71N0j91J24K14M6l80K01J24j75m0K28M6l24J72
2112a01J44n5j65K22j40q9J92Ql67K76J25n2k22J17K91k60j82K66P5k33Q3n3J09
2135a1mK11j91j21L64j67j87j30K98K5l49J02J81Lj31N5J89j77j04J40kM4L0j17
$$ plain form
1976 310 -120 -128 390 210 -25 97 335 196 -65 121 120 44 218 163 48 33 245 179 -2 94 336 -29 -22 137
2000 137 420 -269 -54 228 209 -100 92 263 15 56 213 -101 159 109 42 -26 12 156 -69 -57 142 333
2022 333 -112 -68 102 124 -86 -26 151 144 105 153 -67 -45 99 -40 -129 -35 209 41 -98 -3 275 -168 -397 104
2046 104 38 -293 -93 31 -137 -154 -4 -44 -213 -82 16 -441 -159 161 -270 -396 -120 -26 -199 -264 131 16
2068 16 -253 -223 97 -55 -226 27 -234 -174 8 70 -378 -241 50 -113 -579 -106 -15 -330 -318 -84 -66 -256
2090 -256 -343 -7 -219 -176 -218 -374 -25 -196 -146 -337 -213 1 47 -333 -132 -8 -183 -223 5 51 -273 -101
2112 -101 43 -12 -177 45 -95 -184 8 16 -351 -75 50 -2 -224 -107 184 -76 -258 8 83 -150 -67 -120 -11
2135 -11 -15 196 5 -116 248 81 -106 -236 62 87 -262 -160 21 24 -107 -52 137 -40 -144 -4 -6 38 68 -49
2159d9MJ8J92k42m7K01nj30j57L96m1k70J8L6p0JK7M0L2qJ25k80J1M05k76m2K07
2186I6J1k11K1Q2Q6l54R2P7M4j59J44K6J54j47L0J55J2L5l36J0Q3J63r3o2P8L4
2212G1jo8O0J9j53K50j83p5k1K63j46n1K54k73Q3J36j1j70r0L16N0k82J53J48
2236B79l9l32K51r1J00P5q9r5MK54j01q0R8R5k75j66J70J80m8o9J07p3j13K8O
2261G6J23l8l3Kq7J29k6m1j94J67J07l01L18j34N9l3J43l9k11J02P0j05N3J00
2285B07j20QMp7N1o0M7n1j57K37J29j78k04J22L7J07J5m0q2P0K9o4j28J7J30k20
2311a71jL64j97k3j07L57l85P3J88j31L0N5L6j22N4k9j58K09j39j6O1L9P0k59
2335b02J38k4J24q3k0L7m2PJ77j03n1O6P8J8j55o0R2n1n7L30l11N6m9J89j67r3
$$ plain form
2159 -49 -45 -27 165 -77 -124 77 72 -58 -215 181 140 -130 -112 -76 -146 -145 -118 -78 -46 -54 71 -209 -198 207 -69 -111 96
2186 96 107 -104 -83 -1 85 -269 -177 -100 -56 -215 -71 -45 109 -38 -8 147 159 194 -142 -132 -49 114 21 -41 37 71
2212 71 70 2 62 81 -72 178 -5 -80 -101 162 16 -35 219 -54 29 165 154 -16 -106 210 260 -22 131 279
2236 279 240 -92 159 68 168 243 154 59 63 317 216 136 234 329 54 -112 58 238 190 121 228 155 42 70 76
2261 76 199 161 128 130 43 172 146 105 -89 78 185 -116 202 68 127 94 237 198 -13 89 159 54 107 207
2285 207 87 95 99 22 73 13 60 9 -148 89 218 40 -164 -42 -5 102 117 77 -5 65 94 30 -98 -81 49 -171
2311 -171 -172 192 -5 -28 -135 222 -163 -90 98 -33 -3 52 88 -34 20 -9 -167 42 -97 -113 -52 -13 57 -202
2335 -202 -64 -88 36 -47 -67 -30 -72 -65 112 9 -42 24 102 120 -35 -95 -3 -54 -111 219 -92 -36 -85 104 -63 -156
2361a56R5K2j17K32k28K20L1j01L2j66L08k26J01lj8O5j56q9R8o9j8J1J74j34
2385i2oO2J1o3K3j09J25K2j03N1P1p2R8k26K33q7M5R3j71Q4j31J99n9J7J5nj2
2412A3ko2J38j97j15K62j29O3N4J02k30J51j91N9o3P0P3j10L1R7k10K88r0O6k08
2437a40P7j01j4J50m4P8n1O7N8l03J94J93k23qm2K93j54j79J2J44p7kL2K19l66
2462a87K14RJ03o8j54Q7N7J18l0j69n2k5Q9J61j70J72K5j61MJ11j53M2M6n9K02
2487B12p4o4J40j21r8J07k30K15J7n5K2r2jq5J12pJ38k70K02k09R3Q2o7J2J06
2512H5L4K6k47J23Q9J31k77M5J10q7M1M9j64o6J58K5n2m8rj7j41J46J61j07N8
2537F6r4N4q2P9P8j10pj36L20j35r6Q5L6P8k77J02O7n5m0M8j3J24q4j00N0j6p
$$ plain form
2361 -156 -61 -39 -156 76 -152 68 99 -2 30 -136 172 -54 47 44 26 91 -65 -154 -56 -125 -143 -132 42 -92
2385 -92 -98 -36 -25 -88 -65 -174 -49 -27 -130 -79 -8 -80 18 -208 25 -62 -17 76 -95 -11 -142 57 -2 15 30 25 13
2412 13 11 -51 87 -110 -225 37 -92 -29 25 127 -103 48 -143 -84 -147 -77 -4 -114 -83 14 -196 92 2 68 -140
2437 -140 -63 -164 -178 -28 -72 6 -45 22 80 -223 -29 164 -59 -67 -109 184 30 -149 -137 7 -70 -72 -40 179 -187
2462 -187 27 36 139 71 -83 4 61 179 149 -20 -72 -97 -8 153 -17 155 180 19 23 134 -19 23 69 10 212
2487 212 138 74 214 93 -5 102 -128 87 104 49 71 -21 -22 -107 5 -2 136 -134 68 -141 -48 34 -33 -21 85
2512 85 119 145 -102 21 110 241 -36 9 119 32 73 122 -42 -108 50 75 23 -25 -34 -51 -192 -46 115 8 66
2537 66 -28 26 -56 23 101 -9 -16 -152 168 33 -63 22 58 136 -141 -39 28 -27 -67 -19 -32 92 8 -92 -42 -58 -65
2564f5j37L76l01K21k05K90l07K52l33K23q9M8P1k05K75n0p4K3j32J08l4j4M4
2587a5j05R6J71k45J10J45k71l0K09j42Q1j13k9J50j74O5R2J28k68J15J17j11
2609b4P9j01J4J30l54J82K91Qj36q5M3n7P1o7P0Ql6N5l47L20M4q1L8j81L34r0
2635A28k27J36J31k17J16j83J24M9j60JJ8L5R7r7J55j6j02J21j39J77m7k0q9l2
2659d1J78k81J00J20Ql3j82j1J07J20M5o3r4N9O6k14K15j2m7R5k03M1K16n4R5
2684B30j71J7j55K4J10J18j70K4J50j62Q8j24N2j08J77j22O0q7O5n4J17o9L2q
2708C4K5J9R5j81j68J23J55k5j67J68n3K1o0j4L9klj27n9J69k0j9M4K1m5K33n3
2735A50k07K5K56j72j30N7p5N4mJ00j27jQ3R1j7K7q7n6j7qJ03Qj09Q4JN2J49j86
$$ plain form
2564 -65 -202 174 -127 94 -111 179 -128 124 -209 14 -75 -27 44 -161 114 64 -10 13 -119 -11 -45 -59 -15
2587 -15 -120 -24 147 -98 12 157 -114 -144 65 -77 4 -109 -138 12 -162 -97 -5 123 -145 -30 87 -24
2609 -24 55 -46 -32 98 -256 -74 217 225 89 4 47 -10 61 -6 64 72 36 91 -256 64 108 27 65 -116 218 128
2635 128 -99 37 168 -49 67 -116 8 57 -103 -102 -84 -49 48 -49 106 90 -12 109 -30 147 100 80 -9 -41
2659 -41 137 -144 -44 76 84 51 -131 -142 -35 85 130 67 -27 32 98 -116 99 87 40 135 -68 -27 189 135 230
2684 230 59 76 -79 -55 55 173 3 27 177 15 103 -21 31 -77 100 -22 38 -49 16 -38 79 10 42 34
2708 34 59 78 173 -8 -176 -53 102 77 -90 78 25 46 -14 -28 11 9 6 -121 -180 -11 -31 -50 -6 15 -30 203 150
2735 150 -57 -32 224 52 -78 -21 -96 -42 -46 54 -73 -74 9 100 83 110 23 -33 -50 -58 45 53 -56 28 29 81 230 44
2763D4l6J15Q6l20P5J21kl73K96O5l4J09k49K62k03J8qJ35p2N2K8J5j88j22K10
2788B4lk6Qkj85K80p7o1J45j54P3N6J04m49L00J25k47J70j22J21q2n3J23nL0j0
2814H3K8j06J33n0m4M6J12j33j18J29n3no7Q0j50L16j98n7Q4P5n0R5L7j70o4j19
2840a66Q0j00K49m4j51P7J4J02p6K5J21k38L8J27j03R6m2k6jK1L0j50k1J93r7
2865d2PmJ65r7n7m5NN2J15Jm9j33n1R9L5j31J59l2k04J61M6j14J8O0m5J30k29
2892a80K39j61K9P9j23K26j58j86R8K5J16J65j09Lo9j08J10K04k65J2m0J09kj8
2916dl4Q4M2k89K61j42J75j69Q3j2j0N4k6P1K43k10j67J2J77k52O4J12k00R5J09
2941F7j9j52Q9m6J71j26K47k55L1kj52J42J25j07J05p5J71r1j62j68K32P5o8J8
$$ plain form
2763 44 8 123 209 -111 -36 85 83 -290 6 71 37 146 -103 159 -44 -26 -34 101 29 81 109 124 -64 -186 24
2788 24 21 -5 3 1 -184 96 19 -42 103 -51 22 78 182 -267 33 158 -89 81 -41 80 -2 -55 68 63 93 83
2814 83 111 5 138 88 44 90 202 69 -49 80 27 22 -45 35 -115 201 3 -54 30 105 55 150 187 17 -47 -166
2840 -166 -86 -186 63 19 -132 -55 -41 61 -15 10 131 -107 -69 58 -45 51 9 -17 -18 3 33 -117 -138 55 -42
2865 -42 -35 -39 126 29 -28 -73 -68 -16 99 100 51 -82 -133 -34 1 -130 29 -3 -207 -46 0 -114 -96 -36 -81 49 -180
2892 -180 59 -102 -73 6 -117 109 -49 -235 -137 -112 4 169 60 63 -6 -114 -4 200 -65 -53 -93 16 14 -4
2916 -4 -38 46 88 -201 60 -82 93 -76 7 -5 -15 39 13 84 327 117 -50 -38 139 -113 -49 63 -137 -42 67
2941 67 48 -104 -15 -61 110 -16 231 -24 7 5 -147 -5 120 13 118 43 214 123 -39 -207 25 100 32 50
2965E0j04P1J34k3p6L6Qj59J5p9J44N4p7L7j65J58J36o6j60m2M9R2P0j57l1Q4
2991aO0R1j34J53n6j06J10r5J5N3l00J49J08N0L%j06p0J33j03L5J3J80j66J35
3016A51j31m2J48l11O2%K26k36O9K6j20J40J38k49J48j48J60j13J72j79K05p9
3038C7p4k3k3m6OL4J00J7p5J4j4j6J5j9M7M1j3j95Q2J42Q7k19J64L2j37P4k93
3065b55K74J1j42J38k8N0J9mK8p2N8p4Q3k71J85N1PQ%m7J33r9o6o2J02J0j3R3
3093A17q7lJ5m9R4J7n7j26oJ42r6j22P7J5J59l6n0ko2J41k8l6j02J64q6J24K4
3120A41k28n6J35p0P8LK9n6k0J66n7O5j35N5pO9N0j72m2R4M9j86J12m0P3k3j10
3147h3J49k7m8O9r4P4j56RL5J70k22K1Q8j15J59j1r2P0L8j24L5K7R4j83K05q1
$$ plain form
2965 50 -54 17 151 128 52 88 96 -63 -48 -127 17 71 -6 31 -134 24 160 94 -66 -108 -59 33 103 -54 -85 -1
2991 -1 59 150 16 169 113 7 117 22 37 90 -210 -61 47 97 100 100 -6 -76 57 -46 -11 2 182 16 151
3016 151 20 -22 126 -185 -123 -123 103 -133 -64 -38 -158 -18 120 -129 19 -129 31 -82 90 -89 116 37
3038 37 -37 -60 -83 -129 -123 -89 11 28 -47 -33 -47 -63 -48 -67 -20 21 8 -187 -105 37 124 -95 69 101 -36 38 -255
3065 -255 19 30 -112 26 -2 48 67 63 91 19 77 3 86 -185 0 51 58 66 66 19 152 53 -13 -75 27 37 24 117
3093 117 30 27 42 -7 87 104 47 -79 -85 57 -39 -161 -84 -69 90 54 4 2 -60 81 53 17 -85 79 -7 117 141
3120 141 -87 -143 -8 -78 0 3 32 -24 -44 122 65 130 -5 50 43 112 162 -10 -52 42 91 -95 17 -23 50 27 -83
3147 -83 66 39 -9 60 -34 40 -116 -107 -72 98 -124 -103 -15 -130 29 18 -74 -4 34 -90 -55 -28 66 -117 88 7
3173Gqj18K92l02K31j56l6N6o6n0J03M9ro8M3n9N4l0K16j07m4m7J00L1j74L3j00
3200a59J83P0j40Q4q8q5N3m3J12O7p1J64j46J49j51m8K07j52%j3j05J4R5p6Q0
3225AM4k4o8k3J23k7qL4j71L30l22J77rj12J25k10J89O9P6l41J40rK25j96J8L3
3251F4j50M9K5O2q9R4p7J89q1N1j43N7j31K30N7k20j61K66k0q5p1J03j11J22k38
3276b08K29ln9j2p7J25k7j57K42j8o5J94j90p8J98j01L7k6j73J33N0M7p5J44O
3301A36j39kr2R1LJ20k76J39j3K1J09j01J0M5o6P6p5m3L6J32k44Q3N3l1k64L46
3327E4Rj20M6PM8k17R2Q4l9R1rp8O3q9J67k5j49P2l1RR4j36Q7l3J61l18K2K48
3355A10p6k82L13r1P0j34KK10o1j35J61P6j6j11J08r0k17K18j64M4J34j49J84
$$ plain form
3173 7 -1 -119 173 -129 102 -54 -90 -34 -100 -150 -47 2 -7 -75 -32 -91 -37 -67 149 42 -2 -49 51 82 -92 -59 -159
3200 -159 24 94 -46 38 -50 -135 -82 -125 -13 54 -17 147 1 150 -1 -49 158 6 6 -7 -112 -98 -3 -79 1
3225 1 45 21 -47 -70 53 26 18 52 -119 211 -111 66 57 -55 70 -140 49 118 194 -147 -7 -16 209 13 31 64
3251 64 -86 -37 -12 50 -39 55 -22 167 86 137 -6 51 -80 150 207 -13 -174 92 72 -13 -84 19 -92 30 -208
3276 -208 21 18 -41 -53 -130 -5 -32 -189 53 35 -30 164 -26 -104 94 -7 30 4 -169 -36 14 61 -14 130 136
3301 136 -3 -5 -97 -6 -3 117 -159 -20 -33 -12 97 -4 6 51 -15 61 -14 -57 -21 111 -133 -50 3 -28 -292 54
3327 54 63 -57 -11 -4 44 -173 -81 3 -36 55 46 -32 31 -58 109 84 -65 7 -24 -15 79 -57 30 -3 158 -160 -138 110
3355 110 34 -248 65 -26 44 -90 -88 122 61 -74 87 163 147 36 144 54 -163 55 -109 -65 69 -80 104
3378A04k03L9L8J32j33K8Q8o5o9r8K25k27Q8J01J1k3J8j17P5M1O5m2j01J31q5
3403B1KJ03n7j20J70k17o5J27o1J89j52J42o6n3P0j35J79l1j12Q8QM3p0K02k22
3428a7O4j29N0n6R2J14k50Q8J63k04J01K9q0J03Q3k40K06kj09j19J10J20j38k
3452b3J78j17N0m3j94J98q6q6N4j7O8l9R1k0k08K68q2j00m6P5l6N5J34k6l0L0
3478D8r0M2n6J0O1m0K5N3P5L1j16k23J78Rj23Q2O3k9Q0k1q1l7K30o8p9P1jK8l7
3507H5j19pK7J5K4k04K51M4j64M9J35q3J19k11j55K10m0J76j39j10K99j19n4j90
3531a61J87j26J52o1L2m4KL8o7pQ7n0J0j98J82J9J31j14N8l8k6l5Np2K0J52j84
3558a08L7J66j12j50J92N4j00J98k71J00j50J90j36K01j59R7O8j21m3J5L6r6Q5
$$ plain form
3378 104 -99 -60 -22 110 -23 5 93 28 -41 -139 86 -141 -53 48 59 36 54 -63 12 53 118 76 -25 106 21
3403 21 23 126 69 -51 119 -98 -163 -36 -97 92 -60 82 16 -37 33 -102 77 46 -66 22 30 73 3 205 -17
3428 -17 47 -82 -32 -88 4 118 -132 -44 119 -85 16 45 -35 68 151 -89 117 115 6 -113 -3 117 -21 -23
3452 -23 155 38 88 45 -149 49 -37 -123 -69 -86 -18 -57 34 14 -194 74 -8 -108 -154 -79 -115 -60 74 48 18 48
3478 48 -42 0 -56 -46 15 -25 0 53 128 159 43 -180 -2 7 -116 -34 29 0 80 59 -22 -59 171 103 24 95 94 122 85
3507 85 -34 -41 -14 1 25 -179 72 116 -48 1 136 53 172 -39 -194 16 -24 152 13 -97 202 83 29 -161
3531 -161 26 -100 52 -9 23 -21 -19 19 -48 -55 32 -18 -8 -206 -24 -5 126 12 70 32 6 -29 -24 -96 -76 76 -108
3558 -108 -71 95 -17 -167 25 79 -21 177 -94 6 -144 46 -90 111 -48 49 117 -4 -47 -32 4 -92 -7
3581gp0J54jm2J4r9K4J1M2J2n6j00K7J26Kj2j16K83k80J70j26q5k7L90j17j07
3607A0R1J3o4j35J18NJ88l03K2J63m8j26J78q4J1jO0o4n5J14kn5J9O3j45J10o2
3634B1N8j94J46j5M1r1J0N0j07J79q3l1j31J88j20L7J02M1k98J06L42j36r9j97
3658a81K28r3M2J05j71M9J49k63J24J22j92K01l02J41J00L2l7j64N7Q3r6J24l
3681E5j11N2N4L2j17j3J30J4j21j6Q5j59R7L7n0k4n3P1M5j9m6J12n3m3m2Q8n0
3708d5L4Q0j18L7j20J00m6J25n2L0j34K44j37j4K2k2L3J81k49R3J03j73kK01k58
3733h7R3j42J70j06Q9Pr5L1K11k19O5N8j91J9O3m2k3K16j75R1M8j09Q9m9M4R7
3759A53n8P7k11J28Pk1j21J94j2j23j69L3J54k21J96Q6j73J46j8K9k04J86j59
$$ plain form
3581 -7 -77 77 76 34 48 -51 -27 -16 26 38 -18 -118 -91 35 37 25 -91 192 -88 82 -44 -129 -156 234 117 10
3607 10 101 114 50 -85 33 38 226 -77 -55 108 60 -66 112 28 39 38 98 34 -21 93 91 36 55 118 -27 83 21
3634 21 79 -115 31 16 57 -34 -24 26 -81 98 15 -16 -147 41 -79 -42 60 101 -197 -91 251 115 16 -181
3658 -181 47 -46 -4 101 -70 -21 128 -135 -11 111 -81 120 -182 -41 59 91 54 -110 -53 30 -66 58 55
3681 55 -56 -4 50 82 -35 -48 82 96 -25 -41 44 -115 -18 19 -31 -55 -108 -37 8 -11 -57 55 2 -41 -83 5 -45
3708 -45 -11 69 -49 -12 -132 -32 -78 47 -5 25 -109 135 -2 -16 6 -16 17 198 -51 42 145 -28 -30 171 -87
3733 -87 6 -136 34 -72 17 24 -71 -40 171 -48 17 75 -116 -97 -34 -76 -99 117 -58 33 81 -28 61 12 56 153
3759 153 95 172 -39 89 96 75 -46 148 136 13 -156 -123 31 -190 6 92 -81 65 47 76 -128 58 -101
3782a01J18M7j13l6P6j59J41J34j96L9N9j7P4j39J11q8o2N6R6K0o6O9p5roO6k24
3809a85J37J02j77J60j25k5P0JMQ6k1j09R0r8J80j26J9J57m6j19q0J01J85k40
3833e9J05j66lJ36J90j03j46K16j41j8J05r0M7Q2j14P4p0qj4l0m6J79p0r8J41
3858I9p5q3q7K65j89OJ86j62j9n4M2N9P2j09M2N6p5R7j24R2Mk32n0K34J06o1j10
3885g0J21j04n5j5K85j61kj12J21j56J58p6qL0K3o9P2n3M1r4k3J04K3J7j04J53
3911D6K7p4q7R9J66j37O2j62j01P5J35M6j15j6j8n1M8O3j17J15Mk5j34J28r6J81
3937F2k05K00n1Njk0m6K09l6j11rL0q1j03J71M5j37m8n8K52P4k93j7J12m5M3R8
3964D0j40J84r9L4j3K7o3l7J53l9j60J57j23K05j06q1J2kN8m4J02j80q4Q7P8m8
$$ plain form
3782 -101 17 64 -49 -85 -9 -168 -27 107 -89 -50 9 -8 66 -73 38 -50 -112 -56 40 60 -6 63 -12 -21 -27 39 -185
3809 -185 -48 54 -123 37 -88 -113 -43 -42 -38 48 27 -82 8 -90 90 -36 -17 140 94 -25 -105 -4 181 -59
3833 -59 46 -120 -123 13 203 100 -46 170 29 11 116 26 73 155 41 115 45 37 23 -7 -53 126 56 -42 99
3858 99 24 -59 -146 119 -70 -64 122 -40 -59 -113 -71 -12 60 -49 -7 49 -26 71 -53 39 43 -189 -239 -5 101 40 -70
3885 -70 51 -53 -108 -123 162 1 -1 -113 8 -148 10 -66 -74 -44 -21 -90 -18 -71 -30 -124 -147 -43 -20 -3 -107 46
3911 46 73 -1 -88 11 177 40 102 -60 -161 -86 49 95 -20 -36 -54 -105 -57 6 -111 4 8 -17 -151 -23 -119 62
3937 62 -143 57 6 11 10 -10 -56 153 117 6 -3 27 -54 -157 14 59 -78 -126 -184 68 142 -151 -168 -56 -101 -58 40
3964 40 -100 84 -15 19 6 33 -30 -67 86 47 -113 44 -79 126 20 -61 -49 -51 7 -37 65 -115 -199 -112 -34 -82
3990h2o1J22o6N1R9ol3O7r7J16j86M6m6J19q6l2Q0n1kn2J31O7j36O6J43l24J92
4017C9k7NP0j69k1J13r9N9L6J0n8J32o4j67Q8J76j05j08J9J87k60J60p3J01j00
4042e6p3R5j26L27j15Jp7J02k34J45j5J15l21K57N3q6O7p6j5J30k4j27O8N1q7
4067b1k1n8j36K45L8N6o0l7kR5j18k7K01o1j12L9k47M05J0j04n9L5L4Q4j27m4
4093HM8j37j9J79o9n5J05j09M7P7O4k04J54o2N8K6r0M9k52J60p8J69k3q0K44j22
4119H8j18J97pj89j15l4K00j84N8Q9J49n6j32Q7o3K8j7j1K14k27J35o3j8J36j22
4144B5L0L0l5j06Q8Q1q7m8l8N1J13j63J98j30P3r0J5p6J52j30j2L6l5J74o9j51
4170a04J35q4J3J12k3Q4j08J03k26L3J6m2P4K2J51k18R9p6R2J28l1j85O4o9J52
$$ plain form
3990 -82 -143 -21 -87 -36 63 57 24 91 -6 110 -76 -30 -76 43 -43 -75 5 -46 -48 -100 31 98 -38 28 171 -153 39
4017 39 12 17 87 -82 -103 10 -89 -30 6 16 -42 90 26 -141 -53 123 18 -90 -71 116 -144 16 -57 44 -56
4042 -56 -129 -34 -160 167 52 53 -24 78 -156 -11 -26 89 -232 25 78 -8 59 -17 -32 98 74 -53 15 66 -21
4067 -21 -42 -100 -236 9 47 103 43 6 4 99 -19 -46 155 94 -18 21 -226 179 189 85 26 61 95 179 52 8
4093 8 56 -81 -100 79 10 -45 60 -49 -2 75 139 -65 89 27 85 111 21 70 -182 -22 -100 69 46 -34 210 88
4119 88 -30 167 160 -29 -144 -178 22 -162 -104 -15 134 78 -54 33 -30 -2 -19 -30 184 -43 92 29 11 147 25
4144 25 55 85 50 -56 32 113 26 -22 -60 -9 104 -59 139 9 82 -8 7 -69 83 -47 -59 -23 -58 116 47 -104
4170 -104 31 -53 -40 72 49 133 25 128 -98 -65 -49 -91 -17 5 156 -62 37 -39 53 181 150 -35 29 -40 112
4195A12j07l3O9L7j39R2K5J28l17J49n2J40j95n4K13k7j4l5P4j8K4O6j35M5O8
4220A16j74l6M1J91l5No5K5n4pq8j02J58o1n9J24j09L6N3L8Q5j10k51K99m9l5
4246f4K7R1n8j29K18r6Jn8L8Q4k7R1O6k01J1r7J51j58R0J84j05o7J53n6j87K5
4272g3Q5M0o6N0K8j15P5j37J06j4j39K90k48Q3N7n4J17o0j34J50L9j76K26l3J14
4297B11k89K85k15L5j76O0K94j32j09J5r6J29J8o9N8L7K6m8r8L0R7M1j97J5J70
4322I2j41J01m0j53J11J28r5M9O8m4q8J7j11J43m7P7j7m5J08q1N5k40J29M7Q7
4347A10m4j4j55N6q2K38M1r9j18J61o5l02L96lo1j19J04R9o3n5L3J0n8o2nJ59
4373A02j70J99k18K17j65R4j51J13r3J21n3o5l8K41k2k28O1J09l6K9K55j92k32
$$ plain form
4195 112 5 -28 41 78 -61 31 56 184 -133 16 -36 104 -91 -145 68 41 27 -8 66 48 72 138 3 48 116
4220 116 -58 -94 -53 138 103 108 43 68 14 7 -81 -183 -25 -86 -145 -21 -130 -94 -41 -3 82 -28 -279 20 -29 -64
4246 -64 -37 54 -4 -133 85 -11 -10 -68 -30 54 27 118 184 -17 -6 -103 48 -110 -20 164 59 -8 145 89 -98 -73
4272 -73 12 52 -14 36 64 -51 24 -113 -7 -21 -160 130 -118 -35 22 -32 85 25 -109 41 80 -96 130 97 211
4297 211 -78 207 -8 27 -149 -89 205 73 -36 -21 -117 12 30 -39 19 56 82 34 -64 -34 63 104 -93 -78 92
4322 92 -49 52 12 -141 -30 98 3 52 120 76 -12 5 -106 37 -10 67 50 5 113 32 87 -153 -24 23 110
4347 110 66 52 -103 -47 -129 109 150 51 -67 94 29 -273 123 120 59 -60 44 143 80 25 58 68 10 -52 -57 102
4373 102 -68 131 -87 130 -35 59 -92 21 -72 49 -4 -69 -107 134 112 -116 -55 54 18 47 302 110 -122
4396a22K31r0j12L0P2R4q0m0q3J02m4N2O5j55J03p8J20j67j5J38j36j31K39j3
4420b0j43J75kK5M8j03M7m8p9J56J3j30J40j74N5M3O5M5k86k9L55j62Kn1N4r6
4446a00J81m3l5J59k44M1J42k50J10m8K2l5J3J56p7J04k32J47j8m3J24k2k0J7
4470D9r0K64r7K4j21m6P2k36J53R5j14P8On4P7j22J0L1pJ53k18K96l05M2j14L76
4496B02k06J01mj37J26j46R9r6rJ19o4j14J44rJ18p1j61jM7J71j23j33J22j27
4520a52J87o1M9j08M7K2k22K11Q8j78n1K13k3m0r4J81l3o1j3K63j79k67Q6jK12
4545G6j96J07M6N5j5LK9j68Q6o9j01J40J16j50J57k02R5q4J86j13o2J30p3k3P
4570b3J60k41J73j93m3K9R2R0j26O0K7j09M7J00rJ09k16M1N1o7L1R2j52k5J19
$$ plain form
4396 -122 109 19 -93 -63 9 103 23 -17 -100 2 -42 10 75 -80 23 -55 65 -102 -117 21 -115 -246 -7 -20
4420 -20 -163 12 10 35 83 -20 27 -21 -100 56 69 -61 79 -95 -40 3 68 113 -173 -202 153 -9 -7 -58 -4 -100
4446 -100 81 38 3 162 -82 -41 101 -149 -39 -87 -65 -100 -87 69 -8 96 -136 11 -7 -50 74 52 32 49
4470 49 -41 223 126 150 29 -17 55 -181 -28 67 -47 31 37 -17 60 -62 -52 -21 -28 125 -93 203 -102 -60 -174 202
4496 202 -4 97 93 -44 82 -64 35 -61 -70 49 -15 -129 15 6 124 53 -108 -109 -62 109 -14 -147 -25 -152
4520 -152 35 -26 23 -85 -38 -16 -238 -27 61 -117 -168 45 22 -18 -112 69 36 -25 -38 225 46 -221 -135 -136 76
4545 76 -120 -13 33 88 73 76 105 -63 23 -46 -147 -7 109 -41 116 -86 9 -75 111 -2 -64 66 -7 -30 -23
4570 -23 137 -104 69 -124 -167 -138 -46 44 -82 -22 5 -104 -57 43 34 143 -73 -32 19 -48 -17 75 -77 -102 17
4595A7Kj47J39J15k9o5k23K18O7j8r5L3M7j36P6mj72N1K74j57Q4Q3k49l6q3P5
4621a33J85Jk3o7N3N1J31j35o7J6Lkj9k6J03J7j21L8m1N4j0LP1j28R2k36J23J40
4649G3p4L8j0M5j6m2q0J14o2l9L3k9j21J32lO5l9L0j61K13P9j61j7M0k39J09J70
4676D8Q2k02J61L4o9J5k9j53K47j31j7j50J68r0J4k3R9p1l6j8L61k99K4L5O6k18
4702a52J06J39j99J53p7l0N3L2j05K06n3q6j47J87o6o1M8R6j16J22Nj6qk16J29
4727e6K8J14j09N9j07J40m6k37J36J68q5n6Q7o8j7J19o7Pp9J04m2J9N9j68K05
4752A08j46Q0M1qj08K6O6j21R4L3P1o4o7k3M6o9J9k10J42NM7j6M1nj60J81J86
4779A89j54R8j09j8j18K2J66n6p6Q7O4p5o1P6j69P8J23j42R1j30J51pR4r3l6R8
$$ plain form
4595 17 19 -128 11 126 97 32 -191 27 94 76 -19 14 61 -75 1 -3 -175 -124 150 -7 77 160 -89 -125 -208 -133
4621 -133 52 53 30 -37 16 67 198 63 -4 12 15 13 -6 -32 71 88 -33 5 -36 18 8 11 82 -46 46 -190 -67 73
4649 73 -1 37 27 72 56 14 -66 48 -14 -53 -20 -49 -170 -38 -41 24 -15 15 -146 67 146 -15 -32 8 -231 -122 48
4676 48 130 -72 89 123 54 69 40 -113 134 3 -14 -164 4 -86 -72 -95 4 -67 -103 -121 240 -59 -35 0 66 -152
4702 -152 -46 93 -106 47 -30 -60 -7 25 -80 126 73 -13 -160 27 -39 -100 -52 44 -72 50 55 39 31 -185 -56
4727 -56 -28 86 -23 36 -71 69 23 -214 -78 90 5 -51 36 -32 -49 70 3 10 -69 35 -7 12 71 -97 108
4752 108 -38 42 83 75 -33 -7 59 -62 32 65 136 72 5 -18 28 -41 -22 -232 -90 -85 -38 -54 -13 -18 -178 3 189
4779 189 35 133 24 6 -112 -90 76 20 -56 31 95 20 -41 35 -134 -56 67 -75 16 -114 37 30 124 31 -5 93
4805I3o8j9k6O2m7J49j34L9J1N1j45J74k26J92J3j32K8j35J40j8K01k35r7J93
4829F4o7k3j08M4J92j85P0N8K3j08J12k17J81N1j98k2J12N5P3r5oO0L6q1P7L0
4855A28j31N9o7m6J35q6K4l4MQ9j77J65L5k07M0n2J5m4J64J50k11j4J5M4L0kp9
4882e3O8j22J50J25k22j48K77j38L6l3j0K9N9J07j15n9R4k6Q4j79q9M2J11KM4
4907C4j38M1o1J27Q5k8k18L0J36o6j24L06k59N1j12K21j96J57j0l3N9Q8kj94J71
4932F5j59J34p1M9o5L4p3J45n1j62R7N4n5O1o8j5L9J23k06J55P3k0k12Q6J15n3
4958B0k4O0l0N7n2p6n2rJ86p3J12O6j39r2q0J71p0J82o9N3j68l7O0J42k1L4k60
4985a09j0L9K31q8o5j7O6m0J25m8pj11k6J40j35m4K46r0j40J48k2L4k5r5N1n7
$$ plain form
4805 93 25 6 -20 42 -5 144 10 49 60 111 -34 140 -86 106 119 -13 15 -120 20 2 203 -32 -129 64
4829 64 -3 -26 -134 -90 102 -83 -13 45 68 -40 72 -145 36 87 -111 -133 -21 34 107 12 6 66 102 21 98 128
4855 128 -3 56 -11 -57 78 -8 16 -18 -14 75 -102 63 98 -109 -69 -121 -106 -150 14 164 -47 -61 -46 -2 28 26 -53
4882 -53 15 -107 43 168 -54 -202 75 -63 -27 -60 -70 -41 18 125 10 -49 45 19 103 -76 -165 -123 -12 -10 34
4907 34 -104 -63 -124 3 88 60 -158 -128 8 -58 -182 124 -135 -84 -196 25 -171 -14 -24 -57 2 90 88 -106 65
4932 65 -94 40 -31 18 -47 -13 -86 59 8 -154 -57 -3 -58 3 -65 -80 -41 82 -124 31 104 84 -128 -42 73 20
4958 20 -4 56 26 83 31 -45 -97 -106 80 7 119 185 46 -46 -126 45 -25 157 88 141 -27 -64 -4 138 117 151 -109
4985 -109 -119 -80 151 63 -2 -19 47 7 132 84 77 -34 -60 80 -55 -99 147 57 -83 65 43 77 52 -43 8 -49
5011d9j33K34n4L1k29L40k12K06k35R7L4k80K49J79k05lR0r6J02q0k1OL3K31k27
5036HJ25k69R9M7j3O9k9J12k38K17j61O4j36P8l2J75q8l1O5r4j6m1K11j00j47
5061a25L52l14K64j56J5j31M3OJ76j37K1jL6o3J4o8o7M2P0J2J25k1l4J4o6J33
5087A40k48J13j40J10L9Q8j89J06K3M5m4m7L2j08o0J40Q7j42P4Mj23J47k5Q0m2
5112F0m6lO2K7j85J52N0n3k7N9j08RR4j72P4J02n7q6L5m7k7K5J20J5k53L81l94
5139a93J98m0Np4J35l5N0L5k35K39r7r0m1J7J70o0k1J16O0l72K06O8j74J00J98
5164A65q1j12l4MN9k10M61l90P1J17N9q2k3J33j86K9o3J21k06K97j34j17J75j30
5188g7N8r1l5J82N3k03J88o4j07J19k6l7O0M4j38J6O6n3N7q3l1m5L00j53R6j34
$$ plain form
5011 -49 -182 52 -2 29 -200 140 -72 134 -101 -4 30 -250 -1 178 -27 -30 60 -36 66 -14 -35 -29 4 235 8
5036 8 133 -136 -37 10 -3 66 37 149 -89 128 -33 31 -105 -27 -59 116 28 -3 62 -32 -48 -89 122 22 -125
5061 -125 227 -87 177 21 36 -95 -52 -46 130 -7 14 13 49 -14 0 -68 -135 -93 -23 -11 114 93 59 73 7 140
5087 140 -108 5 -135 -25 14 102 -87 19 42 87 43 -4 28 -80 -140 0 87 -55 19 23 -100 47 22 102 60
5112 60 14 11 73 100 -85 67 117 64 37 96 -12 -3 91 -81 -7 95 38 -48 -13 -60 -87 -62 58 73 -180 201 -193
5139 -193 5 -35 -30 -104 31 -4 46 81 -154 85 -12 -102 -143 -126 44 -16 -37 79 139 -233 -27 41 -133 -33 165
5164 165 84 -28 -62 -58 1 -209 252 -138 -67 50 109 27 4 137 -49 -20 -83 38 -168 129 -5 -122 53 -77
5188 -77 -19 -110 -145 37 90 -113 75 11 -96 23 -3 -40 20 64 -74 -58 8 -45 12 -71 -102 -147 153 0 96 -38
5214c8M7J8J40J19m91J72N6j02P6l0N8rj4j19K5K43j65Q6j28R1k56J90J24j56
5238f3j14P9J87j21L09k69N0oj02J82j16K1M9j33R1J8o6j05K80k02n2j75K34K31
5262B07k29LQ9R5j38L1k6j49J46k8P9j74k5K55k03K40j51J7o4J13p0J2p1j08L21
5287A72k45q1R9P3j9j7k1P4k9o6J51j45k8J6K66k02J55k22L1Q9m4q6P3J40j84
5312e0R2jj19O6O7j1o7L1J40j11J35k11O0q9l0J67m9N2q4oj0J59j89l4K20L2j81
5339b1M6m9k0R8N1ro5O2j89J13Q8k26J63j34J13J55j15kj19K0L4Q3o6j4M3O6k70
5366a64J90m5R2p0o1q8L50j55R0k59J89N7k56Q7JL6k17K08k1J3Q0p2j21Q0p4Q5
5392d5K4j0J08n2K9o9J9L9j78J01j19O3J31j13M3O1p4j49K67k61K29O7k16N5J57
$$ plain form
5214 -38 9 27 167 286 -205 -33 23 -79 -3 -33 25 16 2 -117 -92 151 -14 72 -56 35 -221 -31 93 -63
5238 -63 -177 -98 89 -32 277 8 58 52 -50 132 16 37 86 -47 44 62 -4 -109 171 -31 -83 -258 -24 207
5262 207 -22 -19 70 165 27 58 32 -117 29 1 80 -94 -119 136 -67 173 22 39 -25 88 18 30 -41 -149 172
5287 172 -73 -154 -55 18 -1 -18 -39 35 6 -60 91 -54 -82 -66 200 -2 153 -69 -38 51 7 -79 -6 134 -50
5312 -50 42 41 -78 -12 55 44 -23 8 148 37 172 -39 21 -68 -98 69 20 72 -12 -18 -28 131 -58 -92 128 160 -21
5339 -21 25 -24 -44 54 105 96 31 93 -96 17 105 -121 42 -92 21 176 61 59 -60 -40 -6 77 11 -3 40 106 -164
5366 -164 26 -19 73 3 -58 -146 204 49 139 -120 69 126 -130 -43 -42 -6 -223 -15 -36 -23 57 -15 -136 -56 -130 -45
5392 -45 -21 -31 77 25 54 -15 4 43 -135 -34 -153 -90 41 -72 -29 32 -42 -191 76 -185 44 111 -105 -50 107
5417A07k04LR3o4J40j17k6J2J80j80M4J07j63N7K1k18R7%J91j47j8J14l2M8Nl4
5443A6M9j60J55j29J54l6j44Rn6K54p5j50r2L35j50Mk8l7N6MK34k44pM2j11K58
5469A51j93J98p7k93K93q8J6J4p1P7n6r0L8j08Q7J34o2P7%O5Q1j73k4K4N0N8l2
5496I6j28J08nk6r1j78J19J96j27P0k4j33J81j63J23k6K5J14j76o0J02k9K5J8
5520A1o0%J59RJ30k74LP7l7J5j90kK26lj64l4mK64n0r3K1j26p7K27m8q1O4J68
5548A31k0m6j34m6M7j6K84j86q9K8rp0K39k55P8J65Qj6k55J73M9k87mK54L8k42
5574a81J0K64k93K17k6j24N7K07O4o2J31k19Q2r3M4j16l9Q5J03j00M6m3P4j93
5598a05K06k86L09k30L44k58q4J11J3n0L3M1O6j54J21L4j60Q0o9J16L3p7j26O3
$$ plain form
5417 107 -97 -94 -1 -65 75 -42 -68 -56 124 -56 -12 95 -68 -11 10 -208 -111 -111 80 -67 -85 29 -3 45 50 16
5443 16 65 -95 60 -69 85 49 -95 -86 -142 112 37 -113 -205 130 -20 -16 -44 -81 -25 -21 213 -31 -38 4 -107 151
5469 151 -42 156 79 -214 79 -9 7 21 -50 27 -29 -119 -81 -189 -102 32 -30 47 47 112 193 20 -4 20 70 128 96
5496 96 -32 76 71 45 -46 -224 -105 91 -36 34 10 -123 58 -105 18 -8 17 131 -45 -105 -3 -32 -7 11
5520 11 -49 -49 110 119 249 -25 -22 55 18 33 -157 -159 67 64 -100 -134 -138 126 76 -17 4 -122 -199 28 -20 -101 -37 131
5548 131 111 65 -69 -115 -68 -84 200 14 -75 -47 -56 -126 113 -142 -64 101 109 93 -162 11 60 -227 -231 23 61 -181
5574 -181 -171 93 -200 17 -9 -133 -76 131 195 133 264 45 127 34 78 -38 -77 8 111 11 57 14 88 -105
5598 -105 101 -185 124 -106 238 -20 -104 7 20 -30 3 44 110 -44 77 111 -49 31 -38 78 111 34 -92 -29
5622b9O3j18J4Q8Q0k13J17j72J87j51K45k35J57j98K74j62P6o8J43m1k85L17p6
5645A3N0P4n6j57n1R9R6j71J23j84J84j29O3mJ7L4k6l0J95j75J43k5j11m7kO4
5671a3l8j3J54m3J57j36o9n4nqp8O3O3n5J36j27P3m1K8M9K05j59J6r6L2JJ0l6
5699A6o4J10j42P9l5Q4Q2j90n6Q7R4j23n2J48k6JP1k32K4MJ24L4Qj66J49l8O8
5726E9K5m3n4j30J81k04J95M6j49K01k60J94j88r5L71r3q4j35J51J38r3J6m2k50
5750b43K38J21n9j5O2k22P9j9j3Q8r8K77j99n6J0j21K49k32J34J09m9n2o9OQ1
5775Gp0K77k11j2q7M9j37K70r8J15j61O7j37K12r9J19j10k3r8N7p0J62M4J8q6
5800bL3j67K60j00N5p9k7j0L8J00j73l8J46j0O4o1j0P9j37O3o8m7J50o6J6J18
$$ plain form
5622 -29 34 -84 -70 18 98 -115 2 -170 17 -134 111 -124 33 -165 109 -53 23 -45 98 57 -228 89 13
5645 13 63 137 81 -76 -127 -28 68 -103 20 -164 20 -109 -46 -50 -33 1 -25 -55 140 -35 108 83 -28 -75 -77 -13
5671 -13 -51 -64 90 47 204 68 -1 -55 -60 -68 -146 -83 -20 -75 61 -66 7 -34 -6 43 248 89 105 9 41 42 52 16
5699 16 -48 62 -80 -1 -36 48 130 -60 -116 -29 65 -58 -110 38 12 13 84 -148 -124 -120 4 38 46 -120 29 -9 59
5726 59 84 41 -13 -143 38 -166 29 75 -74 127 -133 61 -127 -222 149 56 -28 -163 -12 126 33 49 7 -243
5750 -243 -5 116 57 42 104 -118 -39 -58 -71 17 -81 196 -3 -59 -49 -170 79 -153 -19 90 41 -11 -80 -74 7
5775 7 -63 214 3 -9 -96 -47 -184 86 -12 103 -58 9 -128 84 -15 104 -6 -29 -127 -70 -140 22 66 84 -2
5800 -2 31 -136 124 24 79 0 -27 -37 1 101 -72 -110 36 26 90 29 19 98 -39 24 -44 -91 59 -7 9 127
5826A27j32K54q1j11q4L4r8P5J99k68K13k82L08m3k52J02n8J38n1M3l7r9J92p3
5850A6j10RJ35m0K65k44rk18L09q0q7M1k0n9K7J7O3J6q6Q0J8L6j03P1j3P6j4r9
5878cJ35P3k41o7p5rJ13O8oK9j16J1O0L2K1J16Ok17j0J50j5r0L7K7j79J59K8j19
5906h2K51k04J14j66L6q6J83p2J0N0j45L8N3J3O6k01K06o4j12NJ36j42J19P2j23
5931d5j02K0J24l9K0N2j25Q8o5J46j42J88j12Q4j55Q1OL8J38k31O1Lj3l4R9K4
5957A09p0j82K29j3j34Q3mm5r3R3J25k15J62l2J61j17m4J42j74J00Q7j88J11j26
5981c5K5N9q8j6N8R6j31J6P4Q6p4j51J1P7k21L54j31m7m4J6K6J74k54O5J70j31
6007a6P1k8m0K7n3J65j73p9K39k17L28j24k01O9J19o5QJ53j95j4J89o5J7k5J56
$$ plain form
5826 127 -5 249 168 57 -27 7 -91 -16 183 -85 128 -154 154 111 -141 -39 -97 41 -10 33 -4 -103 89 16
5850 16 -94 -85 50 10 275 31 22 -196 113 33 -54 -13 -33 -92 -65 -48 15 31 -55 25 43 79 -24 47 34 110 96 -3
5878 -3 132 205 -36 -103 -178 -187 -74 -6 -12 17 -99 -88 -28 4 25 141 147 -70 -80 70 55 -35 2 29 -150 9 37 -82
5906 -82 169 -35 79 -87 -51 -137 46 -26 -16 34 -111 -73 -20 -7 59 -142 64 0 -112 -107 29 -113 6 78 -45
5931 -45 -147 -127 -3 -42 -22 30 -95 -7 -72 74 -68 120 8 92 -63 18 24 62 200 -31 30 33 20 -14 85 109
5957 109 39 -143 86 73 -61 22 18 -27 -120 -27 98 -117 45 13 174 57 13 155 -19 81 168 -20 91 -35
5981 -35 -10 49 -39 -55 3 99 -32 -16 58 144 70 -81 -70 7 -214 140 9 -38 -82 -66 -40 134 -120 -55 115 -16
6007 -16 55 27 -13 14 -39 126 -47 -126 113 -104 224 100 -101 -32 87 22 30 183 -12 -26 163 98 115 90 246
6032B46m70K13J0p6L5M1J96j47j21Q8kP9j50l3J86n4k52K22J07k43K09r2J27q3
6056C6r0r2J21J72k49L20l29J45l1L6n7P4J8r6R3m4Nk42K02n8K5j40K16j20K16
6081A31k55J08K10l04J37O2n9p0l9JK42m36K35R1ml1l4N9O8k5r1p2j24L31j64
6106c3P8r1K0M3M2j29Q3J67k77N1NJ48j07jM1o3k8J06q7K42j95P3o5k38J74%J33
6133I2j88J61j50K0OQ5l5l3J41j03J32k17J01N7r2O3k4Rj36K8K06L7j83o1R3m5
6159c6R7P6l91K23M3L4J4j38K3P5Ro3N0r7j2J93p4l0L7k17J65L8j40J71j19J21
6185E2J7k1k18K22p6j16K31Q5k50M6n3j03J38o6L3Q4k1N6j5m2j2l9R7k11J61n3
6211g4j22L18O6j1l07Q8Mp9P5j34K62k52rK32j6j18J37O1l5m3J0M7k7j05J3p4
$$ plain form
6032 246 -224 -11 -1 -77 -42 -1 195 48 -73 15 13 92 -58 -91 95 41 -211 11 118 -125 84 -8 119 36
6056 36 -54 -146 -25 147 -102 218 -111 34 3 39 -18 56 74 -22 71 27 32 -210 -8 -66 -41 -181 35 -85 131
6081 131 -124 -16 194 -110 27 89 30 -40 -79 -78 164 -272 -37 54 50 19 -15 44 112 87 -4 -76 -200 131 -33
6106 -33 45 -46 -26 17 59 -70 13 180 -97 -46 -41 107 0 -1 40 -23 -51 55 -32 210 15 88 23 -215 -41 -41 92
6133 92 -96 65 -85 -65 -59 26 -9 -42 99 -4 128 -89 12 69 -23 40 16 25 -111 -83 123 160 -23 -84 9 -36
6159 -36 61 137 -254 -31 12 46 60 -78 -55 20 29 -34 16 -81 -93 100 26 -4 33 -184 -19 19 -121 50 -69 52
6185 52 69 48 -170 52 -24 -140 91 176 -74 -28 -81 -184 -46 -112 -79 5 -16 40 25 -17 -29 -68 29 -182 -21 -74
6211 -74 -196 122 188 177 -130 -42 -38 -117 -42 -176 86 -166 -175 57 41 -77 60 121 86 43 53 100 73 -32 -19 -93
6237i3J68r7J6K1p3P7l4M3k0j19K59j22j17K02l17J47J54j00L0oQ4k23K37J04
6261B21k26j31K78J2k07J54j01j61K62j14r5N8mQ0Jk09J95P3lj22O5j28L03k30
6285b9m3O0N3P4k7o9Qr7J07Q0j74J71k33O2K5pL7j4M4j8Kr3K25m8j34K5J57O3
6313B07m02J58N3J09k19K3J05k9o3N9l4P9m2jj33J84r2k1K27k79J88j63J54jq6
$$ plain form
6237 -93 75 -22 -6 15 -58 19 -15 28 8 -111 148 26 -91 111 -206 -59 95 -5 25 19 103 -120 117 221
6261 221 -5 -136 142 154 -53 101 0 -161 101 -13 -108 -50 -54 26 27 -182 13 86 83 -39 26 -102 201 -29
6285 -29 -72 -12 41 115 88 19 27 -70 37 117 -57 114 -119 -57 -32 -39 -2 -16 28 10 12 -81 144 96 -38 -13 144 207
6313 207 -195 -37 16 125 -94 -71 34 5 -58 1 -33 46 4 3 -130 54 -38 -59 168 -111 77 -86 68 67 -19
$$ [...]
8191e4
##END NTUPLES=NMR FID
##END=
