##TITLE=1H_24-2025
 200.13MHz, CDCl3,
 8 sc
 
 5.2.2025
##JCAMPDX= 6.0         $$ Bruker NMR JCAMP-DX V2.0
##DATA TYPE= NMR FID
##DATA CLASS= NTUPLES
##ORIGIN= UXNMR, Bruker Analytische Messtechnik GmbH
##OWNER= pz
$$ XWIN-NMR		Version 3.5
$$ Wed Feb  5 16:00:50 2025 Russian Standard Time (UT+4h)  she@DPX200
##.OBSERVE FREQUENCY= 200.1313
##.OBSERVE NUCLEUS= ^1H
##.DELAY= (6, 6)
##.ACQUISITION MODE= SIMULTANEOUS
##.ACQUISITION SCHEME= undefined
##.AVERAGES= 8
##.DIGITISER RES= 18
##SPECTROMETER/DATA SYSTEM= spect
##.PULSE SEQUENCE= zg30
##.SOLVENT NAME= D2O
##.SHIFT REFERENCE= (INTERNAL, D2O, 0, 14.3821)
##AUDIT TRAIL= $$ (NUMBER, WHEN, WHO, WHERE, WHAT)
$$ ##TITLE= Audit trail, XWIN-NMR		Version 3.5
$$ ##JCAMPDX= 5.01
$$ ##ORIGIN= Bruker BioSpin GmbH
$$ ##OWNER= she
$$ F:/spectra/data/she/nmr/H-C/1/audita.txt
$$ ##AUDIT TRAIL=  $$ (NUMBER, WHEN, WHO, WHERE, WHAT)
(   1,<2025-02-05 15:59:51.50 +0400>,<she>,<DPX200>,
      <created by zg, POWCHK disabled, PULCHK disabled
       configuration hash MD5:
       00 E9 B6 7A A2 85 ED C7 34 08 36 98 17 FE 4E 26
       data hash MD5: 16K
       66 22 E1 A5 84 94 40 01 E3 4B A9 7D D5 61 09 AE>)
$$ ##END=
$$ 
$$ hash MD5
$$ 1D 13 78 77 D8 6D 71 FB 24 15 E1 12 02 1D 9B 03
##$RELAX= 
##$RELAX= 
##$RELAX= 
##$RELAX= 
##$RELAX= 
##$RELAX= 
$$ Bruker specific parameters
$$ --------------------------
##$DU= <F:/spectra>
##$EXPNO= 1
##$NAME= <H-C>
##$PROCNO= 1
##$TYPE= <nmr>
##$USER= <she>
##$AMP= (0..31)
100 100 100 100 100 100 100 100 100 100 100 100 100 100 100 100 100 100 
100 100 100 100 100 100 100 100 100 100 100 100 100 100 
##$AQSEQ= 0
##$AQ_mod= 1
##$AUNM= <au_zg>
##$AUTOPOS= <>
##$BF1= 200.13
##$BF2= 200.13
##$BF3= 200.13
##$BF4= 200.13
##$BF5= 200.13
##$BF6= 200.13
##$BF7= 200.13
##$BF8= 200.13
##$BYTORDA= 1
##$CFDGTYP= 0
##$CFRGTYP= 5
##$CHEMSTR= <none>
##$CNST= (0..31)
1 1 145 1 1 1 1 1 1 1 1 1 1 1 1 1 1 1 1 1 1 1 1 1 1 1 1 1 1 1 1 1 
##$CPDPRG= <>
##$CPDPRG1= <>
##$CPDPRG2= <>
##$CPDPRG3= <>
##$CPDPRG4= <mlev>
##$CPDPRG5= <mlev>
##$CPDPRG6= <mlev>
##$CPDPRG7= <mlev>
##$CPDPRG8= <mlev>
##$CPDPRGB= <>
##$CPDPRGT= <>
##$D= (0..31)
0 0.7 0 0 0 0 0 0 0 0 0 0.03 0 0 0 0 0 0 0 0 0 0 0 0 0 0 0 0 0 0 0 0 
##$DATE= 1738756790
##$DBL= (0..7)
120 120 120 120 120 120 120 120 
##$DBP= (0..7)
150 150 150 150 150 150 150 150 
##$DBP07= 0
##$DBPNAM0= <>
##$DBPNAM1= <>
##$DBPNAM2= <>
##$DBPNAM3= <>
##$DBPNAM4= <>
##$DBPNAM5= <>
##$DBPNAM6= <>
##$DBPNAM7= <>
##$DBPOAL= (0..7)
0.5 0.5 0.5 0.5 0.5 0.5 0.5 0.5 
##$DBPOFFS= (0..7)
0 0 0 0 0 0 0 0 
##$DE= 6
##$DECBNUC= <off>
##$DECIM= 32
##$DECNUC= <off>
##$DECSTAT= 4
##$DIGMOD= 1
##$DIGTYP= 9
##$DL= (0..7)
0 120 120 120 120 120 120 120 
##$DP= (0..7)
150 150 150 150 150 150 150 150 
##$DP07= 0
##$DPNAME0= <>
##$DPNAME1= <>
##$DPNAME2= <>
##$DPNAME3= <>
##$DPNAME4= <>
##$DPNAME5= <>
##$DPNAME6= <>
##$DPNAME7= <>
##$DPOAL= (0..7)
0.5 0.5 0.5 0.5 0.5 0.5 0.5 0.5 
##$DPOFFS= (0..7)
0 0 0 0 0 0 0 0 
##$DQDMODE= 0
##$DR= 18
##$DS= 0
##$DSLIST= <SSSSSSSSSSSSSSS>
##$DSPFIRM= 0
$$ [...]
##$SUBNAM0= <"">
##$SUBNAM1= <"">
##$SUBNAM2= <"">
##$SUBNAM3= <"">
##$SUBNAM4= <"">
##$SUBNAM5= <"">
##$SUBNAM6= <"">
##$SUBNAM7= <"">
##$SUBNAM8= <"">
##$SUBNAM9= <"">
##$SW= 18.0517328524113
##$SWIBOX= (0..15)
0 0 2 0 0 0 0 0 0 0 0 0 0 0 0 0 
##$SW_h= 3612.71676300578
##$TD= 16384
##$TD0= 1
##$TE= 0
##$TE2= 300
##$TE3= 300
##$TEG= 300
##$TL= (0..7)
0 120 120 120 120 120 120 120 
##$TP= (0..7)
150 150 150 150 150 150 150 150 
##$TP07= 0
##$TPNAME0= <>
##$TPNAME1= <>
##$TPNAME2= <>
##$TPNAME3= <>
##$TPNAME4= <>
##$TPNAME5= <>
##$TPNAME6= <>
##$TPNAME7= <>
##$TPOAL= (0..7)
0.5 0.5 0.5 0.5 0.5 0.5 0.5 0.5 
##$TPOFFS= (0..7)
0 0 0 0 0 0 0 0 
##$TUNHIN= 0
##$TUNHOUT= 0
##$TUNXOUT= 0
##$USERA1= <user>
##$USERA2= <user>
##$USERA3= <user>
##$USERA4= <user>
##$USERA5= <user>
##$V9= 5
##$VALIST= <valist>
##$VCLIST= <CCCCCCCCCCCCCCC>
##$VD= 0
##$VDLIST= <DDDDDDDDDDDDDDD>
##$VPLIST= <PPPPPPPPPPPPPPP>
##$VTLIST= <TTTTTTTTTTTTTTT>
##$WBST= 1024
##$WBSW= 4
##$XGAIN= (0..3)
0 0 0 0 
##$XL= 0
##$YL= 0
##$YMAX_a= 860194
##$YMIN_a= -953426
##$ZGOPTNS= <>
##$ZL1= 120
##$ZL2= 120
##$ZL3= 120
##$ZL4= 120
##$ABSF1= 10
##$ABSF2= 0
##$ABSG= 5
##$ABSL= 3
##$ALPHA= 0
##$AQORDER= 0
##$ASSFAC= 0
##$ASSFACI= 0
##$ASSFACX= 0
##$ASSWID= 0
##$AUNMP= <proc_1d>
##$AZFE= 0.1
##$AZFW= 0.1
##$BCFW= 1
##$BC_mod= 2
##$BYTORDP= 1
##$COROFFS= 0
##$CY= -3
##$DATMOD= 1
##$DC= 2
##$DFILT= <>
##$DTYPP= 0
##$F1P= 0
##$F2P= 0
##$FCOR= 0.5
##$FTSIZE= 0
##$FT_mod= 4
##$GAMMA= 1
##$GB= 0.15
##$INTBC= 1
##$INTSCL= 1
##$ISEN= 128
##$LB= 0.25
##$LEV0= 0
##$LPBIN= 0
##$MAXI= 10000
##$MC2= 0
##$MEAN= 0
##$ME_mod= 0
##$MI= 1.114404
##$NCOEF= 0
##$NC_proc= 0
##$NLEV= 6
##$NOISF1= 3.799351
##$NOISF2= 2.8
##$NSP= 1
##$NTH_PI= 0
##$NZP= 0
##$OFFSET= 14.38212
##$PC= 1
##$PHC0= -103.4992
##$PHC1= 7.592221
##$PH_mod= 1
##$PKNL= yes
##$PPARMOD= 0
##$PSCAL= 0
##$PSIGN= 0
##$REVERSE= no
##$SF= 200.129724274929
##$SI= 16384
##$SIGF1= 3
##$SIGF2= 2
##$SINO= 400
##$SIOLD= 16384
##$SREGLST= <1H.CDCl3>
##$SSB= 0
##$STSI= 0
##$STSR= 0
##$SW_p= 3205.1282051282
##$SYMM= 0
##$S_DEV= 0
##$TDeff= 0
##$TDoff= 0
##$TI= <>
##$TILT= no
##$TM1= 0
##$TM2= 0
##$TOPLEV= 0
##$USERP1= <user>
##$USERP2= <user>
##$USERP3= <user>
##$USERP4= <user>
##$USERP5= <user>
##$WDW= 1
##$XDIM= 8192
##$YMAX_p= 0
##$YMIN_p= 0
$$ End of Bruker specific parameters
$$ ---------------------------------
##NTUPLES= NMR FID
##VAR_NAME=  TIME,          FID/REAL,        FID/IMAG
##SYMBOL=    X,             R,               I
##VAR_TYPE=  INDEPENDENT,   DEPENDENT,       DEPENDENT
##VAR_FORM=  AFFN,          ASDF,            ASDF
##VAR_DIM=   8192,          8192,            8192
##UNITS=     SECONDS,       ARBITRARY UNITS, ARBITRARY UNITS
##FACTOR=    0.0002768,     1,               1
##FIRST=     0,             0,               0
##LAST=      2.2672688,     0,               0
##MIN=       0,             -953426,         0
##MAX=       2.2672688,     860194,          0
$$ Real data points
##PAGE= N=1
##DATA TABLE= (X++(R..R)), XYDATA
0@%%%%%%%%%%%qJ6j2J2j6K1k5K8l2M0n0N4o0P2q7R9j12J28j44J63j85K08k34K63
35A39k93L24l60M03m48M94n41N93o57P26p96Q73r60J058j166J282j411J558j726
54i08J919k138K392k696L063l512M075m801N771p123R108j2248J7749k9035N9934
69D1550k81037p13939J281145K35809j174999N32156Q28766r91631l67337J110843
79E01326j21511r91865M70974O32014o34016j22965O70696k80632o09718L94813
89i0884M34867l58031k12445L77741L0719m32719J65622M23772l99343l17500
99c78201N61171J22585n43123J70397M01548n05599k21395P09322n7718o78843
109d19856M32044M10099p21331K7754P38285m86324m87949P68377J13715p52275
$$ y = [0, 0, 0, 0, 0, 0, 0, 0, 0, 0, 0, 0, -8, 8, -4, 8, -8, 13, -12, 16, -16, 24, -26, 28, -32, 40, -47, 52, -60, 68, -76, 87, -98, 110, -124, 139, -154, 170, -190, 213, -235, 259, -282, 311, -346, 380, -416, 457, -503, 555, -611, 671, -740, 818, -908, 1011, -1127, 1265, -1431, 1632, -1880, 2195, -2606, 3165, -3958, 5150, -7098, 10651, -18384, 41550, -239487, -953426, 327719, 563528, -611471, -79315, 749451, -242180, -609517, 501326, 379815, -612050, -141076, 490938, -143078, -266043, 404653, 124021, -485697, -90884, 343983, -14048, -226493, 151248, 181967, -250752, -85130, 338642, -60701, -378201, 182970, 305555, -237568, -67171, 334377, -171222, -392617, 316705, 258987, -419856, 12188, 422287, -299044, -271290, 466995, -19329, -507278, 261099, 374814, -377461]
119c77461K92895N25397o28623k12566P65978j36628o52102M54990L56042o16474
129b28552k3859N51746k39843l79327L69760K26709l84680r1841L71019n9836
139A11296l59405K11603L10499l10674j82753L73064K0327m13394J39689L90946
149B91198l25323k64029M96883K1955n41249K66000L82671m94621r9918N62785
159B96352j71859m40502L76521K08792m83783N6707M59182k95265k84863M40379
169A61661K4062m20331K02075K46131l23459m7938L17857q0440k37107J48737
179h752J36888j98360l8150K23283n2380j89737J26375J30942j54990p6506J60244
190E8857J9853j87171O5975K12940j84314j65851K74863J4917k89590J59829K08652
$$ y = [-377461, -84566, 440831, -187792, -400358, 365620, 228992, -423110, 31880, 387922, -228552, -252411, 299335, 59492, -319835, 49925, 276634, -108046, -199887, 171132, 111296, -248109, -36506, 273993, -36681, -219434, 153630, 173957, -239437, -99748, 291198, -34125, -298154, 198729, 220684, -320565, -54565, 328106, -166515, -266433, 296352, 124493, -316009, 60512, 269304, -214479, -157772, 301410, 6145, -278718, 161661, 185723, -234608, -32533, 213598, -109861, -157799, 160058, 79618, -157489, -8752, 128136, -70224, -108374, 114909, 62529, -127208, -833, 130109, -24881, -101387, 58857, 78710, -108461, -42486, 170454, -13860, -179711, 95152, 110069, -179521, -19692, 188960]
201A88960k74755o6776L14232p8939k81949K09353J73624l01090J0050L17166
211B09876j92848k18965K90008L9890k77646J13605J88364j92407q2265K10768
221H8380j4226j99962R2857J46792j48313m6211J67408m3223j34653Q2537Q5560
232G6946q6787n2182J02161K7098j31740K6447J32546j11216q8148J63389Q305
243F6819j55580O9843J14248j29697o4160J69190n497j72960J06962J26096j86503
254f1239j9153J92825r8332j27123J61379L6756j59416L6596J24436r7317q4301
265i4889J37938J9705j44557O3878J04663j17172l3150J15155k5072p9613N3081
276c3N8084o1440m3981P8225R264r5845L9948P8885p9232l3188Q6282j0770p8868
$$ y = [188960, -85795, -152571, 161661, 82722, -199227, 10126, 183750, -117340, -107290, 209876, 17028, -201937, 88071, 127961, -149685, -36080, 152284, -40123, -122388, 88380, 74154, -125808, -32951, 113841, -34472, -80683, 86725, 43502, -91151, -8614, 76946, -9841, -62023, 40138, 67236, -64504, -38057, 94489, -16727, -104875, 58514, 66819, -88761, -18918, 95330, -34367, -98527, 70663, 65166, -107794, -832, 125264, -61239, -80392, 112433, 14101, -113022, 48357, 85113, -74303, -37707, 86729, -10588, -94889, 43049, 62754, -81803, -17925, 86738, -30434, -63584, 51571, 26499, -53114, -33, 58051, -3389, -47370, 30855, 40119, -55726, -15778, 63107, -16125, -49313, 36969, 26199, -52669]
289e2669L3710O9854n9195m8945R8696L547j12787O3253P6915j08805p510J08425
301F4489m6731p4632P2059L5760q9703k177R5969m6056p4686R2394J8069j03422
313e8667M2750O8875p1033j9377O9074o050n6521K2033N0204m5382l4929O9330
325C0307k540o7018L9058L5248n3363p707M3674l700m0860J2962M7076l7465l4606
338c8934O5365k482o4887M3942L7948n7763m567N0965j4620m6009L0450L8032
350C7440n6534j3261P0398l1535n2861O3670Q057o1154K6612L9194l5449j8501
362b3924L8770P619m4651J2619M3669l9636j9911N2131j4594l7497K9135J1818
374A5548k5226m830K1114N695k9753O073L4974l0664j7695M4841r010l2023K5451
$$ y = [-52669, -18959, 50895, -8300, -57245, 41451, 44998, -67789, -4536, 72379, -36426, -43936, 64489, 17758, -56874, 15185, 50945, -38758, -40935, 55034, 8978, -65708, 26686, 44755, -58667, -15917, 52958, -18075, -37452, 31622, 25572, -30949, -8916, 41288, -4094, -39023, 30307, 27767, -39251, -193, 35055, -18308, -26015, 17659, 13959, -26901, -13939, 33137, -4328, -38934, 26431, 23949, -40938, 3004, 40952, -16811, -21378, 29587, 14967, -31042, -592, 37440, -19094, -32355, 38043, 6508, -46353, 17317, 25374, -35780, -9168, 30026, -5423, -23924, 14846, 22465, -22186, -9567, 34102, -5534, -25445, 26686, 12092, -25405, 3730, 15548, -9678, -14508, 6606, 12301, -17452, -11379, 23595, -7069, -24764, 20077, 11067, -20956, 4495]
387D495J5799k5397q903K7388K763l7423J7993L3231m5237o595M9203k8498k8314
400b9495M1389J718l2244J1284K3991j6477k0099K9278J0179l8268J5735K8971
412B5962l4227l473K9791j6748j3418J4119M833p375j0834J2731Q222k4913Q457
425f873K2740k3344m638K3375o050j2687O272J2710q504j7379K4762P141l6813
438a9288J7532K3894l7118K617L1245k1976j3751K2303L168j9634J484K2636j2249
451H63j8573K9882J585l0762K0674J1687k4955Q290J1469j0690k517J459N536
464C948l166j1367J2665L106j6139J0109P737j1215O2M881N013n960o366J8634
478A1942o068k1396K5492L331l0204J8509J3343k6029M024J7565j0846j2374J1861
$$ y = [4495, 20294, -5103, -14006, 13382, 16145, -21278, -3285, 29946, -15291, -21886, 27317, -1181, -29495, 11894, 13612, -18632, -7348, 16643, 166, -19933, 9345, 19524, -18744, -3009, 25962, -8265, -11738, 18053, 1305, -12113, 2006, 6839, -536, -11370, 1361, 9583, -15330, -6873, 15867, -7477, -12115, 11260, 5210, -7477, -1205, 11505, 3001, -14378, 10384, 17525, -19288, -1756, 22138, -14980, -12363, 18882, -3094, -16845, 5458, 8626, -11008, -9524, 13112, 863, -17710, 12172, 13757, -17005, 3669, 15356, -9599, -1309, 10160, -530, -3047, -1588, 3948, 782, -10585, 2080, 5186, -10953, -844, 6893, -4322, -4260, 621, 5634, -326, -6692, 11942, 5874, -15522, 9970, 13301, -16903, 1606, 14949, -11080, -7056, 10509, -337, -12711, -850]
491h50J1307j9217o00K5030j7627j3964L0119p868j9384K1082k38j4012Q277K316
505D371l575l726l86Q174o285m679R785n582m000O924j961K460l139l788J4459
520I052p947j0398K1071p440j7400K2379K78j9651J0615P316j2527l006J3139
533E481l65j8231R928J6094k3247K207K3674k0948n033K3628j1772q233J3462
546F645l141n956K712L228r24p824M896M582r977M967L135q707P226j078n070
561e286J1258p900m381J5770j0178n698J6390q314q512J1934K00q402J72P809
575D862l489j1349J3299M851k1931J2090J3329k2750P074J5852j7678N62J3769
588H491p270l605M812J627m363l030R194l553r271J0892k779q590J1235m450n924
$$ y = [-850, 10457, -8760, -9360, 15670, -1957, -15921, 14198, 6330, -13054, 8028, 7790, -6222, 2055, 4371, 796, -2930, -3316, 4858, -1427, -6106, 3679, -1903, -5903, 1021, -940, 1520, -1619, -5407, 9052, 1105, -9293, 11778, 4338, -13062, 9317, 9595, -10056, 559, 7875, -4652, -7658, 5481, 5116, -13115, -3187, 12907, -10340, -8133, 15541, -5407, -10440, 13188, 1416, -6817, 6645, 3504, -2452, 260, 3488, 2564, -5260, -364, 4218, -5759, -792, 2343, -6364, 862, -216, -5286, 5972, -1928, -6309, 9461, -717, -6415, 9975, 1661, -6851, 5083, 5283, -3119, -2947, 4862, 1373, -9976, 3323, 8174, -13757, -1667, 11662, -11088, -4014, 11838, -5840, -5278, 8491, 1221, -2384, 2428, 4055, -308, -3338, 5856, 2303, -6968, 3924, 1145, -7445, 3790, -660, -6584]
603f584J0612o888j283J0637j0168N46R859p827l22O071k882k620M80N058l686
618A003p606J1595j461j5086J5479J965j8382J3141O621j6111P875P090q901O85
632b093N009P18n375P46Q512q482l635J2403q392n722J2542q232l688R785p216
647c120j32N925o329K614L350m724L205J055j378J155k023L765k097n040R200
662E426m037q501J3208n033j0294J3482k235r820R343L58n830K786K624j4m137
677b674L201N633r321J814R863j1882O87J0251j0759K77P807q004R47L415m206
692b951K916q72q29K935l269K091K030m128M934j132m264P999n306l680R345o398
708e79l966R879o909l223P557l791k012K749J31M54l308L684L369q214N142N301
$$ y = [-6584, 4028, -2860, -4143, 6494, -3674, -3128, 6731, -1096, -1418, 4653, 1771, -849, -369, 4689, 1003, -6603, 4992, 3531, -11555, 3924, 5889, -12493, 648, 7269, -8842, -967, 6123, -2778, -2093, 2916, 3634, -1741, -995, 7517, -965, -4600, 7803, -589, -6311, 6231, -2001, -5689, 4096, -3120, -3252, 2673, -3656, -1042, 2308, -2416, 789, 1844, 466, 1621, -402, 3363, 1266, -3774, 5426, 1389, -7112, 6096, 1063, -9231, 4251, 2016, -7804, 1539, 1897, -3933, -1147, 1477, 1463, -2674, 527, 6160, -3161, -1347, 8516, -3366, -2679, 7572, -3187, -2910, 4897, -3107, -2160, 1255, -2951, -35, -907, -1736, 1199, -2070, 21, 2051, -2077, 2857, 1725, -2539, 5460, 154, -3526, 5819, -579, -4545, 5334, -1575, -4798, 2759, -1032, -3044, -295, -164, 290, -3018, 666, 4035, -4179, 963, 6264]
724F264j0828M995N856j0069L900M265p338K894J022k993K566k797J512J633m601
739c719N174o65m717O988k399l219P054m878q54O404o729P55N237p055K072K884
755B333m610J628Q0q48J613l594L865J140o201O373J474p802P284P05p224O173
771B389J75m614L965j542q57J133k706K964j381l560N960k753l141P182m483j055
787b324N643n153J423M009n457L181J791m971L842j083k528L196k860L44J739
802G92l783L289L23n072O378j297m665P214k549l545O450k893j741L657k762Q99
818F95M04k577L479k787j924N761n403j36M971n387J354M156n042K563J597l605
834a881M005j243j999L831k785k2K574m327K101J051m009L870j159l537N534l368
$$ y = [6264, -4564, 431, 6287, -3782, 118, 4383, -2955, -61, 961, -2032, 534, -2263, -751, 882, -3719, 1455, 790, -3927, 3061, 662, -2557, 4497, -381, -1235, 5169, -1560, -805, 4432, -2623, -551, 2333, -2277, -649, -569, -1417, 196, -3398, 467, 1607, -4594, 1779, 3253, -4549, 2735, 3440, -3784, 2389, 2564, -2050, 1915, 373, -484, 649, -2057, 907, -474, -4034, 1926, -827, -3968, 3214, -1269, -2324, 3319, -1834, -411, 3598, -1859, 1322, 3113, -1858, 1984, 901, -1627, 1569, -1291, -947, 792, -2991, 298, 621, -4451, 1927, 630, -4035, 3179, 630, -2915, 3535, 642, -1099, 2558, -204, 695, 1099, -1478, 2001, -786, -2710, 3051, -2352, -2488, 2483, -2904, -1550, 2606, -2436, 127, 1724, -1881, 2124, 881, -1118, 2713, -72, -94, 2480, -1847, 254, 1305, -2704, 1166, 7, -3530, 2004, -1364]
850a364j542N721m317m16M397l551J332K132l337K968j405j380L838m145K11L889
866C031n838K083L000n643L170J464m612L913k80k387L885k569K32L035l772K200
882I12J411m243L956q34k955M188k974j808M400l928N35L124m766K354J996l892
898b524L497k00k245L569k470M32K715m408K535J573m665L617K35m647M326r99
914C41l074L955k535m69L163l312K085J460l444L799q24k642M314k546j225L710
930B756l954Q22K431m433K716J062m160L309m92k644L631k045l00L295l388J925
946E31J441l478L163l54l156M115j645k506M507l594l05K754l418J501J190l124
962b378L078q71j670L824k661l69L540l548R60K747l977K341P30l571L428j288
$$ y = [-1364, -2906, 2815, -1502, -1918, 2479, -1072, 260, 2392, -945, 2023, 618, -762, 3076, -1069, -858, 3031, -2807, -724, 2276, -3367, -197, 1267, -3345, 568, 288, -2099, 1786, -783, -551, 2484, -1288, 912, 2323, -1920, 2036, 1202, -1753, 2435, -539, -2347, 2053, -1875, -1340, 1784, -2982, -628, 1368, -2524, 973, 773, -1472, 2097, -373, 59, 2774, -1634, 901, 2474, -2191, 1426, 1661, -2986, 1340, 341, -2733, 1222, -1313, -1782, 1381, -1931, 154, 1614, -1830, 1969, 1145, -1497, 2817, 271, -954, 2756, -1198, -376, 2055, -2378, 338, 1400, -2760, 549, 57, -2587, 1044, -1001, -1301, 1994, -1394, 531, 1972, -1506, 1657, 1303, -1853, 2262, 617, -1889, 2618, -976, -1281, 1473, -1945, -444, 746, -2378, 700, -171, -1841, 1983, -678, -1047, 2493, -1055, -95, 2652, -1325, 1016, 1746, -1825, 1603, 315]
978C15k520L777k338j102L096l053J296J677l222L128l84k692M008k141j040M112
994B917l379M2L212m238J544J690l850K926o41k390L460k276p38L130l208J111
1010f88K114l375K623N72k874L590j168j874L420k454q55L099l587J064J386l256
1026b263K420J31k616L271j360j187L508l292Q62K547l584K468Q46l142L005k41
1042A373k898L229j842j029K931l238Q33J779l322K456L05k841L357j102j548
1057a557L671k491j84K882l161J222J384l198K450J85k950K964j656j029K653
1072A185k880P34J967k828K105M00k668L368o27k290L627j879q05K687k771N21
1088a54J720l074J778J82k525L014j146j937L138j898m2K550l100J544J782l525
$$ y = [315, -2205, 1572, -766, -1868, 1228, -1825, -529, 1148, -2074, 1054, 670, -2022, 1986, -155, -1195, 2917, -462, -420, 2792, -1446, 98, 1788, -2062, 864, 223, -2167, 1293, -983, -1721, 1409, -1799, -688, 1426, -1949, 674, 1246, -1628, 1962, 794, -1080, 2340, -114, -969, 2130, -1457, -393, 993, -2263, 157, 288, -2328, 943, -417, -1604, 1904, -1388, -526, 2021, -1563, 905, 1751, -1391, 1614, 1373, -1525, 1704, -138, -1167, 1764, -1474, -641, 1138, -2184, 272, 577, -2264, 1093, -9, -1557, 2114, -377, -561, 2321, -840, 382, 1766, -1432, 1018, 1203, -1747, 1217, -439, -1468, 1185, -1695, -961, 1006, -1822, 283, 683, -1985, 1383, 756, -1534, 2093, 214, -591, 2096, -675, -154, 1566, -1508, 270, 452, -2073, 941, -205, -2142, 996, -902, -944, 1606, -1494, 50, 1832, -1693]
1104a693L009n5k771L264j407j251K745k518k99K195k783J714L71k484K770q61
1120e4j898L263j638o73L064k910N89K238k738J524L95k150K225r27j495K579
1136A394k126k55J984k624J121J328l150K954K9k415L022j037j192K735k241K25
1152b48K204k890J412O46k284K095r98j563K729j891n97K652k818N68K733l348
1168a598J687Q89k303K828p63j460K508j937q1J879k946J562N12k626K523l50
1184C24k062K606j176j313K894j990Q0K196k307J084Q84k092K123p55j051K167
1200A612k060n73K294k785Q29K007l290J978M61k368K343j15j503K239j293q3
1216c07J896k052J045N07j886J881l66j898K701j983r11K685k265q4K283k575
$$ y = [-1693, 1316, 1261, -1510, 1754, 347, -904, 1841, -677, -976, 1219, -1564, 150, 521, -1963, 807, -54, -1952, 1311, -327, -1000, 2064, -846, -257, 1981, -757, 767, 1162, -988, 1237, 310, -1185, 1394, -732, -987, 997, -1627, -506, 822, -2328, 626, 655, -1760, 1262, 225, -967, 1768, -473, -248, 1956, -934, 478, 1124, -1160, 935, -63, -1626, 1103, -788, -1385, 1267, -1551, -983, 1750, -1598, 89, 978, -1325, 1503, 740, -720, 1788, -149, -230, 1649, -1297, 265, 777, -1849, 674, 324, -1738, 868, -308, -1621, 1273, -717, -637, 1559, -748, 336, 1220, -872, 1251, 496, -555, 1612, -448, -1021, 1273, -1512, -683, 1324, -1966, 12, 473, -1895, 448, 333, -1170, 1069, -224, -307, 1589, -463, 582, 1089, -797, 1084, 718, -1180, 1521, -462, -1373, 1312, -953, -1037, 1246, -1329]
1232a329R48J102k018K028m06j242K565j941j4K139k773J077J441l018K095K77
1248I31k516K353m84j847K196j190m06J952j931Q24J117j830J629k68j345K464
1264A649j690n59K278k180o3K038k814J197O04j756J345K24j325J887j279k71
1280g15J832j972J002J122k136J684j37j544K369j058j588K286j578m51J908k360
1296a336Q66J008j760J676j52j310K291j565j09J863k058L35J803k586J609O61
1312A236k305J554P0j645J679j078m80J777j872Q31J019k208J950K24j905K360
1328A207p36j182K177j430l16J716k047O56Q74j805J356m68j256J816j042n52
1344a032J915j770L76J677k474J740Q50k203J708kj584K049j169n50J187j513
$$ y = [-1329, -381, 721, -1297, 731, 325, -917, 1648, -293, -307, 1832, -941, 136, 1577, -1441, 654, 931, -1585, 768, 284, -1563, 633, -557, -963, 989, -942, -118, 999, -831, 798, 530, -815, 1649, -41, -600, 1678, -502, -565, 1473, -1341, -144, 460, -1296, 49, 273, -1052, 835, -444, -715, 1117, -855, 147, 1269, -867, 817, 680, -864, 1505, 447, -1141, 1145, -433, -884, 1024, -1336, -470, 538, -1222, 454, 302, -1008, 1283, -282, -391, 1472, -586, -251, 1552, -1034, 575, 1236, -1069, 485, 555, -1090, 589, -489, -969, 808, -1064, -233, 786, -1422, 528, 752, -1153, 1207, 471, -711, 1466, 36, -280, 1436, -611, 45, 919, -886, 470, 2, -1254, 562, -480, -1032, 883, -887, -511, 1166, -1308, 432, 1282, -921, 787, 785, -799, 1250, 81, -469, 718, -795]
1360g95O93N75j716J617k72j503J966q36o84K215j541j86J814k037N00J169j590
1377f11J506n28j077J596q90o40J435j736P84P55j790J430K88k040K164p8j938
1394a370K363j011k59J237j163K84O80j549J504l65j308J644j009q73K553k138
1410g80j88J899k105J124J064k118J408N18j415J482n65n32J316j299J18Q04j687
1427i56J188K84j725J744o25r05J580p52o32J816j311K88Q83j403N96M24j034
1444e40J438r00n85J425j301q6J408k108J037Q53j934J718j70j116J192l06m51
1461d26J238j079O75L60j295J080k07j256J567q02r90J791j083l09J572j554K42
1478d76J160j393R77K65j222J158l58l67J283j586O11Q43j677R53N86j706J286
$$ y = [-795, -102, 473, -1243, 374, 102, -1401, 565, -271, -955, 1260, -281, -467, 1347, -690, -190, 979, -611, 895, 367, -710, 886, -4, -644, 791, -945, -161, 594, -1196, 234, 522, -1518, 646, 568, -1370, 993, -18, -277, 960, -203, 81, 761, -788, 716, 351, -957, 687, -322, -1195, 1358, -780, -968, 931, -1174, -50, 1014, -1104, 304, 822, -593, 889, 324, -208, 1108, -191, -73, 731, -956, 232, 516, -1209, 535, -90, -995, 585, -167, -799, 1017, -294, -6, 877, -526, 70, 494, -540, 898, -2, -587, 838, -463, -549, 859, -1249, -212, 641, -1293, 425, 255, -861, 331, 25, -426, 812, -267, 408, 768, -527, 553, 346, -910, 657, -145, -1135, 656, -427, -736, 836, -718, -476, 684, -709, 268, 533, -689, 469, 111, -256, 1027, -559, 52, 895, -782, 171, 757, -949, 337]
1495C37j32j368J575l82q75J486r09J2P44r32O78K10r93J194n92m83J504j201
1513a27l56J468j495M36Q73j493Q06M24j331R13j70m24J235r44k9P92j279O66
1531c5P90j515J435k59j026J494q60p48J621j284p1P33j046O81R8m97R52n30n10
1550e77J309r12j49J097j439O26J067j817R44M30j167J042n01m68J139j082K53
1567b05N65j363J026L24j084R63J45j221J488m33q36J682j091l71J046j156N34
1584A3K34o87P62l59o68J291j005l5J144j350Q76N39j342J141j16r39R07J64r11
1603c41Q86r83J43Q14j273N84J05m62P73r8r35J497j034j82J161p87k92J215j282
1622d91N83M91j125J170l70p19J063r71k44J066j232P03P32j656J223K14j236
$$ y = [337, 205, -1163, 412, 30, -845, 641, -268, -256, 488, -444, 234, 444, -549, 645, 53, -430, 1074, -127, -483, 985, -510, -74, 799, -694, 112, 536, -795, 118, -52, -476, 759, -185, -214, 578, -701, -35, 755, -760, 675, 416, -610, 884, 24, -724, 897, -387, -458, 275, -771, -90, 8, -489, 463, -67, -577, 732, -180, -329, 768, -671, -45, 1022, -795, 149, 579, -588, 454, -47, -515, 624, -458, -205, 360, -1003, 23, 347, -737, 226, 371, -850, 638, 205, -631, 1051, -40, -411, 635, -521, 13, 247, -440, 322, -37, -705, 586, -419, -454, 690, -660, 216, 755, -587, 554, 438, -501, 406, 570, -341, 545, -438, -295, 519, -754, -170, -65, -527, 246, 148, -787, 710, -324, -506, 655, -132, -424, 791, -491, 92, 583, -542, 628, 258, -461, 602, -369, -613, 453, -779, -76, 656, -1000, 223, 437, -799]
1639g99J133j52n86P42j0m88O79q07M63K64q33P40m51o07J194r05j43J298j455
1658g23K39R51j076M91P47r01O68j00o69J009r45K50Q39r98L0P54j317J177k85
1677A41r77J112l81m10R34n77k07J117j236N92K76p41Q29l94k77J026j071M1R21
1696G18j277K29R61j211L95M68j221J042R5m49O88m49J31P46j321O42L66j175
1714f22R93k33o28R34n18n66J236j024m8P58n92J20O58p50K58L56o30P95m81L3
1734D9N80r37K68O06j114P05M06r60L65J41m63O06k81k94P26m57K21L22r30R32
1754D91Q6p63R49r04k54P36n41j34J017j053J99N85q84L22K56o62Q03k67p5L67
1774B74n16K87L06r81P61K35q74J052l22p22R65o49k31O28o13L68Q7o67N29M44
$$ y = [-799, 334, 182, -404, 338, 328, -160, 519, -288, 175, 439, -394, 346, -105, -712, 482, -423, -566, 732, -723, -484, 467, -609, -118, 629, -272, 396, 296, -373, 636, -309, -59, 780, -218, -188, 566, -751, 426, 141, -836, 276, -105, -515, 419, -158, -365, 752, -484, 108, 384, -357, 472, 78, -199, 827, -244, -203, 718, -559, -330, 631, -580, -185, 283, -938, 104, 199, -250, 438, -11, 120, 866, -455, 187, 553, -622, 371, 138, -490, 444, -74, -640, 596, -428, -476, 282, -310, -190, 468, -282, -24, 332, -298, 497, 16, 49, 629, -308, -40, 566, -548, 157, 563, -397, -32, 109, -354, 252, -29, -323, 403, -54, 167, 489, -441, 491, 577, -186, 763, -141, -395, 341, -200, -334, 683, -370, -171, 414, -470, -148, 108, -554, 249, -18, -93, 274, -242, 45, 351, -630, 131, 366, -508, 544, 222, -500, 465, -184, -415, 213, -400, -32, 55, -612, -83, 361]
1794C61p33P93m48l21J028o78j95Q82j235P54Q3o93O37R0n58K82l60O3L08m63
1814d03K50K63o23Q48o1p78O33k27pQ15r13J78N82p65Q5M14o84N52j34l25P62
1835D62n56k97Q45j014L79N90o68O30j35p71O93K62j133Q46q6j95L73j65k37N16
1855C39j002R67p7j032J004k34l04N64k92j05O86j007L91P35j205O42L14o84M90
1874A90k80j68O06q28M34L65p97O02K07q70P42k08j34M19l59j00M93l92J19M01
1894D42n04K36J19j034R58n01j61P63n40j49Q13p89K07M53n01K73J68o33P40n1
1914C09p66Q41q74J06O49p62O07K30q11M91O5l31P50q50J38M58l95J24K45o25
1934d01P35j02m74O18k67k74O30p54oO51n51Q6N52r45M58K63n46L81k91J56N19
$$ y = [361, -372, 421, -27, -348, 680, 2, -193, 689, -546, 208, 291, -402, 235, 325, -233, 49, -311, -248, 60, -403, -153, 110, -513, 335, 274, -504, 129, -98, -105, 710, -203, -25, 557, -208, -123, 291, -393, 159, 25, -300, 462, -94, -391, 454, -560, -181, 409, -259, 371, 236, -535, 158, 420, -713, 133, 47, -148, 225, 60, -177, 339, -663, 304, 227, -805, 199, -35, -339, 225, -67, -172, 514, -493, -102, 633, -572, 70, 384, -300, 190, -90, -258, 348, -480, -46, 319, -478, 124, 331, -539, 203, -5, -139, 280, -79, -179, 314, -78, 41, 442, -62, 174, 293, -741, 217, -284, -445, 318, -222, -371, 442, -347, -140, 313, -188, 85, 253, -380, 360, 309, -457, 384, -490, -384, 265, -497, 110, 340, -471, 20, 85, -246, 504, -346, -208, 250, -145, -21, 224, -401, 334, 232, -242, 376, 109, -165, 465, -289, -295, 356, -195, -109, 443, -502, -44, 219, -327, 54, -237, -81, 438]
1955D38r34J18R40p76O80j45o02L15K13n15O03l68k46N56n77K42K63p30Q37J11
1975D23n77L05l5l82P19m40o4K46m35J65M45r91N70L14n75Q19p14n1O16l13k36
1996a91N15o31M09o3l73N91r7n17Q77l84m68P39n80K17L92q48J55N05p37P28m6
2017A93n85Q18n14j92K75l28K76K13o42Q38k85o73R72m68k70O42o52K39K56l57
2037b44Q4L28n28M15K9m15N51m26j00Q93q23Q4N07q20P28r0o41O50m4n89P55o50
2059c46N1K51j73p2J56m52Q66l7p28Q57j68k19L33l94J10K86k29j12r7k93M01
2080iL3m04N90k34k45O98q54L45N33n80R4K50n42O55j21l40K20l22K32l6k91L83
2102E5J73o99Q22m51l56O58k33k15Q61r18O5O95m40J17Q0m81K89N6l56N88l03
$$ y = [438, -496, -378, 562, -214, 466, 321, -281, 34, 247, -268, 335, -33, -279, 277, -300, -58, 205, -525, 312, 423, -154, 151, 116, -266, 453, 13, -51, 195, -240, -75, 370, -621, -51, 263, -312, 507, -207, -258, 358, 45, -191, 324, -307, 102, 39, -334, 257, 160, -357, 520, 136, -332, 407, -173, 44, 436, -412, -257, 248, -489, 239, 193, -392, 426, -88, -280, -5, -333, -57, 156, -486, 352, 67, -606, 366, -102, -372, 270, -382, -143, 113, -244, -160, 168, -360, 55, 84, -331, 220, -206, -306, 587, -236, -152, 355, -465, 263, 173, -468, 182, 138, -451, 304, -346, -295, -44, -217, -289, -133, -585, 281, 244, -484, 373, 205, -14, 319, -75, 35, 321, 92, -20, -117, -410, -9, 24, -380, 210, -24, -269, 429, -425, -80, 453, -127, -33, 217, -325, 330, 209, -131, 89, -233, -1, -37, -328, 55, 228, -471, 351, -100, -456, 202, -31, -246, 615, -303, -238, 457, 17, 134, 214, -267, 22, 78, -278, 310, 7]
2123Gm17N54l05j9L68m49N94k29l23O08n2o88N82j37o1K51o15L85M9l24M89k36
2145C2l03N14k78j52M09r8m79R61p57L93j27l44N72q0n36L85n3k74N28o89K92
2166h4K85n06J87K28k41K41j66K4j13K13j58M69p07M24Q0m17M60q8m01P15l73
2187G2k01L76l88J18M48p08K73J01n30M43m4k84O53o00L18K97o66K75K19j53k7
2208hJ0l95O29l87q0L79k45K33N9m53J01M33n79N57j06l48L82l41P9L94l93L6
2230d3J23l26K67p5k76O64n78N5PL03k59K97k93Q5O7k87M96k66n4L54r8n16M10
2253E7r2m7L4j32K29K82l72p3K90l05M57l15r0L10l03J81q9k55N99k6k87NJ60
2276B18o82O54j97j80M42o20J24J79K6O9J6q2M26o22p6M31q4k23M62o24J01L75
$$ y = [7, -410, 144, -161, -180, 188, -261, 333, 104, -219, 389, 337, -351, 231, 94, 33, 284, -331, 54, 103, -221, 268, 32, -271, 243, -35, -187, 222, 124, -355, 606, -151, 242, 115, -229, 343, 263, -273, 112, 59, -215, 313, -376, -84, 201, -305, -118, 110, -131, 110, -56, -32, -145, 68, -90, 379, -328, 96, 176, -241, 219, 131, -270, 445, 72, -129, 247, -141, -23, 425, -283, -10, 91, -439, 4, -40, -324, 329, -271, 47, 344, -322, -47, 172, 19, -8, 2, -393, 236, -151, -231, 148, -97, 136, 195, -258, -157, 276, -303, 254, 148, -200, 182, -159, -80, 314, -79, -43, 80, -246, 21, -54, -330, 334, -244, -189, -182, 121, -138, 159, -134, -49, 18, -269, 227, -39, -93, 261, 163, -353, 57, -35, -82, -48, -180, 49, 331, -41, -114, 176, -129, 328, 13, -77, 233, -70, 111, 22, -233, 366, 340, 53, 58, 218, -464, 190, -7, -187, 255, -365, -241, -62, -36, 33, 49, -33, 393, -229, -305, 126, 42, -181, 281, -343, -242, 133]
2298A33n16P29n01P5L19o21o3M62j79M3L11m25K30R2k94K75j15NJ69j79O8J58
2320A76k86J26J87m41K47R0j35J29j16J29l2k16K81O5n67K08N97o83M15Ql37K61
2342A06k02j25N12n08L83J88l58J61j90k24M28k83nL79m99L88j40j56LK27k13
2363a28P5K97m23K62m7m26M29m8j13M95n40K05M1m59M67o0m29O90o45L88J76k47
2385d0p6J76k28L50J19m88J24k6k1O4K81k87M31n18J59K01m85N05j4k67J93j45
2407Hk1L6o9j53K81k34OM50m49K02j20k96L84m7K2K73j95j16J89k90J62J52p70
2430e95J097m98N4j6j25k4K16k89J96M2j62K42Rk28L56l54l74M92Oo2K8l99M36
2453D8J11k02O3j61J11J45k39l08K20j57L40L02m83J52N8k88L45K74m27Q1k72
$$ y = [133, -383, 346, -155, -80, 239, -382, -445, 17, -162, -119, 192, -233, -3, 89, -205, 70, -45, -40, 129, -50, 18, 176, -110, 16, 203, -238, 9, 99, -36, 93, -23, 106, 74, -142, 139, 204, -363, -155, 442, -241, 174, 182, -155, 106, -96, -221, 291, -217, 166, 354, -4, 157, -33, -257, 171, -112, -117, 262, -237, 151, 11, -145, -142, 85, -128, -53, 244, -179, 83, 36, -390, 39, -9, -122, 373, -167, 38, 79, -380, 87, 27, -402, 288, -357, 31, 207, -40, -116, 60, -168, 182, 301, -187, -63, -89, -110, -46, 235, -52, 379, -139, 20, 221, -264, 241, 227, -40, 153, 8, -13, 23, -46, -199, 82, -152, -146, 304, -145, 57, -63, -359, 25, -22, 0, 273, 78, -38, 151, -139, 23, 175, -595, 502, 4, 58, 42, -83, -107, 109, -180, 16, 58, -104, 138, 147, -81, 275, -79, -453, 39, 45, -17, 11, -388, 48, 159, -43, 20, -141, -30, 115, -124, -432, -212, -369, -29, 273, -210, -58, 0, -288, 57, 331, -96, -15, -287]
2474b87J99J45j04Q5K99n36M5L37p19O33k7k34J99k22J11K33k39O4j35l1L00n02
2496c86K90K23l41J41J5k1kkj74K62j19J00J91n63J15K95k33K67K23m45K12R8
2518A46k87R4L35l37J18k37L17J55k63l10L22m41K57N16o29K16K0J44j23k98M1
2539b44M57m45J94K03k93Q5j3k2J93j96J67j32L7pK22j76k06L85m92N07k08k5
2561iN5j98L12K8m97L04J23l17J63q7j00M35k33N4K70q73M62K73m12K16Q9l56
2583b98M88L16q95N98J19n73L94j04l46L75l15K40J73m62L82j03k50K61k66J3
2603b53L63j17p4L30k26MJ28k63N02l56O8J02l69j98O95m06l9K84k9Oj13m70M36
2626EJ9m1jJ23J5m5l79J98n2J16J53l6n7M9Ql60L23k01J67K08j54J27l83k97O36
$$ y = [-287, -88, 57, -47, 38, 337, -199, -154, 183, -536, 97, 70, -164, 35, -187, -76, 157, -82, -18, -153, -184, 116, -386, -96, 127, -214, -73, -58, -79, -81, -83, -257, 5, -114, -14, 177, -386, -271, 24, -209, 58, 281, -164, 48, 146, -141, -47, 288, -49, 69, -168, 149, 304, 41, -269, 53, -388, -131, 385, -244, -28, -8, 136, 13, -285, -244, 213, -232, -38, 165, -128, -43, -56, -78, 115, -81, 86, -46, -9, -16, 206, 30, -176, 209, -283, 224, 16, -9, 46, -152, 160, 188, -309, -5, 118, -199, -36, -123, -223, 212, -21, 33, 303, -570, -108, 165, -247, -31, 58, -298, 190, 506, -389, 209, 328, -245, 149, 45, -301, 74, -241, -1, 172, -290, 92, -11, -261, 0, -266, -253, 110, -7, -81, 249, 23, 27, 155, -108, 394, 38, 106, 208, -161, -359, 336, -70, -109, 175, 146, 152, 39, -431, 5, 24, -17, -18, 105, 120, 75, -304, -106, -158, -42, 111, 75, 18, 67, 75, -285, 38, -163, 4, 212, 58, 185, -198, -495, 141]
2651A41l93J00K47k68R9M28l94j63K67l05N10m49l12O17j23q2J5q8N7J94k2p8
2673br4p9K53J15l26K31q9O5K54l00M1l3j37K01L17n91L69k98j01M14n11K13L59
2696B71k99M4n9K24j46k77M41j73k54J70J21p3J25M7m42L51L29l71Q8P6m2m9L
2719A05k17k9K08J15K24l93J00mj49J94L9k16J1o7O3J64J77k79J43k08P0j07k14
2742b70J81J02N2p6k52K3K84j70J65J73n50N74m52J42J12l51M03J38m62J23K76
2763A65k99K86k48k29N63m63R1RK5K0Q2j82L90m78J33L17l45P6L25K0n99M99l25
2786a67J10Ko5l2K87m17K84j78k6K46r8mP7k52J22pR7J47Qk98K03j59N6K74j57
2811E3p9R0k2Q6k17J94K57k16j95n3j9J14J65k25j98P18m58nJ27l12J74j20K75
$$ y = [141, -252, -152, 95, -173, -74, 354, -40, -203, 64, -241, 269, -180, -492, 125, 2, -80, -65, -153, -96, 98, 76, -2, -96, -175, 78, 193, -133, 98, 9, 74, 328, 28, 69, 36, -101, 100, 417, -174, 195, -103, -204, 210, -301, -88, 271, -28, 16, -43, 181, 35, -242, 199, 26, -228, -58, 63, -10, 115, 162, -280, 71, 400, 29, 117, 193, 151, 102, 105, -112, -141, 67, 182, 406, 13, 113, 109, -40, 154, 193, -23, -12, -79, -16, 148, 325, 46, 189, -19, 51, -56, -270, -89, 13, 65, -11, -263, -240, 44, -126, 39, 212, -338, 236, -216, -74, 38, -313, 90, 228, -234, -111, 165, -134, 152, -96, -325, 238, -225, -134, -125, -100, -80, 2, -180, 210, -268, -135, 182, -163, -87, 238, 258, -341, 158, -167, -57, -55, -120, -152, 135, -282, 2, -176, -202, 44, -54, -58, 19, -233, -111, -118, -21, 126, 134, -164, 39, -120, -64, 210, 53, -26, 64, 42, 128, -89, 105, 362, 146, -49, -102, -121, -7, 158, -67, -265, 453, -5, -10, 117, -195, -21, -141, 134]
2834A34n2J72j63L6j64q7m4N4J86o1JJ02j39j92M66l17k13M47k62J11K26l60K04
2857H5m5j83K82k73j62L72k21J01L96l60r7k03K45L60l68j30K15l8J57J39k95
2878b3R0L4k18M07m46q4K56j11L8L24l40j01K24m1l13N56k72J05j05j1Mo2K60
2901A71j29j62%Q9N6K1j5M0n2j91M8L49l40J92J95j76N8k23M4O6Q6l14J27L12
2925B52k49k96K35k47L44N7j74k6O5J50j30J78j91Q5j53j7M0J01q8n5J24j09J26
2948B2k07M9p1M17M4j81K66k71j34N6P5k60o2K85K17r6j66J09k79K24r0J58J27
2971B32j13l31k4Q5J22O9M7o1J02j49Q8K94p02J26J00J27J16l17j05L92n05J72
2993b35M06j73m0N1j40K85l82J14J34p5J08k71Q8M11m57J42j60J39M7O0j57J17
$$ y = [134, 82, 254, 91, 127, -37, -124, -168, -114, 72, 11, 12, 114, -25, -217, 249, -68, -281, 166, -96, 15, 241, -119, 85, 40, -143, 139, -134, -296, 76, -145, -44, 352, -8, -105, -308, -63, 297, -71, -201, 14, -24, 133, 272, -23, 67, 101, -117, 290, -156, -240, 16, -95, -57, 267, -73, -174, 50, 9, -304, 252, -20, 85, -20, -31, -27, -89, 171, 42, -120, -120, -31, 25, 46, 31, 71, 19, -172, -124, 225, -115, 77, 272, 96, 154, -69, -25, 41, 127, -187, -60, 252, 3, -293, -58, -305, 39, 96, -78, -104, -39, 111, -19, 159, -32, 53, -100, -117, -77, 24, -64, -119, 5, -104, 22, -185, -136, -207, 210, 254, 73, 339, 68, -66, -10, 65, -195, -257, 28, 245, 149, -17, 92, -187, 37, -53, 105, 232, 119, -212, -236, -151, -29, 40, 87, 26, 128, -21, 67, 361, -341, -215, -115, 12, 128, -189, -294, 98, -407, -235, 171, -2, -42, 9, -131, 154, -228, -114, 20, -55, 53, -218, -130, 281, -176, -34, -194, -55, -8, 52, -105, 12]
3015A2M27p22M30o8p2L9j07O8J68j83k1J63p5k02L04k57P7q9r2R6L7l61N36k03
3039i5jl1K89k12J84j33K17O1m09J48Q4k28P2L2K23J41m30J11K22j0k41qj13N
3063a22J17l9n5J20nQ9j08J04m7jj1l2k8J5o0J68j95j43j11L61J01j59J93p0j3
3088F9J42n7l00L8K03Q6l17J72O9j49J26l4k51K55M5j52J25k42L88k35N8M3Rk44
3112a53L23k25L4O2J31j41J00l0k10J15k7JJ13k98Q3K54j96J90l62K11m4j13J62
3135b0N1O7j46P2j46K94l17J17q4L96k44J3J6j23M3j3M6m0J89r2n7p4Oj40J75
3160a1R4l42J13K67k31J03M6j38P3l07L3L16m5J25L1lj95J28Jj90J87PJ68k05
3184B5Pp3k10J20K34o0k45J29J38p7r4J33J43k26j03R2M3J78j65K00j15j6K00
$$ y = [12, 439, -283, 147, 79, 7, 46, -61, 7, 175, -8, -29, 134, 59, -143, 161, -96, -19, -108, -200, -104, -67, -428, 108, -95, -96, -127, 162, -50, 134, 1, 218, 279, -130, 18, 102, -126, -54, -22, 201, 342, -88, 23, 245, 235, -6, -14, -127, -122, -5, -44, -99, 21, 16, 105, -3, 101, 54, 53, 42, 10, -18, -3, -63, 105, -90, -233, -344, 17, 118, -41, 152, 82, 69, 211, 154, -146, -108, 95, 181, -136, 36, 105, -44, 82, 48, -203, 52, 97, -55, 70, -172, 216, -19, 39, 82, 91, -153, 170, -55, -21, 41, 172, 31, 131, 101, -109, 6, -21, -20, 93, -205, -122, 132, -64, 126, -236, -25, -69, -182, -20, 31, 98, -48, 24, -122, 172, -145, -28, -112, 284, 40, 53, 69, -54, -11, -24, 22, -18, 171, 79, 22, -52, -46, -186, -11, 83, -259, -146, 121, -110, -7, 39, -99, -26, -333, -300, 16, -29, 96, 127, 124, -71, 57, 58, -132, 55, 62, 230, 25, 32, -41, -251, -131, 103, 43, -202, -73, 65, -12, -106, 27, 170, -56, -159, -67, -24, 154, -11, 189, 74, 58, 258]
3207B58k88N9k51J87K55p21M40K37j27j23P0O5j09L9J11l3R0k02J10J0K77k39
3229A15j31l6n3L46J6k91J46m5j81K8L79j47j37K16m1n6P0j32p2k28K78j32K79
3252A91j42o4j78L87l90K61k14j22K2K8J32J20k79L21J50k96J69j29Rk09j0K07
3274c6P6k47M24j25pj12K28j82j75L29l48K71k85K60J04mk52j34K58o8q5J07K48
3297B45m06Q5j26K83j67K04j40j22L01m02L14j67K1K25l40K46o8Q5j35JM5J70
3319A52k21M35k31J95l49k68J78M7K18j61N2K5l30K7K18j4j9J11n4n7J40L2j42
3342a6l06K7L56N1q8k58J09J88J00n2k42J92k84J45k74J37N59m13o7J56k99M25
3364A46l03L43J29k12j8k48J76J52k68J04J78k86K17p4j48Q8J31n18K82jj19K83
$$ y = [258, -30, 29, -222, -35, 220, -501, -61, 176, 49, -74, -4, 61, -48, -9, 102, 69, 159, -43, 67, 77, 354, 115, -16, -52, -105, 241, 257, -34, 112, 67, -114, -86, 293, 146, 9, 225, 184, 128, 198, 66, -6, -234, 44, -88, 191, 49, -15, -193, 194, -196, 65, -149, -271, -249, -221, -89, 31, -248, 73, 223, -73, 96, -33, -24, -233, -243, -36, 40, -207, 217, 92, 85, -27, 201, 19, -156, 173, -175, 96, -189, 71, 175, 171, -81, -215, 43, -25, -110, -3, 245, -161, -76, -202, 81, -86, 118, -22, -144, 157, -245, 69, -98, -77, 148, -192, 54, -14, 71, -64, -63, -18, 152, -69, 366, 135, 330, -19, -287, -109, -62, 156, -5, 47, 72, -258, -231, -13, -27, -46, 65, 11, -46, 94, 126, -16, -322, -295, 61, 112, 24, -234, -125, 63, 163, 111, -131, 61, -223, -78, -352, -215, 344, -69, -136, 20, -279, 146, -157, 186, 315, 103, 85, -163, 13, 165, -103, 1, 179, -107, 110, 36, -112, -24, 107, -411, -129, -130, -249, 34]
3386C4P2j45K83l32L28J22l72j87J85K79l07Q8k09K78m55K11J48j16K6Mj07J11
3408f1J63j98N9L5n1J37l49K27L53l37J02m1k81J88K23j22M1r6r9J0j8L55l03
3431f3o6K77O8k52o3J72r9L01k83K68l13n7J04q9M7L37j44l44K35K86l05mk4J96
3455A85j66J18k61L59l07L9K59l54J70j50p5K2M4J12o0N5J37m8m35N26m03k25
3477d58O38l76R3KR4j49L66l13k7K6K82j56j50K47N4j82j49M27l35j90J08J94
3499D6J1j80J37K23l71J54J54j43J6K04o0j49k69K56r7J95k5k65M11kj56j50j0
3522g0NP1j79J01M0J65o9j0j05J51l07J7J8L30O5n9j85J08j92r6R7J04K21j11
3546A10j38Q5P6j03J99j99PJ28k90J34j39N5L8j1J37j76M0J42k91K72j81nK78
$$ y = [34, 106, -39, 244, -88, 240, 362, -10, -197, -12, 267, -40, 48, -161, 117, -338, -127, 21, -95, -69, -65, -172, -61, 102, -96, -37, -2, -53, 84, -265, -38, 315, -22, 80, 39, -242, -54, 169, 47, 88, -8, -107, -97, -115, 240, -63, -129, 148, 216, -36, -99, 73, -26, 275, -8, 260, -53, -110, -6, -95, -48, 289, 145, -199, 36, 322, 17, 13, -11, 185, 19, 137, -124, 235, -72, -33, 226, -128, 42, -108, -183, -161, -117, -5, -65, -10, 127, 79, -356, 170, -233, -458, 180, -196, -103, -101, -7, -156, 210, -103, -130, -104, 178, 22, -128, 119, 173, -9, -158, 269, -66, -256, -148, 46, 57, -123, 14, 237, -134, 20, 174, 31, 47, 251, 191, 42, -227, 29, -68, 127, 102, -163, 248, 246, 90, -60, -70, -65, 6, -173, -72, -32, 133, 64, 54, -51, 100, -207, -190, -172, 158, 223, 164, -21, 87, -105, -201, -104, 0, 221, 110, -28, 57, 133, 30, 229, 30, 37, 165, -125, 9, -130, -75, -37, -48, 89, -87, -47, 95, -196, 76, -105, -110, 168]
3569A68k8k00J63Pk57K99j97j82J84J16R4l10J75l01M47m49K75N2J60n5k29J4
3591e4J15r1p9J3J75k91k04K51L56l98J68J37J3k81k5M06m60K97k6j83L9p8J69
3614c1Jj56%n0R5J63O8j04K09k30J98k09K6r6J75J9j39J5LJ08M6k25J76j2l14
3639b64J09j22K60o8R8K39m7l36j13J49P4J65n5k25K26q8mK11k28K62l07K55j43
3662D8J04p3q7j31J34k41K40m1j93J11R3j23p3J89n1J33R1j49JmK13k52J75q3
3686C1J62p3j70P8M9O6o0k15j34J58K18j36J4k4l4J02K57m83J62K19j88m0q0K42
3710A21J33j72J3O5r6m3l01K15Q5J50n8l99L88j52R5O0J33l0oo3j56J48q0o1l6
3735d7O3J05k76m3P6J62j01K46M8m55K42k54L91n5j81K08j69K42k33k94J53j23
$$ y = [168, 140, -60, 103, 110, -147, 152, -45, -227, -43, 73, 167, -143, 32, -269, 178, -271, 4, 56, 216, 161, -68, -54, 61, -30, -109, -96, 79, -212, -416, -165, 191, -207, -39, 98, 111, -170, -195, 211, -249, 48, 22, -161, -122, -200, -31, -30, -186, -186, -236, -141, 22, 90, -14, 195, -35, 163, -46, -20, -116, 59, 78, -61, -46, -43, 65, 111, -114, 62, 50, -264, -155, -277, -17, -85, 13, 252, 205, -131, -244, -95, -21, 144, 89, -136, 90, 2, -2, 209, -19, 243, -64, 191, 48, 152, 79, -8, -139, -5, -246, -6, -47, -240, -129, -36, -159, -232, -43, -94, 39, 130, -19, -18, -22, 191, -61, 114, 31, 193, 120, -50, 28, 77, 143, 83, -132, -266, -108, 110, -26, -12, -36, -70, 32, 289, -194, -32, 187, -1, -41, -121, 121, 254, 82, 95, 160, 64, 21, -280, -65, 20, 170, 112, -287, 101, -51, 44, 104, 237, 207, 201, 138, -18, 130, 50, -11, -47, 16, 121, -155, -198, -122, 40, -61, 185, 233, -222, 20, -234, 157, 102, -79, 129, -40, 202, -31, -325, -172, -295]
3757b95M63j3j89K32l32Q0k15K74P3q2k6k64K69QL4r3M9O0q5j50J52J57j18N6
3781D5J04q4j53m1L10k99K08k91K45j59J11K45l51K11q6p1jJ12r5R0K3J37l24
3804a14K52k62K39p4l51K81m7j7O6j46J23K1o7L25l46j0K65j30k90K50rK80k67
3827b8J43J70k42J1k19K36q0j0M2q8J78j29o1J91k85J95O8J35o7q9K69k79k53
3850a92J1L15n3j78j95J28K56oM8k85M21k94%j29P9M2J57j97J29j06j16JJ99J55
3874A90R3m04Q7m3N10l71j64J67j93L49m21L26l01J59Nj21P8kJ70j01l6J28l35
3897b30J39L20n47J84L0J15K8o9J67k13K93k18J1oj6p2lL69k53j72L78m2k77J27
3921D3j63m0K30j11k19l6M90Q3k11M8r9J8R4q9O9P3j17q0K69l86K79j81k0K81
$$ y = [-295, 168, 155, -34, 198, -134, -54, -269, 5, 78, -4, -30, -294, -25, -17, 17, -76, -27, 33, -52, -202, -50, 107, -11, 45, 149, 65, -88, -129, 181, -118, 90, -201, 44, -115, -4, 241, -110, 101, 15, -56, -57, 55, -40, 50, 73, 210, -114, 138, -124, 115, 41, -310, -29, -76, -93, -27, -173, -50, -29, -96, 229, -117, -127, 138, 8, -282, -32, -41, 239, -28, 115, 285, 43, 54, -165, 71, -9, -19, 23, -65, 113, -16, -77, 114, -171, 24, 92, 227, 160, 71, 340, 61, -192, -181, 134, 81, -97, -292, -164, 92, 86, 134, -151, 270, -24, -24, -153, -74, -32, 125, -72, 57, -49, -165, -164, 35, 190, 283, -121, -34, -77, 433, 62, -102, 65, -128, 221, -200, 126, -175, -16, -11, -132, -54, -56, 114, 13, -23, 105, -230, -91, 229, -318, -134, -104, 11, 39, -30, 137, -76, 217, -1, 10, 4, -12, -84, -87, 282, 29, -143, 235, 193, -84, 43, -120, -160, 70, -41, -260, -296, 194, 277, 66, 114, 15, 33, 127, 38, 107, 180, 63, -17, 252, -134, 145, -36, -56, 225]
3945B25j16l29K20RM3R9l35Q8R8J80k98L76j66m0k63L43r8O1m06M72j32PRn1k86
3970b90K26K82k13P1l18K76J46j17M1lj85K46j82p7Q8J28j99Q6o0L2J43k99K13
3993C5Q8m09K98N7j92J50m7OQ9J42J01n40PL36LK7j0n3j32r2L2k2J94j01K34j15
4019H6N5R9k77K7K6r9K66r2p6NM7R2pj01k75N3J19pQ2j56K24k21K6J20K20m76
4045b40N32p6m2K3K1j80K8l12K47K07l18O3J11j95K5J2K7O2Q2L2J61k66L8j22
4069h0O6q8j74Q1J80R1j20K86k75L43k30L8l6K80n39K58k28K00J30Rj48k9j60
4092a45K56l16J85j61K66n9k17O0L48l05j6M46m32j9%L48j41j95j60J41K89j31
4114D2k53L47j50J8p5J59O9l83K38r8J03k94N17k93L7r7Rl7K71l84L13j76q2N73
$$ y = [225, 109, -220, 0, 9, 52, 151, -184, -96, 2, 182, -116, 260, 94, 54, -209, 134, 36, 97, -309, 163, 31, 38, 47, -4, -290, -64, 218, 5, 76, -242, 34, 180, 63, 104, 101, -84, 162, -20, -97, -9, 119, -80, 6, -54, -22, 121, -178, 35, 123, -286, 12, 69, -123, 27, -20, -14, 75, 217, 318, -222, -215, 121, 124, 151, 141, 88, -44, -136, -104, -126, 68, -33, 201, 86, 141, 240, -37, -10, 16, -83, 183, 91, 15, 20, 67, 159, 152, 51, -224, -171, -52, -59, 23, -133, 91, -130, -104, 16, 236, -240, 292, 216, 174, 197, 218, 38, 66, -246, 1, 208, -110, -47, 64, -131, -106, -94, -67, -5, 77, 109, 270, 4, 42, -80, -14, -102, -276, -195, -15, 76, -44, 242, -33, 310, 80, 118, 82, 362, -177, 81, -147, 53, 183, 192, 44, 15, -145, 111, -205, -20, -181, 85, 26, -191, -131, 217, -88, -104, 342, -90, -109, -109, 239, 98, -97, -257, -116, 173, 42, -211, 136, -14, 4, -71, 88, 157, -226, 12, -86, 17, -277, 240, -53, -16, -113, -104, -141, 130, -254, 59, -117, -199, 374]
4138C74m72L09j96l9l9J35J03m0%j21k1r7K20k5j57M33m55J30r9J22j64K64k01
4161c6K22k38m3m7J15J7j73J42L0m4N5m1l2J42j25n9M3P9m0j94K32l79K33K19
4185G8o7j82j02J47J54J9l55O3L9N8K92j58l13K79r7l2N55l90J84k08K47q2l9
4208I0k31N6qL37j54k19P9l2k0J44p1k06K87q3J81l21K75l60J61K00j79R4k80
4231b60K43k34l5J65K88j71J44j93j04K19j37J22J40lm5l5o8J33j28j23L24k63
4253b1lJ19k2J54l13j1K26n9J17j64Oo3K14k65J79J07j50K08k59j40K22m1J38
4276A79k69j45K99j85R7n5Q7M2J89k72Q0l0j52J86j4K59n61L03n1k53J56K23q7
4299B6j72K26l8k15Q7m1K45j68P3M5j43Q1j49J95J03l8r7j66J68J53Q2j40q0j24
$$ y = [374, -98, 211, 15, -24, -63, 72, 175, 135, 135, 14, -7, -104, 116, 91, -66, 367, -88, 42, -57, 65, -99, 165, -36, 186, -52, -95, -142, -27, -10, -183, -41, -11, -55, 0, -41, -73, 69, -56, -115, -72, 7, -33, -227, 5, -374, -141, 78, 11, -171, -273, -126, 28, 47, -308, -245, -206, -148, 144, -14, -327, -48, -145, -177, 378, -12, 172, -36, 211, 129, 90, -141, -85, -93, 244, 90, -129, -50, -82, -102, 42, -29, -235, 52, -31, 150, -171, 104, -256, -95, 105, -74, 20, -260, -17, -251, -286, -121, 167, -4, 140, -53, -157, 62, -75, 47, 187, 184, 139, 104, 36, 169, 41, -82, 242, -21, -24, 95, 73, 227, -86, -97, 129, 70, 187, 23, 29, -34, 180, -85, 94, 201, 51, 259, 0, -140, 82, 41, 179, -90, -235, 64, -121, -24, -79, 8, 50, 239, -33, 47, 17, -135, 51, 37, 296, -265, 38, -13, -266, -110, 113, 26, -146, 80, 42, -173, -86, -127, 118, -50, 23, 68, -75, 6, -143, 52, 155, 117, 20, -146, 22, 175, 257, 117, 37, -87]
4323h7M7J38O9j12K8l50K29m6j92L10l1j80J34l2J42J41l59n2L06j46P6k36J36
4346f7j18K49m2J63k55J40L4j38K35l74J27k4m7QJ15j3r3L28j69q3L3R8l3j26
4370e2J05L9l06J04l2N8K81j00n62N03k36J50p4M5J43l52J06R3J79o4j2J89n88
4393c83O30k43L0k1kk13p5PL87M1N1m36J35rP9o5J31o5p8J52K6J9j52K14k36J90
4419A14k99L56j96J66M7k7l8o8R3j29K5J32j26M8P2r8j54j36P6J47k7K65m81L21
4443H3N6k84K38R7l19P4j5nJ28L0j93P4J76j23J87m79J25J71J32q0J63n04M44
4466A76j6k86K86j74K23j70L6p0P2J57m29L30k21J81k47L5M4j5Kj03L41l90K60
4489B2k09K90j39j00J72J88k62J27k05l3K24L08l30N8q9p7J14j54L54l45J16J05
$$ y = [-87, -40, 98, 167, 55, 83, -267, -38, -84, -276, 34, 3, -177, -43, -75, 67, 208, -151, -203, 103, -43, 33, -203, -67, -185, 64, 22, 185, -70, 70, 104, -34, 201, -173, -46, -70, -117, -109, 6, -7, -100, 228, 59, -24, 9, 107, 74, -52, 53, 92, -214, -110, -142, -84, 197, 97, -465, 38, -198, -48, -122, -77, 66, -286, -180, -87, 92, 28, 16, 205, -383, 247, 4, 34, 13, 11, -202, -277, -270, 117, 158, 209, -227, -92, -101, -22, -87, 44, -21, -99, 53, 79, 98, -54, 160, -76, 114, -185, 171, -25, 141, 188, 161, 123, 55, 148, 19, 44, 176, 50, 98, 170, 72, -82, -218, -142, 5, -22, 243, -238, 83, 139, -145, 93, 190, -129, -55, -70, -75, 53, 83, -110, -36, 140, 17, 204, -275, -150, 21, 153, 73, 236, -268, 176, 160, -126, 160, -14, 209, 39, 75, 5, 77, 234, -195, 135, -86, 95, -152, -117, -73, -88, -86, -189, 152, -238, 22, -187, 103, -36, -136, 36, 224, -38, 89, -116, -149, 75, 383, 53, 111, 22, -55, 59, -95, 259, -86, 30, 135]
4511A35J29m49M69k82j62J15L4J18j65j77M75n37K28k5L0m7P0K67l08n1P2r7L01
4534A43j84j34J91r3j9J2O0J05k72O2M57j98J86M4l61K1R2l80N21J8l85L11k68
4557g1Q7L3l17K34J72N4Q8l09j7pN0r6J79K09l26j6p2L17k74O3J01j69r2K09k32
4582b02L34j09j31P03m68j65J37k10K08k26K6K24j6n5N1J10l25J50K17j52j30
4603b9R9m2j15M63l19j42J9k1P0K63j68j40O2L4l5j0j50M9J06o7l57N77L5l65
4627a83P8l5L67m13J08Q9k14K31j91K17j87R6N1j21Q1l1j81L24%k20Q4j91K18
4650b3K6R2l0j40L35j47m3R2q1k72K4M47k9mk45K73k40j65K24k89L00M2Q2j23
4674A06k98L8K74l30L06QK44m53L29q7k44k36K09R3J93n10J22K91N9j63J06j21
$$ y = [135, 264, -185, 284, 2, -160, -45, -11, 107, -58, -235, 240, -297, -69, -94, -64, -111, -41, 226, -82, -133, -61, -158, 143, -41, -175, 16, -77, -96, -84, -24, 81, -191, -129, 328, 130, 316, 360, -1, 20, 112, -268, 253, 271, -114, 197, -71, 16, 49, -268, -34, 138, 192, 280, -29, -46, -53, -3, -99, 80, 289, -37, -53, -125, 192, -82, -19, 82, -87, -179, 30, -202, 132, 23, -108, 595, 127, -38, 99, -111, 97, -129, -103, 121, 105, 50, 101, 211, -114, 36, 253, 101, -29, 70, 28, -87, 376, 57, -85, -66, -87, -17, 246, 78, -62, 0, 34, -1, -11, -161, -112, -6, -73, -430, 147, 182, -183, -105, -140, 227, -186, -78, 11, -203, 28, -163, 54, -133, -37, 14, -107, -26, -57, -238, 86, 86, -134, -50, -241, -23, 3, 95, 65, -75, 260, 113, 70, 162, 81, -191, -167, 280, 251, 247, 2, 275, 35, -130, 94, -195, 105, 147, 229, 106, -192, -154, 120, -210, 96, 104, 348, -105, 224, 137, -107, -343, -134, -41, 152, -358, -236, 55, 114, -49, 57, -64]
4696f4K00j33l58J33K24j0J21j4n7rJ47l27L37m61K5M39j10l9Oj25J20j07J53
4719I1J19j8j62J70k04j21L82k63%m5n4J13P8j70Q6k37M07j17k52qK4M3r0L85
4743A57j32J48K7k78J04k52J46K62l34J39n6j44L32Ll55R5L8%K44J31k51p7J69
4766A16m15K98J8K72k27R8l30J73J29m0k30J47L4j55J82k23J74K16r9m12N85l96
4788h5o0K43k57L21k92J40J48k19J70l96R7K82k87O6J59J16l37J85J37M9o9j68
4810e7q6J66J39j73rj44M24n10p5L44J52j87k24J68K15j54j29j09l1Q2MJ86P3
4833F5kM9l71M11m9j72j35J12K16k24l4M09j85o0rn4M1J84k44j9L05k65l5RNK00
4859A48l50K05J34j16k6k2n7Kj97J80n3L91l55J81J59k17L06j5l42K13l1k54j9
$$ y = [-64, 136, 3, -355, -222, 2, -8, 113, 99, 42, 33, 180, -147, 190, -271, -246, 193, 83, 44, 50, -75, 45, -62, 91, 210, 192, 30, 200, -4, -125, 257, -6, -6, -51, -105, 8, 86, -84, 2, -235, 172, 55, -197, -205, -181, -138, -228, 157, 25, 173, 200, -78, 26, -226, -80, 182, -152, -13, -69, -213, 119, 122, -233, -138, -100, -100, 144, 275, 24, -53, 116, -299, -1, 17, 289, 62, 160, -170, 3, 132, 92, -138, 9, 43, -112, 70, -153, 21, 237, 138, -274, 311, -85, -145, 98, -159, 162, -130, 10, 158, -61, 109, -287, -190, 92, -195, -129, 30, 146, -191, -6, 131, 180, 111, -57, -143, 23, 162, -11, -20, -164, 260, -250, -325, 19, 171, -16, -240, -72, 143, -11, -140, -249, -280, -198, -194, -8, 65, 63, 112, -259, 152, 103, -69, -204, -92, 124, -100, -134, 275, 90, 30, 21, -33, 8, 192, -52, -71, 234, -31, -66, -57, -52, 148, -202, 3, 137, 21, -5, -27, -84, -82, -279, -99, -152, 239, -116, 65, 224, 7, 313, 298, -44, 169, 138, -116, -135]
4882a35J08P7J0p1J04r8J68Lm57L61j54K7R0J29l23R5k04K29M3j07J43k19L95
4905B14k40N0M5m52N41o5K0j6j05L2j83J62l4j9J82j39n1J85J15l3j5j55j32J54
4929F1J9J29k87J00K12J50o04J42J4j8K07j20k23K42l3N2j3N6j4r8J97j43j84
4952a56q3K29J68j61K9j4j08J79j27j6p8K26m53J83K12p3Nr7K75l69K01N6J50
4975A78l61p4K67Q8r9Rj51j3K93j25L5J3q4L5p6L7N6j19L34l33J76K45m10J55
4999G6q6k2q9J11n6j76M73k54J7P4M5j52PQ1J64j29n7%l96M17P9l39Q8J05l4J26
5025G3j73j0J28r3j24pL36j64k85K63J06o4J67l32J65r3K57k93J77N1o3n9q5P3
5049d9Q3k02oM44k56p6J55N9j35K27l44P9J20l05K25j43J0J6O9Ql59M62J20l55
$$ y = [-135, -27, 50, 60, -11, 93, -5, 163, 166, -291, 70, -84, -57, 33, 162, -161, -66, -270, -41, 2, -105, 38, -181, 214, -26, 24, 69, -383, 158, 93, 113, 97, -8, 24, -159, 3, -31, -50, 132, -7, -58, 127, 242, 209, 194, 39, -93, 61, 80, 209, -78, 22, 234, 384, -220, -78, -64, -82, 125, 5, -218, 24, -9, 43, 30, 86, 72, -26, 171, 28, -156, -239, -10, 158, -3, 26, 12, -96, 83, -44, -60, -138, 88, -365, -182, 30, -43, -38, -135, 140, -229, -28, 28, 178, -183, -257, 10, 98, -1, 8, -143, -156, 137, 12, 47, 60, -24, 11, -65, -28, 28, -91, 243, -90, 86, 331, -79, 76, -10, -32, -121, -10, -66, -242, 231, -23, -6, 68, 113, -39, -32, 49, 213, 84, 27, 27, -369, 48, 127, -212, -124, -19, -53, 73, -100, -110, 18, -75, -199, -206, 130, -34, -319, -56, 50, -14, 153, -179, -14, -107, 150, -143, 34, 85, 22, -37, -122, -49, 34, -168, -174, 270, 14, -62, 93, 152, 17, 244, -100, -21, 99, -206, 19, -124, -114, -98, -29, -21, -380, 82, 202, -153]
5073a53K24j56k9K50l80K86J21m11K13o5k01L85j02k07K18j2q7n4J08k9k07J29
5095a59k9p4N8K04J1J22k54k9N5KJ02k2K16j04P7k91n7P6m3K6O6j22j58L46j85
5120a66J75J05O3k09j20k26N71l33L11P1k06J20k53J66j67j51K86P2k16j6O8J93
5142A38j38q3R4M8L6p4J2q1lN5k34L38j94OJ01K08k24j31K98K0k50j54N1J55k61
5167b67L84j25k69J02K34P9j42k85J59N6j05K19l6M6J03l2J30k02J09m9o7K8%
5190G0N6l03K91j46j63N3k9J80J01q3J14PJ65l75M9l17N13k92K36L1m8n1j72L12
5214A99k38J46j17j00J53J14k82P2j11o5K28M4J96R6l00J91j49j07J29m4j46K1
5236g0N27o97N78m27P9K8K76l99J63k61J40Q8Q5k3m42N15l7o9K21k31j23jq5M71
$$ y = [-153, 71, -85, -114, 136, -244, 42, 163, -248, -35, -100, -301, 84, -18, -225, -7, -19, -106, -160, -52, -81, -288, -159, -188, -262, -204, 0, 11, 133, -121, -150, -95, -93, 9, -13, 203, 99, 176, -115, -172, -96, -139, -113, -47, -169, -327, 19, -166, 9, 114, 177, -32, -152, -378, 193, -140, 171, 242, 36, 156, -97, 69, -98, -249, 37, 109, -107, -123, -55, 138, 0, -83, 11, 59, 95, 21, 33, -48, -51, 4, -230, 108, -86, -80, 21, 229, 5, -126, 172, 192, -58, -212, -161, -6, -267, 117, -8, -277, -175, 59, 138, -4, -289, -130, -74, -179, 40, 4, 50, 153, 121, 251, 49, 158, 109, 42, 70, 70, 126, -177, 114, -32, -195, -142, -171, 9, 110, 27, 141, 148, 313, -62, -13, -330, 183, -109, 127, 158, 110, 59, -113, 199, -39, 107, -10, -110, 43, 157, -125, -53, -164, -229, -1, 43, 239, 335, 35, 226, 77, -30, 99, 55, -91, -70, 457, -240, 338, -89, -10, 18, 294, -105, 58, -203, -63, 25, 110, 87, -355, 160, 123, 54, 275, 44, -79, -80, -165, 306]
5260C06j73j12J76k40l5L9R6m3N7J80n25N67k95k0lJ99k71Q8J43j60J49j84J24
5283F3j37J25n1j16L45k71KM0K83k7j83M7k75K49k74L98J1k85K9N1k52J31J28
5306C1k87J25J92j81J08J64l10L01j47j97Q8J58k98L58l65K92K1q7M71m79R1J61
5328B10j73J54m19N1O6p4K45K6K2k06K46k89K69o1q3rK2n5j67P7J73j01L13j59
5352G8J7k02L85n11L90j35m04K66J1J78l24K11o8O4Kj78N81l96k4K95k93l7n8
5375a52R2k36K38J98k15K65l36jJ63n5K17q1q1R3j93K13j74j56P2J03rr0M91l91
5399b5m5q2K66l63M07k24J35m3k12J51k64L80k39K70K0k90J27j55K54m0n1M1j2
5422FJ43j7j21j14K77m7q8L0j69r7K88j24J08k02L0J1J05M3lnL2Q1J82k58K6j83
$$ y = [306, 133, 21, 197, -43, -78, -39, 57, 14, 71, 251, -274, 293, -2, -22, -25, 174, -97, -9, 134, -26, 123, -61, 63, -74, 51, 0, -116, 229, -42, -40, 0, 283, 256, 73, 120, -155, 94, -180, 218, 229, -56, -27, 24, -228, -97, 31, -256, -131, 61, -120, -12, 152, -158, 143, -4, -201, -113, 45, -253, 105, -260, 32, 53, -34, 437, -42, 49, 210, 37, 191, -228, -177, -111, -185, 60, 86, 108, -98, 148, -141, 128, 67, -16, -25, -3, -58, -225, -148, 25, -76, 237, 78, 95, -107, 278, -233, 157, 22, -382, -116, -105, 73, -251, -40, -108, -44, -42, -220, 361, -35, -59, 236, -57, -94, -152, -60, -296, -58, 140, -75, 190, -146, -147, 16, -39, 178, 97, 16, 109, -84, 129, -45, -201, -129, -26, -35, -125, 366, -25, -70, -152, 114, -249, 158, -66, 69, 26, -186, -35, -299, 81, -158, 112, 132, -158, -31, -186, 68, 28, -23, 18, 6, 149, 132, 11, -103, 174, 127, 39, 69, -100, -197, 91, -33, 75, -127, -97, -86, 19, 62, 59, 54, 86, 167, 349, 91, 117, -66]
5448f6K41l46J61N6OO9j81P5Jj27m9j06J69J78j77j28N3M77m01L3J72j65k22J44
5472a33J36o6J99k4K1K1%k48J9p2J90J29k09k89J78N14m45J44Ok77M01k84O8P4
5496E3O4j15o9L25l56J11n7J5k02L08k4l6l4K20j46M5k12L28m09M64l27Kk6K31
5520A53m44K38J26r9K9J77m8n8j81J63J53l07O3R1k0J95j74j08L61l86J1pK9P5
5544C2j30J04n5J13j25q0K38R3o8j83L4J13k68K9J86l19J33K88j89L90l13rJ39
5567A53p7J0m8j35K51l06K76j34mn1J7K20k00J75k73J18K48k58J9R2k33k41N31
5590A50k47J5L7j37J35M7M5M3k11J89p3m6J61k71J56L1m36K54M75m25l9K17R9
5613A69J60l58K10k0l60K65M1k07K87J47n08J45qj11M76l62p5K32Rj81J67l53
$$ y = [-66, 175, -171, -10, 46, 52, 121, -60, 15, 16, -111, -160, -266, -97, 81, -96, -224, -171, 306, -95, -62, 110, -55, -277, -133, 3, -63, 136, 112, 133, 154, 154, -94, -75, -147, 43, 172, -37, -326, -148, 366, -79, 65, 71, -206, 195, -89, -21, 53, 117, 2, -67, 258, -98, 13, -44, -29, -231, 77, 53, 17, -17, 203, 57, 102, -110, 218, -191, 273, -54, -52, -78, 153, -291, -53, 73, -26, 3, 180, 132, 74, -107, 56, 209, -98, -35, 56, 36, 231, 57, -51, 310, -76, -65, -72, -43, 32, -98, 6, -49, 64, -61, -141, 97, 190, 122, -61, -27, 86, -182, -153, 33, -286, -153, 135, -54, 336, 23, 14, 153, 76, 86, 38, -97, 154, -152, 124, -10, -14, -65, -48, 172, -28, 147, -126, -8, 240, -18, 1, 93, -140, -381, 150, -97, -82, -45, -182, -47, 0, 45, 88, -123, 66, -7, -53, 108, -163, -7, 24, -412, -158, 317, -108, -147, 70, 169, 329, -29, 181, 161, -199, 66, 107, -100, 187, 334, -174, -29, -37, -148, 328, -34, -109, 123, 132, -49, 118, -235]
5635b35J77j21K58j06K63k02oJ08mk81J85r2K6R9M7q8O9k6O4j85K2J28l57K97
5659D0p1K39l95RK14j53N2Q8j80l3M03k48J0o4L80k21J40m45L97J4J0j49k8Nk15
5684b01M08J34n81J87m4lO4l0K44k95K39p6j08j14J27K22L2j88K37o3j32J72j59
5707G2L6Q4o3l43L05k45K01O5p7m60M86k96L50j81q6K87j89K46l3k04n0J04l11
5730c02M97k48K31m11L19k56J21k8K24j15J94j43k4k16N6J27k99K32j01K63m6
5751G5l0R5J37j65k58J74N5Q5o8k25K7Q8P0n87N13k26K33j73N8K41j72j3M5J20
5775I9k15L16k79J20k45J5L24j04n6K8k12K48j02J9j67L81l82O1J36k02K77j36
5797g6n0p7L33M24k67n83L61k54P6J22j15J57L24m67p0l7J01J0r1K30QK5l34J77
$$ y = [-235, -58, -179, 79, -27, 236, 34, 28, 136, 132, -149, 36, -56, -30, 69, 116, 28, 97, 71, 135, -50, -28, 100, -257, 40, -31, 208, -187, -178, 36, -117, -65, 23, -157, -190, 213, -35, -25, -89, 291, 70, 210, -235, 162, 176, 186, 37, 9, 14, -201, 207, 341, -240, -53, -97, -100, -36, -66, 178, -117, 122, 46, -62, -176, -49, 173, 205, 17, 254, 191, 59, 231, 72, 108, 192, 129, -214, 91, -154, 47, 112, 35, -425, 61, -235, 115, -66, -152, 135, -54, 192, 159, -45, -95, 9, -302, 195, -53, 178, -233, 86, -170, -49, -77, 147, 32, 226, 83, 59, -157, -101, 26, -273, -41, -142, 121, 75, 45, 140, 277, 112, -146, 28, 83, 168, 100, -125, -98, -10, 60, -527, -14, -240, -7, -180, -122, 119, -53, -66, -21, 99, -116, 200, -79, 41, -204, -189, 135, 31, -25, 3, -209, 39, -63, -44, -211, 170, -212, -151, -15, -217, 60, -76, -126, -203, 130, 554, 287, -296, 65, -189, -113, 9, -106, 51, 375, -92, -162, -199, -98, -88, -179, 51, 59, 84, -250, -73]
5821g3j8P8J34J23J12j97j63J04j96L0K31l49J20J27j66j8J01k38M18P0o46M29
5843A3j7P4M9l57L83n03M50k77JK45Q5l19P9q8r0L56j89N8k04J67J53r1P8k03
5867a47n2O2j59L00l3J00j91L99m09J52j14K51r1k30j67L98j44O2Q6m5J37j96
5889c1r8J09j75L90j15j74k59K22M49m91J39J28k6J05j65K00k20J0l10N66m0l03
5911h9K1J44o9J37l39N10l33O7O4q6K16l57K7L85l83K82j97l17K88K60m71L37
5933I7k13K92J03m02K35j86L49k23m1m5K32k94K70o0k7J41j93l3j84L9J20O9k8
5956A8J84p9q1o5j67J76J82m23K94n4j51P1kJ66J47j04J6j34q8J93k12K39J21
5979B47k41Q9j8J27j89j17j7J90j58K6K01j97M1J05J75l78M5Q6K3k82J41L5J62
$$ y = [-73, -91, -13, 121, 244, 356, 159, -4, 100, -96, -66, 165, -184, -64, 63, -103, -121, -20, -258, 160, 230, -416, 13, -4, 70, 119, -238, 145, -358, 92, -185, -184, 61, 146, -173, -94, -182, -272, 84, -105, -47, -251, -84, 69, -22, 56, -147, -199, -137, -296, 4, -29, 71, -120, 279, -130, 22, -92, 159, 68, -162, -329, 69, -75, -13, 73, 28, 165, -31, -129, -20, -195, 195, 80, -94, -353, -131, 318, -173, -34, 94, 68, 173, 8, 208, -12, -2, -312, 254, 214, -89, -68, 76, 7, 144, -195, 315, -18, 49, 113, 27, 243, -114, -87, 298, -85, 197, 0, -317, -29, 231, -240, 97, -116, 176, 279, -123, 112, -74, 275, 52, 11, -34, 198, -96, 174, 114, 87, 228, 35, 2, -182, -143, -23, 46, 18, 202, 123, 42, -23, -190, -14, 168, -255, 39, -15, -166, -95, -97, 69, 216, 112, 128, -6, -94, 99, -113, 126, 247, 6, 95, 77, 204, 15, -102, -119, 71, -87, -61, 140, -57, -16, 89, 264, -114, -69, 17, 40, -242, -101, -66, 96]
6002I6j94r7J8J10j79L92O8k39mlM1n6q3q8M6J81p0n9J34o%j88Q1K81m8l26J13
6029g9N3l48M45j75R0o6K44j32J1k75N26j19l65J89L5o6M3Q9l1k18M16k7j89O3
6053A14k88J23L84m39j65J46J61N9j87J39p5J49k22L05k30L6R6l20N14l54J11
6074E7j52J04Jj08J41N3k25J39p9l9O6P4k19J64J26j42P1K9J49l54K29j39j96
6097b50L91k53l1j4J27N1Rn6O8n7pp6K76j85p7L66l49Km8K30k7j40j17Q0O2J87
6123A62J61m82l2o3K97j02J97n5k34Or5Q0J52m5j10J78j2K51l65J19MN4r6j5K19
6148A74o2l31J97L6J35%j55N5k2J63l96K29j50J74O2j42j78J28R1n7j44J66o5
6171i2J54m3j22L19l20k9J83M4l09P3r2L47k88L55j68J79j11j88m32M73k1j34
$$ y = [96, -98, -195, -177, -67, -246, 146, 214, -25, -29, -32, 9, -47, -130, -218, -172, 9, -61, -120, 14, 8, 8, -180, -99, 182, 134, -192, -79, -26, -374, 71, -104, -14, -80, 164, 32, 43, -232, 294, 175, -190, -1, 34, -32, 11, 100, 69, -149, 267, 240, 51, 114, -174, -51, 333, -106, -271, -125, 36, 95, -92, 47, -28, 121, -101, 204, -26, 10, 106, -214, 300, -54, 57, -95, 9, 10, -98, 43, 96, -129, 10, -69, -108, -42, 32, -187, -23, 103, -39, 32, 61, 210, -144, 85, -54, -250, 141, -112, -143, -157, -30, 21, 30, -26, 42, -15, -22, -98, 178, -7, -84, 282, -67, -65, -113, 117, 90, -50, -167, -87, -25, 162, 323, -159, -191, -254, 43, -59, 138, 83, -151, -145, -240, -160, -8, -53, -163, 15, 3, 254, -111, 8, 12, 66, -30, -45, 174, 112, -219, -22, 14, 149, 149, -6, 49, 27, 190, -206, 23, -127, 47, 109, -33, -211, -83, 8, -49, -193, -27, -92, 62, 19, -103, 216, -104, -133, 50, 94, -215, -142, -234, 113, -175, 180, 12, 191, 80, -108, -540, -67, -88, -222]
6193b22M19k45N5L06k44k8K85k27q9N2j24P4j43K5Q6k84K89J65K56k53l73K10
6215a0J56l10Q1K50j45j29L77m51k13P26k64j79l0N07l94pr1L58m15J03L33l13
6237f0J17J58k0j53j15M18l43j13M31l77K49j89n1j01K7Lq3Q9L54n04M11j50O1
6260E9k37l8K6J32p5l44P32m53L39j86M8j95M52l02J07J12k16J92m13L57j56j97
6282b56K56J09lJ8k63k6J38j15K27l12K20j01J47K05j90k16PJ13J56k26nOk7N28
6306C90n18L1L46m91O4K97j57Q3j01P3J75l49L21j1Q8m79J45N9J3M4q7j04K61
6329I3j29J70m25M31q5l33K63k1N1j74K49j2j33K17m3l8k88J63L5p7J04l60M45
6352A03j64J94j23K11j94R0j69N4k09Q5M63l88p5L6L24l95L40m70M01j87OR1p1
$$ y = [-222, 197, -48, 7, 313, 69, 41, 326, 99, 10, 62, -62, 12, -131, -106, -20, -304, -15, 150, 406, 153, -220, -10, 146, -164, -83, 167, 22, -107, 270, -181, -394, 332, 68, -111, -141, 366, -28, -35, -126, 232, -183, -80, 253, -60, 57, 215, 195, 42, -73, 345, 2, -111, 320, -57, 192, 3, -48, -149, -122, -119, -202, -113, 241, -263, 148, -2, 59, -178, -216, -190, -58, -133, -477, 255, -198, 141, -45, 3, -192, 260, -42, 65, 177, -39, 153, -260, 97, -59, -256, 0, 109, 106, 124, -139, -165, -27, -142, 85, -227, -7, -108, 39, 244, 54, -162, -155, -42, 114, -112, -117, -111, -138, 390, -128, -97, 249, -242, -178, 119, -38, 45, -56, 17, 192, -157, 164, 153, 241, -238, -93, -34, -21, 23, -64, -168, 93, -36, 134, -291, 140, 55, -278, -15, -36, 15, -159, 90, 78, -55, 162, 119, 81, -207, -44, -9, -86, 18, -342, 103, -61, 133, 10, 221, 27, 117, -52, 2, -207, -122, 341, -47, -122, -86, 238, -157, 183, -287, 114, -73, -67, 24, -47]
6375d7M7J65k39K43k16QJ78j26k42O42o88K14j41L90j31l51L4L85j22j22J6K43
6397A40j69J29n6o6O0L43k85Rj51K70l5l15O4q1mK46qk73j06J32J58J67k28k1
6421h0O4j99L03O0nj0j97J22L8j36O2J23l22K50q2J1N7p1r0Q7j09J19J20r3L5
6446E7J28m62O0L13k1o2m7J22P6k82m8j1J48K3R5j36K68j81j81J52nJ37r6l40
6470b93K16L7j71K50q3m8qJ36N2r2o7K94l21K65p5n3j16j44L02l23L30l8k15n2
6494b17J74L7j18J3O9j13M3J50R7k23K31l88M30k66j78O2j5K40MNk24L02j70N6
6518AK6k32K88M3j09J79j68j15J58j1m13M76p7o4j7L75l98L39n02L81k21J73k37
6541a25O4L2Q3O5j91K10j08l8J50j87q9J40M0m8k47K33J76l57N6J24L59m38k02
$$ y = [-47, 0, 165, -74, 169, -47, -39, 139, 13, -229, 413, -275, -61, -202, 188, 57, -294, -260, 125, 3, -119, -103, 140, -29, 100, 44, -22, 38, 381, 96, 105, -46, 224, 189, -126, -62, -143, -147, 99, 91, -182, -288, -156, 2, 169, -59, -80, -16, -215, 88, 148, 143, 133, -64, 58, 96, -40, 22, 145, -177, 73, -9, 2, 59, -12, -102, -15, -124, -5, 115, 22, 57, 185, -277, -217, 96, 75, 13, -34, 88, 164, -118, -166, -177, -29, -6, 89, -47, 221, 40, -141, 11, 6, 143, 47, -293, -77, -40, -211, 39, -44, -92, -100, 36, 88, -4, -71, 223, -98, 167, 92, 39, -77, -221, 81, -242, 88, 50, -165, -217, -43, -6, -124, -111, -42, -155, -112, 38, 135, -88, 143, -245, 185, -81, -259, -197, -212, 28, 32, 37, -187, 115, -55, 1, 27, -205, 83, 126, 17, 196, 28, -87, 71, 60, -353, 123, 46, -18, -35, 340, -58, 281, -221, 160, -61, 112, -125, -61, -29, 54, 119, -72, 138, 30, -8, 142, -45, -134, 6, 46, -2, -249, -16, 160, -197, -141, -17, 342, -96, -298]
6564b98N00l18J4j53K42P3K36l33jj49J14K39K2k87J51l8J50r7j66J03k10M22
6586B16r8j26l61L08Jk49M23k10k9r0K82j75j7R1J25j44P5r9l16M68j30l9J49
6609E5L2J42m18OJ09M1l09J88j53J24P3L13j84j32J10K08N2M0j95k87N1K13l6
6632D3r1K57k82O4j48L58j07l81Q6n1J52m1L4Q6l97M67l7m34N60j3k11MM5J21
6656H4j27J25k28N7K27m7r3J65j51j42K47q9J52j68K86j74j43J49l48J31L4j20
6678a73N6N2J06P3m48L56j01q1K38o1l1k66N53j12K57n54M2J65r4o5J07l56K78
6701e9J24P4O3J47m30r6K71j34r6L23l18k6q3L71j91J22K5j4J84k37P3j32O9k73
6725b43K82N1j41j66j5K16r0jJ55K31n50QL39j04J56k9k12K05j39J85o5j02j34
$$ y = [-298, 202, -116, -102, -255, -13, 60, 296, -37, -38, -187, -73, 166, 188, -99, 52, 14, 164, 67, -99, 4, -206, 216, 118, -8, -369, -61, -60, -309, 114, -96, -125, -215, 67, -108, -125, -34, 91, -53, 22, -77, -393, 75, -55, -94, 55, 87, 229, -189, -183, -74, -33, -342, -154, -307, -183, -110, 203, 19, -113, -3, 205, 257, 297, 102, -185, -134, 79, 43, -48, 209, -73, -9, -157, 201, 94, -287, -201, -252, -100, -141, -107, -21, -418, 49, 12, -422, 138, 125, -86, -82, -37, 84, -43, 82, -146, -89, 138, 91, -2, 163, 12, -130, 117, 28, 180, 12, 298, 124, -19, 130, -218, -87, -53, -173, -117, -65, 41, 114, -334, 22, -79, -160, 78, 17, -14, -280, 273, 161, 418, -136, -94, 71, -23, -88, 19, -337, -59, 65, 139, 202, 349, -81, -177, 94, -40, -136, 187, -131, -157, -240, 131, -60, 62, 87, 73, 257, 20, 93, -39, 30, -243, 39, 90, -51, -217, -232, -16, -106, -107, 48, 279, -271, -263, 76, -28, 128, 99, -113, 92, -47, 138, 73, -29, -163]
6748a63K51k27P2j5J60L6k33K53o6r4q5K4M1R2r0j23j4J25Q0J08k0k48J94J66
6772B24k31q9R0Q0J16j51Q0oj50j68L1K89j81q3L21r4o8r0M09k06l35J22N0J89
6796A49o8j4K6j91J56j05L2J13m6K16l40qN8Q6j78J9J32j00j01K4P4P3R2J2k42
6821a31Lj79K81K11r3J8l66L96j45j64L45M9k00jj46K06J8r6L2L00m90J56o7L24
6845B61j56l94J64M65k82k12J63j31Q0l9j00K79J37m37L21j14K64m8k96K1j67
6866b21q7M8K48O4k92R6J42j34J4j19M2M58l69J61MM3l8LJ2j03R7k9m8K99k99
6891hr9O1L2P2j23K4n3R6j28m1n7K92q6M3l01J33R8P3j3J95p6m21M79k32O2L43
6917C65k51k4R7j01L7j61P4N7j9k78K18l01L48l0M9M4q1J0P7J1L3j60O8l9j43
$$ y = [-163, 88, -139, -67, -82, 78, 114, -119, 134, 68, -26, -111, -87, -46, 46, -44, -167, -181, -56, 24, 132, 112, -136, 58, 224, -7, -96, -6, 74, 190, 39, 119, 113, -37, -205, -174, 115, -66, -149, 172, 78, 10, -80, 329, 123, -212, -90, -40, 149, 81, 67, 93, -98, 58, -47, -15, 98, 52, 268, -72, -80, -22, 64, -114, -95, 37, -63, -164, -140, -66, 7, 99, 111, -131, -128, -307, -26, 185, 92, 110, -256, 140, -5, -169, 176, 225, 25, 24, -122, 84, 102, 6, 38, 338, -152, 4, -63, 261, 105, -289, -125, 340, 58, -154, 9, -122, -42, -81, -181, 98, 235, -202, 119, 5, 269, 221, -75, -54, -221, -308, -260, -12, 52, -240, -144, -2, -136, -122, -241, -199, 259, -110, 51, 55, 98, 60, 63, 75, -28, 69, 40, -8, 291, -8, -107, -46, -14, 58, -65, -41, -94, 2, -126, -167, -224, 68, -18, 25, -276, -143, -45, 28, 15, 210, 134, -287, 192, -40, 22, 365, 114, 90, 187, 86, 123, -38, 36, 93, 74, -204, 14, -287, 61, 31, 80, 124, 43, 53, 130, 141, 174, 14, 82, 43, -100]
6942a00J06p7j32j47M12q5j12J58j23K55l7k14k7J66R7j7n03M37K66l75j95L34
6964H7o6J66k71K37K34m76J43J09l00L37k52N9K22m57q6L08p0l3K67j97K56k38
6986b1rj4m8J22j98p0M99l28J71k17J68K98l10q2O1oj45R7k57K18l1J6k6j00L78
7011A66r7n3K4r2K64j05j75J66k15m4N2M06l31j08K06J53k61r2K49j94K11Q0k47
7034c7j20P5K16j47J67J29m37M59q4j64M7j27P3j27k5O8M6J65r7j45m5p1J44k77
7058c14L85o3j29J38j41J89j70J0K7J75R6j97j73M8K3Q8K51l38J57J2n2j12K59
7081A69l37J32j1K62q7m6j09K8J93L0r1ln7L2n6j27q7J95O8j33J1q7J48q2j14
7106a59K67j67j6J19j43K21k14j0P4r4J63J01j92l86O46j3l95J88k31K68N8Q7
$$ y = [-100, 6, -71, -203, -350, 62, -23, -135, 23, -100, 155, 118, -96, -123, 43, 140, 123, -380, 57, 323, -52, -247, 87, 21, 187, -84, 153, 387, -89, 54, 163, -137, 200, -52, 7, 229, -228, -314, -6, -76, -109, 158, -39, 217, -21, -30, -44, -92, 30, -168, -238, 261, -67, 104, -113, 55, 353, 43, -39, 22, 16, -129, -32, -289, -71, -102, -86, -112, -212, 166, 69, 16, 40, -52, 212, 107, -68, 98, -117, -161, -109, 297, -34, -142, 64, 217, -44, -136, 113, -81, 130, 210, -37, -157, -82, 134, -13, 154, 283, -154, 305, 221, 57, 104, -23, 50, -77, -102, -34, 12, 177, 80, -65, -110, -181, -37, -314, 71, 8, -121, 17, -124, 65, -105, -95, -68, 107, 203, 6, -167, -119, -96, -8, 243, -95, 62, 74, 22, -90, 169, -168, -36, -47, 215, 128, 82, -27, 1, 194, 224, 133, 130, 73, 105, 49, -78, -165, 30, 98, -35, -24, -111, 37, -45, -159, 108, -59, -75, 44, -99, 122, -92, -102, -28, -122, 41, 142, -50, -436, 210, 197, -198, -10, -241, 27, 85, 172]
7128A72j79J30j71o2j3K92j92o0P4R2jl8l9p4Q6O0k52L03jl69L43r8l60L16K01
7153A60l21q8L66J05j60o0n1O8k61O07m41P3j64l4O70m17j8j13K91o9j82j87M10
7176A84M8m16J71r9J33R9p0L5k6L6k27R4N7j10m4J16j49K72j72J61O8j55P4j10
7200c0J37j53q5L30j59j19J34m19M91j90J1O7j47J83j08n1O6K05j93L1j75K10
7222C6j03K59j64J11Q7j93J5jk5K50k28k65J18J84j57M7k01J19K50k18K20l31
7244a90J91k3Q4q8LJ77j76J66r7p9m17N17J9P9o7k05j38M31k27O2j94jL14p1R4
7269A64o1j32N5j65K68m5j41j4L58M0k33o2K63j00k23K38p1q7n4oJ31l70J84J1
7293e2r2J04m2L86j85l7O4K7j56m98O44k1m03M71j49j88p7M4j35k3L37J70j13
$$ y = [172, -7, 123, -48, -110, -123, 169, -23, -83, -9, 83, 82, 44, 5, -69, 17, 77, -175, 128, 127, -242, 101, 3, -357, -41, 160, -161, -249, 117, 222, 62, 2, -49, 19, -242, 365, -76, -3, -167, -201, 469, 52, 34, -79, 212, 143, -39, -226, 184, 232, -184, -13, -112, 21, 120, 50, 85, 59, 95, -132, -38, 19, -91, -135, -19, -168, 104, -68, 93, 161, 6, 80, -30, 107, -46, -131, 199, 40, -79, 55, -364, 127, -63, -52, 15, -132, 51, -57, -108, -42, 163, -30, 1, -174, 36, -67, 192, 28, 139, 226, 33, 48, 47, 22, 272, 44, -221, -103, 81, -76, -29, -230, -111, 139, -79, 141, -190, 1, -22, 62, -26, -23, 154, -22, 144, 47, -32, -449, 68, 87, 166, 99, -106, -244, 187, -40, 22, -172, -173, 141, 70, 164, 103, -29, 26, -139, 129, 84, -57, -71, 287, 327, 94, 32, 295, 195, -28, 210, 139, 52, -2, -8, 123, -247, -63, -52, -144, -40, -82, 304, 119, 82, 146, 173, 17, -481, 163, 142, -261, 210, 61, -127, -204, -160, -295, -318, 19, 189, 76]
7316G6j49K74k55lL16j79j19K2k2mq8K98j90q7%j00K57l26p1L96j4k7J24j34l5
7341d0K60m12J50j20K68J00j54j18K20r3K94l55j01J95l70L71%j29j58K44k79
7362b27J1J99O8j64O9Q9K8J72l13J32K79l01K42m29k01M59l5k25N16j85l45K44
7384H3k99O0K46k83L12k23J46P2r4j06N7P9K5l34K12J15k54K79j50J81k39J8K04
7407A07j93L0M9L0k53LM17j05L6J89m69J99PlL6j37j17K52j12N6J01k76L38k92
7431a07K38j31j51n3L48K1j92q7J31l2r0J38L6l33O4K14j10k27L75k3p6L6j55
7454a66L56j47j89J76o6j61r8L24M2j99n3K44o5M1jL14m02L00m87J51M7K8Kk53
7478b62K88j16J54L0j74RL19n30L10p6J10K14k11j00L9k97J95K27J3n17N33k39
$$ y = [76, -73, 201, -54, -57, 259, 80, -39, -17, -39, -43, -131, 167, -23, -110, -110, -210, 47, -279, -350, 46, 32, 5, 129, -5, -40, 220, -192, -42, -162, 106, 206, 52, -66, 154, 61, 355, 0, -101, 94, -276, 95, 95, -34, -192, 52, -227, -216, -17, 51, -113, -44, 45, 73, 245, -68, 64, 343, 42, 284, -145, -346, 113, 78, -147, 369, 184, -161, 83, -216, -156, 90, -193, 119, -104, 42, 114, 20, -86, -29, 50, 75, -259, -47, 68, -186, 93, -57, 124, -115, -97, 107, -86, -56, -7, 23, -230, -227, 190, 85, 121, 310, -159, 40, 47, 44, 80, -57, -174, 78, -34, 22, 123, -153, 185, -107, 131, 0, -151, -204, 144, 165, -27, -114, 17, -15, -105, 33, 69, -264, -200, 14, -96, -323, 52, 29, -47, -11, -166, 190, 43, -146, 30, -36, -197, -295, 29, 71, -128, -181, 63, -2, 39, 38, 352, -50, 250, -237, -86, -39, -11, -9, -262, 26, -90, 64, 94, -80, -71, 248, -282, 28, -48, 62, 276, 65, -35, 4, -293, -98, 129, 142, -375, 158, -81]
7500h1J07k56K21j0k48J70j14K02M8J7K6K80j35k73j90M43l65nl3K89j50K3J29
7523I5r5Np7K57j61Oq3J56k54K18j22J42Kk87L07k45J55q3P3R8m7l8L3L8P1j53
7549A1o4J71j32j27P8K9j85L41O9l36K79J29k28J08j06o9jO6n1l92K59L13k68
7572a06K48l69q9O53j06m43J25K53j23k03J73k53J64K4l5K22k11K52J6j18r6J4
7594hJ62m27R1J13J18P7M9k57L05j9l03K71l4k09Q1j39R0J17j31k95K05J68q9
7617f4J90j12k01N4l1K4J48K62m57K17J70k58J91m08L66l33J87j61jN6J68K38
7639B45o91L80j52K75N4j9j18o4K71l32n1M12k26J18L2l5o4n3P4j28K53l80N8
7662a41L21J12q5j85L1J33J92j21k59M8j34J21Q1j27J8N4J60K45m06J1J33k64
$$ y = [-81, 26, -230, -9, -19, -267, -97, -211, -9, 39, 56, 82, 362, 227, -46, -236, 207, -158, -163, -196, 93, -57, -34, 95, 0, 5, -72, 185, 24, 30, -53, 103, -151, 67, -55, 87, 89, -198, 109, -136, 19, -64, 9, 107, 60, 22, 55, 93, 164, 11, -53, 118, -14, -141, -63, -34, -219, 122, 191, -145, 134, 263, 35, 143, 37, -32, -33, 33, -18, -410, -151, 162, -106, 142, -227, -316, 337, 231, -212, -87, 166, 43, -160, 13, -240, -76, -52, -87, 135, -76, 176, 192, 74, -22, -8, 154, -273, -182, -69, 49, 126, 175, -82, 223, 204, -99, 172, 138, -71, 10, -129, -39, 78, -53, -348, -143, 25, -64, 126, 14, -187, -133, -164, -140, 8, 270, -187, 30, 200, -58, 133, -275, 91, -242, -55, -216, -217, -161, 7, 245, -446, -66, -218, 57, 111, 92, -26, -90, 181, -151, -202, 210, -16, 102, 134, 99, 35, -18, 56, -72, 181, -199, -141, 180, 292, 207, 22, 53, 186, 378, 257, -2, 46, -88, 33, 114, -13, 5, 59, 219, 464, 58, 69, 202, -62]
7684f2j63J62j26J71J38Pj59j14K28J0k11l2J55Jn0M37n42K86j13j41n8P5J98
7707I7j97L85l14j07N5j2L80l08Q8O6j64L61l54l21M08j02j91M87m01K26Q6o5
7729A03J22j90PK14k29l84K56J55j03J25J37j83p3j75M19k66J1K06p2K3o8N8j2
7752H1j16J70K7j64m4k19J46R1R2J99j05k03n3K91m08L41r4k35K15j52J3J91J09
7775A73n26K11J54j86QL28l78L06m00L00j3L08k96J35j14q1J55K7k47J87Mm8M6
7798E3k38j6J09j13L41km0N4j69j39L01j31j7n1K51j06k90L29k79K41p6k7P7j00
7822c8j9K18j8k78K59k01L1J99j55k2N2l6j8J61j84j8M7j46J88J38k03PK83l02
7846e5K9L27q0j38k88L24J5j2l17J75K28j17k24R4J24N9j25M8P4n3m1j7K77j26
$$ y = [-62, -225, -63, -189, -18, 120, 127, -32, -146, 82, 92, -119, -151, 4, 5, -45, 392, -150, 136, 23, -118, -176, -101, 97, -100, 285, -29, -136, -81, -93, 287, -21, 67, 133, -31, 330, -24, -345, 63, -39, -230, 257, -144, 82, 168, 103, 225, 35, 42, 256, 27, -357, -101, 54, -49, 76, 213, 30, -43, -218, 201, -65, -54, 152, 80, 103, 35, 93, 81, -35, 135, 162, -2, -46, -265, -119, -28, 64, 263, 158, -45, -98, 193, -215, 126, 32, -203, 12, -140, -127, 64, 173, -353, -142, 12, -174, -166, 162, -216, 90, -310, -10, -23, 285, -11, 124, 10, -71, 84, 111, -136, 51, 55, 7, 53, -185, -201, -92, -205, 136, 134, 94, 148, -21, -160, 141, 10, -7, -58, 193, 87, -203, 126, -153, 88, 12, -15, 62, -38, -57, 161, 143, -135, 124, -77, -46, 153, -2, -24, 28, -8, -26, 135, -49, -67, -20, -166, 22, 160, -43, -36, 247, -55, -26, 301, 221, 83, -205, 119, 134, 122, -195, -20, 208, 91, -133, -39, 85, 144, 19, 67, 141, 88, 47, 30, 307, 181]
7870A81j87Q8r7P3j82K55k98R2j16M91m00J62j3j04O1r5oM30l85N9K6P0k11K03
7894I7Q3m7k02J15J04j51J30j11O1j8p4J16j98Q4j78k3K05M0J02l70J30m3L1p
7918a24K4J55o1p4N2k64K79k38L23K7J95k86Q5j99J22j23j80R7L58k32L6L6j26
7941a18O8k12K89j02J8p7K92p6j45L62m76J31j73K6J89r4j11J05J03JJ02P8J71
7964C51l84J92O4j41k43M85l12k95K40L01l78j5K14k05r8L15p3J76k92J99o2O
7986D5J10L9k16L2J23j47Q4L3k46j52N31k06L24k14o9k35K05J66k40Q4L0j9j60
8009i8K16l81LK13q7j72L84q4k8P3j68J0K32j70J70j37J26k79K79N7l28R7J87
8032A15k47J51k35R3K4K22k10K3M3j85K08r7lJ44Q4j60q9Q6K7K28k25Qo6K18k60
$$ y = [181, -6, 82, -15, 58, -124, 131, -167, -75, -191, 300, -100, 62, 49, -55, 6, -89, -95, 335, -50, 9, 35, 105, -106, 97, 180, 133, -69, 46, 150, -1, 129, 18, 79, 61, -13, 103, -95, -11, -189, -212, -7, 33, 135, -235, -105, -148, -117, -124, -100, 55, -6, -80, -28, -292, -13, -251, 72, 99, 294, 8, 93, -106, 16, -107, -287, -190, 168, -64, -28, 8, -118, -50, -262, 27, -75, -57, -134, 158, 82, -63, 299, -177, -46, -219, -193, -4, -98, -209, -104, -1, 0, 102, 180, 351, -33, 159, 223, 82, -161, 324, 12, -283, -43, 258, -120, -135, 79, -126, -224, 91, 18, 194, -98, 101, 39, 45, 155, 194, -22, 10, 133, -14, 70, 103, -143, -295, 236, 30, 354, 140, 71, -164, 41, 207, -33, 51, 81, 62, -98, 118, -263, -260, -47, -134, -306, 78, -6, -34, 39, -129, -119, 113, -57, 113, -24, 102, -177, 102, 159, -169, -72, 115, -132, 19, -216, -123, -99, 123, -87, -64, -21, -206, 2, -95, -98, 46, 130, -30, -119, -33, -6, 222, -3, 5, -61, 157, -103]
8057a03O7K60J7l01Q0r2N0K48k17j68L60K71n57J35j53K83k88j9j2n3K27O5k95
8080a95M2J22K17r8m1J3J49k96l4M60l46J92j95j94K69j73J13j10J32mk07R7J15
8103B8K41l47L57l27j90L13m9K28l29j86L72k1o0j35L8K92m57J51O2p0P6Q6J50
8126B23J2l8q8j71L70l84k5L06n04K51L60l76K1j47M8K16n6p8J72k03Q3J28j2
8149A08P0k64J62l31K65l4k72J21R5m1J10k0k62J89k14K95j05K51o0j6k51L49
8171A45j20j03n2M19j11m3j35R0j59j62M29k93k2j60L03q9M3P0j17J58
$$ y = [-103, -36, 224, 241, -60, 20, -72, -22, 226, 9, -159, 201, 472, -85, 50, -103, 180, -108, -127, -139, -192, 35, 100, -195, -153, -31, 186, 88, 47, 60, 209, -87, -121, 339, -7, 185, -10, -204, 65, -108, 5, -105, 27, 23, -184, -87, 28, 269, -78, 279, -48, -238, 75, 26, 254, -75, -261, 111, 90, 30, -105, -67, 225, -232, -81, -19, -89, -13, 73, 223, 235, 197, 109, -62, 308, -76, -101, 205, -299, -48, 312, -64, -43, -190, -142, 74, 18, -60, 112, -91, -8, 120, 108, 178, -86, 76, -255, 10, -24, -296, -175, -80, -121, -11, -31, -293, -104, -318, -23, -128, 123, 63, 47, -204, 145, 25, -78, -130, 289, 178, 135, 0, 90, -69, -231, 198, -95, -117, -277, 26, -63, -20, 50, -67, 91]
8191I1
$$ Imaginary data points
##PAGE= N=2
##DATA TABLE= (X++(I..I)), XYDATA
0@%%%%%%%qJ6j6J6k4M0n6P2q8J12j36J60j94K34k86L42m00M72n55O49p53Q66r97
30e34J145j305J484j684J903k146K414k707L030l384L771m194M653n156N712o317
46c315O973p690Q476r342J0292j1335J2489j3772J5207j6820J8644k0727K3133
59A2213k5949K9298l3356L8392m4843N3440o5520Q3849j15255J83153n74507N21547
71F2462P97732j388996K57557R49254p54202o51694J133064Q6286j049957K90999
81b67495Q62252n92965l62031O47793r8593o73948L79391N22266l67444l30250
91b81024L63526J06199m02130N6995M50429k83376l75163M94846K36370n75149
101b08477J8127M79423l39997l22361O32554R6027p24277K37853N69679o07115
$$ y = [0, 0, 0, 0, 0, 0, 0, 0, -8, 8, -8, 8, -16, 24, -32, 40, -48, 64, -72, 88, -106, 128, -158, 184, -216, 256, -299, 350, -403, 463, -534, 611, -694, 790, -894, 1009, -1137, 1277, -1430, 1600, -1784, 1987, -2207, 2446, -2710, 3002, -3315, 3658, -4032, 4444, -4898, 5394, -5941, 6548, -7224, 7983, -8837, 9807, -10920, 12213, -13736, 15562, -17794, 20598, -24245, 29195, -36325, 47524, -67731, 115422, -459085, 62462, 860194, -528802, -271245, 678009, -76193, -727887, 405177, 491463, -558494, -267495, 594757, 1792, -360239, 287554, 188961, -484987, -105596, 416670, 49226, -281024, 82502, 188701, -213429, -156434, 293995, 10619, -364544, 130302, 366672, -208477, -190350, 289073, -50924, -373285, 259269, 355296, -368981, -131128, 438551, -168564]
111a68564k07189P66800k65463o37246O61071L08559p95404R2958O59207m75195
121f0466l72827P28463M1616p37362L07815N18486n64435j89250O06717j23561
131A55196m70195L21839K95829l89156j61905L76642J9404l65538J40451L45036
141B67603k66635k53071L47038J04251l96223N9651M13830k29393l42320M18288
151A23019J53052n45042J20140M84122l96469k48765N51712m3633n22485K84477
161c9872L33852m42823p4709M92401j80951l87346L86412J59387m53121R9948
171a06822L45529k79952j42319L33124k8468k85108J17231J85468j75992q7115
181a24424K15849p953k12441R4514J63139j45493j00622J58802N1772j69327J9254
$$ y = [-168564, -375753, 391047, 125584, -511662, 149409, 457968, -337436, -244478, 414729, -60466, -433293, 295170, 336786, -400576, -92761, 425725, -138710, -327960, 278757, 155196, -314999, 6840, 302669, -86487, -248392, 128250, 147654, -217884, -77433, 267603, 968, -252103, 94935, 199186, -197037, -137386, 276444, 47051, -295269, 123019, 276071, -268971, -148831, 335291, -61178, -309943, 241769, 198136, -324349, -39872, 293980, -148843, -223552, 268849, 87898, -299448, 86964, 246351, -206770, -106822, 238707, -41245, -183564, 149560, 121092, -164016, -46785, 138683, -37309, -124424, 91425, 83472, -128969, -34455, 128684, -16809, -117431, 41371, 93143, -76184, -56930]
192e6930K04540j24098k03240K35356R9232k95644P4589K58103k28605j42726
202a79423L02035p799l06844J47713K39189k60622q6873L23529j05960k80770
212b15825K56976J33798k96367M5861K38161j63258j36007K04577L1092k10276
222a11268N4237J78577j24695j00265J63578l404j55870P0848J10719q4660o4343
233f6546R2978M1790j15992n134J37666o8399j16232J43068M9877j67536L1045
244d3415J35270j03606r1418J51832L3591j76647N4586J58592j52594p7111K01772
255I0852m1652j65081J40156Q2092j66717K373J43211o9128j06838J19731N4376
266H3375j47847K1040J29102r7831p0856J22876M08r7049M3684O7072n5883n0836
$$ y = [-56930, 147610, 23512, -179728, 55628, 154860, -140784, -66195, 191908, -36697, -179423, 122612, 114813, -192031, -44318, 194871, -65751, -152624, 170905, 64945, -215825, 41151, 174949, -121418, -75557, 162604, -654, -136661, 67916, 99008, -111268, -57031, 121546, -3149, -103414, 60164, 56760, -99110, -28262, 82457, -2203, -66546, 26432, 68222, -47770, -52904, 84762, 16363, -99869, 43199, 93076, -74460, -43415, 91855, -11751, -103169, 48663, 82254, -94393, -39807, 118785, -33809, -110920, 90852, 49200, -115881, 24275, 106367, -60350, -57977, 85234, 16106, -90732, 28999, 83375, -64472, -43432, 85670, -12161, -83017, 39859, 40267, -56782, -13098, 53974, -1909, -52745]
278e2745O9261L0981q8387J5129R2813o3016n8384Q5021P548q3734K3053P3026
290E0566m5255o2918P8294K9572j11457L0417J01944r0425m1823J15669k2158
301C2426r2601O2480N4538q0718j9510R4630k0956r0735P0244M8583j05187J3238
313c3568Q9958o2188m3317P2633L981o1901J4836N4072l1387m4206O0284J8979
325C8176p1873K3249N2455n0037j9805M9270j074m0912N743M3238k3930m4994
337d0494N2302J8555o9564K5639N4503n3743j9321N6762o183m6729K2492M3719
349C7938m2665k9233O6654q832o7506N0408L0715o7614J1779N0875l4599k7445
361b9525L6949J3048m0650J145M7459k5638l4043N0441K638m7182K5102K3637
$$ y = [-52745, 16516, 47497, -40890, -25761, 67052, 4036, -54348, 30673, 38221, -45513, -22460, 50566, 5311, -57607, 20687, 50259, -61198, -30781, 71163, -19262, -61085, 54584, 32426, -60175, 2305, 56843, -23875, -43385, 51245, 30289, -60446, 9798, 58381, -46806, -33568, 56390, -5798, -49115, 23518, 27499, -34402, -19566, 34506, 3119, -41087, 19197, 38176, -33697, -10448, 42007, -8030, -27835, 21435, 20361, -20551, -14808, 28430, 4500, -40494, 11808, 30363, -39201, -13562, 40941, -12802, -32123, 24639, 18456, -28273, -5781, 37938, -4727, -33960, 32694, 23862, -43644, 6764, 37479, -30135, -18356, 32519, -2080, -29525, 7424, 20472, -20178, -19033, 28426, 2788, -31255, 19186, 21824, -25358, -256, 23381]
373B3381k8337o474K1026M700k4763l148L3268j8652k9586M0165M568m0824K0075
386d601K3222k5748j0171K6368P852l1956N844L8787l1703k3507N0542j2198m1575
399b8844L7299J3325l9159O373K6053j3753k2041K1981J7021l4192J956L7535
411B3554k6725j6511L5897q425k1332J7786P032j0005p826P778J1023k0199j857
424i810K5447j8088j4756K5194k555j7342P210J1579m742j5077J6342J5041l2129
437a3686N125L3310k9798j0971L6791j5216k3035K3273O218k0858k055K0147n221
450D024k2876K2138J2017l3028J1071K3580k4899N35J9885j1221n391O397K775
463E007r28j0220P418Q471j7002L634J2332j3068l075P926J607l483p228J2891
$$ y = [23381, -4956, -11430, 9596, 14296, -10467, -13615, 19653, 1001, -28585, 11580, 16148, -24676, -4601, 18621, -7127, -17298, 9070, 16922, -15034, -9190, 29597, -2106, -25613, 24929, 12731, -28844, 8455, 21780, -17379, -11006, 15047, 1294, -20747, 1234, 18255, -15937, -13981, 23554, -3171, -19682, 16215, 7790, -13542, 4244, 11276, 1271, -6555, 1223, 12246, -7953, -9810, 15637, -2451, -17207, 7987, 5432, -11910, -4700, 6879, 2137, -12940, 3402, 18443, -13686, -8561, 24749, -5049, -16020, 20771, 5555, -17480, 5793, 12011, -8847, -10902, 9245, 4024, -18852, 3286, 15303, -17725, -6654, 16926, -7973, -7438, 12447, 1226, -4165, 2232, 5007, 4079, -6141, 1277, 9748, -7254, -3620, 8712, -4356, -7431, 495, 2102, -1381, -8609, 4282]
477D282K438k1833J7296J4876l0305R012K3695k4683l584K2347r360j4799J0598
490b0J1555j5615q165K3148q321k2330K6736L145k7077J7706R475j8570P138Q002
504F807o669r46L54O150k151q360Q958j349q369P086m60l080Q01n132R458l61
520B737j4715J6546K391k0923J7496R627k2634P147J3804j2623m287J1448J679
533G693j5842L069J8488j7776q680K5349j2959j5589K5276m690j6575J5079J956
546D799r679M991L636r44m975K033P297q412n02P919r472K400M306q310P034j831
562B90r272J3388k303j2801J5849j354j3151J2480L917j0159Q15P385j039r903
576e858P305R609j9446K673J9296j9718l826K1390j4894p418J7447n232q233P122
$$ y = [4282, 6720, -15113, 2183, 17059, -13246, -4234, 19461, -5222, -8806, 13541, 4181, -10618, -20, 11535, -4080, -12245, 10903, 2582, -19748, 6988, 10133, -16944, 762, 10237, -8333, -1195, 6807, 138, -808, -454, 5696, 3545, -4815, 4143, 2794, -5575, 1511, 1051, -2029, -1228, -6360, 3098, 2737, -11978, 4568, 6959, -13964, 3532, 13159, -9475, -2328, 11476, -1147, -5434, 6014, 7693, -8149, -5080, 13408, -4368, -13048, 12301, -658, -16247, 9029, 4339, -12236, 2843, 4799, -4880, 111, 3747, 2803, -2172, -139, 7158, -1254, -1756, 6163, -3309, -909, 3397, -4913, 2121, 290, -8982, 4406, 2103, -10698, 5151, 3797, -9354, 3126, 7043, -3116, -2301, 5084, 4045, -5858, 1447, 11056, -8390, -5717, 13579, -6139, -9965, 11425, -3469, -10887, 6560, 1328, -6905, 217]
590B17K499l414k245P098O62j0074P842L960j1697P893J754j0810R008j141q192
605f640J0360m651o350J1707m996n054Q677k145l707L029K908n38o610P063M768
620G821j5144Q578R617j9442N516J3589j7347J530J2158j0063k436P053l03m101
634b974j26P395l202p062J2297k394j0386J2300j907r600J0456k907o216P783
648C457m585k145N911n457L75L576l359J492j22J371J332n265O463J605j0510
663e861R880K582j3795R844M266j3734P049M727r618K472L347k021k116M14O269
678C705o112k777J1560o970n021J3063o368n680J1119n808l513O686m717L14J722
693A203l299K580j787j073L548m092K032K536n596N667M57o883Q969j490p476
$$ y = [217, 2716, -698, -2943, 4155, 4817, -5257, 2585, 6545, -5152, 2741, 4495, -6315, 2693, 1552, -6640, 3720, -931, -7281, 4426, -570, -5624, 3053, 908, -2799, 230, 3138, 2600, -4010, 3053, 7821, -7323, 1255, 10872, -8570, -3054, 10535, -6812, -5282, 6876, -3187, -5623, 1430, 1127, -2974, -3100, 4295, 1093, -5969, 6328, 3934, -6452, 5848, 3941, -5659, 4797, 1890, -4326, 3457, -1128, -3273, 2638, -2819, -2444, 1132, -2227, -735, -857, 514, 1846, -3419, 3044, 4649, -5861, 4019, 6601, -7194, 2650, 6916, -6818, 231, 4958, -4660, -2188, 1159, -862, -2978, -2564, 3705, -2407, -5184, 6376, -594, -5615, 7448, 1080, -4600, 6519, 711, -2802, 3884, -833, -519, 1203, -2096, 484, -1303, -2376, 1172, -2920, -888, 1648, -3948, 1719, 2176, -4707, 4262, 2772, -4704]
708d704R965k014p982Q279j679n057M160l78r87j616L74M323o363K90Q442q681
724c628L75R987r175j34Q453o959M81M178m007J607p38r52K547m121J530K519
740A963o119M175J293o061O405j107m672P629l304l069P616n034j407N949m497
755b40n9K559l037J839k001l3L473o417K435N204q711L694N483q597L883M325
771C800o366L247J453k803K566j694O06J208m579M059M60n722N614q51n487O403
787A914k719k643N791l717p57M908m691K430K579m698L253n8k382L347l500K25
803g18L336n928L246K825p443N241J187o537N875J24m701M770p00j048K146k395
819g20K169L84l498M796k128l672N921l898k583N716m058p12M038m011J520J796
$$ y = [-4704, 5261, 3247, -4735, 3544, 1865, -3192, 968, 590, -397, -2013, -1639, 2684, -3679, -3389, 5053, -3628, -3253, 6734, -2441, -2575, 5878, -1081, -600, 3578, -429, 1178, 440, -512, 2035, -2086, -556, 1963, -4156, 19, 1312, -4749, 1656, 549, -4123, 3506, 202, -2867, 4749, -285, -1692, 4257, -240, -299, 2260, -777, 1062, -939, -972, 2501, -3916, -1481, 3723, -4988, -1294, 4189, -4408, -525, 3800, -2566, 681, 2134, -669, 1897, 203, 809, 2017, -2562, 1497, 1957, -3765, 1849, 998, -4489, 1914, -805, -3448, 2343, -1374, -2131, 2777, -1914, 516, 3095, -1603, 1650, 1592, -790, 2557, -943, -718, 2618, -3310, -64, 2761, -4682, 559, 1746, -4791, 1084, 1208, -3493, 1277, 577, -471, 1675, -720, 1449, 1833, -1665, 3131, 1003, -2669, 3252, -646, -3229, 2487, -1571, -2283, 1755, -2256, -736, 1060]
835A060l774L737k11k592M343k675n18L760m370K074J786n075L994j37m796N204
851A810j786l374M969k660j232L575k765Q51J672k793L698j363j963M774l673
866b60p85N028n078R2L921n051J626J910l941K914o27k177L891k568k90L569l636
883a462J557K027l777L679j94l814M576k137k280M353l431n04L369l893Q17K063
899I49l212K261j12j942L656k338m94M115m428J752K914m753K500J556m325L193
915A292j18l271L567k391o47L015l795J453K149l851L220J57l094M317j505k140
931a642M374k919O2K913m165J425K036m324L110k87l078L570k007q59L295l365
947a861J198K315m148L250J006l743L627k65l140M152k289j282L419l220P42J449
$$ y = [1060, -2714, 1023, 812, -1780, 2563, -112, -630, 3130, -1240, 834, 2620, -2455, 1539, 1402, -3394, 1810, 24, -3350, 1619, -1041, -2273, 1302, -1463, -612, 1060, -1733, 1965, 602, -1361, 3413, -260, -1045, 3983, -1095, -1003, 2918, -2133, -507, 1403, -2538, 376, -251, -2428, 1463, -1105, -1395, 2174, -1462, 95, 2122, -1655, 2024, 1830, -1984, 2592, 455, -1825, 2528, -903, -1407, 1962, -1931, -1114, 949, -2263, -2, -114, -2056, 1600, -738, -1232, 2883, -1545, 207, 3121, -1632, 868, 2424, -1901, 1292, 1174, -2097, 1470, -921, -1568, 1447, -2348, -895, 1254, -2597, 623, 780, -2314, 2003, 498, -1642, 2732, -187, -125, 2788, -1377, 48, 2084, -2240, 870, 583, -2495, 1075, -932, -1791, 1504, -1861, -663, 1652, -2496, 754, 1760, -1983, 1644, 1379, -1761, 2391, 102, -1180, 2239, -981, -239, 1210]
963A210l562L019n11k832L929j758j703L869k932m6L751l687J610J902l667K640
979A232k07k582L427j883j542K949k891Q36J653l305K643K80l012L620p69k382
995a933M191k648o82L415k807O46K170l605K254O7k833L150j742j455L440l236
1011a608K03L080l935J848J514k948K801k1k239L535k127r60L053k694N42J919
1027A963l595K268K82l010K826r68j758L517k809RK901l244J591K155l737K531
1043I22M86k721L217j531j317K810k606J42K059l124J586R97l268K971k12k745
1059b334L772j901q33L185k595M44K442l199J970O03k836K745r12j863K924k533
1075i21O2K066l120J440J488l154K419L53k439L153j095j300K851k173K8K397
$$ y = [1210, -2352, 667, 156, -2676, 1253, -505, -2208, 1661, -1271, -1317, 2434, -1253, 357, 2259, -1408, 1232, 1025, -1557, 1870, -13, -1555, 1394, -1497, -661, 992, -2313, 330, 610, -2402, 1218, 449, -1933, 2258, -390, -1072, 2343, -464, 182, 2352, -1253, 1001, 1068, -1765, 1385, -357, -1812, 1628, -1608, -1405, 1675, -2260, -412, 1102, -1846, 955, 934, -1305, 2230, 103, -857, 2196, -498, 44, 1963, -1632, 636, 918, -2092, 734, -234, -1992, 1525, -1284, -1275, 1626, -1618, -27, 2128, -1609, 922, 1408, -1313, 1904, 373, -944, 1866, -740, -598, 1461, -1663, -77, 920, -2348, 623, 411, -2334, 1438, -463, -1296, 1889, -706, -262, 2180, -1019, 951, 1554, -1282, 1463, 551, -1312, 1612, -921, -859, 1207, -1913, -473, 1015, -2139, 280, 633, -1806, 1347, 252, -1048, 1803, -370, -342, 2055]
1091B055k887J306Q57l013K874p97k179L197k152r86L198l033Q23K211l252K119
1107C41P36k641L006o07j695K589j707k32J802k703J133J203l295K883m06k563
1123b156L412j727j134K726j979KK541k564J068J257k603K377m28k015L003k122
1139c42o08K570k791O21J624l189J958J071k982K704m48j555K443j135n77K154
1155A518k350J528R44k552K105k92k723L309j772j526L183k791K45K157k584J202
1171c99J208k190K068l39j355K385j576l26K458k863J314J505l261J784M27k518
1187a678K479p64j970L081j921m03K204k152J159R57k301J945K14j537K459j650
1203A22q31K604k413J0K364l066R43J035k670K095j78j558K225j316J2J652j938
$$ y = [2055, -832, 474, 1331, -1682, 1192, 395, -1784, 1413, -739, -1725, 1473, -1560, -737, 1474, -1778, 341, 1077, -1564, 1442, 835, -860, 1729, 22, -210, 1592, -1111, 22, 1225, -2070, 813, 407, -2156, 1256, -471, -1605, 1121, -858, -856, 1685, -879, 189, 1446, -1157, 1220, 792, -1223, 1780, -342, -950, 1620, -1171, -550, 1074, -2115, -157, 914, -2068, 636, 188, -1367, 1076, -59, -636, 1518, -832, 696, 1640, -912, 1193, 901, -1822, 1487, -285, -1811, 1372, -1419, -1174, 983, -1601, -399, 809, -1381, 687, 348, -1007, 1378, -198, -524, 1934, -929, 385, 1890, -1371, 413, 840, -1678, 801, 37, -1933, 1148, -773, -1176, 1028, -1124, 35, 992, -1309, 636, 850, -687, 1772, 122, -709, 1895, -518, -508, 1856, -1210, -267, 768, -1902, 193, 15, -1543, 682, -634, -622, 1030, -908]
1220i08R21J392k560K175K30k797K822q20j729K544j460o85J772k094P90J212
1236H05k291J590K22j505K296j314o59K396k046L30J937l046J507J337k755J631
1252D35K6j830J834r71p31J599j673J111Q64j842J808r2j786K559j145j253K890
1269A803k158k94K358k143M00J160k295J396J67j589J653j006m66J948j862N79
1285c49J708k320J353P91k291J942J00k012K065l94j193J676j545K31Q19j653
1301a072J463r8j704K301j139q44K303j638l49K420j978M94J344k192J110J23
1317E44j273J477q79l05J221j662L70J319k392J730P80k206K052l11j610K271
1333A126r49o92J687j671L23J329j569R50L5j698J742r17r27K205j831l16K075
$$ y = [-908, 13, 1405, -1155, 1020, 1250, -1547, 1275, 455, -1274, 1270, -190, -875, 897, -1197, -407, 805, -1486, 104, 326, -1179, 1117, -197, -856, 1540, -506, -176, 1761, -1285, 222, 1559, -1196, 435, 461, -1369, 465, -506, -1237, 362, -1311, -200, 664, -1178, 630, 538, -1248, 1311, 166, -1087, 1803, -355, -649, 1709, -434, -34, 1126, -1169, 227, 394, -1195, 458, -548, -1014, 934, -928, -349, 1359, -961, 392, 1183, -1108, 834, 934, -1078, 987, 593, -600, 1076, -469, -238, 581, -1072, 391, 293, -1411, 890, -249, -1093, 1210, -428, -777, 1643, -335, 159, 1503, -689, 421, 544, -729, 748, -131, -436, 785, -877, -507, 812, -1580, 150, 930, -1276, 776, 465, -1145, 1126, 177, -515, 1172, -499, -176, 1153, -416, 534, 569, -1129, 613, -304, -1231, 974, -857, -1173, 902]
1350I02k135P33J368k176J712N84j855J683n61n06J739j862O3J180k059J292M43
1367E45k034J799k52j431K183j041o10J917j600L07J250j532R52K34j425J725
1383I87o92q90J797j752K90J393k146R34O73k050J665K48j953K008n93p74K197
1400A342j723L31R15j527J171K31j617J681o34j217J979j466l75J737j459K03
1416d28J449k002J136L71j526J623m66k92J214j302K85J050j958R90O34k018J724
1433D84lj435J463l84r17J195p41j82J159j420R07K01j033J655p05j189J875r60
1451c0j18J115j606L89J096j919J092M7j137J310m03m90J030q18K29R34j776J379
1469C24N36j659J214L98j852J764o01r99J797j438p1J339j529O93M14j271J506
$$ y = [902, -1233, -500, 868, -1308, 404, 988, -867, 816, 255, -251, 1488, -374, -311, 869, -1190, 102, 545, -1489, 310, 58, -1373, 810, -231, -841, 1076, -524, -217, 1033, -499, 453, 687, -738, 987, 295, -595, 1202, -550, -260, 1133, -1013, -79, 594, -1456, 209, 457, -1496, 512, -81, -855, 1342, -381, -50, 865, -662, 509, 740, -877, 804, 170, -1047, 932, -534, -909, 828, -631, -428, 1021, -981, 155, 526, -1000, 623, 157, -135, 1079, -223, 62, 1112, -846, 144, 778, -1240, 484, 481, -954, 509, 125, -792, 403, -338, -520, 639, -781, 126, 327, -706, 949, 244, -945, 930, -30, -148, 967, -639, -250, 846, -1073, 19, 66, -1071, 239, -164, -654, 376, -442, -213, 721, -1055, 324, 860, -799, 415, 813, -1039, 725, 124, -875, 922, -516, -587, 752, -777, -84, 330, -941, 565]
1486E65m56p56J347q49j1J159j619N78J063j848J179J79j245R59m19m40J146j056
1504e24L8Q05j215J036K41j111J461o47r88J991j022o35J725j405j41J349j615
1521f57N69N94j400J129l70n07J110o76k64J431j861R98P44j538J193L4j139J323
1539G13n42q11J155q60n3J084j305O83J09o30N73k48p58J494o37o67J585j290
1557d05J13J436j335L22N72j296J104l19p85Q15p50J38J117j393L95R64j880J630
1575D43j36r83J388m31q60J286q17l04J220r41K79L99j164J015j96r45J189r02
1593d60m4J134j112M7J147j333O55O96j449Q38j21l17Q54n36r0P15r94N30pq19
1613f66J084Q1j180J155o72p00J538p60k91J228j118O39K42j084P49l5p68J171
$$ y = [565, 109, -647, 700, -149, -160, 999, -620, -42, 1021, -827, 352, 531, -714, 245, -174, -614, 532, -524, -486, 319, -896, 140, 381, -730, 731, 84, -904, 1087, 65, -570, 1155, -250, -391, 958, -657, -88, 506, -894, 235, -135, -642, 468, -208, -472, 959, -902, 96, 840, -698, 495, 529, -610, 713, 171, -640, 515, -345, -398, 686, -619, 64, 173, -457, 116, -132, -890, 604, -33, -700, 885, -405, -292, 1144, -191, 131, 703, -593, 511, 192, -593, 222, -528, -390, 727, -666, -271, 693, -1187, 443, 307, -676, 712, 281, -579, 707, -110, -414, 806, -135, 144, 543, -621, 394, 198, -747, 442, -460, -504, 630, -482, -435, 712, -621, 34, 730, -719, 119, -2, -319, 535, -1, -91, 624, -370, 160, 153, -666, 418, 499, -681, 474, -198, -898, 640, -120, -411, 817, -301, 338, 580, -504, 245, 210, -558, 613]
1631F13n25n85J179j147P3J208j503P00J75j088J009n5m80R74m46m40Q72q28N56
1650B62L19j132Q57L8j170J203l97q09J239q93J5J002r80o2J056j042O24M47r85
1669d08R59m83l13J003q52K30M76j178O36J99j141J196k54p34J100m64l46N48
1687A74m29J27K22k75N85j36n85J059o12o41J350r91k84J155j158M81M29j397
1705i26J020M7p35R08m18q6N07o25L88N76j093Q73J48j041P26j32p13J088m95
1724A7o37J037o56j59R09j117Q00o2n70J177r51j70J035j047M57R77j370L88N63
1743F21j109O76J38q42O37j91j23P06q22K27M75o30O18j65j012J135l18m98Q52
1762C75l77k86J077p88k03O26p24K39J69o27P86j90m33R06p87J17M69p84O06M73
$$ y = [613, 88, -497, 682, -465, -392, 816, -687, 13, 188, -900, 109, 54, -426, 548, 102, -338, 534, -294, 262, 581, -551, 306, 344, -826, 377, -20, -829, 410, -483, -468, 534, -446, -508, 548, -494, 130, 577, -408, 551, 68, -245, 758, -94, 136, 612, -566, 70, 269, -872, 324, 70, -664, 436, -28, -374, 174, -255, -128, 94, -181, 404, 268, -317, 742, 130, -511, 839, -152, -436, 719, -439, 42, 471, -926, 94, 141, -594, 314, -104, -190, 317, -308, 80, 656, -437, 436, 584, -457, 269, 137, -576, 512, 17, -620, 417, -239, -398, 511, -606, 194, 132, -438, 739, -212, -382, 653, -394, 63, 1040, -330, 58, 621, -488, 188, 326, -516, 121, -70, -193, 513, -309, -82, 393, -237, 381, 216, -796, 339, 21, -477, 375, -2, -288, 789, 1, -202, 424, -300, -61, 108, -519, 267, 77, -356, 550, -237, -120, 349, -435, 171, 644]
1782F44j064P87l04n34O77N9p86J068n60k46O31q00M98N1q64J103n10k89Q22n99
1802b16k61J140r48L60R9o44O47J93p64P97l59m39P55q65K80N07p88O14M20j278
1822g50Q77K78q48N42L53l93M36n09M5N23j046N57L69r26Q64k28l71P31p25k5
1842b46P27j014L77N68o11L81P7l33M80l15l29O69o76O0M70p81M88M87j249J027
1862B57j27j036J154m15m03Q98m78j06O10n39O03J54p49O32j87o76Q62o37k88
1881d71Q25r37N95K55o56L32J89o16O52r5m10N48o16M60M30o80L24Q1o73R02k24
1902B15n22P27o11p3P44o49k6M50m49K52K36o60M98m3n52J189p68j58P19o71L16
1923A64L73q99L41K73o98O68n85K41P5p9j22N55n32K29K51m34N83m02k59O48l66
$$ y = [644, -420, 367, 63, -471, 206, 265, -521, 547, -13, -259, 372, -428, 70, 121, -743, 360, -150, -439, 383, -216, -477, 663, -285, 75, 174, -470, 177, 370, -394, 403, 44, -395, 360, -505, -225, 282, -506, 108, 528, -750, 127, 405, -443, 99, 452, 59, 495, -14, 31, 554, -492, 65, 434, -492, 372, 144, -227, 504, -221, -246, 481, -533, -156, 412, -199, 182, 259, -74, 406, 91, -238, 431, -245, -185, 285, -496, -8, 479, -770, 257, 130, -906, 248, -167, -570, 328, -150, -256, 354, -185, 418, 572, -177, 455, 268, -408, 454, -183, -471, 354, -583, 12, 267, -389, -57, 132, -484, 168, 73, -337, 211, -405, 55, 485, -195, 129, 210, -463, 439, 215, -307, 420, -191, -264, 480, -169, -195, 255, -194, 58, 294, -366, 132, 89, -463, 726, -42, -200, 519, -152, 164, 537, -362, -21, 252, -446, 222, -363, -122, -47, -126, -248, 307, -225, 4, 255, -179, 404, 2, -257, 391, 25]
1944B5m89P97n81L78M25r04M09J59r45J110l63l90Q48n25j23M50n69M11N7m81
1964c01L31M08o08N61n15j69O69l97j95K61m47K73M53o49N32P8o01M21j68q1O65
1985E21j068N13M64p74L79J10l60L13L7l94P15m97r3K91n22J57O15n86O53k59
2005B15o23J019n98l07Q46o26P5K73p39O30R5q73O74m8j59O85p87R8N99r60M76
2026c5N09q62M19L68n88L84n5l19O13n56j31O36o34K93J22o94O99J5p15Q42m35
2047a24O4O04q13K9P94n34k7K00m47L19K58q22O58p1m26N57q32N23N52r67M36
2068f9J82k82L58j26l11M60l26j5M09m01NL70n37L54n20K00N52k38l23P23q58
2089c93J72P12q68N40J45p90O12l70k1M06j45j55L98l38L9K75m63K57K32o30M49
$$ y = [25, -464, 333, -248, 130, 555, -349, 60, 219, -726, 384, 21, -369, 479, -46, -169, 281, -288, 123, 180, -301, 30, 438, -170, 391, -124, -293, 376, -21, -216, 45, -402, -129, 324, -325, 207, 285, -316, 105, -63, -144, 521, -547, -34, 430, -344, 35, 145, -215, 98, 135, -259, 456, -41, -134, 157, -365, -208, 407, -179, 474, 215, -408, 611, 13, -294, 552, -74, 1, 274, -465, 165, 260, -613, 61, 13, -146, 539, -248, -150, 449, -511, -35, 474, -388, 31, 399, -189, 195, 140, -179, 434, -122, -253, 383, -251, 42, 164, -530, 169, 184, -531, 311, -124, -60, 544, -269, -240, 554, 20, -7, 193, -254, 65, 323, -499, 159, 88, -338, 219, -613, -90, 462, -505, -69, 113, -169, 189, 63, -248, 212, -114, -129, 280, -121, -116, 254, -283, 71, -449, -249, 303, 65, -258, 465, -393, -221, 491, -377, 163, 308, -482, 130, -240, -261, 145, 0, -155, 243, -95, -56, 219, -244, 13, 245, -385, 64]
2110F4M7p12P00kl19K72j18k7L37l64K66O3k60M00r1o32O31n57J32K87o84L93
2132a74N11p68N67O2l59N30n49O4N00n55L13J82n84K36K56o41O25k03l12M25j54
2153b8j61L47m74M16K20o92J64N09m41L91j28j44M32n00k15O72o26N12J26o99
2173c19N27j77l47M77m38l5N47l82j17L75j31oK56p75Q47m27J76L54p87J80N84
2194C82o32J17L05l27k8K31m51M39j26q7L11j13l98O88m95P9M61p83O41k83J6
2215e3N42m49k95L10k82n2L97n07M03K69n81N39k29k11M75l10l20M98k94L29K59
2236D38p07L95m6l48N06m27n0M08k24j19N77n47K66J78o48O07k56N0K34m45K51
2257I3K50p28K70N25n33M21j50k34K5jj25K56k6o2K60m99K48J76l10J70j10j18
$$ y = [64, 111, -601, 99, 97, -222, 50, -68, -95, 242, -122, 144, 207, -53, 347, 256, -376, 255, -302, -170, 117, -567, -174, 337, -431, 136, 198, -161, 369, -180, -116, 384, -171, 142, 324, -260, -24, 232, -409, 216, 13, -299, 126, -28, -189, 158, -316, 100, 320, -372, -208, 301, -140, 251, 123, -21, 411, -89, -304, 368, -258, 254, 380, -319, 208, 31, -316, 161, -277, -312, 235, -147, -264, 111, -20, -26, 230, -545, 302, -125, 51, 405, -382, -202, 382, -250, -133, 172, -155, -183, 48, -403, 36, -90, -177, 134, 21, -377, 311, -184, -105, 356, -427, 214, -69, -53, 489, 40, -255, 55, -227, -279, 118, -389, 14, 283, -298, 241, 12, -199, 276, -34, -354, 144, -150, 179, 438, -269, 126, 80, -268, 238, -189, -239, 169, -55, -174, 403, -144, 122, 300, -348, 259, 3, 53, 287, -158, 93, 343, -385, -115, 410, -123, 298, 148, -86, -61, -62, -187, 69, 43, -19, 241, -258, -10, 166, -144, 26, -84, -202]
2279b02K90J13n95N91k88J06J49l93M27n8m37L34Q7m32M39l81J42L21k34M1L42
2300C62p00M87j79k68N30j46m36N80k76m7K20l93K31O9l19L82J2n73P71k39k22
2321a54M84n33J36J74m96M27j70L4L19j37j23L92m72k22N21j68K3Q3n6J44J74
2342C80l17N9j93j17L30l14p9M10j56k61N49m88J30M7j04K14l31K97L11n56M22
2363B33J01m32J49K10k62K73k88l50P00l60r4J92l70L99k5k93L24J0m20M15m4
2384F8k26K75l5mKm66M75m7m11L90J91o32N60j25j78L51k44M6J56j04K30m7o28
2407d03Q14l84k17N07o00J27M29m67J0M04k38L2J51n74O35l82j98O04k74L1J21
2428A28k85k4M64l39N9J14j17O2M5oK91n43K32J4k08M17k56l8l3N6J35mj1j22
$$ y = [-202, 88, 201, -394, 197, -91, 15, 164, -229, 198, 140, -297, 37, 124, -308, 131, -250, -108, 213, -21, 20, 362, -338, 149, -30, -298, 232, 86, -350, 230, -46, -93, 127, -266, -35, 34, -285, 97, 109, -464, 307, 68, -154, 330, -203, -67, 107, -389, 38, -132, -98, 221, 84, -39, 353, -119, -341, 180, 12, 35, 118, 62, 206, 380, 63, 122, -71, -188, 142, -172, -251, 159, 3, -258, 291, -197, -67, -20, -124, 90, -241, 56, 367, -189, 233, 334, -98, 51, 261, -1, 272, -16, -366, 334, -26, -120, 72, -298, 101, 76, -217, 107, 117, -303, 112, 68, -158, 117, 82, 78, 80, -386, 89, 42, -369, 21, 212, -420, 140, 15, -163, 188, -56, -10, 146, 42, 272, 225, -403, 411, 27, -190, 317, -283, -156, 273, -194, -184, 220, -18, 14, 165, -409, 226, -156, -354, 250, -24, 7, 128, -157, -181, 283, -56, 3, 117, 0, 62, 107, 101, 392, -151, 81, 95, -113, 304, 48, 10, -23, 33, 168, 164, 153, 31]
2452C1L96n92N6K78l10R5J23k39K99j57k09L81m67j5L25k16qK85j11J65p3k60
2474b23M81k73r7N22m03J67Qm05K73l3k53K95J36k97J70k05J13J31l38K29N3j2
2496C9j01r8L2M64n14r8P23o06J86R9m44K46R0j67M18m10p6L67l73L92Ko40M64
2519eL83m74M4r8j6L94k54k35N28k00j23M09n04J59P0k25L42j49j11R2j86J75
2541A6R6k94J47M4k07q7M71m21N44P4m80J53j84K30n7k48J12L63o42L77M5j12
2563f0K82l17r7L17N9m0l8m1k8Q1j68J74l06P8J69L1k23K97m11M41k80m6K35J4
2587A23j48J02M0n6Nk80L82p5j51J33m9l66O94k12o63O12J21r9l3k51K3N62o23
2610b09N46m86o0K56M6k11K48k12RK29k76K35j09j63L0J31k68M40j70l28L52k2
$$ y = [31, 427, -165, -109, 169, -141, -46, 77, -162, 137, -20, -229, 152, -315, -330, -5, -221, -229, 56, -55, 110, 37, -223, 258, -15, -112, 410, 7, 174, 182, -223, 50, 17, -236, 59, 195, -102, 68, -137, -24, 107, -231, -2, 51, 39, -62, -160, -128, 336, -178, -276, 447, -159, 27, 126, -318, -72, 18, -149, 269, -141, -217, 150, -223, 169, 171, -469, -5, 378, -96, -52, -150, -166, 228, -26, -261, 267, 67, -56, 353, -151, 8, 78, -147, 195, 46, -65, 27, -159, 16, 112, -182, -35, 9, -198, -285, 186, -235, 309, 383, -97, 56, -128, 102, 45, -203, -91, 272, -370, 7, 52, -60, 222, -95, -192, 125, 184, 144, 106, 65, 37, 118, -50, 124, -182, -104, 65, 96, -127, 170, -241, 200, -80, -126, 109, 123, -25, 77, 117, 61, 66, -214, 168, 93, -58, 75, 26, -340, 354, 142, -521, 91, 212, 113, 80, -171, -148, 414, -209, 337, -149, -209, 47, 93, -118, 130, -82, -73, 156, -120, 115, 6, -157, -127, 4, -264, 176, 6, -322, 30, 8]
2632Hj53L1J14PP4J28j21j76J12J07j1k40N57j82k13K31k59L1l64K0M32j26o9
2655f2J72l47J27L12k86J99J15k62K59m45l8J61J14j07n7K2j82M33m26L84K7k09
2677i6J14J23j55P1Pk99L84m27J88L19m99L80N0j68l3Q3p0j05k0n8L74m06N58
2700C15k97k79L34j98K00q4J38l61K9L26o0J04j59k69J62R4J16p8K9m27L95k12
2722a82K4J35J68rl34J38J22j07J48Q9m84O78k52k15q9o8K2L70k51R9k13j61L78
2745FJ17q0jk2l85O10j0o2m2N7j42k39J48L26k31r1Q1n7N0K63n52K44L03l59P2
2770DK40k84J83q5j57L15n66J8N03m08M60k55n8M90l28k74m2J90m7K69l07K20
2792H1Q7k98J12J97k33L11k75J19K30m27m7J54l92P03k98k62M82l65J67J0m0j46
$$ y = [8, -145, -114, 0, 7, 81, 209, 88, -88, 24, 131, 120, -120, 437, 255, 42, 273, 14, 45, -319, -299, 133, 7, -62, 110, -237, -110, 202, -84, 115, 230, -32, 227, -218, -256, -95, 19, -88, -145, -123, -305, 128, -298, 86, 113, -96, 18, 141, -14, 57, 64, -235, 149, -278, -90, 229, -270, 110, 160, -8, -41, 42, -28, -133, -153, -211, 163, -243, 315, 18, -261, 73, -125, 75, -9, 129, -232, -203, 123, 63, 167, 8, -261, -99, -5, 111, 33, 62, -365, 30, -182, -158, -23, 145, 136, -198, -60, 62, -45, 103, 192, -292, 386, 134, -81, -170, -238, -216, 154, -97, 2, -211, -372, 6, 123, 43, 42, 20, -365, 245, 235, 173, 131, 188, 46, -193, -45, 281, 50, -41, 40, -17, 33, 296, -256, -12, 291, -68, 4, 244, -40, 143, 58, -99, 216, -350, -332, 171, -237, 223, -32, -90, 400, 72, -202, -244, -54, -101, 168, -139, 81, 168, -130, -18, 179, -54, 257, -18, 101, 331, -96, -143, 11, -381, 322, 24, -238, 244, -121, 46, 56, 16, -130]
2814a30K20k01J77J83l41j13K10k84K13l8K04k79j03J80K95m41M2K86k26J45k49
2835b50L54K54o30L23j25k92L16j00m6K28O8j90L92m62m8J37J20r1L08n49K20
2856f3M7k53L84k61P9K42j62J02l06K93ON1l14K87J09n44J13M54k36k7j9J54l0
2879A06r9L6j54n2J98q3j42O0J3J8M9l9K36L5k91L36o7l72L05J34l00p7J01o2
2903a11J51k51K09j92K0L37m5Pk37J75k8j74J46j45Q3JK1J31k70L22j14k52O17
2926D01k56j90J55k83N0k4Q8Q9N8r6j21K4j39K56k53K62j81L27j89l0o2K38K31
2949C55k62J27k08j80M06l64R9J95l64J46J17k58J49Ll01M75m28K58J91k5mR2
2971B19k53K1j35j19M91j99k22K33k24J12J53l18J19R6K50j46j00k2lp1O3K93
$$ y = [-130, 90, -111, 66, 249, -92, -205, 5, -279, -66, -104, 100, -179, -282, -102, 193, -248, -206, 80, -146, -1, -250, 104, 358, -272, 51, -74, -366, -50, -150, -196, 32, 100, -90, 302, -160, -208, -71, 49, -42, 266, -283, -63, -16, -269, 115, -146, -67, 175, 13, 115, -191, 102, 108, 159, -155, 132, 241, -303, -190, 264, 28, 1, -18, 136, 106, 7, 43, -111, -163, 35, -48, -190, -130, -117, -99, -50, -89, 147, 182, -109, 227, 160, -212, 93, 227, -73, -150, -49, -111, 40, -211, -2, -194, -174, 163, 118, 125, -112, 63, 35, -139, 7, -138, -55, -54, -33, 98, -172, 150, 36, -216, 401, 145, -45, 110, -173, -123, -147, -59, 30, 88, -8, -129, -105, -244, 12, -241, 21, -160, 167, -22, -52, -114, 124, 355, 93, 220, 12, -168, 238, -126, -27, 168, -196, -50, 67, -191, -42, -39, -340, 135, -293, -35, 156, 131, 127, 219, -34, -13, -148, -267, 224, 25, -197, 36, -188, -76, 77, -241, -122, -26, 224, 78, -22, -44, -47, -118, -55, 238]
2993B38k11p2J40R5l6N5k69J3K76m94J85l59J47K66Q0k7n6j18M3J31k09L31j05
$$ y = [238, 27, -45, 95, 190, 154, 209, -60, -47, 229, -265, -80, -439, -292, -26, 54, 27, -29, -147, -104, 27, -182, 149, 44]
$$ [...]
8191G9
##END NTUPLES=NMR FID
##END=
