##TITLE=1H_22-2025
 200.13MHz, CDCl3,
 8 sc
 
 3.2.2025
##JCAMPDX= 6.0         $$ Bruker NMR JCAMP-DX V2.0
##DATA TYPE= NMR FID
##DATA CLASS= NTUPLES
##ORIGIN= UXNMR, Bruker Analytische Messtechnik GmbH
##OWNER= pz
$$ XWIN-NMR		Version 3.5
$$ Mon Feb  3 14:13:59 2025 Russian Standard Time (UT+4h)  she@DPX200
##.OBSERVE FREQUENCY= 200.1313
##.OBSERVE NUCLEUS= ^1H
##.DELAY= (6, 6)
##.ACQUISITION MODE= SIMULTANEOUS
##.ACQUISITION SCHEME= undefined
##.AVERAGES= 8
##.DIGITISER RES= 18
##SPECTROMETER/DATA SYSTEM= spect
##.PULSE SEQUENCE= zg30
##.SOLVENT NAME= CDCl3
##.SHIFT REFERENCE= (INTERNAL, CDCl3, 0, 14.3821)
##AUDIT TRAIL= $$ (NUMBER, WHEN, WHO, WHERE, WHAT)
$$ ##TITLE= Audit trail, XWIN-NMR		Version 3.5
$$ ##JCAMPDX= 5.01
$$ ##ORIGIN= Bruker BioSpin GmbH
$$ ##OWNER= she
$$ F:/spectra/data/she/nmr/H-C/1/audita.txt
$$ ##AUDIT TRAIL=  $$ (NUMBER, WHEN, WHO, WHERE, WHAT)
(   1,<2025-02-03 14:12:51.64 +0400>,<she>,<DPX200>,
      <created by zg, POWCHK disabled, PULCHK disabled
       configuration hash MD5:
       00 E9 B6 7A A2 85 ED C7 34 08 36 98 17 FE 4E 26
       data hash MD5: 16K
       22 8F 81 C9 2D F0 9B E2 21 C7 59 09 AE 55 D1 D0>)
$$ ##END=
$$ 
$$ hash MD5
$$ ED 66 9C 7B A1 4D 8F 10 9A 4E 01 C5 5B 96 01 3E
##$RELAX= 
##$RELAX= 
##$RELAX= 
##$RELAX= 
##$RELAX= 
##$RELAX= 
$$ Bruker specific parameters
$$ --------------------------
##$DU= <F:/spectra>
##$EXPNO= 1
##$NAME= <H-C>
##$PROCNO= 1
##$TYPE= <nmr>
##$USER= <she>
##$AMP= (0..31)
100 100 100 100 100 100 100 100 100 100 100 100 100 100 100 100 100 100 
100 100 100 100 100 100 100 100 100 100 100 100 100 100 
##$AQSEQ= 0
##$AQ_mod= 1
##$AUNM= <au_zg>
##$AUTOPOS= <>
##$BF1= 200.13
##$BF2= 200.13
##$BF3= 200.13
##$BF4= 200.13
##$BF5= 200.13
##$BF6= 200.13
##$BF7= 200.13
##$BF8= 200.13
##$BYTORDA= 1
##$CFDGTYP= 0
##$CFRGTYP= 5
##$CHEMSTR= <none>
##$CNST= (0..31)
1 1 145 1 1 1 1 1 1 1 1 1 1 1 1 1 1 1 1 1 1 1 1 1 1 1 1 1 1 1 1 1 
##$CPDPRG= <>
##$CPDPRG1= <>
##$CPDPRG2= <>
##$CPDPRG3= <>
##$CPDPRG4= <mlev>
##$CPDPRG5= <mlev>
##$CPDPRG6= <mlev>
##$CPDPRG7= <mlev>
##$CPDPRG8= <mlev>
##$CPDPRGB= <>
##$CPDPRGT= <>
##$D= (0..31)
0 0.7 0 0 0 0 0 0 0 0 0 0.03 0 0 0 0 0 0 0 0 0 0 0 0 0 0 0 0 0 0 0 0 
##$DATE= 1738577571
##$DBL= (0..7)
120 120 120 120 120 120 120 120 
##$DBP= (0..7)
150 150 150 150 150 150 150 150 
##$DBP07= 0
##$DBPNAM0= <>
##$DBPNAM1= <>
##$DBPNAM2= <>
##$DBPNAM3= <>
##$DBPNAM4= <>
##$DBPNAM5= <>
##$DBPNAM6= <>
##$DBPNAM7= <>
##$DBPOAL= (0..7)
0.5 0.5 0.5 0.5 0.5 0.5 0.5 0.5 
##$DBPOFFS= (0..7)
0 0 0 0 0 0 0 0 
##$DE= 6
##$DECBNUC= <off>
##$DECIM= 32
##$DECNUC= <off>
##$DECSTAT= 4
##$DIGMOD= 1
##$DIGTYP= 9
##$DL= (0..7)
0 120 120 120 120 120 120 120 
##$DP= (0..7)
150 150 150 150 150 150 150 150 
##$DP07= 0
##$DPNAME0= <>
##$DPNAME1= <>
##$DPNAME2= <>
##$DPNAME3= <>
##$DPNAME4= <>
##$DPNAME5= <>
##$DPNAME6= <>
##$DPNAME7= <>
##$DPOAL= (0..7)
0.5 0.5 0.5 0.5 0.5 0.5 0.5 0.5 
##$DPOFFS= (0..7)
0 0 0 0 0 0 0 0 
##$DQDMODE= 0
##$DR= 18
##$DS= 0
##$DSLIST= <SSSSSSSSSSSSSSS>
$$ [...]
##$SUBNAM0= <"">
##$SUBNAM1= <"">
##$SUBNAM2= <"">
##$SUBNAM3= <"">
##$SUBNAM4= <"">
##$SUBNAM5= <"">
##$SUBNAM6= <"">
##$SUBNAM7= <"">
##$SUBNAM8= <"">
##$SUBNAM9= <"">
##$SW= 18.0517328524113
##$SWIBOX= (0..15)
0 0 2 0 0 0 0 0 0 0 0 0 0 0 0 0 
##$SW_h= 3612.71676300578
##$TD= 16384
##$TD0= 1
##$TE= 0
##$TE2= 300
##$TE3= 300
##$TEG= 300
##$TL= (0..7)
0 120 120 120 120 120 120 120 
##$TP= (0..7)
150 150 150 150 150 150 150 150 
##$TP07= 0
##$TPNAME0= <>
##$TPNAME1= <>
##$TPNAME2= <>
##$TPNAME3= <>
##$TPNAME4= <>
##$TPNAME5= <>
##$TPNAME6= <>
##$TPNAME7= <>
##$TPOAL= (0..7)
0.5 0.5 0.5 0.5 0.5 0.5 0.5 0.5 
##$TPOFFS= (0..7)
0 0 0 0 0 0 0 0 
##$TUNHIN= 0
##$TUNHOUT= 0
##$TUNXOUT= 0
##$USERA1= <user>
##$USERA2= <user>
##$USERA3= <user>
##$USERA4= <user>
##$USERA5= <user>
##$V9= 5
##$VALIST= <valist>
##$VCLIST= <CCCCCCCCCCCCCCC>
##$VD= 0
##$VDLIST= <DDDDDDDDDDDDDDD>
##$VPLIST= <PPPPPPPPPPPPPPP>
##$VTLIST= <TTTTTTTTTTTTTTT>
##$WBST= 1024
##$WBSW= 4
##$XGAIN= (0..3)
0 0 0 0 
##$XL= 0
##$YL= 0
##$YMAX_a= 189105
##$YMIN_a= -236698
##$ZGOPTNS= <>
##$ZL1= 120
##$ZL2= 120
##$ZL3= 120
##$ZL4= 120
##$ABSF1= 10
##$ABSF2= 0
##$ABSG= 5
##$ABSL= 3
##$ALPHA= 0
##$AQORDER= 0
##$ASSFAC= 0
##$ASSFACI= 0
##$ASSFACX= 0
##$ASSWID= 0
##$AUNMP= <proc_1d>
##$AZFE= 0.1
##$AZFW= 0.1
##$BCFW= 1
##$BC_mod= 2
##$BYTORDP= 1
##$COROFFS= 0
##$CY= -3
##$DATMOD= 1
##$DC= 2
##$DFILT= <>
##$DTYPP= 0
##$F1P= 0
##$F2P= 0
##$FCOR= 0.5
##$FTSIZE= 0
##$FT_mod= 4
##$GAMMA= 1
##$GB= 0.15
##$INTBC= 1
##$INTSCL= 1
##$ISEN= 128
##$LB= 0.25
##$LEV0= 0
##$LPBIN= 0
##$MAXI= 10000
##$MC2= 0
##$MEAN= 0
##$ME_mod= 0
##$MI= 1.114404
##$NCOEF= 0
##$NC_proc= 0
##$NLEV= 6
##$NOISF1= 3.799351
##$NOISF2= 2.8
##$NSP= 1
##$NTH_PI= 0
##$NZP= 0
##$OFFSET= 14.38212
##$PC= 1
##$PHC0= 251.8526
##$PHC1= 11.99222
##$PH_mod= 1
##$PKNL= yes
##$PPARMOD= 0
##$PSCAL= 0
##$PSIGN= 0
##$REVERSE= no
##$SF= 200.129724274929
##$SI= 16384
##$SIGF1= 3
##$SIGF2= 2
##$SINO= 400
##$SIOLD= 16384
##$SREGLST= <1H.CDCl3>
##$SSB= 0
##$STSI= 0
##$STSR= 0
##$SW_p= 3205.1282051282
##$SYMM= 0
##$S_DEV= 0
##$TDeff= 0
##$TDoff= 0
##$TI= <>
##$TILT= no
##$TM1= 0
##$TM2= 0
##$TOPLEV= 0
##$USERP1= <user>
##$USERP2= <user>
##$USERP3= <user>
##$USERP4= <user>
##$USERP5= <user>
##$WDW= 1
##$XDIM= 8192
##$YMAX_p= 0
##$YMIN_p= 0
$$ End of Bruker specific parameters
$$ ---------------------------------
##NTUPLES= NMR FID
##VAR_NAME=  TIME,          FID/REAL,        FID/IMAG
##SYMBOL=    X,             R,               I
##VAR_TYPE=  INDEPENDENT,   DEPENDENT,       DEPENDENT
##VAR_FORM=  AFFN,          ASDF,            ASDF
##VAR_DIM=   8192,          8192,            8192
##UNITS=     SECONDS,       ARBITRARY UNITS, ARBITRARY UNITS
##FACTOR=    0.0002768,     1,               1
##FIRST=     0,             0,               0
##LAST=      2.2672688,     0,               0
##MIN=       0,             -236698,         0
##MAX=       2.2672688,     189105,          0
$$ Real data points
##PAGE= N=1
##DATA TABLE= (X++(R..R)), XYDATA
$$ [...]
1829A06q95J44J144j275K99J50p02J107L63n03P74q78k74J696o94m7M26j430O72
$$ 106 -789 -645 499 -776 -477 -327 -1029 78 441 -62 712 -166 -440 1256 562 515 941 -489 183
1848A83P74j457Q86n13j401J444k01o6P61j429L89R06n18Q66r8j242Q83L90m55
$$ 183 957 -500 386 -127 -1528 -84 -285 -351 410 -1019 -630 276 -242 624 526 -716 167 557 102
1867A02J219j272o28J090q37M39N46j752M09K56k88J074l28j022J063m15K91J321
$$ 102 1321 49 -579 511 -326 113 659 -1093 -684 -428 -716 358 30 -992 71 -344 -53 1268
1885A268j029k48M75o61J340n8j364M46n40k55J419q57q22N65j156R61R71r19
$$ 1268 239 -9 466 -195 1145 1087 -277 169 -371 -626 793 -64 -886 -321 -1477 -516 455 -464
1903d64M33m2p48J655J83l11K29j278L27J499j042%N7j616J132N92j001N83j117
$$ -464 -31 -73 -821 834 1017 706 935 -343 -16 1483 441 441 498 -1118 14 606 -395 188 -929
1922i29m65J429k49P0M49j496O48R80l23Q32o15j127J255k96J22R15j650j98N70
$$ -929 -1394 35 -214 -144 305 -1191 -543 437 114 946 331 -796 459 163 285 1200 -450 -648 -78
1941g8l68Q53J18j686P03J4J9J632j105m19P01m76O84P21j387J70L3o24J606n09
$$ -78 -446 407 525 -1161 -458 -444 -425 1207 102 -317 384 -92 592 1313 -74 96 129 -495 1111 602
1961F02j149L80p25M35J144j090l14M10j014J484O57j274L43n57k7J591k23o19
$$ 602 -547 -167 -892 -457 687 -403 -717 -307 -1321 163 820 -454 -111 -668 -695 896 673 54
1979E4L34j331R40R56r51M04n29j257J541km34N02j293L0J438l61L86M5j535J143
$$ 54 388 -943 -3 953 2 406 -123 -1380 161 159 -275 227 -1066 -1036 402 41 427 472 -1063 80
1999H0N46k15R19j272p09J250l36L62L33j666M8N14j84O46k26j532J112k68M79
$$ 80 626 411 1330 58 -651 599 263 625 958 -708 -660 -146 -330 316 90 -1442 -330 -598 -119
2018a19J005j232k30N58k83J131R5j504P72k29k96J284o98q96N87p94M82J115
$$ -119 886 -346 -576 -18 -301 830 925 -579 193 -36 -332 952 254 -642 -55 -849 -367 748
2036G48j126J09K5p26J645J44q13P66j183K75J482q05l8q2j418J262M21r83N65
$$ 748 -378 -269 -244 -970 675 819 6 772 -411 -136 1346 541 503 421 -997 265 686 -297 268
2055B68r66n38J429l15l24M34j188N75R51m33Q44o71q34J231J8j63P50j445l16
$$ 268 -698 -1236 193 -122 -446 -12 -1200 -625 326 -107 737 66 -768 463 481 318 1068 -377 -693
2074f93J044o31N53J70j291L28N12l01J079o40r79J147m74O17P48j468K31J63
$$ -693 351 -280 273 443 -848 -520 -8 -309 770 130 -849 298 -176 441 1189 -279 -48 115
2092A15l39J279n74r81N72n85m5J416j222m80P21q11P83P35j057P14m14k56J355
$$ 115 -224 1055 481 -500 72 -513 -558 858 -364 -844 -123 -934 -151 584 -473 241 -173 -429 926
2111I26m92j95K92j070M91Q14j113K89L4j134J136M31q49L87m43k8R37l89K20
$$ 926 434 239 531 -539 -48 766 -347 -58 -24 -1158 -22 409 -440 -53 -496 -524 413 24 244
2130B44K37q83N86L71k76N66q22o21J203l81j98N46j274J64R22p55N04R1j015
$$ 244 481 -402 184 555 279 845 23 -598 605 224 26 572 -702 -538 384 -371 133 224 -791
2149g91Q94j20J22M82q77K0P32r26P56K88j220Q74j95o09R73k93n80O47o74L25
$$ -791 103 -17 105 587 -290 -270 462 -464 292 580 -640 234 39 -570 403 110 -470 177 -497 -172
2169a72R01q27J5K27o83J258k59n60O01p36j58J040j003J85K92p16N82K93q18
$$ -172 729 -98 -83 144 -539 719 460 -100 501 -235 -393 647 -356 -171 121 -595 -13 280 -538
2188e38N21j98m07R04m90o9R25r86J11R62r06L73K68q61Q31j53n34J013q86k04
$$ -538 -17 -215 -622 282 -208 -277 648 -338 -227 735 -171 202 470 -391 440 287 -247 766 -120 -324
2208c24R55r67L20M26r28O30J32o97J007m56p93J050n63m6O65q38K65K67p17P58
$$ -324 631 -336 -16 410 -518 112 244 -453 554 98 -695 355 -208 -254 411 -427 -162 105 -612 146
2228A46K2p17P08k32m38J100q19R3O13p74L22N82j013P96J3o36P67n31j75O20
$$ 146 168 -549 159 -73 -511 589 -230 -137 476 -298 24 606 -407 389 402 -234 533 2 -173 447
2248D47o81J2R29j361O30M37r32N86J36j043R98k02m10P98n90o0P55q54M74J87
$$ 447 -234 -222 707 -654 -24 413 -519 67 203 -840 158 -44 -454 344 -246 -306 449 -405 69 256
2268B56o40N42o1n15J018q17j41Q19q21N57K11j073M79L65p30O69r3n51P19m97
$$ 256 -384 158 97 -418 600 -217 -358 461 -360 197 408 -665 -186 179 -551 118 25 -526 193 -304
2288c04K7Q43q77L26K31n22O97j72q10Q00k62n44J127o63m31P95o47K58O87q54
$$ -304 -277 566 -311 15 246 -276 421 249 -561 239 -23 -567 560 -103 -534 261 -386 -128 559 -295
2308b95L81L58r46R83q5n67O27p11K11O29r76M06k37o89J017J38r32Q54n77k38
$$ -295 86 444 -502 481 396 -171 456 -255 -44 585 -391 15 -222 -911 106 244 -688 166 -411 -649
2328f49R22m26p1L65o47O01K85l82O43n02n88J023m02j22L64r91J61P23q89N29
$$ -649 273 -153 -224 141 -506 95 380 -2 641 139 -449 574 172 50 414 -577 -416 307 -582 -53
2348e3J60r00O06K24o43J098p36j76J012o71K49N52q81J42ol46Q96l94p72N60
$$ -53 107 -793 -187 37 -606 492 -244 -420 592 -79 170 722 -159 -17 -23 -369 527 133 -639 -79
2368g9l45J91J009j128K20M50p92O53L24q43Q34l60o2Q45o99k38M73r90L20M92
$$ -79 -424 -233 776 -352 -132 318 -474 179 503 -340 494 134 72 917 218 -20 453 -537 -217 275
2388B75q02K98l58n53J235k84k59N06m69J6R30n43L71J05r17Q55K66l70L61q04
$$ 275 -527 -229 -587 -1140 95 -189 -448 58 -411 -395 535 -8 363 468 -449 406 672 302 663 -141
2408a41j68N47j84j6L24j017L05M11k46O70l23p11P73O1q3N93q59j90P21n18L36
$$ -141 -309 238 54 38 362 -655 -350 61 -185 485 162 -549 224 285 202 795 -64 -254 467 -51 285
2429B85J59j245P24m29q3Q06l30n52P03o55K75P70q22K37K67o30J115Pq48N61
$$ 285 444 -801 -77 -506 -589 217 -113 -665 38 -617 -342 428 -394 -157 110 -520 595 602 -246 315
2449C15k20j13R63n75k41j69n07Q82J11q03K83k19l44R16j35l64M56q52O18O41
$$ 315 95 -18 945 370 129 -40 -547 335 446 -357 -74 -293 -637 279 144 -220 236 -616 2 643
2469F43m97K47p4r10J048n4n74N41r24k4Q32m03k42J83p52O21L81k85O30l72l84
$$ 643 146 393 319 -591 457 403 -171 370 -554 -578 254 -149 -391 -208 -960 -339 42 -243 387 15 -369
2490c69P19l50M04M68p88o2M74l41N41m69o91N69k07j60Q84r46k95M98l02P17
$$ -369 350 0 404 872 84 22 496 155 696 227 -464 105 -102 -262 622 -324 -619 -121 -423 294
2510B94J25o89M41k53P6Q89m91m49M57j003M50P01j186M41j09o14P18J49n98Q95
$$ 294 419 -270 171 -82 -6 883 392 -57 400 -603 -153 548 -638 -197 -306 -920 -202 -53 -651 244
2530B44p90j9J150q42K40K25o40Q46J98n94P20o76n94J024m84j16J81p96K86N17
$$ 244 -546 -565 585 -257 -17 208 -432 414 612 18 738 62 -532 492 8 -108 73 -723 -437 80
2550H0n04M75l3p18Q94q6p4M92o12K9K88k79M41L26j135N61J2k08L78m97m12O44
$$ 80 -424 51 18 -700 194 108 34 526 -86 -57 231 -48 393 719 -416 145 157 -51 327 -170 -582 62
2572F2m07J14N70p34J33L36m91P02j56n28R74m34r0N87p00k04L15m98N71J87m91
$$ 62 -345 -231 339 -395 -262 74 -417 285 129 -399 575 141 51 638 -62 -266 49 -449 122 309 -182
2593a82J88j30l30R31l46l43Q14q29J36Q88o54J25Mo06N89J29n60O40q99J30N75
$$ -182 6 -124 -454 477 131 -212 602 -227 -91 797 143 268 272 -334 255 384 -176 464 -435 -305 270
2614B70p34J43L28r71O81L13l24N08k92m75Q66k33O5M95r22K46M78o61P68k63
$$ 270 -464 -321 7 -964 -283 30 -294 214 -78 -553 313 80 145 640 -282 -36 442 -219 549 286
2634B86o84O54q3l09N59p56j98Q06o16N06J67p63L33J96p18R04m7o03O98q11N19
$$ 286 -398 256 173 -136 423 -333 -531 275 -341 165 332 -431 -98 98 -620 284 237 -366 332 -479 40
2655D0K77m65M3K92o23M49J16n90O12q1k68O78k96l2J89l55L51J74p09L24Mp34
$$ 40 317 -148 -105 187 -436 13 129 -461 151 70 -198 480 184 152 341 -14 337 511 -198 126 130 -604
2677f04Q41k98k16M87n56K70K20n77M36J41o19O15k07l47N62n94K84N76n39K17
$$ -604 237 -61 -277 210 -346 -76 144 -433 3 144 -475 140 -67 -414 148 -446 -162 414 -125 92
2697I2L53p87M77J89l56L60j44j42L86m36l6N19o97K12L48j015J022m0n98O14
$$ 92 445 -342 135 324 -32 328 184 42 428 -8 -44 475 -222 -10 338 -677 345 305 -293 321
2717C21l40j33M92n49r5M97n80M14J87n60L45n0m50P10j56l79P83p31J6N52m88
$$ 321 -19 -152 340 -209 -304 193 -387 27 214 -346 -1 -51 -501 209 53 -326 457 -274 -258 294 -194
2738a94L58K00o62O25k46n96P33k80n5L01n07K59K39o19M39M13p35L54K57n93
$$ -194 164 364 -298 327 81 -515 218 -62 -117 184 -323 -64 175 -444 -5 408 -327 27 284 -309
2758c09P17o28p4N66j63K20r1n14M55q6j36L58j70m27P78n81k14P37o72nM86o58
$$ -309 408 -220 -294 272 109 329 238 -276 179 93 -43 315 145 -282 496 -85 -299 438 -234 -239 247 -411
2780d11N33J89q73O44r3l91Q36m46LL19n70M95K13r18M51J93o96R50l89l01N33
$$ -411 122 311 -562 82 -11 -402 434 -12 -9 310 -260 235 448 -470 -19 174 -522 428 39 -262 271
2801B71l85J30N75o80J66R5n06N37N1m89M95k60l29O69l47j29K88o40L39J30n13
$$ 271 -114 16 591 -89 77 172 -334 203 254 -235 260 0 -329 340 -7 -136 152 -488 -149 -19 -532
2822e32N07o3m76N67p3l19O52n28K04O12m91K25j04n99N67j0j63N47q08J20N01
$$ -532 -25 -88 -564 3 -70 -389 263 -265 -61 551 60 285 181 -418 149 139 -24 523 -285 -165 336
2843C36n63m1P42p78L45K72o26O41k40m61O81m67J09L51m57j67L69m09M08M7o74
$$ 336 -227 -268 474 -304 41 313 -313 328 88 -373 308 -159 -50 301 -156 -323 46 -363 45 92 -582
2864e82R12o34j01P42l26k96P56r36O26L99o49L61j32l72N17k58LJ69l73M7J99
$$ -582 330 -304 -405 337 11 -285 471 -465 161 560 -89 272 140 -232 285 27 30 199 -174 -127 72
2885G2k29q0K01n78P87l5l96N83n77k8L56j2K18J13p58J70N61m95O15l73m59L46
$$ 72 -157 -237 -36 -614 173 138 -258 325 -252 -280 76 64 282 395 -363 -193 368 -127 488 115 -344 2
2907Bn1m9L76o54J93N01l61L11R2n04L36J27l93O62l90l59M17m84K48M03o18J24
$$ 2 -49 -98 278 -376 -183 318 -43 268 360 -144 192 319 -74 588 198 -161 256 -228 20 423 -195 -71
2929g1Q1m75N51q1k67L54k73m6M00k53NL16o58O13L7m01K51k19j77O02l59M1o9
$$ -71 10 -465 86 5 -262 92 -181 -227 173 -80 -75 241 -417 196 233 -168 83 -136 -313 289 -70 -29 -98
2952i8l42K03L42k25L51k19n06P35j02j71O41o29j16P19n99L43J15p84M62J25
$$ -98 -440 -237 105 -120 231 12 -494 241 139 -32 609 -20 -136 583 -16 327 442 -342 120 245
2972B45l51N38p03l71N39q2l1L51p46L46L94m33O06k3o41N82j86j69P17p03j78
$$ 245 -106 432 -271 -642 -103 -185 -216 135 -611 -265 129 -304 302 279 -362 220 34 -135 582 -121 -299
2993b99O54n95J83M36q34N00kl82P24m92j72M97j09J79K95o40K15K70o73N98j18
$$ -299 355 -240 -57 379 -455 45 43 -339 385 -107 -279 218 109 288 583 -57 158 428 -245 353 235
3014B35j82L13o21j14P55n82L25k3p61O33J81l17K74k24j26M98j67NP0m45L15
$$ 235 53 366 -255 -369 386 -196 129 106 -655 -22 159 -158 116 -108 -234 264 97 102 172 -273 42
3035D2R7k79J00K98r95Q06k75k44Q15p30N7O06o20O82l9r78Q48J38l94N40q7o10
$$ 42 139 -140 -40 258 -737 69 -206 -450 365 -365 -308 298 -322 360 321 -657 191 329 -65 475 388 -222
3057b22O70n30N2N10o54P7L97o84L37K11n40L33j04M4L11l50kL43m24M66K24o22
$$ -222 448 -82 -30 480 -174 -97 300 -384 -47 164 -376 -43 -147 -103 208 -142 -144 199 -225 241 465 -157
3079a57K13J91m50L26j11j91K43k55K5K52l22K34J3l73N79M9l92M20j72j21M70
$$ -157 56 247 -203 123 12 -179 64 -191 -166 86 -236 -2 11 -362 217 266 -126 294 122 1 471
3100D71m41J54J86n01L07O3m93L62l00j59M62n08K43M21q15N23k8l30P73O2o73
$$ 471 30 184 370 -131 176 239 -254 108 -192 -351 111 -397 -154 267 -548 -25 -53 -383 390 452 -221
3121b21N48k75LL04j13N6j40l41L87L13q70M11o2m01N94j73k76M63m18N4N14m88
$$ -221 327 52 55 359 246 302 162 -179 208 521 -349 62 0 -401 193 20 -256 207 -211 -157 357 -131
3143a31J95J08m00L91K7n01O71m73l59M72k46m7J09l94M72K65l47J39J63j65M77
$$ -131 64 172 -228 163 190 -311 360 -113 -472 0 -246 -293 -184 -578 -106 159 -188 -49 114 -51 426
3164D26k16m08P25n22K43K83o30M11L5p81N51R9m52L33j82k43N79o03K65M01r02
$$ 426 210 -198 527 5 248 531 -99 312 347 -434 117 216 -236 97 -85 -328 251 -352 -87 314 -588
3185e88P55j98l69O76l72L0L08m58K46L09n67K29K1j81O4M8m01O90l81K3M88l85
$$ -588 167 -31 -400 276 -96 -66 242 -216 30 339 -228 1 22 -159 -95 -47 -448 242 -139 -116 372 -13
3207a3j05L62m45J13L13k20J75R4m76M11M1m35N23n32r4L33k06K16p5j43J58L40
$$ -13 -118 244 -201 -88 225 5 180 274 -202 209 250 -185 338 -194 -288 45 -161 55 -20 -163 -5 335
3229C35p35O67j81l22M03j85k4L49l08j0J94l13j34L41m25L28j79j34M22l17K13
$$ 335 -400 267 86 -236 167 -18 -42 307 -1 -11 183 -130 -264 77 -348 -20 -199 -333 89 -228 -15
3250a5K41l52L39N8m62J64J63j57L66j73j54K55l94Q8K74m51J84K78m15M25j46
$$ -15 226 -126 213 271 -191 -27 136 -21 345 172 18 273 -121 -33 241 -210 -26 252 -163 262 116
3271A16l74M29j1k68L07k64p5N91o39N34j6q35O90l28k1J99k36j4K84n43K95K58
$$ 116 -258 171 160 -108 199 -65 -140 451 -188 346 330 -505 185 -143 -164 35 -201 -215 69 -474 -179 79
3293G9p09N85o0j04M04k29k18N75l21M8L36p71L35K90l04O4J91l84J93k03jM61
$$ 79 -630 -45 -105 -209 195 -34 -252 323 2 50 386 -385 -50 240 -64 0 191 -193 0 -203 -204 257
3315B57o21n7O31n97L71J52k59K50m6k08N18l56k61L68l45K82K35n28NM27m98
$$ 257 -364 -421 210 -387 -16 136 -123 127 81 -127 391 35 -226 142 -203 79 314 -214 -209 218 -280
3336b80L13j67LM79m12n4M82l92m8K62l31K64J36m86M45l76r4K76j74q6J89k61
$$ -280 33 -134 -131 348 -64 -118 364 -28 -76 186 -145 119 255 -231 214 -162 -256 20 -154 -240 -51 -312
3358c12J87J49k78L86p4k07M42Lm50L09k5k44N45m70J66K19p19L38L18n16M69
$$ -312 -125 24 -254 132 58 -149 293 296 -154 155 130 -114 431 -39 127 346 -373 -35 283 -233 236
3379B36k49l22L79j36l25N17k27o0L61k75K65J59m46L91m83J00M51m67O9N6l03
$$ 236 -13 -335 44 -92 -417 100 -127 -187 174 -101 164 323 -123 268 -215 -115 336 -131 -62 -6 -309
3400c09L0M36n27J29K61m82N11k04l29P20m16J65L78p02L77J41k70L76N7n29N40
$$ -309 -279 157 -370 -241 20 -462 49 -155 -484 236 -180 -15 363 -339 38 179 -91 285 342 -187 353
3421C53m52n5K91l30K20J0l49K39K51l36J79J8j09M34k09l66O19q97M28K72l20
$$ 353 -99 -154 137 -193 27 37 -312 -73 178 -158 21 39 -70 364 155 -211 408 -489 -61 211 -109
3442a09Q5K50m86L25r9l13M59l83rK01O8K51K8p46N22J92j85J09j37l81O02j31
$$ -109 -24 226 -260 65 -34 -347 112 -271 -280 -79 -11 240 268 -478 44 236 51 160 23 -358 244 113
3464A13M4L23n96Q7L0k60L91R1p03O84l41J85K92m04JL24l75K18k0k34K98k02
$$ 113 157 480 -116 -29 1 -259 132 223 -480 204 -137 48 340 -64 -63 261 -114 104 84 -150 148 -54
3486e4K9J61Ok93K22l00j9M23m00J38L88m21J61K14m88N31m26j18L58l7J25p3
$$ -54 -25 136 142 -151 71 -229 -248 175 -225 -87 301 -120 41 255 -233 298 -128 -246 112 75 200 127
3508A27k93P1K97k46L27l62j59K27k5j1J33k44N4J08k88M31n9m50O07j96N6J98
$$ 127 -166 -95 202 -44 283 -79 -238 -11 -36 -47 86 -158 -104 4 -284 147 88 -362 245 49 105 303
3530C03j42j51J60m11L09O6p48L99K76k58L91l35j09O03l41J95k03j57K42J83
$$ 303 161 10 170 -241 68 134 -614 -215 61 -197 194 -141 -250 353 12 207 4 -153 89 272
3550B72l35K93j41k43M74l86M3R0l7m06L84l12L93ok59N9K87j39P0r2R8J82m93
$$ 272 -63 230 89 -154 320 -66 -23 67 30 -376 8 -304 89 83 -176 -117 170 31 101 9 107 289 -204
3573b04J51L23n07L17Ml31J30J14j97O1k19L37K04j96j60K28q9p7O48p40M88q
$$ -204 -53 270 -237 80 84 -247 -117 -3 -200 -139 -358 -21 183 -13 -173 55 -34 -111 537 -203 285 277
3595B77l70Q5Q3l3K83n79K7K99m12K30J51l15J28J3p2L27l64P3L30l56K37K96
$$ 277 -93 -8 75 42 325 -254 -227 72 -340 -110 41 -274 -146 -133 -205 122 -242 -169 161 -195 42 338
3617C38n43J02J63k86L05J04l27M46l38j56L88m95J85J79o2J89o1k6Q0Q0l43L63
$$ 338 -205 -103 60 -226 79 183 -144 302 -36 -192 196 -299 -114 65 3 192 131 105 185 265 -78 285
3639B85k73O6J16l65K71K33m65j29L63n09M26j92j8R1P4j59L55p9K36j57m01L33
$$ 285 12 78 194 -171 100 333 -132 -261 102 -407 19 -173 -191 -100 -26 -185 170 91 327 170 -231 102
3661A02P4l3L31o15l9K48j89J06M0k33J07J82n06N64j80j10J85kk2M94j22k65
$$ 102 176 143 474 -141 -180 68 -121 -15 25 -208 -101 81 -425 139 -41 -151 34 32 10 504 382 117
3683A17R1n2rJ37m39R0j7j06J43k02K28L6n8k00J41k08M97j39k60L65j27k42M40
$$ 117 208 156 147 284 -155 -65 -82 -188 -45 -247 -19 17 -41 -241 -100 -308 189 50 -210 155 28 -214 226
3706B26k99J75J39k87J55l8l25K65n8j54M71k21k80K47j91o9K52j61M23l7l91
$$ 226 -73 102 241 -46 109 71 -254 11 -47 -201 270 49 -231 16 -175 -244 8 -153 270 233 -158
3727a58L61J7k73J75L9k3J05l21J24M8j57J48j51j33J13K26j87L83m17o1K96j55
$$ -158 203 220 -53 122 161 138 243 -78 46 94 -63 85 -66 -199 -86 140 -47 336 -81 -142 154 -1
3749aL6P5j69J04P0j78l5lJ9Q4J28l70L04l71N2L58q0P3K7j96K01M4j36K11r9
$$ -1 35 110 -59 45 115 -63 -98 -101 -82 2 130 -240 64 -307 -255 103 23 96 123 -73 128 172 36 247 148
3774A48k09L20k04l8J01J9j25L6k73M38l13j2j9j0K0K47m7j89J75j36L99k41j19
$$ 148 -61 259 55 17 118 137 12 48 -225 213 -100 -112 -131 -141 -121 126 79 -110 65 -71 328 87 -32
3797c2J02J54k37j32J18j5K52k39m2Q6l02M77j28l03L04j57NR1J15q7L99n24L80
$$ -32 70 224 -13 -145 -27 -42 210 -29 -71 15 -287 190 62 -241 63 -94 -89 2 117 30 429 -95 285
3820B85l2k64L01k42m41N05o0k94J95j35N7N5mJ74Kk10J52K16l89K56m8J22m3
$$ 285 253 -11 290 48 -393 112 52 -242 -47 -182 -125 -70 -74 100 102 -108 44 260 -129 127 79 201 158
3843A58j88P0K30n59J03K3k0L57k48M3L0J4l07L79k85J3K87k41OO8O3J08Q5q4
$$ 158 -30 40 270 -289 -186 -163 -183 174 -74 -31 -1 13 -294 85 -200 -187 100 -141 -135 -67 -4 104 189 105
3867A05J27l59O1j02k37K05P2k4K27m0k24K33J26k19L01l10J03M1LJ8n9j29K85
$$ 105 232 -127 -66 -168 -405 -200 -128 -152 75 35 -189 44 170 -49 252 -58 45 86 89 107 48 -81 204
3890B04j64l31M08q8k25J45j18K28K01k72j61K19j48N12m16j45K92l97J72K55
$$ 204 40 -291 117 29 -196 -51 -169 59 260 -12 -173 46 -102 410 -6 -151 141 -256 -84 171
3910A71j29J76j57j55L6J01k09J83O9k11J42j79qK66r0m3J94j61J14j8l83O31
$$ 171 42 218 61 -94 -58 43 -166 17 86 -125 17 -162 -170 96 6 -37 157 -4 110 92 -291 340
3932C40k79q0J27k27K80k39N2J4K74l85K75j9k58J46K36l40P1M2k70L81k92nL81
$$ 340 61 -19 108 -119 161 -78 -26 -12 262 -123 152 133 -125 21 257 -83 -12 30 -240 141 -151 -156 225
3955B25k48J53N9k60N7k19M1M42k69j97M96m03R1R5k62J81K3J7L10m06R7n5J7
$$ 225 -23 130 189 -71 -14 -233 -192 250 -19 -216 280 -123 -32 63 -199 -18 5 22 332 -74 23 -32 -15
3978a5o9K93k95Q5r8j12K18K30m75J38n7P5J51k01K65p8j03n4L08o0k95L25m06
$$ -15 -84 209 -86 -1 -99 -211 7 237 -238 -100 -157 -82 69 -132 133 55 -48 -102 206 146 -149 176 -230
4001b30L87k70J17j8r9J7J92j50o1m3j48M50k17O2%Or1J19R1K9r0J01j28J49j73
$$ -230 157 -113 4 -14 -113 -96 96 -54 -115 -158 -306 144 -73 -11 -11 -5 -96 23 114 143 53 154 26 175 2
4026BP4k05M6L1p8p6L09j06m5j5l89K28J93M9J37r1j3O5l2MK7k02J9K78j44m8
$$ 2 76 -129 -83 -52 -130 -206 103 -3 -48 -63 -452 -224 -31 18 155 64 51 116 84 88 115 -87 -68 210 66 18
4052A8n1O1Q6q0n2j35Nl7K55o5n7K27k38L38j38m08M30p8k15K29k11l0J63l9o4
$$ 18 -33 28 114 34 -18 -153 -148 -185 70 5 -52 175 -63 275 137 -271 159 81 -134 95 -116 -146 17 -22 -86
4077h6J51o2L0L8j59J0oK30L6j11k85K61m1M2P1k23K22j77J6J95k88p4J98j50
$$ -86 65 3 33 71 -88 -78 -84 146 182 71 -214 47 6 48 119 -104 118 -59 -43 152 -136 -210 -12 -162
4101a62L0J18q9J58O4k49K35J8k88L40M9j39l4j60r8J58n1k4J04j61J06o7%K92
$$ -162 -132 -14 -103 55 119 -130 105 123 -165 175 224 85 51 -109 -207 -49 -100 -124 -20 -181 -75 -142 -142 150
4125A50j14r3K01l51K25J29k84J62M8k07J50J8k14L76k21L9j47j05J37K26m15
$$ 150 36 -57 144 -207 18 147 -137 25 73 -134 16 34 -180 196 -25 14 -133 -238 -101 125 -290
4146b90N75k51j49K53k37J14K57k87r5O9J6qk3M2J53j07j73J89n9j36K40k23k9
$$ -290 285 34 -115 138 -99 15 272 -15 -110 -41 -25 -33 -56 -14 139 32 -141 48 -11 -147 93 -130 -159
4169a59K81k46K17j96J28K31k76k7K34j19r8J1j9j31J83k40M6J72j59J05k1j83
$$ -159 122 -124 93 -103 25 256 -20 -47 187 68 -30 -19 -38 -169 14 -226 -180 -8 -167 -62 -83 -266
4191b66N19m14q6K79O4k13K89j90l11O21m01Q9J59l37L27k07J61j18j72J18K23
$$ -266 253 -161 -247 32 96 -117 172 -18 -329 292 -109 -20 139 -198 129 -78 83 -35 -207 -89 134
4212A34j13J09J08k30J07k01MK44k67P6L50j14r3q8J59o8r9j17k5P6j47K87J27
$$ 134 21 130 238 8 115 -86 -82 162 -105 -29 321 207 114 26 185 117 18 -99 -124 -48 -195 92 219
4235B19l86M25l48K59Q8m23L26J7l38K34M9k03J98lq3r5L7k4p2r2J00K38m38L61
$$ 219 -167 258 -90 169 257 -166 160 177 -161 73 122 -81 117 114 31 -64 -27 -51 -123 -215 -115 123 -315 46
4259D6J13j50J10l6J23p9l11L09q6Pk69K44n5J72l07J22L31n30L63j06j65K13
$$ 46 159 9 119 83 206 127 -184 125 39 46 -223 21 -34 138 -169 -47 284 -246 117 11 -154 59
4281E9j62j25L76K9l29K82j23j74K53k95K69J24k18k45L49k35J74n8l10L33K48
$$ 59 -103 -228 148 177 -152 130 7 -167 86 -209 60 184 -34 -279 70 -165 9 -49 -359 -26 222
4302B22k84r8J34j88Q2k0J98Jj03J03m5j04K27j76j10K75j41L3n6o4lR3l52K47
$$ 222 -62 -160 -26 -214 -132 -152 46 47 -56 47 2 -102 125 -51 -161 114 -27 6 -50 -114 -117 -24 -376 -129
4326a29J07j50J50J22j69J84l25J97jo3R9o9ml8P0r5K27JJ9j26l3L1q8J37O1j72
$$ -129 -22 -172 -22 100 -69 115 -210 -13 -14 -77 22 -47 -51 -89 -19 -114 113 114 133 7 -26 5 -83 54 115 -57
4352e7K18P3k98l9L21j61P6O0k48j81K62r0K40l6j65R2n7q6K33k67M9J68k43L44
$$ -57 161 234 -64 -103 218 57 133 193 -55 -236 26 -64 176 140 -25 67 10 -76 157 -110 -61 107 -136 208
4376B08o0j63J18j03p3K07k51J84m5j10K41k20R6r3N3j06K10j57m6J86j56K08
$$ 208 148 -15 103 0 -73 134 -117 67 22 -88 153 -67 29 -64 -11 -117 93 -64 -110 76 -80 128
4398A28M7j41J44m6k34P7J2n7J49P1m29K56o8O7J51j40k9J47k22J81j39J51K8
$$ 128 175 34 178 132 -102 -25 -13 -70 79 150 -279 -23 -91 -24 127 -13 -42 105 -117 64 -75 76 104
4421A04j33R9k06J46K70k13k65L68L4j63J19k3k09R5M4j44J19o2Q8k1p2J1O6j34
$$ 104 -29 70 -136 10 280 67 -198 170 204 41 160 137 -72 23 67 -77 42 -20 68 47 -25 -14 52 -82
4445h2J20K33k69j17J42k76J93O3j01J65N6j50kn7n3R6k09M21K2k37J92k25J18
$$ -82 38 271 2 -115 27 -249 -56 7 -94 71 127 -23 -25 -82 -135 -39 -248 173 195 -42 150 -75 43
4468D3J3j11K2K06l66K78R1j08J5j31j25K26n1J4J95k87J16l8J9P4j03q4K46k38
$$ 43 56 -55 -33 173 -193 85 176 68 83 -48 -173 53 2 16 211 -76 40 2 21 95 -8 -92 154 -84
4492h4J07Q1mo5m3j43O5J73l50L31j93J09m2k84J46M43j41j04J13k41K99j36K4
$$ -84 23 104 100 35 -8 -151 -86 87 -263 68 -125 -16 -58 -342 -196 247 106 2 115 -126 173 37 61
4515F1j93J01J29J35l59J78o2J17K0j29j90L14J0j66R7O9k01K49j10j44P2O2R5
$$ 61 -132 -31 98 233 -126 52 -10 107 127 -2 -192 122 132 -34 63 132 -69 180 70 -74 -2 60 155
4538A55j00q3Q6j62r9J13J81k04J94pn4K40k69l0N5k24P7K50j43J50k52J30P8
$$ 155 55 -28 58 -104 -203 -90 91 -113 81 74 20 260 -9 -39 16 -208 -131 119 -24 126 -126 4 82
4561H2k13J88j70m5J53l8j32JO1l7J42J51q4p9RJ14o8j85Q2L0k33N05k76R0Po1
$$ 82 -131 57 -113 -158 -5 -43 -175 -174 -113 -150 -8 143 59 -20 -11 103 35 -150 -68 -38 -271 234 -42 48 55 -6
4587fk55K99j82p0L04O0k01J47k2J13l23K1K77k36n5L03k93K04j44Kj9N1l0J11
$$ -6 -261 38 -144 -214 90 150 -51 96 74 187 -136 -115 162 -74 -129 174 -119 85 -59 -57 -76 -25 -55 56
4611E6r3k2J00j29L12r1j42J59n3j97J55J07j07R8k11J25o3l08M49k6m10M00j54
$$ 56 -37 -59 41 -88 224 133 -9 150 97 -100 55 162 55 153 -58 67 4 -304 145 119 -291 109 -45
4634d5Jj78K05K14k27J56k44J92n6j40M10m65J44N7J00J03k50N2p4pK13p8j76
$$ -45 -44 -222 -17 197 -30 126 -118 74 18 -122 288 -177 -33 24 124 227 -23 29 -45 -52 161 83 -93
4657i3J06J72j02j27O0J01o6j93J91R2q4K16j02l29l4L34k57P8J10j55j1RJ10
$$ -93 13 185 83 -44 16 117 51 -142 49 141 57 273 171 -158 -192 142 -115 -37 73 -82 -93 -84 26
4680B6Q3l7k39K38k3J5N5n8o8J20k02K74k99J41P1j63K99m45K28M8n4r2L8j48
$$ 26 109 72 -167 71 48 63 118 60 -8 112 -90 184 -115 26 97 -66 233 -212 16 64 10 -82 -44 -192
4704a92J19Kn3KJ61J36m6Oj89j03J81J76j99Q9K0j27p4l7R0q1O1Q7j84J90L7j59
$$ -192 -73 -71 -124 -122 39 175 129 135 -54 -157 24 200 1 90 110 -17 -91 -128 -38 -119 -58 29 -155 35 72 -87
4730h7J85m9l6k4j60J85J00j00O7lnr8MO7o7m3J21O2Mr2p7l8J7J3J33j67J82j36
$$ -87 98 49 13 -11 -171 14 114 14 81 78 73 -25 -21 46 -21 -64 57 119 123 31 -46 -84 -67 -54 79 -88 94 -42
4758d2J60k4L2j25k6m03K43J52mK0l3J80j03J27j60J44k11J23q3K07m46L75q0
$$ -42 118 94 126 1 -25 -428 -185 -33 -37 -17 -50 130 27 154 -6 138 -73 50 -33 174 -272 103 23
4781B3M2P4j48L8j09J3R6K5J39j51j8N8q9j70N9J73j77Q3j75L34j70M9n7J53o1
$$ 23 65 139 -9 29 -80 -67 29 54 193 42 24 82 -7 -177 -118 55 -122 -39 -214 120 -50 -1 -58 95 34
4806C4n0j7q1J91J1J6K4k30J44q2J7j27J5J52J44k53J60J55m19J87l6J89J68l94
$$ 34 -16 -33 -114 77 88 104 128 -102 42 -40 -23 -150 -135 17 161 -92 68 223 -196 -9 -45 144 312 -82
4830h2j5K34j65J14r9j64K86K6k52L5N2O0L0j2N4k31J58Nj65J55j78N1nj5J47
$$ -82 -97 137 -28 86 -13 -177 109 135 -117 -82 -30 30 60 48 102 -129 29 34 -131 24 -154 -103 -108 -123 24
4855B4k06K76k43J11L0k1J50k15J05n9OP9p3K3Q6M7j14m37M44m2qJ63k22K33q2
$$ 24 -182 94 -149 -38 -8 -29 121 -94 11 -48 -42 37 -36 -13 73 120 6 -431 13 -29 -37 126 -96 137 55
4880E5K54j43O1p5k56p6J35J6j6r4k4N5p4K92k3j53J3J65M5k44J31k0j82K08p0
$$ 55 309 166 227 152 -104 -180 -45 -29 -45 -139 -163 -108 -182 110 87 -66 -53 112 157 -87 44 24 -158 50 -20
4905b0j43M4J57j25J46j32K67j6k68J12j01q2M01p0k64n0Q6n8L08k05j53K44j83
$$ -20 -163 -119 38 -87 59 -73 194 178 -90 22 -79 -161 240 170 -94 -144 -58 -116 192 -13 -166 78 -105
4928a05J93j37N0j30J03K8N9Q2q9N0q6P4o4j2j74K99J03m02J82r8Q0J1o1q0K48
$$ -105 88 -49 1 -129 -26 2 61 143 54 104 18 92 28 16 -158 141 244 -158 24 -74 6 17 -44 -124 124
4953A24r8j10J70j48l3o2J08m0L09k05k06J03O1n0P0r3j04J08J84Q5n0l32J52
$$ 124 26 -84 86 -62 -95 -157 -49 -89 220 15 -191 -88 -27 -77 -7 -100 -204 -96 88 173 123 -209 -57
4976e7J71j95Q5K0J00k9j29j43K90p4J5J35k78K76j71r0L2M1M2k33K95R6j64l5
$$ -57 114 -81 4 24 124 95 -34 -177 113 39 54 189 -89 187 16 -74 -42 -1 41 -192 103 199 35 0
5000@J6j43L50l27J42j05N8q3P2k6K09l3k68J98r0J17m3j18J98j44j41j1P2n2
$$ 0 16 -127 223 -104 38 -67 -9 -92 -20 -46 163 130 -138 60 -30 87 44 -74 124 -20 -161 -172 -100 -152
5024a52K8J13J93k11r0J97k63J52lR8p6k8k83M55j03jJ56k54O7j81J38N1J0J89
$$ -152 -124 -11 182 -29 -119 78 -185 -33 -36 62 -14 -42 -325 130 27 26 182 -72 -5 -186 -48 3 13 202
5048B02m07J14K35k87J99j84lJ38Q5K2k41L4J71m4q1Q1o8l4K22k09k1J11j06P7
$$ 202 -205 -91 144 -143 56 -128 -131 7 92 114 -127 -93 78 34 -47 34 -34 -68 154 -55 -76 35 -71 6
5072FK9k95J59N8J16k3j05Nq4N2k3J13j72J66o4J31J70k76J87j28Q5J10k80P5
$$ 6 35 -260 -101 -43 73 50 -55 -50 -134 -82 -105 8 -164 2 -62 69 239 -37 150 22 107 217 -63 12
5096A2J90k46N4J9K2J18o7k45K47k14k3J03Q3q8j8J42K6j08N3k46L79j81M7J1
$$ 12 202 -44 10 29 51 169 102 -143 104 -110 -133 -30 53 -35 -53 89 115 7 60 -186 193 12 59 70
5120G0L5j26j24K91j73qJr9K37l6J73l61R6M8j93J12Pj53j4J83k6K1j9j9l7m1
$$ 70 105 -21 -145 146 -27 -35 -34 -133 104 68 241 -120 -24 24 -169 -57 -50 -203 -217 -34 -60 -39 -58 -77 -114 -155
5146a55P7J35M8K7J39m14K99k26K06n5k8Qj75J44j31J62m4l2O0l1L17k36k23J68
$$ -155 -78 57 105 132 271 -143 156 -70 136 81 53 61 -114 30 -101 61 17 -15 45 14 331 95 -128 40
5170D0q1O3m2r5J23k29J58J1J20j08p3j24L52K0k35L28l32O0K14k04j30J74K5
$$ 40 -41 22 -20 -115 8 -221 -63 -52 68 -40 -113 -237 115 135 -100 228 -104 -44 170 -34 -164 10 35
5193C5O4m6l7o1R9k06N8K84j83jN6j91J45%P4J2j9J4r4q4R8J55k47k0J48m2J83
$$ 35 99 53 16 -45 54 -152 -94 190 7 6 62 -129 16 16 90 102 83 97 3 -81 17 172 -75 -95 53 11 194
5220A94k26J50j38M4JJ5q5J94j17j77K57P1k83J86L6k46J2J75j04R7l66L47n6
$$ 194 -32 118 -20 24 25 40 -45 149 32 -145 112 183 -100 86 122 -124 -112 63 -41 56 -310 37 -19
5243a9J05j2j99Q8J56j95K04j16p2J39m7qp2Oj36L33k38R5q2n6J73m1K0k1J87
$$ -19 86 74 -125 -37 119 -76 128 12 -60 79 32 24 -48 -42 -178 155 -83 12 -70 -126 47 6 26 5 192
5268A92k32O0O5K7R0l28P8j4J44k6k16J29J28j8j81J65j48j3P9J68j74J46k19
$$ 192 -40 20 85 112 202 -126 -48 -62 82 56 -160 -31 97 79 -102 63 -85 -98 -19 149 -25 121 -98
5291i8K0Q6O9k4N5k03o4J44n2M1J8j54L48k16m2K41k05N0l9j1P7q0l5n4K7L00
$$ -98 -78 8 77 53 108 -95 -159 -15 -67 -26 -8 -162 186 -30 -72 169 -36 14 -25 -36 41 -39 -74 -128 -101 199
5317A99j49N4j8j03j37J25O8K1J06j43pj05K14k13Q7N1K9O8l74K16K9O0k5P1m1
$$ 199 50 104 86 -17 -154 -29 39 60 166 23 16 -89 125 -88 -1 50 79 147 -227 -11 18 78 53 124 83
5342H3p9L6m9K02k23q8L30m09n5M24k18O4J9M1P2k31O2Jn4R5k7r3J72j54J04q8
$$ 83 4 40 -9 193 -30 -118 212 -197 -252 172 -46 18 37 78 150 -81 -19 -18 -72 23 -4 -97 75 -79 25 -63
5368f3L35k83l3O8J2j08J09J81j41j27po5Q4L5PP8L1Nj46OM2L9j29N3m8J2M7o1
$$ -63 272 -11 -44 24 36 -72 37 218 77 -50 -57 -122 -38 -3 4 82 113 118 -28 -22 20 59 -70 -17 -65 -53 -6 -67
5396f7K15k62k8k5L31k79J06q5J17j20Q4J45K3n9K2j58J28l9qn6j03J15J6N4n6
$$ -67 148 -114 -142 -167 164 -115 -9 -94 23 -97 -13 132 155 96 118 -40 88 49 41 -15 -118 -3 13 67 11
5421A1K3k28J10J2l0Q7K5j33JK58k08L29j99j6j6p9QL18l17o2J03J27j97L3K4
$$ 11 34 -194 -84 -72 -102 -15 10 -123 -122 136 -72 257 58 42 26 -53 -45 273 -44 -106 -3 124 -73 -40 -16
5446a6j37R8M0R9m2j40J75m1K4k8j2p8J50j65Q0j2J85l84L54j28J05l88L27k0
$$ -16 -153 -55 -15 84 42 -98 77 36 60 32 20 -58 92 -73 7 -5 180 -204 150 22 127 -261 66 46
5470D6l0K74l45J24j18K3jJ0J8N6n8j0k00J38K22j01n7l7j23K03j31P1J4P0j62
$$ 46 16 290 -55 69 -49 -26 -27 -17 1 57 -1 -11 -211 -73 149 48 -9 -46 -169 34 -97 -26 -12 58 -104
5495a04M3p0J90j0q7k4k26L45o3n7P7j28J70l4r5K1P5K45l27J77n3o9j9Q6O1l05
$$ -104 -61 -131 59 49 -38 -62 -288 57 -6 -63 14 -114 56 22 -73 -52 23 268 -59 118 65 -4 -23 63 124 -181
5521a81K61k6n4O1Q7j57Q3j29Pn7K19k36JP3L9p5J04L9J36k72pJ71%J32l83M28
$$ -181 80 54 0 61 148 -9 74 -55 -48 -105 114 -122 -121 -48 -9 -84 20 59 195 -77 -84 87 87 219 -164 264
5547B64k96J09j60j84K88J37k98K73j93M1J22j57lj25L06r7j12o6N2R2j10L31
$$ 264 -32 77 -83 -267 21 158 -140 133 -60 -19 103 -54 -57 -182 124 27 -85 -151 -99 -7 -117 214
5569B14l94L99j75K8NJ6j05n3K24p9k20J37M5J12k41j43J99K4M9j10O2r5Q9L8
$$ 214 -180 219 44 72 77 93 -12 -65 159 80 -140 -3 42 154 -87 -230 -31 -7 42 -68 -6 -101 -12 26
5593B6J29lj64P2j67qL6R3o8j00Q2N2p7k6jJ28L46l40L3N7k06N1Q0J19j5k07J26
$$ 26 155 152 -12 60 -107 -115 -79 14 -54 -154 -72 -20 -97 -123 -124 4 350 10 43 100 -106 -55 25 144 129 -78 48
5620D8J17j37n0K4O8P3o7Q3j51J5J15j76J4n9J29k89K02pK02k00j84K00O4Q6l02
$$ 48 165 28 -22 2 70 143 76 159 8 23 138 -38 -24 -83 46 -243 -41 -48 154 -46 -230 -30 34 120 -182
5645a82J32o5J01P0j34J23l44K99q4j05J66K3L7r5J75k88M32m48L2p5K19j05J73
$$ -182 -50 -115 -14 56 -78 45 -299 0 -84 -189 -23 0 37 -58 117 -171 261 -187 -155 -230 -11 -116 57
5668E7O6k03J61r9Lj25J51K49k82K1n6PJ3J7k60M84j42Q8N0k42J3Q9l6o1O4j54
$$ 57 123 -80 81 -18 -15 -140 11 260 -22 -1 -57 -50 -37 -20 -280 204 62 150 200 -42 -29 60 24 -37 27 -127
5694a27J62or8M4J4O1m1j8k1lr2Q6Kk4Q1q4J64l6O1k02J79k3Q5P1l37M3J47Mj46
$$ -127 35 29 -69 -25 -11 50 9 -9 -30 -33 -125 -39 -37 -61 20 -64 100 64 125 -77 102 79 164 235 -102 -59 88 92 -54
5723e4l0P1J5M7J48o5j30p7Q9mL7n0J41j05m4L3j6j9m1j24R9L6O3r3K3J38j85
$$ -54 -84 -13 2 49 197 132 2 -75 14 10 47 -3 138 33 -11 22 6 -13 -54 -178 -79 -43 20 -73 -50 88 -97
5750i7m1L08j52r7M0j59K11k84K13l2N7M1K1qO3q6J11j03o7NJ09o2j02O7l7J53
$$ -97 -138 170 18 -79 -39 -198 13 -271 -58 -90 -33 8 29 21 84 -2 109 6 -61 -56 53 -9 -111 -44 -81 72
5776G2j40k0O6j20J74J73j81N1k40Q4J65qj74J94l75K31O3R4j7L7k96o0L3J65
$$ 72 -68 -88 -22 -142 32 205 24 75 -165 -81 84 76 -98 96 -279 -48 15 109 92 129 -167 -227 -194 -29
5800b9k0O1J4j33lM7R8nK4Pj89K56j75N7p1m8J46M6o8J10l0L0j31J52k94N0K13
$$ -29 -49 12 26 -107 -110 -63 35 30 54 61 -128 128 -47 10 -61 -109 37 83 15 125 95 125 -6 146 -148 -98 115
5827A15k3j31n6J01j3R1m8Nn5j47O6K73o5k0M3k48K47j38L8j95J56j34J82M9q4
$$ 115 92 -39 -95 6 -7 84 36 41 -14 -161 -95 178 113 93 136 -112 135 -3 35 -160 -4 -138 44 93 9
5852Ip6J39P3k35J33mk5N3k61J35Q4n9Q4Qk19P7K98m21L23q6oK04l20M0P4K9o7
$$ 9 -67 72 145 -90 43 39 14 67 -194 -59 25 -34 50 58 -161 -84 214 -207 116 30 24 228 -92 -52 22 51 -16
5879a6M2N3p5J37m21J42J55j93L08j74J11K5k70K26J34k65j14J26O9P6M1j76J35
$$ -16 26 79 4 141 -280 -138 17 -176 132 -42 69 94 -176 50 184 -81 -195 -69 0 76 117 -59 76
5902G6j9r2J89j81J80j63O3j8o9J40j16o0L8ok3R8m9j18K77R9k93O3m3r8L28k51
$$ 76 57 -35 154 -27 153 -10 53 35 -34 106 -10 -70 -32 -38 -61 37 -12 -130 147 246 -47 16 -27 -125 203 -48
5928d8L05k49j03K30j14Kp4J26k23M0K59j96J63j23J09j2q5m1r4r9J92O0j92L58
$$ -48 257 8 -95 135 21 23 -51 75 -148 -108 151 -45 118 -5 104 92 7 -34 -128 -227 -35 25 -167 191
5952A91j24j8j80P1J79l04K20j0j02J35j55J37j6qj7J57o4k04J52j10K94o5k41
$$ 191 67 49 -131 -60 119 -185 35 25 -77 58 -97 40 24 16 -1 156 92 -112 40 -70 224 159 -82
5975h2j0K2o9j25J27J66j4q3J3J00m0o9J6J91k95L79j07L6Q0m20L08O4m6q2j94
$$ -82 -92 -70 -139 -264 -137 29 15 -68 -55 45 5 -64 -48 143 -152 227 120 156 236 -184 124 188 142 60 -134
6000a34Q3J07m5J4rNm2N6Q4l43L9J52J6J21o9N2Rj56n7K54k36J2O1k03L75k54
$$ -134 -51 56 11 25 16 21 -21 35 119 -224 -185 -33 -17 104 35 87 96 -60 -117 137 -99 -87 -26 -229 146 -108
6026a08j78L82j75Q3j16J00K12q1k24J32k17L92p7l65K46r2q4RJ16j0j00J86j15
$$ -108 -286 96 -79 4 -112 -12 200 119 -105 27 -190 202 125 -240 6 -86 -170 -161 -45 -55 -155 31 -84
6049h4K43m8J00k29l4J15q8Q7K1P1k50J42OK21j89k63K35Kj36P1q1M4Q0j31m7
$$ -84 159 111 211 -18 -52 63 -25 62 83 154 -96 46 52 273 84 -179 56 58 -78 -7 -88 -44 36 -95 -142
6074a42K30j43J54m2Rj56J53K5k6r0j45K42j63J10K4l7P4J7k33m9L52k97n0J31
$$ -142 88 -55 99 57 66 -90 63 88 62 -28 -173 69 -94 16 40 3 77 94 -139 -188 164 -133 -183 -52
6098e2l0J86n4JoJ01l49K40j24J62j24k46J06M6k5J13r7K24j7J34j57n9JJ52l55
$$ -52 -82 104 50 51 45 146 -203 37 -87 75 -49 -295 -189 -143 -168 -55 -152 72 55 189 32 -27 -26 126 -229
6123b29M14k23J10LN7j15k69K19J55k51K08j35j22K95j79J23j01O3J02Mj07j02
$$ -229 185 -38 72 75 132 17 -252 -33 122 -129 79 -56 -178 117 -62 61 -40 23 125 129 22 -80
6145h0K1k3K9J59j80n8J14L3L0q6n0J65j59j51K61m9J4pQ0OK4j12Q6k7j58P1n3
$$ -80 -59 -82 -53 106 -74 -132 -18 15 45 -41 -91 74 -85 -236 25 -24 -10 -17 63 69 93 -19 67 40 -118 -47 -100
6172a00r5M4L58k67Q9K7o4O5lr3n3J83j21r5K43p4L5%j30K49k57pM9%j34K78j17
$$ -100 -195 -151 207 -60 29 56 -8 57 54 -39 -92 91 -30 -125 118 44 79 79 -51 198 -59 -66 -17 -17 -151 127 10
6199A0j76K56j34J85n6l16J05K61p7n5k80M14J4k0j61oL6q1O8p6l8j56J99L4j78
$$ 10 -166 90 -44 141 85 -231 -126 135 58 3 -277 137 151 131 -30 -36 0 -81 -13 -89 -127 -283 -84 -50 -228
6224b28J92J25k41M1J77j19J30j08J61o1l6k03N3q4J24P0j50J90k46J24J7O6l6
$$ -228 -36 89 -152 -111 66 -53 77 -31 130 69 33 -170 -117 -201 -77 -7 -157 33 -213 -89 -72 -6 -42
6247d2k3k6K1J07j02Q5P7Nj45n6K89l22L5l9J40j4K40j92p1J22k18Q0L8N5K1r8
$$ -42 -65 -91 -70 37 -65 20 97 102 -43 -99 190 -132 -97 -136 4 -10 230 38 -33 89 -129 -49 -11 44 65 -33
6273c3J96j90J18j21k8j0n4m4J94J1j07L0R1l4K04k87k4L01k64L6k9L4r2J08p6
$$ -33 163 -27 91 -30 -58 -68 -122 -166 28 39 -68 -38 53 19 223 -64 -88 213 -51 -15 -44 -10 -102 6 -70
6298g0J58J09M5j56k5k31J82j36J91Oj74K0R1m3J25J07m49K90j57L9K7K02j06
$$ -70 88 197 242 86 61 -170 12 -124 67 73 -101 -81 10 -33 92 199 -250 40 -117 -78 -51 151 45
6321D5Q3j65K45k68K6J06j47N5P1r3R7L6p9j4J55k14M3K7L3o7j54L49N8k68J42
$$ 45 128 -37 208 -60 -34 72 -75 -20 51 -42 55 91 12 -2 153 -61 -18 9 42 -25 -179 170 228 -40 102
6346A02m4R9k02M0j0J55j17j48J41j63P9j8J01j33K39J87p5l42J38P6j26N6k55
$$ 102 58 157 -45 -5 -15 140 23 -125 16 -147 -68 -86 15 -118 121 308 233 -109 29 105 -21 35 -220
6369b20M4K58m23L60L6j18K6l2o0L00k76K67q3p2N7j17J37K1n5j54K48k42Q4j34
$$ -220 -176 82 -341 19 55 -63 -37 -69 -129 171 -105 162 79 7 64 -53 84 105 50 -104 144 -98 -14 -148
6393a48K55k88J02J33k12J27j84O9PK40N4j97O8k24K20j58K49j91J99o0q5q4J30
$$ -148 107 -181 -79 54 -158 -31 -215 -146 -139 101 155 -42 26 -198 22 -136 113 -78 121 61 -24 -108 22
6416B2l7j64J51k14O8K13j18J57qj30Q2J4j6p9j95J91J12m7k24L93j44r4L18k25
$$ 22 -15 -179 -28 -242 -174 39 -79 78 70 -60 22 36 20 -59 -254 -63 49 2 -222 171 27 -67 251 26
6440B6l6R9l9J0k00P1m5l2L87m47L04j57k1K83k48J57j68K98l3k96M7O1Q4N6N7
$$ 26 -10 89 50 60 -140 -69 -114 -146 241 -206 98 -59 -80 203 -45 112 -56 242 209 -87 -40 21 105 161 218
6465B18k0j06O8O5j65r2L05l10J09Q6m7j31J44k52L2J01r9n8K42j00J29k23k8
$$ 218 198 92 160 225 60 -32 273 -37 72 158 111 -20 124 -128 -96 5 -94 -152 90 -10 119 -104 -132
6488a32L23l26M4N9K5j72J25J85j22j27OK59j89J76M9k37J30M3m9kn1Qn8r1K79
$$ -132 191 -135 -91 -32 -7 -179 -54 131 9 -118 -112 147 -42 134 183 -54 76 119 70 68 17 25 -33 -124 155
6513A55k52J24j54Q7J54k67K11L9mk40L31o4k06J54j53K1OL5K1R3j61n2J19r5
$$ 155 -97 27 -127 -40 114 -153 58 97 93 -147 184 120 -86 68 -85 -64 -58 -23 -2 91 -70 -122 -3 -98
6537i8J77r2Q1p6K5O4k09K98j15J17k79J94k28J72NM0r0J77k51M7K9o8N2m1j28
$$ -98 79 -13 68 -8 17 81 -128 170 55 172 -107 87 -141 31 36 76 -14 163 -88 -41 -12 -80 -28 -69 -197
6562a97L09j17k39M53r7q8L8j05K45j20j71K33j90Kr0N6q8N7K22j04mr2K35j49
$$ -197 112 -5 -244 209 112 24 62 -43 202 82 -89 144 -46 -44 -134 -78 -166 -109 113 9 5 -87 148 -1
6586al26K62K28q8q6q0L4J78jk16l6J39k25K02O3J08j25j60K80J17j80j74J78
$$ -1 -327 -65 163 75 -11 -91 -57 121 120 -96 -132 7 -218 -16 47 155 30 -130 150 267 87 -87 91
6609I1j11p2J67p5K48k00m0R9k92R2N2K35m81J17O5J20k06J25N3O2j05j8p0L20
$$ 91 -20 -92 75 0 248 48 8 107 -185 -93 -41 194 -287 -170 -105 15 -191 -66 -13 49 -56 -74 -144 176
6633A76l16j8K55Kr9N1l6oJ15k17K23j83j77K55k33J91j13K23j14pj95K08J43
$$ 176 -140 -158 97 99 0 51 15 9 124 -93 130 -53 -230 25 -208 -17 -130 93 -21 -28 -223 -15 128
6656A28j72Q5J51k56J89K7j40j44L51m1k67J49j89R4OP7Q5j74P3J12K6l21J34
$$ 128 -44 41 192 -64 125 152 12 -132 219 178 -89 60 -129 -35 -29 48 133 -41 32 144 170 -151 -17
6679a7j25L9L29j17q2n8j22k0L71k08L3N7q4K00m33N37q7m27J61J55j49J88j68
$$ -17 -142 -103 226 109 27 -31 -153 -173 198 -10 23 80 -4 196 -237 300 213 -214 -53 102 -47 141 -27
6702b7o0J48m7k71J59K83j27L6j50K5J14k66M8J87k45J51O5mj6M1k33J21Q9K8
$$ -27 -87 61 14 -257 -98 185 58 94 -56 -31 83 -183 -135 52 -193 -42 23 19 3 44 -189 -68 21 49
6726D9j6R2j64J07l0M4k66K20K58k78M0j76K8qM8j15J79J67k24l8Q9l3K9Q8j54
$$ 49 33 125 -39 68 38 82 -184 36 294 16 56 -120 -92 -100 -52 -167 12 179 -45 -83 6 -27 2 90 -64
6751f4p9J23p2J78k6j18N4P2j46K93l57K38k20J78l64P3L22m0N3O2j80Mp3M2K02
$$ -64 -143 -20 -92 86 60 -58 -4 68 -78 215 -142 96 -124 54 -310 -237 85 45 98 160 -20 -16 -89 -47 155
6776A55j38r8L00m21J35K8R0Q9j7j05J97j71n5J57k53J49k9J32p8m9J16l66L79
$$ 155 17 -81 219 -202 -67 -39 51 140 123 18 215 44 -11 146 -107 42 13 145 67 18 134 -232 147
6799A47k17M6J66k24J04j5k1p6J49j41J88j29J35k6lk69K52j2J58l33k2J41j05
$$ 147 -70 -24 142 -82 22 7 -14 -90 59 -82 106 -23 112 86 83 -186 66 54 212 -121 -143 -2 -107
6822a07J03M0M5j20r3M9J13j03K47r3N1j44r8P5P6p6n9K0M3R2j51J8nK19k15K17
$$ -107 -4 36 81 -39 -132 -83 30 -73 174 81 132 -12 -110 -35 41 -35 -94 -74 -31 61 -90 -72 -77 142 -73 144
6848A44l03J2j00J20K28N7N1l03O8K8L7j49K54k45J91o4p6J08jq0j15J67l1m7
$$ 144 -159 -147 -247 -127 101 158 209 -94 -26 2 39 -110 144 -101 90 26 -50 58 57 -23 -138 29 -2 -49
6872d9J91j22r1J24L9j14J37RM7K1l01M0o9L55j41o9K33k55P7j95K07j36J19P9
$$ -49 142 20 -71 53 92 -22 115 124 171 192 -109 -69 -138 217 76 7 240 -15 62 -133 74 -62 57 136
6896A36m08K88J92l17J81l1j90M6R6J40o0k28M9J75j47J24l7r8J10nlJ23k84K5
$$ 136 -272 16 208 -109 72 41 -149 -103 -7 133 73 -155 -106 69 -78 46 9 -89 21 16 13 136 -148 -123
6920a23Q8R2k32K13j1k5K9j00O9K94k97L6j16J00L7j40j0L9l1K66l26M1O5j71
$$ -123 -35 57 -175 38 27 2 31 -69 0 294 -3 33 -83 17 54 -86 -96 -57 -88 178 -148 -107 -42 -213
6944b13J03L18o9j58M6j07J09j29k4J00J36o4k4L26m56J37R1j59l8L8K56j86m9
$$ -213 -110 208 139 -19 27 -80 29 -100 -124 -24 112 48 24 350 -106 31 122 -37 -75 -37 219 33 -16
6967a6j83K82o7j71n5K51n4J89j44Q5k40J43n6q7J5R8Nk01L75k00k9mJ78q3L1
$$ -16 -199 83 16 -155 -210 41 -13 176 32 117 -123 20 -36 -123 -108 -10 -5 -206 169 -31 -60 -64 114 31 62
6992F2J60j06j02m3L1j38J46j80P7J02J13q9j27K2P9j05J58N0k63L31j50L5j07
$$ 62 222 116 14 -29 2 -136 10 -170 -93 9 122 33 -94 -72 7 -98 60 110 -153 178 28 63 -44
7015d4J14k2k08J42J26k33K12J2j97K30l48K13R1O9l14J69q4K89m5k95q3K77k40
$$ -44 70 48 -160 -18 108 -125 87 99 -98 132 -216 -3 88 157 -157 12 -72 217 172 -123 -206 71 -169
7038a69J24J47j83K82j55j90J61q8K02r5P9k5M9k10M4J60j35J52k75K98p6q2j09
$$ -169 -45 102 -81 201 46 -144 17 -71 131 36 115 90 139 -71 -27 133 -2 150 -125 173 97 15 -94
7061i4L4O3P7k86J46O6j14j1n6J30K44l05J83K4k27j88K62J49o7j08K69j61l5
$$ -94 -60 3 80 -206 -60 6 -108 -119 -175 -45 199 -106 77 101 -126 -314 -52 97 30 -78 191 30 -5
7084eJ57k35K14o0l0P0r8L40r9l93P8k2o2K73o7On7j2l0O4j29j7p1j6K17LR3j51
$$ -5 152 -83 131 71 41 111 13 353 254 -139 -61 -83 -145 128 61 67 10 -2 -32 32 -97 -114 -185 -201 16 19 112 -39
7112c9q1r0N60k78j38J9J17o5J5r0R9j46M99j67j54n7Q0j46L6m0J24k12QO5K40
$$ -39 -120 -210 350 72 -66 -47 70 5 20 -70 29 -117 382 215 61 4 84 -62 -26 -66 58 -154 -146 -81 159
7137A59k54%J54k74N18j57j1q8r4j54K22m6j52M52k41P9R2o8j53o1j79K04J11
$$ 159 -95 -95 59 -215 303 146 135 47 -47 -201 21 -25 -177 275 34 113 205 137 -16 -77 -256 -52 59
7160E9L3r7n3J57p6m7K8m2r8J49o9M2j16K43k25J17n4q1L36j20j40j1P6l8K23
$$ 59 92 -5 -58 99 23 -24 4 -38 -136 13 -56 -14 -130 113 -112 5 -49 -130 206 86 -54 -65 11 -27 196
7185A96j63q2L9l1N5L4l18M51L1p1J25j41Lj77j64K02m2M4pK1q5J2K61M0k32M5
$$ 196 33 -49 -10 -41 14 48 -270 181 212 141 266 125 128 -49 -213 -11 -53 -9 -16 5 -80 -68 193 233 1 46
7211D6o4r0mJ55Q1k1j37j3J24j54m2L69l53K76l04J62j86K03m1M7m6j0J28j34
$$ 46 -18 -108 -112 43 124 103 -34 -47 77 -77 -119 250 -103 173 -131 31 -155 48 7 54 8 -2 126 -8
7235hj43J59n8J41j70O8K11RL2k44NJ1p7l2J4J05l5p8J40o2M2jj68O7J47k50L55
$$ -8 -151 8 -50 91 -79 -11 200 209 241 -3 2 13 -64 -96 -82 23 -12 -90 50 -12 30 29 -139 -72 75 -175 180
7262A80j66P0r3q1m7J15J46j02j20k4M2L9j1k80J71O1r2L03j84J53q5%j08J43
$$ 180 14 84 -9 -90 -137 -22 124 22 -98 -122 -80 -41 -52 -332 -161 -100 -192 111 -73 80 -5 -5 -113 30
7286C0j94K94r9k39K12j30K6J64k38J24J9q4J73k4J50p7j10p5Q1J82k26K8j08
$$ 30 -164 130 31 -208 4 -126 -100 64 -174 -50 -31 -115 58 34 184 107 -3 -78 3 185 -41 -13 -121
7309a21R6j3j0M7j09K41j81R2J44j57kK7n6q0%nJ74j92J55r2J89k13J23n6m1O3
$$ -121 -25 -38 -48 -1 -110 131 -50 42 186 29 27 54 -2 -82 -82 -87 87 -105 50 -42 147 -66 57 1 -40 23
7335B3k29J37J01k7j33K17r1N8l1k48K43o9j6J15j09J82j97r0Q9J50k4m8j80R7
$$ 23 -206 -69 32 5 -128 89 -2 56 25 -223 20 -49 -65 50 -59 123 -74 -164 -75 75 51 3 -177 -80
7359h0l6M7j2R0J29k27K52r9j14L9LO8l0k06J47M1j97M17k15l4r5J54k2R6k99
$$ -80 -116 -69 -81 9 138 -89 163 64 -50 -11 -8 60 30 -176 -29 12 -185 232 17 -17 -112 42 20 116 -183
7384a83l5J71J36j96j05O6R5L0P3J0j25J07j19m5L67l30J0J65q3n9n4P2j96L77
$$ -183 -218 -47 89 -107 -212 -146 -51 -21 52 62 -63 44 -75 -120 247 -83 -73 92 9 -50 -104 -32 -228 149
7408A49j69N6o3k39J96j30L0M75j66j19Q1o8p0j36O9M8m2M9L9L4j23p9R1J51j76
$$ 149 -20 36 -27 -266 -70 -200 -170 305 139 20 101 33 -37 -173 -104 -56 -98 -49 -10 24 -99 -178 -87 64 -112
7433a12J01P8j42Q7K0j89J41O6Qk6m1r4J51K6j48L1n7K9Q2j15K95j04k09K57m1
$$ -112 -11 67 -75 12 32 -157 -16 50 58 32 -9 -103 48 74 -74 -43 -100 -71 11 -104 191 87 -122 135 94
7458I4m3P2q6n5j26K68p3k90M49k22J19k2p9j4O5QJ2r3j28J94o6L8j8k8R0l4j24
$$ 94 51 123 37 -18 -144 124 51 -239 210 -12 107 85 6 -8 57 65 77 -16 -144 50 -16 22 4 -24 66 32 -92
7485i2J77j05j04P0K37k43K76j35P8k56K0P6k18J24J09l0p9L00p4l80K26J4P9
$$ -92 85 -20 -124 -54 183 -60 216 81 159 -97 -77 -1 -219 -95 14 -16 -95 205 131 -249 -23 -9 70
7508G0J45j70j49K17l26L33j83lJ16j46J24q8R3k20J79q7M0K6J08J57r7r1n8q9
$$ 70 215 45 -104 113 -213 120 -63 -66 50 -96 28 -60 33 -187 -8 -95 -55 -29 79 236 139 48 -10 -99
7532i9P6J19m5r0j13L2J54J17k94J27K30j18k0P4k71K43j28N1n8L6R0J62k23J19
$$ -99 -23 96 51 -39 -152 -120 34 151 -143 -16 214 96 76 150 -121 122 -6 45 -13 23 113 275 52 171
7556A71r2n2O5k5p4J03l45K00rj25M3J32n0J25j49MJ20m8j51J46K49k41j18R7
$$ 171 79 27 92 67 -7 96 -249 -49 -58 -183 -140 -8 -58 67 -82 -78 42 -6 -157 -11 238 -3 -121 -24
7580b4J85j51Q2j22K82l26j13P6K19k9q8k6N5q8J5pJ89j0k34R9JJ38n1j86m3J31
$$ -24 161 10 92 -30 252 -74 -187 -111 108 79 -9 -35 20 -68 -53 -60 129 119 -115 -16 -15 123 72 -114 -157 -26
7606b6J15K4j04j27J86j82MK86k35j8Q8Q1k67Q5J68R9j88J47j63k82K07N1j75
$$ -26 89 113 9 -118 68 -114 -110 176 -59 -77 11 92 -175 -90 78 177 -11 136 -27 -309 -102 -51 -226
7629b26L29m19M87r8k22J02%o0K98m39L42o2j6Q6j20L6J57k76J16J20j41q1J9
$$ -226 103 -316 171 73 -149 -47 -47 -107 191 -248 94 32 16 102 -18 18 175 -101 15 135 -6 -87 -68
7652f8l7J4PJ72m5j7J1Q2k9j44L8O4Q4L2j04j40R2J53k25J05k01j4K06K00j7j99
$$ -68 -105 -91 -84 88 43 26 37 119 90 -54 -16 48 132 164 60 -80 12 165 -60 45 -156 -170 36 236 219 20
7678B0J03j65Pp6J60q4P5j65J58J51k83m8P0O1k1k2Q1J84j86m2p9J78P8q6Qk0
$$ 20 123 -42 -35 -111 49 -35 40 -125 33 184 -99 -147 -77 -16 -37 -59 22 206 20 -22 -101 77 155 69 77 57
7704E7j19qO3j8j2K5P3j05J8j34M1K10k63J36M5L0j66J87j38P5l7J28j96R1l8
$$ 57 -62 -70 -7 -25 -37 -12 61 -44 -26 -160 -119 91 -172 -36 9 39 -127 60 -78 -3 -40 88 -108 -17 -55
7729e5Q8L9J36j52j08R5j30K1Q7j8N3j12J35M1m3J5k01j55L41j99P6K8K2J07P7
$$ -55 33 72 208 56 -52 43 -87 -66 21 3 56 -56 79 120 77 92 -109 -264 77 -122 -46 -18 4 111 188
7754A88k1l12MK41j64J77rMj69n3j14L12j99K7m5J48o4L0P8J8k6r8J10J78l87
$$ 188 167 -145 -141 100 -64 113 104 108 -61 -114 -228 84 -115 -88 -133 15 -49 -19 59 77 51 -47 63 241 -146
7779a46J87N9k38J08j15K37r1j18J86k7r3q6O0J96J50j11k03L6j6J72j30k15K70
$$ -146 41 100 -138 -30 -145 92 1 -117 69 42 -51 -137 -77 119 269 158 -45 -9 -25 147 17 -198 72
7802G2J00r7o7j00l5J14j28J05M3q6p4L3K32m2q2N4Mp9N4j06r1L24k03m2L26l9
$$ 72 172 75 8 -92 -127 -13 -141 -36 7 -79 -153 -120 112 70 -12 42 46 -33 21 -85 -176 148 -55 -97 229 190
7828A90l45J61J01k9J3r1N5j16O3P6k00K82k49K7l0Mn1J02K71m16J23o9J12n3
$$ 190 -155 6 107 78 91 0 55 -61 2 78 -122 160 -89 -62 -92 -88 -139 -37 234 -182 -59 -128 -16 -69
7852f9pO6J49j72q5J0J5J51QK4r7N6O0m7j04P1j50P7R6k06l2K90Q3j17j4k33J74
$$ -69 -76 -10 139 -33 -118 -108 -93 58 66 90 -7 49 109 62 -42 29 -121 -44 52 -154 -186 104 187 70 56 -177 -3
7879cn5O0l3N2j80K77p3l3LJ3J01j43j46L47m16N8J21J9K71m69J34Q8j5L5r5o1
$$ -3 -58 2 -31 21 -159 118 45 12 15 28 129 -14 -160 187 -229 -171 -50 -31 240 -229 -95 -7 -22 13 -82 -143
7905a43L7K66k46P9K16j16o2j9j52P0K9J32PRR4j41n3j32K87r1j02pJ29k97L58
$$ -143 -106 160 -86 -7 209 93 31 12 -140 -70 -41 91 98 107 201 60 7 -125 162 71 -31 -38 91 -206 152
7930A52l1k19K9j1k47K98j0N6K5J34j01n1q5J44k25J63R9J6k95J79O6j41J31o3
$$ 152 121 -98 -69 -80 -327 -29 -39 17 42 176 75 24 -61 83 -142 21 120 136 -159 20 86 -55 76 13
7954A3L2k16K42j84J22j00J85j14M3J1J1k91J65N3L6l9J17j6n3JN8k40Q1R5O9
$$ 13 45 -171 71 -113 9 -91 94 -20 23 34 45 -246 -81 -28 8 -31 86 70 17 18 76 -164 -83 12 81
7979H1l6K4k9j54J94j07l3j56J91j57K18kn5n2k6J18l9N9j39K68k23j29J90P7
$$ 81 45 69 40 -114 80 -27 -60 -216 -25 -182 36 34 -21 -73 -99 19 -20 39 -100 168 -55 -184 6 83
8003H3j18N3j3Q8j47J16k7j69OJ42N3k53J92J0j56J7M25l75K93j15qj06l5O8r1
$$ 83 -35 18 5 93 -54 62 35 -134 -128 14 67 -186 6 16 -140 -123 302 -73 220 105 97 -9 -44 24 -67
8028f7k9m7L86k72L8k06n1J29J63k5o6J65j64l2K64k26Qq1M38l38J67k95K91j41
$$ -67 -96 -143 243 -29 9 -197 -248 -119 44 19 -47 118 -46 -78 186 -40 -32 -113 325 -13 154 -141 150 9
8052Ij48K40k41P9J43k7k15L02j03J34j75p1J14m3m2p2K8K1L6n7O9K2o6nj1M01
$$ 9 -139 101 -140 -61 82 55 -160 142 39 173 -2 -73 41 -2 -44 -116 -88 -67 -31 -88 -19 3 -63 -68 -79 322
8078C22k85J19j3j11L2j99J88O6j48L6j37L15j41M3N1l8R4j57j45M8q2l6J27J1
$$ 322 37 156 143 32 64 -135 53 119 -29 7 -130 185 44 87 138 100 194 37 -108 -60 -142 -178 -51 -40
8102d0n9R5J47j02q3R1Pj76K66p4j05j1J43n2n6p6K00k33L72j41L8j39rJ17o1
$$ -40 -99 -4 143 41 -42 49 56 -120 146 72 -33 -44 99 47 -9 -85 115 -118 254 113 151 12 3 120 59
8127E9n7q7J22j79K26m8j60R6J58L3k26j71J66J74l2j30Q7L6j08q4k2n0L05o1
$$ 59 2 -85 37 -142 84 36 -124 -28 130 163 -63 -234 -68 106 74 -56 31 67 -41 -125 -147 -197 108 47
8151D7k20L20j41j4j87K32J76j34j09q9O6P9r1Q5k47J63K18j92K7N5M4j41j39
$$ 47 -173 147 6 -8 -195 37 213 79 -30 -119 -53 26 -65 20 -227 -64 154 -38 -11 44 88 -53 -192
8174a92K25k88o0J60K17l00J21K82k41J47p8O1M1j23K23k64k09
$$ -192 33 -255 -315 -155 62 -238 -117 165 -76 71 -7 54 95 -28 195 -69 -278
8191b78
$$ Imaginary data points
##PAGE= N=2
##DATA TABLE= (X++(I..I)), XYDATA
0@%%%%%%%%%%Qj6J6j6K4l2L3m1N6p2Q1r5J18j36J60j90K20k54K94l37L85m39M98
$$ 0 0 0 0 0 0 0 0 0 0 0 8 -8 8 -8 16 -16 17 -24 32 -40 41 -54 64 -72 88 -102 118 -136 158 -179 206 -233 265
33B65n67O43p24Q13r13J022j141J272j414J570j741J926k127K349k592K856l147
$$ 265 -302 341 -383 430 -483 539 -602 670 -744 826 -915 1011 -1116 1233 -1359 1497 -1650
50a650L467l819M208m640N123n666O282o982P791q741R868j1236J2934j5106J8004
$$ -1650 1817 -2002 2206 -2434 2689 -2977 3305 -3677 4114 -4627 5241 -5995 6939 -8167 9837
65I837k2079K8275l8939O2266k05791J12278K06731l34227J58791J01395k35758
$$ 9837 -12242 16033 -22906 39360 -166431 -54153 152578 -181649 -22858 78537 -157221
76a57221P6451K62408j66764m8916J58128j28322j02847K86419k9749k89036J44295
$$ -157221 -80770 181638 14874 -34042 124086 -4236 -107083 179336 149587 -139449 4846
87D846J31274k48947Q6932J77419k39991l5958K13106j10906k5893J71248j39184
$$ 4846 136120 -112827 -25895 151524 -88467 -124425 88681 -22225 -48118 123130 -16054
98a6054j28279K20241M1160j68718P7223P0155j91616K7848K07615j13211j09924
$$ -16054 -144333 75908 117068 -51650 25573 95728 -95888 -68040 139575 26364 -83560
109h3560J17721r9192p2213K21803l0316j87497J12337L5626j23464J19018J09616
$$ -83560 34161 -65031 -137244 84559 54243 -133254 -20917 14709 -108755 10263 119879
120A19879j48760m2224J22098j7375l9188R5034m1114j26201J02909N7701j28465
$$ 119879 -28881 -71105 50993 33618 -5570 89464 48350 -77851 25058 82759 -45706
131d5706N1764N3351j53692L4434J38356r0298n0447O8545m5056j3517J06205
$$ -45706 6058 59409 -94283 -59849 78507 -11791 -62238 6307 -38749 -52266 53939
142E3939j309q8822K5173M3252m9639M2713Q5097j11257o8372J06094k1056m1330
$$ 53939 52630 -36192 -11019 32233 -17406 25307 110404 -853 -69225 36869 15813 -25517
154b5517R0977n2452j04279P5092L2753m5293M3178L560q1077J6522Q5578j6876
$$ -25517 65460 13008 -91271 -16179 16574 -28719 14459 18019 -63058 -46536 39042 22166
166B2166m6416M2439j0637n7318P5166L5179r4038J8680L5937o2409M4664N1248
$$ 22166 -24250 18189 7552 -49766 25400 60579 -33459 -14779 21158 -41251 3413 54661
178E4661q7353j5017N6697j5944L689M0109l0436n1066L5814N2169k4024p73K0882
$$ 54661 -32692 -47709 8988 -6956 -3267 36842 6406 -44660 -8846 43323 19299 18526 39408
191C9408o4956j902Q5784k9977l7226L9543n0054l1743P5722k015m7933J3268
$$ 39408 -25548 -27450 58334 28357 -8869 30674 -19380 -51123 24599 22584 -25349 -12081
203a2081n556k2544K8474L2410k7193k9220L1425O692k1004M3066q69n8292L7710
$$ -12081 -17637 -40181 -11707 20703 -6490 -35710 -4285 2407 -18597 24469 23600 -34692 3018
216C018L0097l9736K3575P899n3009J9089L6672j9550p909R39j7739l865L0778
$$ 3018 33115 -6621 16954 24853 -28156 -9067 27605 8055 146 1085 -16654 -20519 10259
229A0259J9033l4953j2294K1425j9912J4933M4743m2499k4454L5732j9680p77
$$ 10259 29292 -5661 -17955 3470 -16442 -1509 43234 735 -23719 12013 -7667 -8444
241h444M0503k6899k8094J8940K203m608Q764L112j6526j0687K7897K943k4201
$$ -8444 32059 5160 -22934 -3994 -1791 -6399 2365 5477 -11049 -21736 6161 9104 -15097
254a5097K2773M33k8862L4481R172l6635J8100O555k2340K1534P729k3057k912
$$ -15097 7676 8109 -20753 13728 22900 -13735 4365 10920 -11420 10114 17843 -5214 -8126
267h126K920L007K589K798J063k1333N3K6107j1381J302J7684k9049m93K9248
$$ -8126 -5206 -2199 390 3188 4251 -17082 -17029 9078 -2303 -1001 16683 -12366 -12859 16389
281A6389j5883Q68J5794k1872j842J3553n509M29q51j796n52p550R943O66j5337
$$ 16389 506 1374 17168 -4704 -6546 7007 1498 1927 1076 -720 -1272 -8822 1121 1787 -13550
296a3550J6956K184j8481J7670j533j5462K0063l15j1494J0857p167m033R429
$$ -13550 3406 5590 -12891 4779 3246 -12216 7847 7532 -3962 6895 -272 -4305 5124
309E124m298L762j542r761Q303l473l210J3464j0949k582J1644j2604L012J0368
$$ 5124 826 4588 3046 -6715 1588 -1885 -5095 8369 -2580 -5162 6482 -6122 -3110 7258
323G258j2450P674M862j3578O580q26n263J2529n418m590L827j0965O653J0231
$$ 7258 -5192 2482 7344 -6234 346 -480 -5743 6786 1368 -3222 605 -10360 -3707 6524
337F524r256O066k782j2346J4019L387l898P830j1102l690J0950m690N995R82
$$ 6524 -2732 3334 552 -11794 2225 5612 1714 9544 -1558 -5248 5702 1012 7007 7989
351G989j5235P532K331p344J0886p262j0305J1806l136l46O640j1871J190P419
$$ 7989 -7246 286 2617 -4727 6159 -1103 -11408 398 -2738 -3084 3556 -8315 -7125 294
365B94k131R634o068j1292R843o78M055J1716j6099n963Q632n047J1733O006j8152
$$ 294 -1837 7797 1729 -9563 280 -398 3657 15373 -726 -6689 1943 -3104 8629 14635 -3517
380c517n19J39o09J5953k956j1126n16o011R324J0766j0597j015n292o972J8130
$$ -3517 -4036 -3897 -4506 11447 8491 -2635 -3151 -9162 162 10928 331 -684 -5976 -12948 5182
395E182N78j1380M221r107m45J7861n435o320K43p771J0931R904m633J43r789
$$ 5182 5760 -5620 -1399 -10506 -10951 6910 1475 -4845 -4602 -12373 -1442 8462 3829 3972 -5817
410e817j244J8284M72j183m14j7822N166J5755l669K370q098j7240R387P424J121
$$ -5817 -7061 11223 11695 10512 10098 -7724 -2558 13197 9528 11898 3800 -13440 -4053 3371 4492
425D492K966j6279p564R211K553J0887j714j8901M442O205K464J4364j0218j5587
$$ 4492 7458 -8821 -16385 -7174 -4621 6266 4552 -14349 -9907 -3702 -1238 13126 2908 -12679
439a2679R080K750N791P723j4638p928M416M946J2495n261j2954O96m034J1534
$$ -12679 -3599 -849 4942 12665 -1973 -9901 -5485 -539 11956 6695 -6259 -5563 -9597 1937
453A937J7189j5859q779L651o749J5989J3572j7632p574q77j546J4827L835r790
$$ 1937 19126 3267 -5512 -1861 -8610 7379 20951 3319 -4255 -5132 -6678 8149 11984 2194
467B194r201q348J0531J0428l101Q65j3378r606K2505N811o635N759j4594m641
$$ 2194 -7007 -15355 -4824 5604 2503 3368 -10010 -19616 2889 8700 2065 7824 -6770 -11411
481a1411K3990K165p076k247j3288J574J3680L037n952j6353m387R268K282J0033
$$ -11411 12579 14744 7668 5421 -7867 -6293 7387 10424 4472 -11881 -16268 -7000 -4718 5315
495E315k450k4995M971J5937p15J3249k801k3189Q406J4169K112Q065q456j4683
$$ 5315 2865 -22130 -17159 -1222 -1937 11312 8511 -14678 -6272 7897 10009 18074 9618 -5065
509e065J632Q380J0361k891j3602l252m573O901J7943j1895j2496N375o920R732
$$ -5065 -3433 4947 15308 12417 -1185 -4437 -9010 -2109 15834 3939 -8557 -3182 -10102 -370
523c70J8950j5731j1426M681j660J0959P407j2287j0772m280P437J0729m143l714
$$ -370 18580 2849 -8577 -3896 -5556 5403 12810 523 -10249 -14529 -7092 3637 -506 -4220
537d220j0799r934K0402J2148r678K516q714o941K4053R702p965m94r696p08J6300
$$ -4220 -15019 -24953 -4551 7597 -2081 435 -8279 -15220 8833 18535 10570 10076 380 -328 15972
552A5972M429m685j1832r967O480L822K612j41j9374m223J3281p00O898P76j9596
$$ 15972 20401 15716 3884 -6083 397 4219 6831 6690 -12684 -16907 -3626 -4326 2572 3348 -16248
567a6248L117J5382J086N174m924j3017M264P482O412J051j3892n634J389L268
$$ -16248 -13131 2251 3337 8511 3587 -9430 -5166 2316 8728 9779 -4113 -9747 -8358 -5090
581e090J3938m915j6239K694R90N333J6830o790j2305K751Q72J1213R198j1060
$$ -5090 8848 3933 -12306 -9612 -8622 -3289 13541 6751 -5554 -2803 -1931 9282 18480 7420
595G420o592l066J424J2437k051r443l745r320O543J3155p159m861l673n241J3943
$$ 7420 828 -2238 -814 11623 9572 129 -3616 -12936 -6393 6762 -397 -5258 -8931 -14172 -229
610b29Q955o380j059o454P48J4578J151k848m885j1394P033R238m746L52q846
$$ -229 8726 2346 1287 -5167 -4419 10159 11310 8462 3577 -7817 -784 8454 3708 4060 -4786
625d786j0886J0012N574n66J052j1561k118J0423M384N831m160j0558N824M553
$$ -4786 -15672 -5660 -86 -652 400 -11161 -13279 -2856 1528 7359 3199 -7359 -1535 3018
639C018L128P369j0539q692P275j7M548L080j3130l205M594J489P508l306r468
$$ 3018 6146 13515 2976 -5716 1559 1542 6090 9170 -3960 -7165 -2571 -1082 6426 3120 -6348
654f348J466Q82P387P029r565l503J297j932J0924J629j1925L50k469j094J0964
$$ -6348 -4882 -4000 3387 10416 851 -2652 -1355 -3287 7637 9266 -2659 -2309 -4778 -5872 5092
669E092k546p479p67m158N533P882m249r18l693k034J1392J505k583J603p608
$$ 5092 2546 -4933 -5700 -9858 -4325 3557 -692 -1610 -5303 -7337 4055 5560 2977 4580 -3028
684c028J775J0445l840p88r49q708N489M672l523R79o591m099P469R52R08k40
$$ -3028 -1253 9192 5352 4564 3615 -5093 396 5068 1545 2524 -4067 -8166 -697 255 1163 923
700I23q512K808O556r14M745m430o933O675J159K00M754q138l558N239j866L535
$$ 923 -7589 -4781 1775 861 5606 1176 -5757 918 2077 2277 7031 -1107 -4665 574 -1292 2243
716B243P98p861J001Q91L58O539m695l108L493k570M865M359p529J557J624l756
$$ 2243 3041 -4820 -3819 -2928 -2570 3969 -726 -3834 -341 -2911 1954 6313 -1216 341 1965 -1791
732a791O763k95o808L043k413o48N783m080j972O83l106N231J863m170K944l632
$$ -1791 4972 4677 -2131 912 -1501 -2149 3634 -446 -2418 -1735 -4841 390 2253 -1917 1027 -2605
748b605p88Q400l355j318L707o460J808N531n309J337L81n506L612O50j891K466
$$ -2605 -3393 5007 1652 334 4041 -2419 -611 4920 -389 948 1329 -4177 -565 85 -1806 660
764F60m071K67M100l402L084J130n213N237J126m005N290k374l248N545k774j467
$$ 660 -3411 -3144 956 -2446 638 1768 -3445 1792 2918 -1087 4203 1829 -1419 4126 1352 -115
780a15L606m972M45K296l945K654r27l190M065k152n50M846m727J024M142m572
$$ -115 3491 -1481 -1036 1260 -2685 -31 -958 -4148 -83 -2235 -2785 2061 -2666 -1642 2500 -2072
796b072K377K298m398M058M6l852L921k187j366M357m051J83K343m471L171K070
$$ -2072 305 2603 -1795 2263 2309 -1543 2378 191 -1175 3182 -869 -686 1657 -2814 357 2427
812B427m490L589j565k815N548j859j262K889m640R66L804l776J828n6n041M670
$$ 2427 -2063 1526 -39 -2854 2694 835 -427 2462 -2178 -1212 2592 -1184 644 588 -4453 217
828B17m8k455L519l512r58M626k451J619J570m918L293K093k243L763k762l406
$$ 217 169 -2286 1233 -2279 -3237 1389 -1062 557 2127 -2791 502 2595 352 4115 1353 -2053
844b053M501j606O99K695o204k00L088k701L827p33n935K884l82J82M874m450
$$ -2053 2448 842 1541 4236 -1968 -2168 920 -1781 2046 1313 -4622 -1738 -2120 -1938 2936 -1514
860a514k153K849k384M631K098n663J615J26j632O515j923l892K361k985K480
$$ -1514 -3667 -818 -3202 1429 3527 -2136 -521 -395 -2027 4488 2565 -1327 1034 -1951 529
875E29M613m637m8n01l121O055R10m017J424l556q0O191k428j315m0m890L782
$$ 529 5142 505 457 -44 -3165 2890 3800 -217 1207 -2349 -2429 3762 1334 19 -21 -4911 -1129
892a129L779l125J150l507l205O398L05m71R86n916J073N469j361K655j817n607
$$ -1129 2650 -475 675 -2832 -6037 361 666 195 1181 -4735 -3662 1807 446 3101 1284 -4323
908d323M291K290PK861n323k781M705o59K446L14p166J206J904l01M945l997n132
$$ -4323 -32 2258 2265 5126 -197 -2978 1727 1068 3514 3828 -3338 -2132 -228 -529 4416 419 -4713
925d713L150o13K750M052o274j676K004n79N356N45o230R86q07J313N703l331
$$ -4713 -1563 -2176 574 4626 -1648 -3324 -1320 -1899 3457 4002 -2228 -1242 -2049 -736 4967 1636
941A636l128L2k608N236L499n200P5k055k008Q010j64l854N30m113K230O233k748
$$ 1636 -1492 -1460 -4068 1168 4667 -533 -458 -2513 -4521 3489 3325 -529 1 -4112 -1882 4351 1603
958A603j184j955l674N337K833k107K43n278n34O903m50O64o74o513L249N418
$$ 1603 419 -1536 -5210 127 2960 853 1096 -4182 -4716 2187 1737 2401 1727 -4786 -1537 3881
974C881j180K115l736m876N210J478L82J222o892j223L632j04L338k108o678J985
$$ 3881 2701 4816 1080 -3796 1414 2892 3274 4496 -2396 -3619 13 -91 3247 1139 -5539 -3554
990c554J158J432M481m958l776K944j11M115K443o615l55J286J70N803j166n453
$$ -3554 -2396 -964 3517 -1441 -5217 -2273 -2384 1731 4174 -2441 -2796 -1510 -1340 4463 3297 -2156
1006b156R29j213K938N220m150k597q4j516O094K098m511m53k837P78O924j767
$$ -2156 -1227 -2440 498 5718 1568 -1029 -1113 -2629 3465 5563 1052 599 -2238 -1460 5464 3697
1022C697k908o59m587M025M609l717o53k805l144N733J831j671j45m814O87N662
$$ 3697 789 130 -4457 -432 4177 460 -193 -2998 -6142 -409 1422 -249 -394 -5208 -4521 1141
1038A141l57J170j983m815M358L060o76K216n179k676N261k55J348P62o604L81
$$ 1141 784 1954 -29 -4844 -486 2574 1898 4114 -1065 -3741 1520 1265 2613 3375 -3229 -2848
1054b848L188L5L494k608n209K557P46K355L363n376k371K216l8M477J67o553
$$ -2848 340 375 3869 1261 -3948 -1391 -645 1710 5073 -303 -2674 -458 -496 3981 4148 -2405
1070b405P24M8P01M834l199l460R34j761L848L660m962p45j26r73N869K32l770
$$ -2405 -1681 -1633 -932 3902 703 -2757 -1823 -3584 264 3924 -1038 -1783 -1909 -2882 2987 3219 -551
1087e51M09k651J776N079k497j429r61l480M657K453l155J176l473j531N803j7
$$ -551 -142 -2793 -1017 4062 1565 136 -825 -4305 352 2805 -350 826 -2647 -4178 1625 1608
1103A608q22N35m881J901M634j121J011k374l356L811R23n9J517n355p72L836
$$ 1608 786 1321 -3560 -1659 2975 1854 2865 491 -2865 946 1869 1810 3327 -2028 -2800 1036
1119A036j109J677l75n014J558J733K00L074l383k860K682P7K319J845n179K33
$$ 1036 -73 1604 1229 -3785 -2227 -494 -294 2780 -603 -3463 -781 -704 1615 3460 -1719 -1486
1135a486J731j178L939p86m706J623n42N87L933l069j929R29j269L466J558l204
$$ -1486 245 -933 3006 2220 -2486 -863 -1405 -818 3115 46 -1883 -954 -2223 1243 2801 -403
1151d03N71j457L13M508j693k012J288k850J249L655l043q2q58k309L345Q38j800
$$ -403 168 -1289 -976 3532 1839 -173 1115 -1735 -486 3169 126 44 -814 -3123 222 1060 -740
1168g40P88k881N13L672j225O89n9l835L291K128k100J974k425k166L526l32l22
$$ -740 48 -2833 -2320 1352 127 816 757 -3078 213 2341 241 2215 -210 -2376 1150 818 496
1185D96P20l589R38J742j348K400j455k946K950Q8m29L166k927j346K724q83J091
$$ 496 1216 -2373 -1435 307 -1041 1359 -96 -3042 -92 -4 -433 2733 -194 -1540 1184 301 1392
1202A392R21l036P01J01k42K120k166j540K051k236J364K648l695O53J107k071
$$ 1392 2313 -723 -22 79 -163 1957 -209 -1749 302 -1934 -570 2078 -1617 -964 143 -1928
1218a928L244N14k776J279p06K3K400j716k25L33k115K285M89k659K246j382j903
$$ -1928 1316 1830 -946 333 -373 -350 2050 334 109 442 -1673 612 1101 -1558 688 -694 -2597
1235b597L800j040j419K405k341N01K451j809Q86l4j839K497p18j092J951k215
$$ -2597 1203 163 -1256 1149 -1192 -691 1760 -49 837 803 -1036 1461 743 -349 1602 -613
1251f13m29K167k366P54J348l038J569J041k005K152r56j031K484j227L42J740
$$ -613 -1042 1125 -1241 -487 861 -2177 -608 433 -1572 580 -376 -1407 1077 -150 192 1932
1267A932k572J191J325k412J677M3k075J928r81j274J808j276k91J607j986R78
$$ 1932 -640 551 1876 -536 1141 1184 -891 1037 56 -1218 590 -686 -977 630 -1356 -378
1283c78O31j710K270o85j074K568j521r68K854j911o56J902k417Q07J307j940
$$ -378 253 -1457 813 128 -946 1622 101 -867 1987 76 -580 1322 -1095 -288 1019 -921
1299i21J120m66j284K153r40n16J676k095Q14K177k305J445N39k602K443K34j573
$$ -921 199 -267 -1551 602 -338 -854 822 -1273 -459 1718 -587 858 1397 -1205 1238 1472 -101
1316a01J734k004p72J815j050J84P08k620R97J125j319J965j004j628K541n53
$$ -101 1633 -371 -1143 672 -378 -194 514 -2106 -1109 16 -1303 662 -342 -1970 571 18
1332A8K25J920k250K4J511j510J799R1k602J000l03m15K156k189j073J680j788
$$ 18 243 2163 -87 -63 1448 -62 1737 1828 -774 226 -77 -492 1664 -525 -1598 82 -1706
1349a706J574J325k588J020K97j162K815l92j799J214j276Q91J691j835j19l41
$$ -1706 -132 1193 -1395 -375 -78 -1240 1575 1183 -616 598 -678 213 1904 69 -50 -391
1365c91j490J959Q34k283J367j329k32K965q50l98O74k030J385J789j235Q10j234
$$ -391 -1881 78 912 -1371 -4 -1333 -1565 1400 550 152 826 -1204 181 1970 735 1545 311
1382C11j716K678l61p76R47k862j36K230r39R36k82k675J700J080k10J845j950
$$ 311 -1405 1273 912 136 1083 -1779 -1915 315 -624 312 30 -2645 -945 135 -75 1770 -180
1399a80j390K267m19J219O10l085M33J147q80K110j151k613J452n07Q36J932k628
$$ -180 -1570 697 278 1497 2107 -978 -545 602 -278 1832 681 -1932 -480 -987 -151 1781 -847
1416h47n71Q53q29K416O53k417N80l88k8K966j386j313L78j569J754J913k240
$$ -847 -1418 -565 -1394 1022 1675 -742 -162 -550 -578 2388 1002 -311 67 -1502 252 2165 -75
1433g5j31r24j070L189pj457O24j899O30K961j027m17l90j866K222J455j269P23
$$ -75 -206 -1130 -2200 989 982 -475 149 -1750 -1120 1841 814 397 7 -1859 363 1818 549 1272
1451A272k291q30K906o87J54J47k891P42K000o97J190j404j768K179J14L25J644
$$ 1272 -1019 -1849 1057 370 524 671 -2220 -1478 522 -175 1015 -389 -2157 22 136 461 2105
1468B105k831n10J905l57J565l64k774R12K52J59K202j933j998J087n42J671R57
$$ 2105 -726 -1236 669 312 1877 1513 -1261 -349 -97 62 2264 331 -1667 -580 -1122 549 1506
1485A506k347n62O50k62K867n00k277P59o00P56K577k094j153K63j336K363Q84
$$ 1506 -841 -1403 -753 -1015 1852 1352 -925 -166 -766 -10 2567 473 -680 -417 -1753 610 1494
1502A494j735l46q51l94K973p20q46L94k001J678K230j104J34q00j712K708L53
$$ 1494 -241 -587 -1438 -1832 1141 421 -425 -31 -2032 -354 1876 772 906 106 -1606 1102 1455
1519A455o40K90k413j42K297o45M78m64k825J552J196m11J136j485j522J942N48
$$ 1455 815 1105 -1308 -1450 847 202 680 216 -2609 -1057 139 -272 864 -621 -2143 -201 347
1536C47P28O27k587J23J101K01J446j240k228J039j88Q04J600k574q84J231o52
$$ 347 1075 1702 -885 -762 339 540 1986 746 -1482 -443 -631 173 1773 -801 -1685 -454 -1106
1553a106J983O65k577M13J34K7K473r37j213K4p46J471J283j797k00m29j426K683
$$ -1106 877 1542 -1035 -622 -488 -461 2012 1075 -138 -114 -860 611 1894 97 -103 -532 -1958 725
1571G25J88j825N99j272L12K468p29m46M0j724K014J190j055M99j518q83K339
$$ 725 913 -912 -313 -1585 -1273 1195 466 20 60 -1664 350 1540 485 984 -534 -1417 922
1588I22p3o49L74k171M37J844q68Q44q96j691J658O62p7J081j828r18J986k36
$$ 922 849 200 574 -1597 -1160 684 -184 660 -236 -1927 -269 393 316 1397 -431 -1349 637 401
1606D01O97oj977L88P78l70J233j182j244R90l47P20J293k078j23R05q92J988
$$ 401 1098 1092 -885 -497 281 -89 1144 -38 -1282 -292 -639 81 1374 -704 -827 78 -814 1174
1624A174J18k085P29j46p8K039j420j186P24p55J381L32j423L03n54l27K142m32
$$ 1174 1292 -793 -64 -210 -288 1751 331 -855 -131 -886 495 827 -596 -293 -847 -1174 968 536
1642E36j088R63j498O78K056j445N8j4j286J529P15j138L51r60k46J470p57L32
$$ 536 -552 411 -1087 -409 1647 202 260 246 -1040 489 1204 66 417 -543 -789 681 -76 256
1660B56J46j806J137Q17j163J499q00j334J789j37k56R30j667K8J029l99N56l49
$$ 256 402 -1404 -267 550 -613 886 86 -1248 541 404 148 1078 -589 -561 468 69 625 276
1678B76j413R40qk72J412j629j64J330j213J240N15j660P26K75n63J273n44j115
$$ 276 -1137 -197 -205 -477 935 -694 -858 472 -741 499 1014 -646 80 355 -208 1065 521 -594
1696e94J094p63L00R23j504L05M32j264J386J55j258J164p12m96J860q18l92Q06
$$ -594 500 -263 37 960 -544 -239 193 -1071 315 470 -788 376 -336 -832 1028 210 -182 624
1714F24j221Q92O19j348Q93m20p65J341o12l19P03r07j30J151j215Q08L00j287
$$ 624 -597 295 914 -434 459 39 -726 615 3 -316 387 -520 -650 501 -714 94 394 -893
1732h93J292l56l20J180j131n09J536r06K1Q21j520P01L72p45Q85n05r02J411
$$ -893 399 43 -277 903 -228 -737 799 -107 -86 735 -785 -84 288 -457 428 -77 -979 432
1750D32p51j61J193j148M61M47r19P92J30j076J260m54m96J149j072l83J217j241
$$ 432 -319 -480 713 -435 26 473 -446 346 476 -600 660 206 -290 859 -213 -596 621 -620
1768f20J52N36j172Q36M78j049J025n34k77J519j093K61R29j394P41O04j228Q82
$$ -620 -468 68 -1104 -268 210 -839 186 -348 -625 894 -199 62 991 -403 338 942 -286 596
1786E96k51r40J041j94n29N29q87k1J049r11N98j24p60R23L43p07J150j001m09
$$ 596 345 -595 446 252 -277 252 -635 -656 393 -518 80 -44 -804 119 462 -245 905 -96 -505
1805e05J429q90J25O29j242K32N36q75R64m32j053J096m51j7J194j227O4P38o67
$$ -505 924 34 159 788 -454 -222 314 -561 403 -29 -1082 14 -437 -454 740 -487 -423 315 -352
1824c52J255L03j757J120k06o56J247p42r05O43r23O66N89j164K97j0o29J760
$$ -352 903 1206 -551 569 363 -293 954 212 -693 -50 -973 -307 282 -882 -585 -595 -1224 536
1842E36k13q40J106j055K84J622j123J33L12j221J098M45j482O63q83o77J742
$$ 536 323 -517 589 -466 -182 1440 317 450 762 -459 639 1084 -398 265 -618 -1295 447
1859D47n52m14M82j138N68J256r58O85p8j112J634j06k82Q06j428k97J406r25
$$ 447 -105 -519 -37 -1175 -607 649 -309 376 298 -814 820 714 432 1238 -190 -487 919 -6
1877fN54l63j559Q91M35n11J072q38o80J156n80Q50O74j367J89O24m37J214n67
$$ -6 548 185 -1374 -483 -48 -559 513 -325 -1005 151 -429 421 1095 -272 -83 541 104 1318 751
1896G51j201L70k57R6J042j249m46L28o07J065L81j183M67j83k2K038q55m62L63
$$ 751 -450 -80 -337 -241 801 -448 -894 -566 -1173 -108 273 -910 -443 -626 -648 1390 535 73 436
1915D36q24Q86J232j553J91j32j214J609k8p24J69j099L9J422m93j8k06r30J188
$$ 436 -388 498 1730 177 368 236 -978 631 603 -121 48 -1051 -1012 410 -83 -101 -307 -1237 -49
1934d9O67m65O07j031p06J548j67k6K89j362K22Q01o98P61l75j485J053N4M41
$$ -49 618 153 760 -271 -977 571 404 378 667 -695 -473 328 -370 391 16 -1469 -416 -362 79
1953G9P93j396q4Q45j50J003J22j568L45M32l76J495j190j082J092r81O53Q00
$$ 79 872 -524 -608 237 87 1090 1212 -356 -11 421 45 1540 350 -732 360 -621 32 832
1971H32j404l08K44m65J554M4j338P24n73K97J621j078k37L02r51R87Q11j175
$$ 832 -572 -880 -636 -1101 453 497 -841 -117 -690 -393 1228 150 -87 215 -736 251 1062 -113
1989a13L23n77n64J504l81m76L0r18P66J141p06L62l18j113J354M91k88M49j235
$$ -113 210 -367 -931 573 192 -284 -254 -1172 -406 735 29 391 73 -1040 314 805 517 966 -269
2008b69j47J442n55J54jj703Q72N96l85M73r48p64R97R5K43O00j705L55P54m48
$$ -269 -416 1026 471 625 624 -1079 -207 389 4 477 -471 -1235 -238 -143 100 700 -1005 -650 104 -344
2028c44J382k70j587Q95p0j0J005j195m59L13n89R36N79j359L49o7k00J588p22
$$ -344 1038 768 -819 76 6 -4 1001 -194 -653 -340 -929 7 586 -773 -424 -491 -691 897 175
2047A75o51Q54q39O55J182r95k8l7o67J135J50j217L27r27n4J375n73j98J65j176
$$ 175 -476 378 -461 194 1376 381 353 316 -351 784 934 -283 44 -883 -937 438 -135 -333 -168 -1344
2067a344J140R93j000N94l98o19J348j48l01N90j512K28R68o37N28n61j030R30
$$ -1344 -204 789 -211 383 -15 -634 714 566 265 855 -657 -429 539 -98 430 -131 -1161 -231
2085b31K01k60P92j022k67J137p42J113M5j291O90L55o02J051p39o94O47l50K03
$$ -231 -30 -290 502 -520 -787 350 -392 721 766 -525 165 520 -82 969 230 -464 183 -167 36
2104C6O33j040k43M58o07J177j59p42Q22o19q6J597j071k82L14o64R97K97j277
$$ 36 669 -371 -614 -156 -763 414 255 -487 335 -284 -370 1227 156 -126 188 -476 521 818 -459
2123d59M01k37m68J084j46o99N84p25J99J135r96L79J21j033J358K62q90R41q19
$$ -459 -58 -295 -763 321 175 -524 60 -665 -466 669 -327 52 173 -860 498 760 -130 811 -8
2142hn50J308q95L32L68r60J97L63m24O36n32m31Q85l22j1N36j204K48R61r30
$$ -8 -558 750 -145 187 555 -405 -208 155 -269 367 -165 -596 289 -33 -44 492 -712 -464 497 -433
2162d33Q29Q9j131O79K06n79R47q09l76P34m92M86L60r48M90M58r12J085l26n98
$$ -433 396 485 -646 33 239 -340 607 -202 -578 156 -336 150 510 -438 52 510 -402 683 357 -241
2182b41R87p01n3O93r21J5M29q56Q15O3j019J009m96m49J259o42p1O91j041N34
$$ -241 746 45 -8 685 -236 -221 208 -648 167 230 -789 220 -276 -725 534 -108 -179 512 -529 5
2202EM82r78Q29j57q63J408n22n56R17o96J11N62q47L41O95j184Q69J3p05Q95
$$ 5 487 -491 338 181 -682 726 204 -352 565 -131 -20 542 -305 36 731 -453 416 429 -276 619
2222F19o99j75Q69r82M17M27j079N51J59p51Q24m49n40J129o43k2O26n53Q2M42
$$ 619 -80 -255 614 -368 49 476 -603 -52 107 -644 180 -269 -809 320 -323 -345 281 -272 -190 252
2242B52o56O55R9p16P78k36j06O97o43j64P94q65j2O76q56N08J22p88Q56o32k68
$$ 252 -404 251 350 -366 412 176 70 767 124 -40 754 -111 -123 553 -303 205 327 -461 395 -237 -505
2263e05R85o89j62O56q25M58K79p34O39O0o79J107m56m19Q31r96L6J008p33L35
$$ -505 480 -209 -371 285 -540 -82 197 -537 102 162 -517 590 134 -285 546 -450 -414 594 -139 196
2283A96O8j087R46k1n24P44o65N7P49n20P4O22j105O88L54q04O60j76q53Q69n57
$$ 196 264 -823 123 102 -422 322 -343 -286 463 -57 17 639 -466 222 576 -228 432 256 -597 272 -285
2304b85j33P13o66j40O79m27N56k2p38M74nM6N89n79l68P88m95K29P11j079L84
$$ -285 -418 295 -371 -511 168 -259 297 275 -463 11 6 52 641 62 -306 482 -13 216 927 -152 232
2325B32j30o57Q96l56m64M13k15j09P52o79J56J67m58P79K02o67P02n60j84R31
$$ 232 102 -555 341 -15 -479 -66 -281 -390 362 -317 -161 6 -452 327 529 -138 564 4 -180 751
2345G51m89l46O09j216P37K55q78N34K9p61R89k64k96P24p12J60P29n61M32rq08
$$ 751 262 -84 525 -691 46 301 -577 -43 -14 -775 214 -50 -346 378 -334 -174 555 -6 426 417 -391
2366c91O06J9l74O06p10l39O09m00J38M00o15J71M24m91Q55k5o64N38j92M2Q86
$$ -391 215 234 -140 466 -244 -583 26 -374 -236 164 -451 -280 144 -347 508 483 -181 357 165 207 1093
2387A093j054r7M19q42P61J72r69L40j75n16J096o34k41M95m64L77P23o38J74
$$ 1093 39 -58 361 -481 280 452 -517 -177 -352 -868 228 -406 -647 -152 -616 -239 484 -154 20
2406B0J49m56P53ll62K18p09L2J056o98JJ93r82P98L00o34R03m68o24P42N7R5
$$ 20 169 -287 466 463 101 319 -390 -358 698 0 1 194 -788 10 310 -324 579 111 -513 229 286 381
2428C81L32j284N00O13n58P73n81q24Q78l30j55O46j043l09Q44n97P96L17j079
$$ 381 713 -571 -71 542 -16 757 176 -648 230 -100 -255 391 -652 -961 -117 -714 82 399 -680
2447f80L33L75l70Q84l39n19P01m42K45O69q09k51L38o36J083m33o98M74l81O4
$$ -680 -347 28 -342 542 203 -316 385 -57 188 857 48 -203 135 -501 582 149 -549 -75 -456 -392
2467c92R41o17o2K07m31N52K40l98L83m35l06J100l43n79O44j052K81M21l54M6
$$ -392 549 -68 -130 77 -354 198 438 40 423 -12 -318 782 439 -140 504 -548 -267 154 -200 -154
2487a54l12o90R13Kj44M71o72L1R40l87N09K24j281N91M69l39N02p33m77Q85l40
$$ -154 -466 -1156 -243 -241 -385 86 -586 -555 385 -2 507 731 -550 41 510 171 673 -60 -537 348 8
2508Hp4N31j091K03N02m41R01k72q90P61J1r7J015r64j41L40n48O79k4r81O21
$$ 8 -66 465 -626 -423 79 -362 539 267 -623 138 149 52 1067 103 -38 302 -246 433 409 -572 49
2529D9l02k95P52l82o01O20n05N26M48n57L63P0m56O87K25n61K72l94k88R64n17
$$ 49 -253 -548 204 -178 -779 -159 -664 -138 310 -247 116 186 -270 417 642 81 353 -41 -329 635 118
2550A18j58K07r13O37L76m71J63k34n34J063N1k79M82q43L58P01p93O60o7r49
$$ 118 -40 167 -746 -109 267 -204 -41 -275 -809 254 305 26 508 -335 23 724 -69 591 524 -425
2570d25N68J07k77M82q22j18L73k32L39K7m32n5N37m77Q80m33l78O33o44M66N28
$$ -425 143 250 -27 455 -367 -485 -112 -344 -5 22 -410 -465 72 -405 475 42 -336 297 -347 119 647
2591F47r22Q2L73o09M74J0o70M54K8k44P72m55k67L83m08Q18K72n46k01K76l90
$$ 647 -275 -193 180 -429 45 55 -615 -161 -133 -377 395 -60 -327 56 -352 466 738 192 -9 267 -123
2612a23P90m84l10L94o26K24O33r61N14k3p78P30P7n21N44l68J7O66n05M1N36
$$ -123 667 183 -127 267 -359 -135 498 -463 51 28 -750 -20 57 -464 80 -288 -271 395 -110 -69 467
2633D67p75J98O18n74L36k67n58R05k74k14L19n63J27N29m85L47J47o14M90l8
$$ 467 -308 -110 508 -66 270 3 -555 350 76 -138 181 -382 -255 274 -211 136 283 -331 159 121
2653A21k79Q17q66q3K60j87K22R3n95K55M06n91P39l49l47N25j59j19Q08q16M67
$$ 121 -158 659 -207 -290 -30 -217 5 98 -497 -242 164 -427 312 -37 -384 141 -18 -137 671 -145 322
2674C22R4p50O88K96o70M32k05l37Q49n86L7J63p74N65K89q09M55r7n21N87n2
$$ 322 416 -334 354 650 -20 412 207 -130 719 133 170 333 -441 124 413 -396 59 -38 -559 28 -24
2695b4k07N40o48J26M38p43N35N2o16O21M3m29O72l89k05N63m67P6L77o07N04
$$ -24 -231 309 -339 -213 225 -518 17 69 -547 74 117 -312 360 -29 -234 329 -138 -62 315 -292 212
2716B12J08n46M48J4o32O24l46j01O02o66J27M17p26M95J26o46Q70j40p27O04
$$ 212 320 -226 222 236 -396 228 -118 -219 383 -283 -156 261 -465 30 156 -490 380 240 -487 117
2736A17k25j66M44k99J78K34n28K30J72m12N29l14k67O37l85j00L21n33K85M04
$$ 117 -108 -274 170 -129 49 283 -245 -15 157 -255 274 -40 -307 330 -55 -155 166 -367 -82 322
2756C22n80J79J29m27M28po9K38m32o2N36n14L63K41o79Q60m12m10M68l03j61
$$ 322 -258 -79 50 -377 51 44 -25 213 -219 -281 255 -259 104 345 -334 526 114 -296 172 -131 -292
2777b92P95o32m0L24m82K23J03n99P78j66j36L42k69m5N99n79j30O65q92P23k55
$$ -292 503 -129 -169 155 -327 -104 -1 -600 178 12 -124 218 -51 -96 503 -76 -206 459 -433 290 35
2798C5o24Q55l22j92M87l32k59M64l85J75N50o95K69R0m72P57p1n78P65n91r2
$$ 35 -589 266 -56 -248 239 -93 -352 112 -273 -98 452 -243 26 116 -356 401 330 -248 517 -74 -166
2819a66O44p89L75J03p28N97nm36M75k53l86P51m16J14M86p29N80L2k47L84m54
$$ -166 478 -311 64 167 -561 36 31 -405 70 -183 -569 182 -234 -120 366 -363 217 249 2 386 -68
2840f8r8M05k02m0P39j200K14O31p11N03J6n55M73J08j77L20k72j10K37j79m5
$$ -68 -166 239 37 -3 736 -464 -250 381 -330 173 189 -366 107 215 38 358 86 -24 213 34 -11
2861a1M14q63O26j23m42N85j49k46L40l70j13Q07m97k38M49k74L20J96m11J49
$$ -11 403 -460 166 43 -399 186 37 -209 131 -239 -352 455 -42 -280 169 -105 215 411 0 149
2881A49O5l29O92l59k74L06m29J76N38q23K89J86q31R17j77j9J19l12k15N75l49
$$ 149 214 -115 577 218 -56 250 -179 -3 535 -288 1 187 -644 273 96 77 196 -116 -331 244 -105
2902a05LN67r08M84J38k22J65l43K8L08l12j66O91p74K84L28l04M97k82m23Q62
$$ -105 -102 465 -443 41 179 -43 122 -221 -193 115 -197 -363 328 -446 -162 166 -138 359 77 -346 516
2923E16k27j15K33n49J86L51n27L72o2m50J14J25l24O95l21l52K04k76M68K94
$$ 516 289 174 407 -142 44 395 -132 240 178 -272 -158 -33 -357 338 17 -335 -131 -407 61 355
2943C55n91J22K88m24N76j58l33K13j56j87P18p21j29M32m66L50K25n25J48Q9
$$ 355 -236 -114 174 -250 326 168 -165 48 -108 -295 423 -298 -427 5 -461 -111 114 -411 -263 -174
2963a74m85R20km57O41o17M15L55m42J72J43o56O21m9n80O32n46j38N14k48Q7
$$ -174 -659 261 259 -198 443 -174 241 596 154 326 469 -187 434 385 -195 437 -109 -247 267 19 106
2984A06J88p27M19K04m09N35l29m90O01k07J22N12p52K4M13n27L87q2o49N28K0
$$ 106 294 -433 -14 190 -219 316 -13 -503 98 -109 13 525 -227 -203 210 -317 70 -12 -661 -133 -113
3005a13j1N61p66q8M54k45L32L50o50K44K93m07N95k86l29K22l72J11N54q14K52
$$ -113 -124 437 -329 -417 37 -208 124 474 -176 68 361 -46 549 263 -66 156 -216 -105 449 -365 -113
3026a13J60n99P16k94k99N92m46p8O93l31J34J10l86L39m1k10J99l13k74M91N5
$$ -113 47 -552 164 -130 -429 163 -283 -361 332 1 135 245 -141 198 157 -53 146 -167 -441 50 105
3047A05j93P6n45K07M37k79K28j3m74O26P0k30N72n94j70O32o48L88K43o96J60
$$ 105 -88 -12 -557 -350 87 -192 36 23 -451 175 245 15 587 -7 -177 455 -193 195 438 -258 -98
3068i8L80m51L27n4l01J52j81J28L49m84N1L81m38N11J16o10N51l42M0P1j39j61
$$ -98 282 -169 158 104 -197 -45 -226 -98 251 -233 -182 199 -239 272 388 -222 329 -13 27 98 -41 -202
3090b02K72m00J98K66m56J37K13m63O42j51l25P38o78L26K25l65L81j49p00P12
$$ -202 70 -330 -132 134 -322 -185 28 -435 207 56 -269 469 -209 117 342 -23 358 209 -491 221
3110B21r7j45L29m43k42O97m96j71M43o41M02L06n05N67l4n25N96j87j16O26o46
$$ 221 124 -21 308 -135 -377 320 -176 -347 96 -545 -143 163 -342 225 191 -334 262 75 -41 585 -61
3131f1p1N54n79K72J21m52N46r1l22O31p12r6O64m89qL68n63K11J76l37N04j93
$$ -61 -132 422 -157 115 236 -216 330 239 -83 548 -164 -260 404 -85 -93 275 -288 -77 99 -238 266 73
3153G3l41M13j90k18M57m55n7J97k81M45j40l13L39Nk51P68l29j30L79m52J56
$$ 73 -268 145 -45 -263 194 -261 -318 -121 -402 43 -97 -410 -71 -66 -317 451 122 -8 371 -81 75
3174G5L88o31K80Ol20M37j31l25M60m98p2L82N1q8K06m49K45K39m03L72k93j41
$$ 75 463 -168 112 118 -202 235 104 -221 239 -259 -331 51 102 14 220 -229 16 255 -148 224 -69 -210
3196b10N45m27R9K39o56L35K25l55P7R2o09R22n11j37O99n25L57J04l82K77J49
$$ -210 335 -92 7 246 -410 -75 150 -205 -128 -36 -645 277 -234 -371 328 -197 160 264 -118 159 308
3217C08j98J57k1k46M32n21j38O02n76p7N73n73K22K20l95L76k50P3K01j73n6
$$ 308 110 267 246 0 432 -89 -227 375 -201 -278 295 -278 -56 164 -231 145 -105 -32 169 -4 -60
3238f0K49j41J80J3k68K25q1n86M61j67K5K93n6m97N27l74J61K25o34N31K35k09
$$ -60 189 48 228 241 -27 198 117 -469 -8 -175 -150 143 87 -410 117 -257 -96 129 -505 26 261 52
3260E2K56j85m46O67n25K40M00m81J8K54n05M37k99l9M8J15j25L65l10J70J84
$$ 52 308 123 -323 344 -181 59 459 -22 -4 250 -255 182 -117 -156 -108 7 -118 247 -63 107 291
3281B91n09L63K16o33N44m1l94L28N5l65M56m74l4K75j68l75N46m40N64k18l70
$$ 291 -218 145 361 -272 272 231 -163 165 220 -145 311 -163 -197 78 -90 -465 81 -359 205 -13 -383
3302c83O07m83K28L61l41j45L74m68L53L06n71K34q8m23N99m21KM41m93K89J07
$$ -383 224 -259 -31 330 -11 -156 218 -250 103 409 -162 72 -16 -439 160 -261 -259 182 -311 -22 85
3323H5l90L74Q5m45N30j79p4L18k54k48J58j22L24l9l86J71J94n84P30n07k36
$$ 85 -305 69 154 -291 239 60 -14 304 50 -198 -40 -162 162 123 -263 -92 102 -482 248 -259 -495
3344d95Q98p19K71M34o01J12L60l46K30M0k68K13j84j94N14l22j27K91k91K31
$$ -495 403 -316 -45 389 -212 -100 260 -86 144 184 -84 129 -55 -249 265 -57 -184 107 -184 47
3364D7J86p36P43l46m05N43q1N5J39k15N9K88l81K18R2n48N89j07m93M43r9l32
$$ 47 233 -503 240 -106 -511 32 -49 6 145 -70 -11 277 -104 114 206 -342 247 140 -353 90 -9 -341
3386c41M72j90j83M09l68L38n0j2R4r7m65O21q5o5J85l75PJ91k45K31j02m86M66
$$ -341 131 -59 -242 167 -201 137 87 75 169 72 -393 228 143 78 263 -112 -105 86 -159 72 -30 -516 -50
3409e0j69r2N34k40j56M33m37K56J23l21J05j33j02P11l92k16L99m58r5M33m63
$$ -50 -219 -311 223 -17 -173 260 -177 79 202 -119 -14 -147 -249 462 70 -146 253 -205 -300 133 -330
3430c30K06K79l44L64J47l75M78m31L4L61m02J7O1j18nK97k96J52j21j05K58K6
$$ -330 -124 155 -189 175 322 -53 425 -6 28 389 -13 4 65 -53 -58 239 -57 95 -26 -131 127 153
3452A53j87j16l4m3L47m51L95j3m01K30K19k62J95P1j38K87l99L02ol33n9K38
$$ 153 -34 -150 -184 -227 120 -331 64 51 -350 -120 99 -163 32 103 -35 252 -147 155 149 -184 -243 -5
3474ep6J74Q0m10L92l81K1N72o58K55K13m54N28K7k64l7K37k29M20l82l31L42
$$ -5 -81 93 173 -237 155 -226 -205 367 -291 -36 177 -277 251 278 14 -23 214 -15 405 23 -308 34
3496C4l83K12K69n42K40l9r6N34m29N1L08j82J60L46m39j97L95n20N04J29n58
$$ 34 -349 -137 132 -410 -170 -209 -305 229 -200 -149 159 -23 137 483 44 -153 242 -278 226 355 -203
3517b03M08m91q6N45j74j19J33k23K85J95m29L39k07j58M47k02j33M82m75K8K76
$$ -203 205 -286 -372 173 -1 -120 13 -210 75 270 -159 180 -27 -185 262 60 -73 409 -66 -38 238
3538B38l37K68R6n06J59qj69L11r3p9M62n38M06J03n83L00K37k14J87k50J9J12
$$ 238 -99 169 265 -241 -82 -90 -259 52 -41 -120 342 -196 210 313 -270 30 267 53 240 -10 9 121
3560A21j00j03J94k72j0Q3j38K45J69m15L15o1j85K47P0k67Q3jj84N72n97K52
$$ 121 21 -82 112 -160 -170 -87 -225 20 189 -226 89 28 -157 90 160 -107 -24 -25 -209 363 -234 18
3582A8k6l34L36ql96N49k78q9N24l63N6R6j38N5L15l33L56k43kJ31j58K47j38
$$ 18 -8 -342 -6 -14 -410 139 -139 -228 296 -67 -11 85 -53 2 317 -16 340 97 95 226 68 315 177
3605A77k89K30L1l49J95j22j66L31j84l4M51m03J0N06l59K11n2m05M05p9m03M21
$$ 177 -112 118 149 -200 -5 -127 -293 38 -146 -180 271 -132 -122 384 25 236 184 -221 184 105 -298 123
3627A23j37j96L45k25J34J29l21K36R0l30R2J88m20M05m8j38M53l73N2L36k62
$$ 123 -14 -210 135 -90 44 173 -148 88 178 -152 -60 128 -292 113 65 -73 380 7 59 395 133
3648A33K20k08m35N17o5m03Q7Q9k0j10o1K64K11l92J36J62k42L28k53k3M48l43
$$ 133 353 145 -290 227 162 -241 -154 -65 -85 -195 -256 8 219 -173 -37 125 -117 211 -42 -65 383 40
3670D0q4J38j13j37R6m20O28L1l15J19J38p9Pr5n6L07k06J59j22L7K81k33n3O4
$$ 40 -44 94 -19 -156 -60 -480 148 179 -136 -17 121 42 49 -46 -102 205 -1 158 36 73 354 121 68 132
3694A32j88oP3j64R0O6l08O6J34j41J29K05R1N8k49k1J18r2j53L27l27K55mk55
$$ 132 -56 -62 11 -153 -63 3 -305 -239 -105 -246 -117 88 179 237 -12 -33 85 -7 -160 167 -160 95 91 -164
3718a64n1J31k59N04k83J36J60m39K30K35l47L07J85n04L56P4l50N27l42k08M48
$$ -164 -215 -84 -343 161 -122 14 174 -265 -35 200 -147 160 345 -159 197 271 -79 448 106 -102 346
3739C46j68j69R7k96K33m3m00M19Jk62K49nq7J44j25N6J53l07K7K83l41K40J51
$$ 346 178 9 106 -190 43 0 -400 19 20 -242 7 2 -85 59 -66 -10 143 -164 -137 146 -195 45 196
3762A96l86L69k88j35J43j42J27J04k07K56R0m06M30o7M5J02k10j90M40m58L11
$$ 196 -190 179 -109 -244 -101 -243 -116 -12 -219 37 127 -279 151 84 129 231 21 -169 271 -187 124
3783A24K4n05L89L0j37Pk9j2L30m13P4J81Kj86J09OJ44K6l98N55k78r4K14l55
$$ 124 148 -357 32 62 -75 -68 -97 -109 221 -192 -118 63 65 -121 -12 -6 138 164 -234 321 43 -51 163 -192
3807a92N9J85r6K63k71k74M40j26m9K07j29k29K06O9O6M6k50L13l4k78K01r7j34
$$ -192 -133 52 -44 219 -52 -326 114 -12 -61 146 17 -212 -6 63 129 175 -75 238 204 -74 127 30 -104
3830a04J73j24J9L2j35J1J3L98p8j98k18J36J33K9k7m3j35K18pq0J52k29j30K67
$$ -104 69 -55 -36 -4 -139 -128 -115 283 205 7 -211 -75 58 87 60 17 -118 100 93 13 165 -64 -194 73
3854G3k74K73m7j22P2j93N0K01p4J98l5k45kJ12R0K2k25j02M28k34LQ0k78J02
$$ 73 -201 72 25 -97 -25 -218 -168 33 -41 157 122 -123 -125 -13 77 99 -126 -228 200 -34 -31 49 -229 -127
3878a27J66j45P8j79j1M61j49j68J07J1j79L44l48M52j05o3p2o9k61J55j7J2K84
$$ -127 39 -106 -28 -207 -218 243 94 -74 33 44 -135 209 -139 313 208 145 73 4 -257 -102 -119 -107 177
3901A77l54K62n4j55K86o6k15L01j71k0J09j37O6M12o11K16Q9m15J61L50m39J7
$$ 177 -177 85 31 -124 162 96 -119 182 11 -9 100 -37 29 441 -170 46 135 -280 -119 231 -208 -191
3923a91K77k48K31q2j93K86l53L15L37l44p2K28l95L54j07q8J89j13j63K65j97
$$ -191 86 -162 69 -13 -206 80 -273 42 379 35 -37 191 -204 150 43 -45 144 31 -132 133 -64
3944f4j25m8j23M83j92NJ10k39J83Qk18J32L07l63M8l1J94K78m77RK00k24oK56
$$ -64 -189 -237 -360 123 -69 -64 46 -193 -10 -2 -220 -88 219 -144 -96 -127 67 345 -132 -123 77 -147 -153 103
3968A03o6k09J24j93P1K88l38J52J83j84K82j38l21K56j05r4M96j54k72J81k35
$$ 103 37 -172 -48 -241 -170 118 -220 -68 115 -69 213 75 -246 10 -95 -189 307 153 -119 62 -173
3989a73R7L63k75k5Q7k92K76r1j98L93m16K09n7O3Q2K6j69R3J70j45R8k96K90
$$ -173 -76 287 12 -13 74 -218 58 -33 -231 162 -254 -45 -102 -39 43 69 -100 -7 163 18 116 -180 110
4012A10n6j86J31m7j33Q0L3o4J38j53K23J0o7K8j42OJ40R7j86K22j43j99L79l38
$$ 110 54 -132 -1 -48 -181 -101 -68 -132 6 -147 76 86 19 47 -95 -89 51 148 -38 184 41 -158 221 -117
4036a17K1r4j17R4J2j24L12M7j85L33Lj26J33j72q2J48p7J03m9j93K57j09k76
$$ -117 -96 -190 -307 -213 -201 -325 -13 34 -151 182 185 59 192 20 -62 86 9 112 63 -130 127 18 -258
4059b58L40J27k87o1l6K41jn6p9K44j28N5Q1j55J41j55k91K55k5j09L20l19J26
$$ -258 82 209 -78 -139 -175 66 65 9 -70 174 46 101 182 27 168 13 -278 -23 -48 -157 163 -156 -30
4082c0j13n0P5%o1K83j57M1Q4k21K35q5p7K9J1J1K14k98p4L34m14K22J38j57J58
$$ -30 -143 -193 -118 -118 -179 104 -53 -12 72 -149 86 1 -76 -47 -36 -25 189 -109 -183 151 -263 -41 97 -60 98
4107I8K5k04J87l2J56j49J23l73J84J93J9j2l05k09L53j15J11j30j66K57J35l84
$$ 98 123 -81 106 74 230 81 204 -169 15 208 227 215 -90 -299 54 -61 50 -80 -246 11 146 -238
4129b38K80L2j20J40j82J60j04J06J2r9j63L61n4n6q6l5j08O7j14J8L08j87J7
$$ -238 42 74 -46 94 -88 72 -32 74 86 -13 -176 185 131 75 -11 -46 -154 -87 -201 -183 125 -62 -45
4152d5Mj45K91j73J88k65K77n8k0p8J05o2o3K9j69j2L53j03q3K68n17K3K17m7
$$ -45 -41 -186 105 -68 120 -145 132 74 54 -24 81 19 -44 -15 -184 -196 157 54 -29 239 -278 -255 -38 -85
4176h5K07k39J94J22k49k11L58k02R8J48n4j93K31k84l8J74J64j39j93K04M3j71
$$ -85 122 -117 77 199 -50 -261 97 -105 -7 141 87 -106 125 -159 -197 -23 141 2 -191 13 56 -115
4198a15J60K9q9Q7P7j76N0M0o4p4R8m6q7J30j47K19l11K47lN8l38J59l0J05J52
$$ -115 45 74 -15 72 149 -27 23 63 -1 -75 23 -23 -110 20 -127 92 -219 28 25 83 -255 -96 -126 -21 131
4223A31k22J12J67j51P2j68J0P1j20M13j03m38K17P3j67L05l60N9J56j29MR6m9
$$ 131 -91 21 188 37 109 -59 -49 22 -98 315 212 -226 -9 64 -103 202 -158 -99 57 -72 -68 28 -21
4246b1N4L2R8k11KQ9K22k93O5j87J03K6N1j42O0J86l5k3j5l11O42l95j0R9j98
$$ -21 33 65 163 -48 -46 43 265 -28 37 -150 -47 -21 30 -112 -52 134 99 76 61 -250 392 -3 -13 86 -112
4271a12K58l3k41K18j77N8K24l86K23n0J30l61K44l8j06L28k53N2K94l23J37j15
$$ -112 146 113 -128 90 -87 -29 195 -191 32 -18 112 -249 -5 -43 -149 179 -74 -22 272 -51 86 -29
4293b9J34R0j60q3Q6j09J48j26k65L91k82J66N5L4l58K32m8K03j0j41K38j52j47
$$ -29 105 195 35 -48 38 -71 77 -49 -314 77 -205 -39 16 50 -308 -76 -124 79 69 -72 166 14 -133
4316a33J37L3J1J94k98J1K59k90J86j11j33M23l14j03K33j73r2M30l18P2J42j95
$$ -133 4 37 48 242 -56 -45 214 -76 110 -1 -134 289 -25 -128 105 -68 -160 270 -48 24 166 -29
4338b9m0J40j94K60k69P6KJ34l02K58lp7L7k46J86M9L3J6j16K46q9R3k93L10k34
$$ -29 -69 71 -123 137 -132 -56 -54 80 -222 36 33 -44 -7 -253 -67 -18 15 31 -85 161 72 165 -128 182 -52
4363e2L4L0M1j52L5MO5ok00K23j17K8Q3n2K5j92L47j81J21k80K83M2l88J72N6
$$ -52 -18 12 53 -99 -64 -60 5 -1 -201 22 -95 -67 16 -36 -11 -203 144 -37 84 -196 87 129 -259 -87 -31
4388c1K7K28l23O7J09j42J8K2l63L30J42m3J3q5J15l3k53K45P0m29L25k44J20
$$ -31 -4 224 -99 -32 77 -65 -47 -25 -388 -58 84 41 54 -31 84 51 -202 43 113 -316 9 -235 -115
4411a15J4J22nQ3r0j23K35l27K05o2o2R4k1j60K46M8JL2j98J48P7l1n3k5l14J71
$$ -115 -101 21 16 99 9 -114 121 -206 -1 -63 -125 -31 -52 -212 34 82 83 115 -83 65 142 111 58 33 -281 -110
4437a10MJ78k42Q4K01nj69n1o6Q2J74J11j31j6J53l38K07l1R9N2l41K51k35J03
$$ -110 -106 72 -170 -86 115 110 -59 -110 -176 -94 80 191 60 44 197 -141 66 35 134 186 -155 96 -139 -36
4461c6L1J01l67K84k32J54K12o1k7Qj09J21j87l4K07L8r7K3j58J45P0J48j25j15
$$ -36 -5 96 -271 13 -219 -65 147 86 59 67 -42 79 -108 -142 65 103 6 29 -129 16 86 234 109 -6
4485fj82O0K66j53N5J37j42m6k3l6J34j21j28K12n0K16j10k13Q9J57k01J37J2
$$ -6 -188 -128 138 -15 40 177 35 -11 -34 -70 64 -57 -185 27 -23 193 83 -130 -41 116 -85 52 64
4508F4Q1j22j23N5N3j77K07N2j05J08kj1M2n0j14q7P3K22l32J01K6J35k5j04R1
$$ 64 145 23 -100 -45 8 -169 38 90 -15 93 91 80 122 72 -42 -129 -56 166 -166 -65 -39 96 71 -33 58
4533E8k08R4J08j24l8P7n1k3L6K98j92J13J69l58m7Q0j16P4P1r7M3o8m0L0K71
$$ 58 -150 -56 52 -72 -110 -33 -84 -107 -71 227 35 148 317 -41 -88 -8 -124 -50 21 -76 -33 -101 -141 -111 160
4558A60r9K10k57o0L10m13K64q3j52K64j20RJ1n7j81O5J66j50J35m5O1j16J18
$$ 160 61 271 14 -46 264 -149 115 32 -120 144 24 33 44 -13 -194 -129 37 -113 22 -23 38 -78 40
4581D0k38L09j48L31k13r1J3l0o7J43j87J37K16l24J22r0p0O0p3J9L11j2k31J47
$$ 40 -198 111 -37 294 81 -10 3 -27 -94 49 -138 -1 215 -109 13 -77 -147 -87 -160 -141 170 158 -73 74
4605G4J34l25K44k83J33J83k18Q8J67k15M8N0k51J85j6j3q7M8J96k76J70j7j58
$$ 74 208 -117 127 -156 -23 160 -58 30 197 -18 30 80 -171 14 -2 -15 -102 -54 142 -134 36 19 -139
4628a39j72N21q0k26J57L4j84K21J07j05K0r5l17J4J85R8J01m20L26k07R5j4M6
$$ -139 -311 210 130 -96 61 95 -89 132 239 134 154 59 -258 -244 -59 39 140 -280 46 -161 -66 -80 -34
4651c4k9N6j66K26Kj50K42q4q9j33K38j41j33K40J08m12o4N39k40n8J35J23j63
$$ -34 -63 -7 -173 53 55 -95 147 63 -26 -159 79 -62 -195 45 153 -259 -323 216 -24 -82 53 176 13
4674A3J13j45O5k0MJ51k70Q8n5n1K98j97j75N9Q9K80j52j20M3j86J65J50j81J72
$$ 13 126 -19 46 26 30 181 -89 -1 -56 -107 191 -6 -181 -122 -33 247 95 -25 18 -168 -3 147 -34 138
4698A38j35K48k47k6kj73K86q9m1Mo8Q8k3J91r3p6J12r0L5l0K1J89k60j71K10
$$ 138 3 251 4 -22 -24 -197 89 0 -41 -37 -105 -17 -40 151 58 -18 94 4 39 9 30 219 -41 -212 -2
4723bO0P3q4o9J72l48L09j74MJ08q4J16k42M10l45K53k58K8K63k86Q1J04m1q1
$$ -2 58 131 47 -22 150 -198 111 -63 -59 49 -35 81 -161 249 -96 157 -101 -73 190 -96 -15 89 48 -33
4747c3jL8j70J75n0J13J19j26q1J87k43K30k03O0N4j34m1m0M38j76k07R2l7j8
$$ -33 -34 4 -166 9 -41 72 191 65 -16 171 -72 158 -45 15 69 -65 -106 -146 292 116 -91 1 -36 -54
4771e4j09J54n7J56k52P2J14l1M6l6k7J10R5k00K90m8n06M38l38J36J62j91PL1
$$ -54 -163 -9 -66 90 -162 -90 24 -7 39 3 -24 86 181 -19 271 223 -283 155 -183 -47 115 -76 -69 -38
4795c8Ql1l67L39QL6n7J59K1k99K21J54j70R2l9l6Q6J2k19m3K61p3K75k60q4k6
$$ -38 -30 -61 -428 -89 -81 -45 -102 57 78 -221 0 154 -16 76 37 1 87 99 -120 -163 98 25 300 40 -44 -70
4821g0K01j15j18J49m9j00o0Q4m1Q9K82l04QP2k06K64j48L8K5J11q7Pj92Q6J05
$$ -70 131 16 -102 47 -2 -102 -162 -78 -119 -30 252 -52 -44 28 -178 86 -62 -24 1 112 25 32 -160 -74 31
4846C1p4r9P0j62M24l62K26J83r0j82J28l46J3K81k41KK10j33K89k38J60r4j23
$$ 31 -43 -142 -72 -234 190 -172 54 237 147 -35 93 -253 -240 41 -200 -198 12 -121 168 -70 90 -4 -127
4869a27J90j86k98L06J01j9m1j15J32K20l12R0N4M5J62k70L3N4P5l3J25l19L40
$$ -127 63 -123 -421 -115 -14 -33 -74 -189 -57 163 -149 -59 -5 40 202 -68 -35 19 94 61 186 -133 207
4892B07k05R8n4mj73l7L68j5j76M1q4K07m3j14J58j44K7l8o2N8j38nJ98p4K06
$$ 207 2 100 46 42 -131 -168 200 185 9 50 -34 173 130 16 174 30 57 19 -43 15 -123 -128 70 -4 202
4917B02k26j57J50J38j03Q0k38K24J82k72Qj27r9M36k04j5N0J98k36j25m4J10
$$ 202 -24 -181 -31 107 4 84 -154 70 252 -20 -12 -139 -238 198 -6 -21 29 227 -9 -134 -178 -68
4939f8K04L4N3N5m11J58J19j71Q9J0j59J22J5L4k34P5j50L45j68O0J10j11j07
$$ -68 136 170 223 278 -133 25 144 -27 62 72 -87 35 50 84 -150 -75 -225 120 -48 12 122 11 -96
4962i6K62k31J78j52OJ02r0m8P5M1O6qj31K3j04J01P5j38jL8L4M8r5N8n3J55p4
$$ -96 166 -65 113 -39 -33 69 -21 -69 6 47 113 105 -26 -3 -107 -6 69 -69 -70 -32 2 50 -45 13 -40 115 41
4989D1j20k3N6J0j0k9O1N1j60q5L9J66J88r6j8j34L9q4J65o2k22K50j17L09k76
$$ 41 -79 -102 -46 -36 -46 -75 -14 37 -123 -208 -169 -3 185 89 71 -63 -24 -108 57 -5 -227 23 -94 215 -61
5014f1J6K2r2rK67k83J84K5m9J65j47j24K14j80p8K12K4k8J55l41K75j78m3L9
$$ -61 -45 -23 -115 -124 143 -140 44 69 20 185 38 -86 128 -52 -130 82 106 78 233 -108 167 -11 -54 -15
5038a5J85j84L4k06K00j6m1j6J06j81J73j19J82k3k37J14j2p4K73j59l0p7J91
$$ -15 170 -14 20 -186 14 -2 -43 -59 47 -134 39 -80 102 79 -158 -44 -56 -130 143 -16 -46 -123 68
5061F8q7J40o4k33M01j44k1j43J95J73j37k23P3Q9p9j03J09R6j04j12J01J58j27
$$ 68 -19 121 57 -176 225 81 60 -83 112 285 148 -75 -2 87 8 -95 14 110 6 -106 -5 153 26
5084B6l1j90J61m4J57K0j20p8J57k0J00L8j47Kj31J98k76L51j54PJ59k20l8K19
$$ 26 -5 -195 -34 -78 79 99 -21 -99 58 38 138 176 29 31 -100 98 -178 173 19 26 185 -35 -73 146
5108A46j96J12r1j42K61j02J53j82n2Q3K88j32j80J23p7m9j29J1K7QK53j22m8
$$ 146 -50 62 -29 -171 90 -12 141 -41 -93 -10 278 146 -34 89 12 -37 -166 -155 -128 -120 133 11 -37
5131c7j06K86o0k38K07J01j79q8L14Jl38J75rq1m1K13k63K30p2n9Q3k68K33r3
$$ -37 -143 143 83 -155 52 153 -26 -114 200 201 -137 38 29 -52 -93 120 -143 87 15 -44 39 -229 4 -89
5155h9NK00j51J88k5k66L03n7J9k55O8j27J05k8J6J81j60J42p5r3J45m8nqJ22
$$ -89 -84 116 -35 153 128 -138 165 108 127 -128 -60 -187 -82 -110 -94 87 -73 69 -6 -99 46 -2 -7 -15 107
5180A07k69J7L28k04qK02k15n0K28q9Mj29j2M4K04k74N6K2P8M9j47j52Q6N9L8
$$ 107 -162 -145 183 -21 -29 173 -42 -92 136 47 51 -78 -90 -46 158 -116 -60 -38 40 89 -58 -210 -124 -65 -27
5205b7l1o0K53Ojo2j88MJ1R3K24k14L4j65J65p7k2Lo1q1J67J24R6k17J41k73J05
$$ -27 -58 -118 135 141 140 78 -110 -106 -95 -2 222 8 42 -123 42 -35 -57 -54 -115 -196 -29 95 191 -26 115 -158 -53
5232e3J03k60J48P8K7KR8j58J8j09m1K2J46p4J25J55n1j16n1k29J75m3o4J42L24
$$ -53 50 -210 -62 16 43 45 143 -15 3 -106 -147 -125 21 -53 72 227 176 60 9 -220 -45 -88 -152 -10 314
5257C14l69J79j21O9p6j16K40j02k13K86L4q7l6J29q6j55K19k00J15r5k6p9J95
$$ 314 -55 124 3 72 -4 -120 120 18 -195 91 125 38 2 131 45 -110 109 -91 24 -71 -97 -176 19
5280A9j42J50m6N7O3J3P5k6k00J82j37j06K08j05N5j8J52j49j52J54L4k01K69
$$ 19 -123 27 -19 38 101 114 189 163 -37 145 8 -98 110 5 60 42 194 45 -107 47 81 -120 149
5303A49j8k74M35k74k44J82L04k80P7j06Q2m5O9L8J3k43P9N5J74j92l2K03n5j99
$$ 149 131 -143 292 18 -226 -44 260 -20 57 -49 33 -12 57 95 108 -135 -56 -1 173 -19 -51 152 97 -102
5327a02K5L42j92r0m9N2k3j36J60J22j9M6m0k67J41O3m6r7J44J3k5J02Lp7l8k7
$$ -102 -77 265 73 -17 -66 -14 -37 -173 -13 109 90 136 96 -171 -30 33 -13 -110 34 47 22 124 127 50 12 -15
5353a5j66K06jM4l0j22j2J53n7l3j03L83l86o1L24q3k5k40J63l4j31M0J23J26
$$ -15 -181 25 24 68 38 -84 -96 57 0 -33 -136 247 -139 -200 124 41 16 -224 -61 -95 -226 -186 -63 63
5377F3J58j58j80J6l8J15qm2j82K91j30L94l12R5j74O9KM8Q6j12P3J69k30K5k10
$$ 63 221 63 -117 -101 -139 -24 -32 -74 -256 35 -95 299 -13 82 -92 -23 -21 27 113 1 74 243 13 38 -172
5402a72J78r4N6L7K06j37P4l15L04j32K18j63J11n1j62K17J7q7k27m4M7L0j0o5
$$ -172 6 -88 -32 5 211 74 148 -167 137 5 223 60 171 120 -42 175 192 105 -122 -166 -119 -89 -99 -164
5426a64J41L8L5l1o0J0p2J78j3o1J4R7j02L5j37K34j85K9L6o1Q4ONk27K05%J45
$$ -164 -23 15 50 19 -41 -31 -103 75 62 1 15 112 10 45 -92 142 -43 -14 22 -39 45 51 56 -171 34 34 179
5453A79pj84j37K04R6p4K2j12k9l0k02M73j00o9k34J51J58k37KK46p3o3j34J57
$$ 179 172 -12 -149 55 151 77 99 -13 -42 -72 -274 199 99 30 -204 -53 105 -132 -130 116 43 -20 -154 3
5477Cp1Q6Q8k60J11k8J56m3j59J26J67r2m3P7j34M9N6k08L15k40QJ7N1M8P8j77
$$ 3 -68 18 106 -154 -43 -71 85 42 -117 9 176 84 41 118 -16 33 89 -119 196 -44 -36 -19 32 80 158 -19
5503a9N5k03J90K5kj40Q1L1k09L2J42o0K56j17J02l09J81k7Q4j48L17k70kO5p7
$$ -19 36 -167 23 48 46 -94 -13 18 -191 -159 -17 -77 179 62 164 -145 36 9 93 -55 262 -8 -10 55 -22
5528b2pJ08J25k27Q3k10j5J11l7L6lJ51r5Q1j86k5Q4N2p1p4J61k59J67Q6l4%m
$$ -22 -29 79 204 -23 60 -150 -165 -54 -91 -55 -58 93 -2 79 -107 -132 -48 4 -67 -141 20 -239 -72 14 -20 -20 -24
5555b4K9P4k08M8K15p7j41P7L5J23j27j93J61l1L4l8J15p8M6R5j46q6R5k6mj35
$$ -24 5 79 -129 -81 134 57 -84 -7 28 151 24 -169 -8 -39 -5 -43 72 -6 40 135 -11 -97 -2 -28 -32 -167
5581a67M07l26O9n1J23j63L01k63j27K76J0j9k87K66k11L22j53o2p3k26M35n8
$$ -167 240 -86 -17 -68 55 -108 193 -70 -197 79 89 70 -217 49 -162 160 7 -55 -128 -354 81 23
5603B3j34J04k17j6L33j18j08J47o5J12q1J02n6K08l03K06o8n1L42k33j33MpJ36
$$ 23 -111 -7 -224 -240 93 -25 -133 14 -51 61 -20 82 26 234 -69 137 69 18 360 127 -6 -2 -9 127
5627A27l7j47K01j79N9K3j48k7K05n8M9k31K24JJ10p1k80K25o4n8K43k57R7j29
$$ 127 90 -57 144 -35 24 47 -101 -128 77 19 68 -163 61 62 172 101 -179 46 -18 -76 167 -90 7 -122
$$ [...]
8191B8
##END NTUPLES=NMR FID
##END=
