##TITLE=1H_21-2025
 200.13MHz, CDCl3+DMSO-d6,
 8 sc
 
 3.2.2025
##JCAMPDX= 6.0         $$ Bruker NMR JCAMP-DX V2.0
##DATA TYPE= NMR FID
##DATA CLASS= NTUPLES
##ORIGIN= UXNMR, Bruker Analytische Messtechnik GmbH
##OWNER= pz
$$ XWIN-NMR		Version 3.5
$$ Mon Feb  3 14:34:11 2025 Russian Standard Time (UT+4h)  she@DPX200
##.OBSERVE FREQUENCY= 200.1313
##.OBSERVE NUCLEUS= ^1H
##.DELAY= (6, 6)
##.ACQUISITION MODE= SIMULTANEOUS
##.ACQUISITION SCHEME= undefined
##.AVERAGES= 8
##.DIGITISER RES= 18
##SPECTROMETER/DATA SYSTEM= spect
##.PULSE SEQUENCE= zg30
##.SOLVENT NAME= CDCl3
##.SHIFT REFERENCE= (INTERNAL, CDCl3, 0, 14.3821)
##AUDIT TRAIL= $$ (NUMBER, WHEN, WHO, WHERE, WHAT)
$$ ##TITLE= Audit trail, XWIN-NMR		Version 3.5
$$ ##JCAMPDX= 5.01
$$ ##ORIGIN= Bruker BioSpin GmbH
$$ ##OWNER= she
$$ F:/spectra/data/she/nmr/H-C/1/audita.txt
$$ ##AUDIT TRAIL=  $$ (NUMBER, WHEN, WHO, WHERE, WHAT)
(   1,<2025-02-03 14:33:16.62 +0400>,<she>,<DPX200>,
      <created by zg, POWCHK disabled, PULCHK disabled
       configuration hash MD5:
       00 E9 B6 7A A2 85 ED C7 34 08 36 98 17 FE 4E 26
       data hash MD5: 16K
       F0 F5 C8 9C D8 C3 2D 26 94 8A 81 A9 4E 04 DE D8>)
$$ ##END=
$$ 
$$ hash MD5
$$ BE 4F DB 68 2B 60 80 43 FD 06 68 CF AD E3 4D 51
##$RELAX= 
##$RELAX= 
##$RELAX= 
##$RELAX= 
##$RELAX= 
##$RELAX= 
$$ Bruker specific parameters
$$ --------------------------
##$DU= <F:/spectra>
##$EXPNO= 1
##$NAME= <H-C>
##$PROCNO= 1
##$TYPE= <nmr>
##$USER= <she>
##$AMP= (0..31)
100 100 100 100 100 100 100 100 100 100 100 100 100 100 100 100 100 100 
100 100 100 100 100 100 100 100 100 100 100 100 100 100 
##$AQSEQ= 0
##$AQ_mod= 1
##$AUNM= <au_zg>
##$AUTOPOS= <>
##$BF1= 200.13
##$BF2= 200.13
##$BF3= 200.13
##$BF4= 200.13
##$BF5= 200.13
##$BF6= 200.13
##$BF7= 200.13
##$BF8= 200.13
##$BYTORDA= 1
##$CFDGTYP= 0
##$CFRGTYP= 5
##$CHEMSTR= <none>
##$CNST= (0..31)
1 1 145 1 1 1 1 1 1 1 1 1 1 1 1 1 1 1 1 1 1 1 1 1 1 1 1 1 1 1 1 1 
##$CPDPRG= <>
##$CPDPRG1= <>
##$CPDPRG2= <>
##$CPDPRG3= <>
##$CPDPRG4= <mlev>
##$CPDPRG5= <mlev>
##$CPDPRG6= <mlev>
##$CPDPRG7= <mlev>
##$CPDPRG8= <mlev>
##$CPDPRGB= <>
##$CPDPRGT= <>
##$D= (0..31)
0 0.7 0 0 0 0 0 0 0 0 0 0.03 0 0 0 0 0 0 0 0 0 0 0 0 0 0 0 0 0 0 0 0 
##$DATE= 1738578795
##$DBL= (0..7)
120 120 120 120 120 120 120 120 
##$DBP= (0..7)
150 150 150 150 150 150 150 150 
##$DBP07= 0
##$DBPNAM0= <>
##$DBPNAM1= <>
##$DBPNAM2= <>
##$DBPNAM3= <>
##$DBPNAM4= <>
##$DBPNAM5= <>
##$DBPNAM6= <>
##$DBPNAM7= <>
##$DBPOAL= (0..7)
0.5 0.5 0.5 0.5 0.5 0.5 0.5 0.5 
##$DBPOFFS= (0..7)
0 0 0 0 0 0 0 0 
##$DE= 6
##$DECBNUC= <off>
##$DECIM= 32
##$DECNUC= <off>
##$DECSTAT= 4
##$DIGMOD= 1
##$DIGTYP= 9
##$DL= (0..7)
0 120 120 120 120 120 120 120 
##$DP= (0..7)
150 150 150 150 150 150 150 150 
##$DP07= 0
##$DPNAME0= <>
##$DPNAME1= <>
##$DPNAME2= <>
##$DPNAME3= <>
##$DPNAME4= <>
##$DPNAME5= <>
##$DPNAME6= <>
##$DPNAME7= <>
##$DPOAL= (0..7)
0.5 0.5 0.5 0.5 0.5 0.5 0.5 0.5 
##$DPOFFS= (0..7)
0 0 0 0 0 0 0 0 
##$DQDMODE= 0
##$DR= 18
##$DS= 0
##$DSLIST= <SSSSSSSSSSSSSSS>
$$ [...]
##$SUBNAM0= <"">
##$SUBNAM1= <"">
##$SUBNAM2= <"">
##$SUBNAM3= <"">
##$SUBNAM4= <"">
##$SUBNAM5= <"">
##$SUBNAM6= <"">
##$SUBNAM7= <"">
##$SUBNAM8= <"">
##$SUBNAM9= <"">
##$SW= 18.0517328524113
##$SWIBOX= (0..15)
0 0 2 0 0 0 0 0 0 0 0 0 0 0 0 0 
##$SW_h= 3612.71676300578
##$TD= 16384
##$TD0= 1
##$TE= 0
##$TE2= 300
##$TE3= 300
##$TEG= 300
##$TL= (0..7)
0 120 120 120 120 120 120 120 
##$TP= (0..7)
150 150 150 150 150 150 150 150 
##$TP07= 0
##$TPNAME0= <>
##$TPNAME1= <>
##$TPNAME2= <>
##$TPNAME3= <>
##$TPNAME4= <>
##$TPNAME5= <>
##$TPNAME6= <>
##$TPNAME7= <>
##$TPOAL= (0..7)
0.5 0.5 0.5 0.5 0.5 0.5 0.5 0.5 
##$TPOFFS= (0..7)
0 0 0 0 0 0 0 0 
##$TUNHIN= 0
##$TUNHOUT= 0
##$TUNXOUT= 0
##$USERA1= <user>
##$USERA2= <user>
##$USERA3= <user>
##$USERA4= <user>
##$USERA5= <user>
##$V9= 5
##$VALIST= <valist>
##$VCLIST= <CCCCCCCCCCCCCCC>
##$VD= 0
##$VDLIST= <DDDDDDDDDDDDDDD>
##$VPLIST= <PPPPPPPPPPPPPPP>
##$VTLIST= <TTTTTTTTTTTTTTT>
##$WBST= 1024
##$WBSW= 4
##$XGAIN= (0..3)
0 0 0 0 
##$XL= 0
##$YL= 0
##$YMAX_a= 102963
##$YMIN_a= -164683
##$ZGOPTNS= <>
##$ZL1= 120
##$ZL2= 120
##$ZL3= 120
##$ZL4= 120
##$ABSF1= 10
##$ABSF2= 0
##$ABSG= 5
##$ABSL= 3
##$ALPHA= 0
##$AQORDER= 0
##$ASSFAC= 0
##$ASSFACI= 0
##$ASSFACX= 0
##$ASSWID= 0
##$AUNMP= <proc_1d>
##$AZFE= 0.1
##$AZFW= 0.1
##$BCFW= 1
##$BC_mod= 2
##$BYTORDP= 1
##$COROFFS= 0
##$CY= -3
##$DATMOD= 1
##$DC= 2
##$DFILT= <>
##$DTYPP= 0
##$F1P= 0
##$F2P= 0
##$FCOR= 0.5
##$FTSIZE= 0
##$FT_mod= 4
##$GAMMA= 1
##$GB= 0.15
##$INTBC= 1
##$INTSCL= 1
##$ISEN= 128
##$LB= 0.25
##$LEV0= 0
##$LPBIN= 0
##$MAXI= 10000
##$MC2= 0
##$MEAN= 0
##$ME_mod= 0
##$MI= 1.114404
##$NCOEF= 0
##$NC_proc= 0
##$NLEV= 6
##$NOISF1= 3.799351
##$NOISF2= 2.8
##$NSP= 1
##$NTH_PI= 0
##$NZP= 0
##$OFFSET= 14.38212
##$PC= 1
##$PHC0= 247.537
##$PHC1= 15.19222
##$PH_mod= 1
##$PKNL= yes
##$PPARMOD= 0
##$PSCAL= 0
##$PSIGN= 0
##$REVERSE= no
##$SF= 200.129724274929
##$SI= 16384
##$SIGF1= 3
##$SIGF2= 2
##$SINO= 400
##$SIOLD= 16384
##$SREGLST= <1H.CDCl3>
##$SSB= 0
##$STSI= 0
##$STSR= 0
##$SW_p= 3205.1282051282
##$SYMM= 0
##$S_DEV= 0
##$TDeff= 0
##$TDoff= 0
##$TI= <>
##$TILT= no
##$TM1= 0
##$TM2= 0
##$TOPLEV= 0
##$USERP1= <user>
##$USERP2= <user>
##$USERP3= <user>
##$USERP4= <user>
##$USERP5= <user>
##$WDW= 1
##$XDIM= 8192
##$YMAX_p= 0
##$YMIN_p= 0
$$ End of Bruker specific parameters
$$ ---------------------------------
##NTUPLES= NMR FID
##VAR_NAME=  TIME,          FID/REAL,        FID/IMAG
##SYMBOL=    X,             R,               I
##VAR_TYPE=  INDEPENDENT,   DEPENDENT,       DEPENDENT
##VAR_FORM=  AFFN,          ASDF,            ASDF
##VAR_DIM=   8192,          8192,            8192
##UNITS=     SECONDS,       ARBITRARY UNITS, ARBITRARY UNITS
##FACTOR=    0.0002768,     1,               1
##FIRST=     0,             0,               0
##LAST=      2.2672688,     0,               0
##MIN=       0,             -164683,         0
##MAX=       2.2672688,     102963,          0
$$ Real data points
##PAGE= N=1
##DATA TABLE= (X++(R..R)), XYDATA
0@%%%%%%%%%%%%%%%%%%%%Pj5J6j6J6j6J6k2L0l2L5m1M6n1N8o6P3q1R2j04J15j26
$$ 0 0 0 0 0 0 0 0 0 0 0 0 0 0 0 0 0 0 0 0 0 7 -8 8 -8 8 -8 8 -14 16 -16 19 -22 24 -27 31 -35 38 -43 49 -55 60 -66
42f6J39j54J71j89K08k31K56k80L07l38L74m14M58n07N64o30P05p96R06j041J214
$$ -66 73 -81 90 -99 109 -122 134 -146 161 -177 197 -217 241 -266 298 -332 373 -423 483 -558 656
63F56j440J752k213K955m339P758l2127n4409L0482N954N3712M4700J7352K5538
$$ 656 -784 968 -1245 1710 -2629 5129 -26998 -81407 -50925 -44971 8741 53441 70793 96331
77I6331k2785j1069n781k1157L341m1847j7769O814j3099M5554L8830K4238K1362
$$ 96331 73546 62477 56696 35539 38880 -2967 -20736 -13922 -27021 18533 57363 81601 102963
90A02963n1842m5242m8190m7087P888Q761M6001M2547J986K6749q576j4112n340
$$ 102963 51121 5879 -42311 -89398 -81510 -72749 -26748 15799 17785 44534 35958 21846 16506
103A6506m0197r270j9249j9143K7036K2703M9940L1246l731O237m1109l2987j0873
$$ 16506 -23691 -32961 -52210 -71353 -44317 -21614 28326 59572 55841 62078 20969 -12018 -22891
116b2891j3972L2647R664K771K0243j4759M857j876q851J2770k5692j6770j0466
$$ -22891 -36863 -4216 5448 8219 28462 13703 18560 16684 7833 20603 -5089 -21859 -32325
129c2325j4736K3126P325K2077K6619j9271o333k3455j9972Q576j1969J7598J7848
$$ -32325 -47061 -23935 -16610 5467 32086 12815 6482 -16973 -36945 -28369 -40338 -22740 -4892
142d892j64J9400l279R266N784k5654o329k3900j5092Q409K408L9329K6857N300
$$ -4892 -5056 14344 11065 20331 26115 461 -5868 -29768 -44860 -36451 -34043 5286 32143 37443
156C7443R614k5062j4241j5395k0175J7383L119R337J4994l131J8742j254o472
$$ 37443 47057 21995 7754 -7641 -27816 -10433 -7314 2023 17017 13886 32628 31374 24902
169B4902O784k0776q494j5595j4427J6921k28J2296J3911n635N969j6196p934
$$ 24902 31686 10910 2416 -13179 -27606 -10685 -10913 1383 15294 9659 15628 -568 -8502
182h502N757j3391N930l671l669J4562o577J3094J2426o107L397j9184q352n54
$$ -8502 -2745 -16136 -10206 -13877 -17546 -2984 -9561 3533 15959 9852 13249 -5935 -14287 -14841
196a4841r841J8014J0148J0697J2145j3657K075p964j5226M282q342O963O061
$$ -14841 -24682 -6668 3480 14177 26322 12665 14740 6776 -8450 -4168 -12510 -5547 514
209E14m373J6883M61O79J036j7066j520j3624j0774R865j03J3962O121k205J0419
$$ 514 -3859 13024 13485 14164 15200 -1866 -3386 -17010 -27784 -17919 -18022 -4060 2061 -144 10275
224A0275j0459l481J570q659P982o467j006J0967l722J0282L578j5P737j4090
$$ 10275 -184 -3665 -2095 -10754 -2772 -9239 -10245 722 -3000 7282 10860 10845 18582 4492
238D492l418k005r507P732l323O620J0059n796P418l385l697J320j3104L370o60
$$ 4492 1074 -931 -10438 -2706 -6029 591 10650 4854 12272 8887 5190 6510 -6594 -3224 -3884
253c884m091J1139j719P900L887j0771K953r340o316J072n602J0842J935n0R207
$$ -3884 -7975 3164 1445 9345 13232 2461 5414 -3926 -10242 -9170 -14772 -3930 -1995 -2045 7162
268G162n718K957k702q366O578o395K26N395k350R701j674m99N962q234J115m279
$$ 7162 1444 4401 1699 -6667 -89 -6484 -6258 -863 -3213 6488 4814 4315 10277 2043 3158 -1121
284a121m741N796o934L162N145k114P848m269N31K499r240K121l505r49N917m704
$$ -1121 -5862 -66 -7000 -3838 1307 -807 7041 2772 3303 5802 -3438 -1317 -4822 -5771 146 -4558
300d558P169K798m063M450p166o02o63q163N668j038K395O890l008O993k102n602
$$ -4558 2611 5409 1346 5796 -1370 -1972 -2635 -10798 -5130 -6168 -3773 3117 109 7102 5000 -602
316f02K927o565K442J464l062Q298j882R97K751m553L914m932l786K969n901K620
$$ -602 2325 -4240 -1798 -334 -3396 4902 3020 4017 6768 2215 6129 1197 -2589 380 -5521 -2901
332b901L91r19P749m050J644R61m915L609m830N72L827n021M011m55m86M842m639
$$ -2901 -2510 -3429 4320 270 1914 2875 -2040 1569 -3261 -2689 1138 -3883 128 -327 -813 4029 -610
349f10K281m40n433K213m211K589M247k899O434j947j278J469n572L804n32k052
$$ -610 1671 1231 -4202 -1989 -6200 -3611 636 -2263 4171 2224 946 2415 -3157 647 115 -1937
365a937M791k829L007J032k845M870m210j795P0n686L506j025K13O126k877K856
$$ -1937 2854 25 3032 4064 1219 6089 1879 84 154 -5532 -2026 -3051 -2838 3288 411 3267
381C267j590l187L474m405J238J343l445L587k371M41M432k868L177j559k717
$$ 3267 1677 -1510 1964 -2441 -1203 140 -3305 282 -2089 -1648 2784 -84 3093 1534 -1183
396a183J507n342K071J697j309M618k431J091J808l735L960j315o28K033m295
$$ -1183 324 -5018 -2947 -1250 -2559 2059 -372 719 2527 -1208 2752 1437 809 2842 -1453
411a453K721n6j499L702k756R63r40m964L088j936Q87K869k557L636k121j935
$$ -1453 1268 1212 -287 3415 659 1622 682 -4282 -1194 -3130 -2243 626 -1931 1705 -416 -2351
427b351K915l157K193m3k178L685k862J499K446j977L741k506j497Q90m328K362
$$ -2351 564 -2593 -400 -443 -2621 1064 -1798 -299 2147 170 3911 1405 -92 798 -3530 -1168
443a168j52J02M008l045J864O50j941K795j993N30M58l799K346j475M42L176k576
$$ -1168 -1320 -1218 2790 -255 1609 2259 318 3113 1120 1650 2108 -1691 655 -820 -378 2798 222
460B22K144j199k984J653k522J182J312k400L036k319J68J801k109L547r58j241
$$ 222 2366 1167 -1817 -164 -2686 -1504 -192 -2592 444 -1875 -1707 94 -2015 1532 574 -667
476f67K094k975J778M35j217L344k460j01P6k788K795j369L05K879k627J645p71
$$ -667 1427 -1548 230 665 -552 2792 332 231 307 -2481 314 -1055 -750 2129 -498 1147 376
493C76p75K459k438R40J79k290J760j859J543K003k248K365j789j462J306l282
$$ 376 -399 2060 -378 562 741 -1549 211 -1648 -105 1898 -350 2015 226 -1236 70 -3212
509c212K238l3j367K278k279J499J454j366K964j279m15J017k686J913l99m68
$$ -3212 -974 -1007 -2374 -96 -2375 -876 578 -788 2176 897 482 1499 -1187 726 327 -141
525a41K422j880J247m68j887K218k033Q49Q09k396J962j460j75K225j818J595
$$ -141 2281 401 1648 1180 -707 1511 -522 327 1136 -1260 702 -758 -933 1292 -526 1069
541A069m89j452J779k070J463Q88j664J812j706m62R16k537K079o91k86J795k051
$$ 1069 580 -872 907 -1163 300 1188 -476 1336 -370 -832 84 -2453 -374 -1065 -1351 444 -1607
558a607J466K65r20K393j751O07K27j816J922j065L16J900k159J524q70r83J556
$$ -1607 -141 124 -796 1597 -154 453 680 -1136 786 -279 37 1937 -222 1302 432 -551 1005
575A005k062J271j79j630J873j425M16J401j276J996r23o28R15j780J266j02r51
$$ 1005 -1057 214 35 -1595 278 -1147 -731 670 -606 1390 467 -161 754 -1026 240 138 -813
592h13J927j692M20K73j217J670j293K81O85j655J779l02p52J976j672J278q6
$$ -813 1114 -578 -158 115 -1102 568 -725 -444 241 -1414 365 63 -689 1287 -385 893 807
609H07j390J712j409Q75Q35j390J449j401l03J164j839J365o10r28J583j792J093
$$ 807 -583 1129 -280 595 1430 40 1489 88 -215 949 -890 475 -135 -1063 520 -1272 -179
626a79K44q84J895j436L65L22j470J614o26j52J334j814J249l74o44J161j219
$$ -179 65 -819 1076 -360 5 327 -1143 471 -155 -307 1027 -787 462 88 -556 605 -614
643f14M52L51j418J382n90J08J237j247J322o96m61J161j382J024J72r56J218
$$ -614 -162 189 -1229 153 -437 -329 908 -339 983 287 -174 987 -395 629 801 -155 1063
660A063j390K73N49j631J492q09l45R94j310J208j50n48J324j056N83K86j292
$$ 1063 -327 -54 495 -1136 356 -453 -798 196 -1114 94 -56 -604 720 -336 247 533 -759
677g59J768j344N65O91j448J383o74o14J168j183P71l31r66J342j196O10M99q67
$$ -759 1009 -335 230 921 -527 856 182 -432 736 -447 324 -7 -973 369 -827 -217 282 -585
695e85J537p74k23R59j530J221m84k01J097j341P50n6r65J137j036j6N62j054
$$ -585 952 178 -45 914 -616 605 121 -80 1017 -324 426 370 -595 542 -494 -510 52 -1002
713a002J181n85j56J034j198J225k03p87J570j584P72J64r24J175q20L8N63j259
$$ -1002 179 -406 -562 472 -726 499 296 -491 1079 -505 267 431 -493 682 -138 -100 463 -796
731g96J495q35m71J147j270Q86j06p37J087p77O17O27j235J081o71n7Q71j049
$$ -796 699 -136 -607 540 -730 156 50 -687 400 -377 240 867 -368 713 42 -15 856 -193
749a93P45l90o61J040j176N18K15p12Q58r13M80N86j139J227k30j62O60j230R46
$$ -193 552 162 -499 541 -635 -117 98 -614 244 -669 -189 397 -742 485 255 93 753 -477 469
768D69Q6p45J059j165L98J24q73J114j016P4O43r37Q00m2n45P98o13N50J96q36
$$ 469 555 -190 869 -296 102 226 -647 467 -549 -475 168 -769 31 -11 -556 242 -371 179 375 -461
788d61Q64n66J91N16j091J227o02m29R41j280P65j19o48J079j047M69K43q89J369
$$ -461 403 -163 28 544 -547 680 78 -351 590 -690 75 -44 -692 387 -660 -191 52 -837 532
807E32n97M1N40r17Q92m07m59J261j148O65j77r44J181q64J45L10q30R74n50n2
$$ 532 -65 -24 516 -401 491 84 -375 886 -262 403 226 -718 463 -401 -256 54 -776 198 -352 -404
827d04O94q36Q47j16m10P20p09L99K34p67R18p09J05M78j112R22m89k4P57j088
$$ -404 290 -546 301 185 -225 495 -214 185 419 -348 570 -139 -34 444 -668 254 -235 -259 498 -590
847e90P73k30m69J070p69L90M79r25Q88p60N07l1p31P21j69m41N87p32M23J17
$$ -590 183 -47 -516 554 -215 175 654 -271 617 -143 364 333 -398 323 154 -287 300 -432 -9 108
867A08o71O73l91J16K25m84Q13m93j11Q91q61N27j38j73O13q44K54R9p08R41p17
$$ 108 -563 110 -281 -165 60 -424 389 -104 -215 676 -185 342 204 31 644 -200 54 153 -555 386 -331
888c31pM96n13M55k46l76P59m47K19Nk52P48p55K75L45m71O34n37L7M12p78M75
$$ -331 -338 158 -355 100 -146 -522 237 -210 9 14 -238 510 -245 30 375 -96 538 1 38 450 -328 147
910A47j85l99N34o06L82L98q50J019p21M66K56n98P15n20o0N52o57M45k83o00
$$ 147 -38 -437 97 -509 -127 271 -579 440 -281 185 441 -157 558 38 -22 530 -127 318 35 -565
930e65R22p36M08j6o01P02m71R9M75n93O82m24k16Q92q11M28K60p07Q42r14K63
$$ -565 357 -379 29 13 -588 114 -357 -258 217 -376 306 -118 -334 558 -253 175 435 -272 570 -344 -81
951h1M17q52P42l97l5L83o73O00j71m14R97n56p1K39k91O66n43J79M28r19P09
$$ -81 336 -516 226 -171 -206 177 -496 104 -67 -481 516 -40 -111 128 -163 503 -40 139 567 -352 357
972C57m21k2O66j015M70p9k24O07q08L83K20n60Q58q18M23L82p42Q78l49l50O18
$$ 357 -64 -86 580 -435 35 -44 -268 339 -469 -86 134 -426 432 -386 37 419 -323 555 206 -144 474
993D74n70L40K3n51N91o37m1M97o89P04l76j46O71p99N75j6j79M85l91L57k13
$$ 474 -96 244 267 -284 307 -330 -371 126 -563 141 -235 -381 290 -509 66 50 -129 356 -35 322 109
1014A09m27N07l24P1J52l93M15l27p7O35p15L59o2l6K97m86L88K95p01P93k28
$$ 109 -318 189 -135 -64 88 -305 110 -217 -294 341 -374 -15 -77 -113 184 -302 86 381 -320 473 245
1035B45k89N22p66O51l79m4M58o90N57k79m73O74m51K25L70p33N52k38q8M59n70
$$ 245 -44 478 -288 363 -16 -60 398 -292 265 -14 -487 187 -264 -39 331 -402 150 -88 -176 283 -287
1056b87N50l97L1M91o10K33O5l04M05l61n0M49n36L14k52l18O60l64Q0M61m21
$$ -287 263 -134 -103 388 -222 11 76 -228 177 -184 -234 215 -321 -7 -259 -577 83 -281 -201 260 -161
1077a61M43n35N01Rl87O37l67j62J59o03M45kl40N09n90L88J12k78L85k98R7L11
$$ -161 282 -253 248 257 -130 507 140 -22 137 -466 -21 -23 -363 146 -444 -56 56 -222 163 -135 -38 273
1099B73n18M31j80k03O65o66N26k55j44L08n91K26M02p15N98m55J63M60p05O02
$$ 273 -245 186 6 -197 468 -198 328 73 -71 237 -354 -128 274 -441 157 -298 -135 325 -380 222
1119B22k29k1L27l86K22L1l32M85m27J68K62n88M36l99L2L42m32O2J38o9M64n90
$$ 222 -7 -28 299 -87 135 166 -166 319 -108 60 322 -266 170 -229 -197 145 -287 -225 -87 -156 308 -282
1141b82L15j00qL67l67j5L71n26N19j79n11O27m54M29m27J14N12p82L27N6j84
$$ -282 33 -67 -75 292 -75 -90 281 -245 274 95 -416 211 -243 186 -241 -127 385 -397 -70 -14 -198
1162a98N67l97K2K71n03O31m46K7M45n24L50j12k54K31k27n6L17l62RK01l81L28
$$ -198 369 -28 -6 265 -238 393 -53 -26 419 -105 245 133 -121 110 -117 -173 144 -218 -209 -8 -389 -61
1184f1n6R4j25J05M10k17Q9o7k47M21k75j61K63j31J2k83n4M72l43J10L9j42L92
$$ -61 -117 -23 -148 -43 367 150 239 172 -75 346 71 -90 173 42 54 -229 -283 189 -154 -44 -5 -147 245
1207B45k61j04J80k82L51n2p7N12o28L91l0k90M68n57J9J81k14J54l90L00J2l56
$$ 245 -16 -120 60 -222 129 77 0 512 -116 275 245 -45 423 -134 -115 66 -148 6 -384 -84 -72 -428
1229d28O35m0m35K59j65M58q2l06K99p1L6J2l13M24m42p7N04m42M67l54k49M60
$$ -428 207 167 -268 -9 -174 284 202 -104 195 124 160 172 -141 283 -159 -236 268 -174 293 -61 -310 150
1251A50m40L13J82j87L68l33l2M97o42K32j83R1K31l34R6M0k43J92k58J52J04
$$ 150 -290 23 205 18 386 53 21 518 -124 108 -75 16 247 -87 9 49 -194 -2 -260 -108 -4
1272dj55M00m10M1K26j32L77l31L5K28k07J50j42j00K96k69j01L89l71J02k99
$$ -4 -159 241 -169 -128 98 -34 343 12 47 275 68 218 76 -24 272 3 -98 291 -80 22 -277
1293b77P2M42l21K79l73J00M72n43j16L61k69L69p0rlk54K58k09j51M05m15K88
$$ -277 -205 237 -84 195 -178 -78 394 -149 -265 96 -173 196 126 117 114 -140 118 -91 -242 163 -252 36
1315C6J23m14M69m56K56j44N9K40p0j48K21j92J47j4j30P2k06P4m3N0J77k51j44
$$ 36 159 -255 214 -242 14 -130 -71 169 99 -49 172 -20 127 113 -17 55 -151 -77 -120 -70 107 -144 -288
1338b88L28o8N9q9j20K76k87L31j09n7K44k43J32M3l18K91n9l9k0l78N81l75P0
$$ -288 40 -28 31 -58 -178 98 -189 142 33 -24 220 -23 109 152 -166 125 66 27 7 -371 210 -165 -95
1361i5K90j15m2P1k87L30j25m3K38j84J87l27K09J09l28J20NK5J08l97J48J96
$$ -95 195 80 38 109 -178 152 27 -16 222 38 225 -102 107 216 -112 8 13 38 146 -251 -103 93
1383I3j50l0j9K51J65l75R6k81L14P7j15J62k49k02M92r3j92J42q5k5J5r9K71
$$ 93 -57 -87 -106 145 310 -65 31 -250 64 141 26 188 -61 -263 229 136 -56 86 1 -24 -9 -108 163
1406A63k43J89j05k35L32k33M21k79p7Q4p0J76m5k1J20k16q1K86k91R8p9k0M9
$$ 163 -80 109 4 -231 101 -132 289 10 -67 17 -53 123 78 57 177 -39 -120 166 -125 -27 -106 -126 -77
1429g7L42k06J31l88K45J13j47J00k75L76m05L05k36K16N0j80k63O25k39r1o5
$$ -77 265 59 190 -198 47 160 13 113 -162 214 -191 114 -122 94 144 -36 -299 326 87 -4 -69
1450f9R6Q0J3m8o1j73K08J9r0n4O1k4k5J75j8j48J60R7l83L04l69J60J45j06J3
$$ -69 27 107 120 72 11 -162 46 65 -25 -79 -18 -42 -67 108 90 -58 102 199 -184 120 -249 -89 56 -50 -37
1475c7K2j08J04r3K01o0JK94m12R4j8l21M51n2r9M1p3J60k03p2K12P7j40J56l23
$$ -37 -15 -123 -19 -112 89 29 30 324 -88 6 -12 -333 118 66 -33 8 -65 95 -108 -180 32 109 -31 125 -198
1500a98M01n2qK63m56J7O0R7k12M0M4J3k10J56L9j09M9M8k7j8J59l8j23o3M5Q2
$$ -198 203 151 143 406 -50 -33 27 124 -88 -48 -4 9 -201 -45 -6 -115 -66 -18 -45 -63 96 58 -65 -128 -83 -1
1526aM8J1M4k9k35K31k5r0KmJ49J9j36J30k14KJ74j00J54OO6k65q7rJ68o5K57
$$ -1 47 58 102 73 -162 69 44 -46 -44 -48 101 120 -16 114 -100 -98 76 -24 130 136 202 -63 -150 -159 9 -56 201
1553B01k69L2j21J44J26k99L34j63r3J09j61J58J5k16L23l4n3J12m34K04k0O6
$$ 201 -68 -36 -157 -13 113 -186 148 -15 -108 1 -160 -2 13 -203 120 86 33 145 -289 -85 -105 -39
1575c9J67j94l4M1R7R6j94k21L92r8Npr2P9O6K0k10J66k28L42k5j19k09K30J17
$$ -39 128 -66 -100 -59 38 134 -60 -281 111 13 18 11 -81 -2 64 84 -126 40 -188 154 129 10 -199 31 148
1600A48k79K80l14J97l9N6K5j12l7J55m5k1p8J22l1J10l02K36l6O9LJ49k64P4
$$ 148 -131 149 -165 32 -7 49 74 -38 -75 80 35 14 -64 58 27 137 -165 71 35 104 107 256 -8 66
1624F6J75m60L83j85j63K70n5j78N10m71J21K4l75M81k20K01M8k36J86k44K42
$$ 66 241 -219 164 -21 -184 86 31 -147 363 -108 13 37 -338 143 -77 124 172 -64 122 -122 120
1645A20j61j13K88k87K0J07l79M69L4qk05J27m1Q5k20K32J4r3J81j64L8o2j49
$$ 120 -41 -154 134 -153 -133 -26 -405 64 98 90 -115 12 -29 56 -164 68 82 -11 170 6 44 -18 -167
1668a67K09J4k13K35j03L2j13J88j7P0o4j58L3J45l50L29j54N8K01j19l04J77
$$ -167 42 56 -157 78 -25 7 -106 82 65 135 71 -87 -54 91 -259 70 -84 -26 175 56 -248 -71
1690g1j40M36j71k16J02j55M17j69l3K0RP3m5Ln2J23J50k75K5j26O0N3p2J03n6
$$ -71 -211 225 54 -162 -60 -215 202 33 0 20 29 102 57 60 8 131 281 6 31 -95 -35 18 -54 49 -7
1715gJ50j82K8j20J47P2o5k1j5J43l8j73K18o0j80J03o2O6J93q4l7j62J33j88
$$ -7 143 -39 -11 -131 16 88 23 2 -13 130 92 -81 137 77 -103 0 -62 4 197 113 76 -86 47 -141
1739a41J57M0j82J64m5l8j23K43j41j4k3J2K41o2l06K14o7J94j36Q1j13k27L63
$$ -141 16 56 -126 38 -7 -45 -168 75 -66 -80 -103 -91 150 88 -218 -4 -71 123 -13 68 -45 -272 91
1762I1o4O5N2N0k33o7J67j09j7m7M7L67l38M1K4p1N6MJ4L8kk54J0K14k04J54n6
$$ 91 27 92 144 194 -39 -106 61 -48 -65 -112 -65 302 -36 5 29 -42 14 18 32 70 68 -186 -176 38 -166 -12 -68
1789f8J0J25j87R5M6j70K50n6L4P1k26J61o8k14K11j80K99Rl2R5k70R7K8J28j80
$$ -68 -58 67 -120 -25 21 -149 101 45 79 150 -76 85 17 -197 14 -166 133 142 110 205 -65 32 60 188 8
1814Hj04K6R4J50j73n3k73K34J2j33K25N2k2r8L2n8J1l9J60o3k06K34j59J52L4
$$ 8 -96 -70 24 174 1 -52 -325 -91 -79 -212 13 65 43 -55 -23 -81 -70 -109 51 -12 -218 16 -143 9 43
1839D3j00J36j8j17k9j25K70n0L4j22l6M6j2r8L61l01K09J69j22J9j44l6j00J55
$$ 43 -57 79 61 -56 -85 -210 60 10 44 -78 -114 -68 -80 -178 183 -118 91 260 138 157 13 -23 -123 32
1863C2k8J61j92K16k19J00j0q7K30K3k24N1j7J3J40k04J99o2l07J92MJ9n7M4K3
$$ 32 4 165 -27 189 -30 70 60 -27 203 226 2 53 36 49 189 -15 184 122 -185 7 11 30 -27 17 40
1888D0pj68L77k15o9j3M4l7k8L23j68L1j54J06J9lJ4k7Q2o1k32J64J12j20k8l3
$$ 40 33 -135 242 27 -42 -55 -11 -48 -76 247 79 110 -44 62 81 78 92 65 147 86 -146 18 130 10 -18 -51
1914e1n5N4K47j49M5k62K85k83L14k25l4J86l3k83J60p1K7K16k65K12k6J28N1
$$ -51 -106 -52 195 46 91 -171 114 -169 145 -80 -114 72 39 -244 -84 -155 -128 88 -177 35 9 137 188
1937A88j34j63J35l33L58O2j04J4j96J15J10j32K55q9O0j82J60k99P3K04k1M9
$$ 188 54 -109 26 -307 51 113 9 23 -173 -58 52 -80 175 86 146 -36 124 -175 -102 102 81 130
1959A30L2m9mj87J8K12k88J16J71l21M26j79O1j49p6K7J5j02J99l0k73L29q0J67
$$ 130 162 113 109 -78 -60 152 -136 -20 151 -170 256 77 138 -11 -87 -60 -45 -147 52 22 -251 78 -2 165
1983A65J7k11k7k8K60l5j74J77j7j69L2L5kj8j25J04k42K80J41j76J5j64J92o6
$$ 165 182 -29 -56 -84 176 141 -33 144 127 -42 -10 25 23 5 -120 -16 -258 22 163 -13 2 -162 30 -36
2007c6l3k2RK45j44j92M6J25J9N7pL8m1q6j8R3L3j39L8n5j29J36M3l7j2j51J33
$$ -36 -69 -91 -82 163 19 -173 -127 -2 17 74 67 105 64 -22 -40 53 86 -53 -15 -70 -199 -63 -20 -57 -69 -220 -87
2034h7m4K7L1j60K65j14J10j75J8K10J21k79o5J96q0J64k45J06p2j01J21J7M4
$$ -87 -131 -104 -73 -233 32 -82 28 -147 -129 81 202 -77 -142 54 -26 138 -107 -1 -73 -174 -53 -36 8
2057HK6J33j0j46l4R5k61K56J51k80O1m4o7n1k8J32l0J08L9J80k31K21l26oK85
$$ 8 34 167 157 11 -23 72 -189 67 218 -62 -1 -45 -112 -163 -191 -59 -89 19 58 238 7 228 -98 -104 181
2082A81j72m6J59lR3l31N5n8K01Qq0o5J91j22j17JO6J54j85R8O7j02k5O2j1l1
$$ 181 9 -37 122 119 212 -119 -64 -122 79 87 7 -58 133 11 -106 -105 -39 115 -70 28 95 -7 -32 30 19 -12
2108a2j7J0R3j10J78j12j06J96o2j25L9o5oR4r3M7J23O4j96J63j81J43k19M6J45
$$ -12 -29 -19 74 -36 142 30 -76 120 58 -67 -28 -93 -99 -5 -98 -51 72 136 -60 103 -78 65 -154 -108 37
2133C7J66k51L4mj60J91O6P1k37L56j14l15L67j01j77R7k7Lj4p2K62k49J12k2
$$ 37 203 -48 -14 -18 -178 13 79 150 -87 269 155 -160 207 106 -71 26 -1 2 -12 -84 178 -71 41 19
2157A9j43Q4J65j45L3J18o5j68Q2no9R8J35j40J2O1j4l9K11k56Q2J35k87J31J73
$$ 19 -124 -40 125 -20 13 131 66 -102 -20 -25 -94 4 139 -1 11 72 58 19 230 -26 56 191 -96 35 208
2182B08j55k10J69j19Q3K03l14K1J89m6J2l6K24j89j50R7N9L5n7J44P1k20Q2j21
$$ 208 53 -157 12 -107 -24 179 -135 -114 75 29 41 5 229 40 -110 -13 46 81 24 168 239 19 101 -20
2206b0K5M2j53J95K49l28k0p8O2L79l61k07K29p8J1J30q0pO0k83K45j52L48k36
$$ -20 5 47 -106 89 338 10 -10 -88 -26 353 -8 -215 14 -64 -53 77 -3 -10 50 -233 12 -140 208 -28
2230b8J21j18J22j67K52m5J9l55J21N3OJ9O0k59M73l54n8J51j27J66j03Q2l7j45
$$ -28 93 -25 97 -70 182 137 156 -199 -78 -25 -19 0 60 -199 274 -80 -138 13 -114 52 -51 31 -6 -151
2254a51n7K77k7J45m27N48m20J40j2j34K1J83j98q1K18K33k03j12o5J35m4J15
$$ -151 -208 69 42 187 -240 308 -112 28 16 -118 -97 86 -112 -193 25 258 55 -57 -122 13 -31 84
2276H4n0j14P4j38J02J03j35R4QJ29q2k17K34j56Q9O6j58J60Q6k70L5L6Q3j12
$$ 84 34 -80 -6 -144 -42 61 -74 20 28 157 75 -142 92 -64 25 91 -67 93 179 -91 -56 -20 63 -49
2300d9r1N1L47j67Lp9K4J31p5k81K55J37k65k2j3M8J09k33p1J69j8J1L6q5P2q1
$$ -49 -140 -89 258 91 94 15 39 170 95 -186 69 206 -59 -81 -94 -46 63 -170 -241 -72 -90 -79 -43 -128 -56 -137
2326a37L9P8J72l57Q0J86k36K41Qm4J20j55L8P1N5j79j37K06k08L30M0q9j94J83
$$ -137 -98 -20 152 -205 -125 61 -175 66 74 30 150 -5 33 104 159 -20 -157 49 -159 171 211 122 -72 111
2350A11l36Q1R1N3N1J6O1j44r9J60l9k09j3L45m9l4k03J31R3j37L8R1R4k13K6
$$ 111 -225 -144 -53 0 51 67 128 -16 -115 45 6 -203 -216 129 80 46 -157 -26 67 -70 -32 59 153 -60 -34
2375c4o6m0K93o7j31j11L48l2q5N0j11j03k10K69M7l6q5Q0MJ31j86N1J62j55r7
$$ -34 -100 -140 153 86 -45 -156 192 160 75 125 14 -89 -299 -30 17 -19 -104 -24 -20 111 -75 -24 138 -17 -114
2400a14K7J19p2k01R8K36m2j7j39K04k59Q0J00P4R5j65J10l5j96J6J57l07K33
$$ -114 -87 32 -40 -241 -143 93 51 34 -105 99 -160 -80 20 94 189 24 134 99 -97 -81 76 -231 2
2423BJJ0q4J86l5j21R4O7k19l4J76k41K32j13L45j95j19j44J30mN9qj3pM5k5n1
$$ 2 3 13 -71 115 80 -41 53 120 -99 -133 43 -198 34 -79 266 71 -48 -192 -62 -66 -7 -15 -28 -35 10 -15 -66
2450f6P4No2J12m3L0J84j49j52J1J51k68L55k91m5J25j29L81k3l32RJ34P1o0q7
$$ -66 8 13 -49 63 20 50 234 85 -67 -56 95 -173 182 -109 -154 -29 -158 223 200 -132 -123 11 82 22 -65
2475f5lP0k68K83J88k42J28j73lK17j48k7K5p5J15jnJ73j55Pj3K7r6NJ51l00K09
$$ -65 -68 2 -266 17 205 -37 91 -82 -85 132 -16 -43 -18 -93 22 21 16 189 34 41 28 55 -41 -36 115 -185 24
2502B4k5J36o8Ok05K42j72Q5J64k76J09Q6p8N4q1Q5j03J67k07N7J7J8k06P6J24
$$ 24 -1 135 67 73 -132 110 -62 23 187 -89 20 106 28 82 1 86 -17 150 -57 0 17 35 -171 -95 29
2527B9k24K12P8j67Q0p5L9K2L24k73M8l42L54r3M1r9P5r8J16j13J39l4n5lP5J47
$$ 29 -195 17 95 -72 8 -67 -28 -6 318 45 93 -249 105 12 53 -46 29 -69 47 -66 73 39 -16 -19 56 203
2553B03j53j47NJ3O3J00n4j0j07J13N7o8j34N1m1K12j67KJ81p6l8j25J7N7p1R0
$$ 203 50 -97 -92 -79 -16 84 30 20 -87 26 83 15 -119 -68 -109 103 -64 -62 119 43 5 -120 -103 -46 -117 -27
2579b7J90n8k76P8J04j21J37N4k05J07k12J72R1j11Q1j47m6J67O1j04J9N5R0r6
$$ -27 163 105 -171 -93 11 -110 27 81 -124 -17 -229 -57 34 -77 4 -143 -189 -22 39 -65 -46 9 99 3
2603Ckj70J93Q3K2k40M9j42NK01J08r0l4R5l4j08J57k12lJ19L1J8j21m3K6J84
$$ 3 1 -169 24 107 129 -111 -62 -204 -199 2 110 20 -14 81 47 -61 96 -116 -119 0 31 49 -72 -115 -89 95
2629I5P7j72J29l1m7j09O9k04j7K77L9lj55LJ10P8k59N4o3L30k15M3L3l2p2O3
$$ 95 172 0 129 98 51 -58 11 -193 -210 67 106 103 -52 -49 61 139 -120 -66 -129 201 -14 29 62 30 -42 21
2655B1N7j43n3K64j13k65R6J64p0N8j33K21j56N4j13J16J10o4N5j36q8K39l7j88
$$ 21 78 -65 -118 146 33 -232 -136 28 -42 16 -117 104 -52 2 -111 5 115 51 106 -30 -118 121 84 -104
2679a04J15J42k13J57l1k26pJ16K33k84Q7P4K7L6J07j95k29KJ92k4m5K29j30j44
$$ -104 11 153 -60 97 66 -160 -167 -51 182 -102 -15 59 86 122 229 34 -195 -193 -1 -25 -70 159 29 -115
2703a15L64k47p9qk26L16J26Qm6j23m6Q1j23qJ32J12j02j75L06j68l8J89l6q1
$$ -115 249 2 -77 -85 -311 5 131 139 93 -30 -76 5 -118 -126 6 118 16 -159 147 -21 -59 130 94 13
2727A3l0j20J47Mj4k26J08J58j22O3J64k17J08N9kn8N6j77j0J11J1q3o1Q1l6k4
$$ 13 -17 -137 10 14 0 -226 -118 40 -82 -19 145 -72 36 95 93 35 91 -86 -96 15 26 -57 -118 -37 -73 -97
2753i7j9l8k2o3M61m34L00K7j17l0l5J66k8r0n6r7K00oK15K9j30k97lJ27R7Oj30
$$ -97 -116 -154 -176 -239 222 -212 88 115 -2 -32 -67 99 71 -19 -75 -172 28 22 237 266 136 -161 -164 -37 60 66 -64
2780f4J88n8k36J34K1J6K18r7Q0j18Rk12N2q3J20J89k00R9KL2K04k98p7K68j06
$$ -64 124 66 -170 -36 -15 1 219 122 202 84 93 -119 -67 -150 -30 159 -41 58 60 92 296 -2 -79 189 83
2805H3q0J00k1m7n4k7J98n7j28n0k3K06j30k9J84j29J00j04L3j8l7J09j69L3J8
$$ 83 3 103 82 35 -19 -46 152 95 -33 -83 -106 100 -30 -59 125 -4 96 -8 25 7 -30 79 -90 -57 -39
2830c9K33k69J74j68M4O2Q2k0k63J45J33o2o6j9l0j07K79p4Q0R3j41P1k00K46
$$ -39 194 -75 99 -69 -25 37 119 99 -164 -19 114 52 -14 -33 -63 -170 109 35 115 208 67 138 -62 184
2854A84k3p6k07K62r2l1J15j42r5K32k13K36k61J12J69j84K18k92Q0l9lj00J04
$$ 184 161 85 -122 140 48 17 132 -10 -105 127 -86 150 -111 1 170 -14 204 -88 -8 -47 -50 -150 -46
2877d6q6K56j30N8L15m40J2M8L1jm5L4N5j00J0J0kj50lJ75k44J60P4N4J07Q1k96
$$ -46 -132 124 -6 52 367 -73 -61 -13 18 17 -28 6 61 -39 -29 -19 -21 -171 -174 1 -243 -83 -9 45 152 233 -63
2904f3O1R1m3J9k05M93n68K55k5J11k16L09j90N3r3n5J90j35o7o0K8N7M0R8n0
$$ -63 -2 89 46 65 -140 353 -215 40 15 126 -90 219 29 82 -11 -66 124 -11 -78 -138 -110 -53 -13 85 35
2929C5K4j08J42j09j15p0N52k77j41NL03j53j48p1J58J09j74J7m0K31j74J15q7
$$ 35 59 -49 93 -16 -131 -201 351 74 -67 -62 241 88 -60 -131 27 136 -38 -21 -61 170 -4 111 24
2952B4J07j83K09j85K17j45q3R3j58R5k03L02r9l9nJ93Rm6j69k23L72lJ05j70
$$ 24 131 -52 157 -28 189 44 -39 54 -104 -9 -212 90 -9 -48 -53 140 149 103 -66 -289 83 80 185 15
2976A5k06J98j06N0J30j48M7J06j95P6J36Nn3j36O6Pm6L56k52o3q2J53r7j7N0
$$ 15 -191 7 -99 -49 81 -67 -20 86 -109 -33 103 108 55 -81 -15 -8 -54 302 50 -13 -95 58 -39 -56 -6
3001fJ61l71M67l45J96O7k45N2j12M09l88K28k32Q5J91p2k3R8j20O7k97n8J85
$$ -6 155 -216 251 -94 102 169 -76 -24 -136 273 -115 113 -119 -34 157 85 62 160 40 107 -190 -248 -63
3024f3K28j77k3J68r5j83P7L04l48K05J6n2k1r0j24K07J61j80j55K54p7j15J80
$$ -63 165 -12 -35 133 38 -145 -68 236 -112 93 109 57 36 -54 -178 29 190 10 -145 109 32 -83 97
3047I7l7J72m07J6J01j13J63k9Q9J7j9j04J50j67Q7J49k36J81k9j71J6K2k4K4
$$ 97 60 232 -175 -159 -58 -171 -8 -37 52 69 50 -54 96 -71 16 165 -71 110 81 -90 -74 -52 -76 -52
3071e2J17QM6p2L5j99mR9k15J86o5K55l77K52j08M1K7O1k11K44p3q1K20j96j61
$$ -52 65 73 119 47 82 -117 -121 -22 -237 -51 -116 139 -238 14 -94 -53 -26 35 -176 68 -5 -86 134 -62 -223
3096b23J81m3M5J45j71kk1Q4J64k69K7K8R3L9l7j42K67k60J92j02k7J54j83J9
$$ -223 -42 -85 -40 105 -66 -68 -89 -5 159 -110 -83 -55 38 77 40 -102 165 -95 97 -5 -32 122 -61 -42
3120d2J61j23P4j33j07K23j76K07k14K75J13j28r2p1J35J5J10j18J50j85O2Qj31
$$ -42 119 -4 70 -63 -170 53 -123 84 -130 145 258 130 38 -33 102 117 227 109 259 74 136 144 13
3143A3N1n5k20K73k18K08j89J6J68J30j04nk49J08J25n5j05m9J72L9N3q8K8l3
$$ 13 64 9 -211 62 -156 52 -137 -121 47 177 73 68 -181 -73 52 -3 -108 -157 15 54 107 19 47 14
3167A4o3K9J57n5n6j71K15j68K67k46j1o8J71J31k43K40O0k88n2K2K28p5k1L1
$$ 14 -49 -20 137 82 26 -145 70 -98 169 -77 -88 -156 15 146 -97 143 203 -85 -137 -115 113 38 17 48
3191D8q1K09j98j5O5j30P4j4j3J57Q5k48J10M7p0k34QJ67J2RRJ3l0K0J26k46j30
$$ 48 -33 176 -22 -37 28 -102 -28 -42 -55 102 187 -61 49 96 26 -208 -200 -33 -21 -12 -3 10 -20 0 126 -120 -250
3218b50L58p4p4n1J84M0j59K31j46j1K31l88J66j51L39l44K92j71K3nK57pk10
$$ -250 108 34 -40 -91 93 133 -26 205 59 48 279 -109 57 -94 245 -99 193 22 45 40 297 290 80
3241H0j03jJ6R4J33j82m8o4K58k96J84M2m9j17J58P0j8l88M50j75R4j09l3r1J41
$$ 80 -23 -24 -8 86 219 37 -11 -75 183 -113 71 113 64 -53 105 175 157 -231 219 44 138 29 -4 -95 46
3266D6k78K29o6J67o0J32j04j87K04p4j66O0J21J49j47r4j7J06j30M7K43k17J38
$$ 46 -232 -3 -69 98 38 170 66 -121 83 9 -157 -97 24 173 26 -68 -85 21 -109 -62 181 -36 102
3289A02%j4m05J56J98J09k31L20l65O9j24K5K85k73J84J13l08M5J42K37l6k33
$$ 102 102 88 -317 -161 37 146 -85 235 -130 -61 -185 -160 125 -148 36 149 -159 -114 28 265 229 -4
3311dM4J82l33K22k45K47l0K2k22N1K0K8P4j18l2j1J19J00Q7j44n3K9j21J65k17
$$ -4 40 222 -111 111 -134 113 83 105 -117 -66 -46 -18 56 -62 -94 -105 14 114 201 57 4 33 -88 77 -140
3336a40K3J22r8J32j91O6K02j16%J38l59J48l2K41m12J22K68j47L54j8j72o9r4
$$ -140 -117 5 -93 39 -152 -86 116 0 0 138 -221 -73 -105 136 -276 -154 114 -33 321 303 131 62 -32
3359c2J22n6p0p2K48j65o3M2R1m9o9L23k33j26J72k04O3L8J46j94K23k9m22L85
$$ -32 90 34 -36 -108 140 -25 -88 -46 45 -4 -73 250 17 -109 63 -141 -78 -40 106 -88 135 106 -316 69
3383F9j6k18K15j30n9QJ87j17M6Q9M1o3l10J18N7N5J37nk4M1k05J16o4K2j4j1
$$ 69 53 -165 50 -80 -139 -131 56 -61 -15 74 115 52 -258 -140 -83 -28 109 104 80 121 -84 32 -32 -10 -24 -35
3409c5P8l07J74K34j21K04l07J09k22K01L1L2J8r4J01lj80P4KL5P2r1j32K65k51
$$ -35 43 -264 -90 144 23 227 -80 29 -193 8 39 71 89 -5 96 93 -87 -13 -11 24 96 5 -127 138 -113
3434a13K30j56N7j58J37Q7k15R5k9J79p8k7J03j57J71j10k56M54jk85M0P2j9r1
$$ -113 117 -39 18 -140 -3 84 -131 -36 -65 114 36 9 112 -45 126 16 -240 214 213 -72 -32 40 21 -70
3458g0P7P6o4j18N0M6Q0P8l98J95J61j18O8J17k37k9m6LK04j73P9N9Q0r5k6p6
$$ -70 7 83 19 -99 -49 -3 77 155 -243 -48 113 -5 63 180 -57 -86 -132 -129 75 -98 -19 40 120 25 -1 -77
3484g7J20j32J60j0r9R0p9J91j21n9J53k32K22k96J20J17J01j93k5P5j7M2q6k54
$$ -77 43 -89 71 61 -38 52 -27 164 43 -16 137 -95 127 -169 -49 68 169 -24 -49 26 9 51 -35 -289
3508b89L50q9P4n4j6J11l8O8j32J5K9K0j61O2L6k7k6o1J40K1r2J38j9k04m7K85
$$ -289 61 -28 46 -8 -24 87 49 117 -15 0 29 49 -112 -50 -14 -41 -67 -128 12 33 -59 79 60 -144 -191 94
3534I4Q6k06q3L51k13q7Q3l8r6J8J21J31l1k48J10l5l5J20P1r2m1P1j23J68j33
$$ 94 180 -26 -109 242 29 -58 25 -13 -109 -91 30 161 130 -118 -8 -43 -78 42 113 21 -20 51 -72 96 -37
3559c7P3L3p9l9p5J48P0j65M7jJ32n2k4P3M1l25M09l94J29r2J55q0P6j62K60n9
$$ -37 36 69 -10 -49 -124 24 94 -71 -24 -25 107 55 31 104 145 -180 229 -165 -36 -128 27 -53 23 -139 121 62
3585F2m0J20k34K21k94K08L7j74%KK01j56J73k32K44j20m7Qq7L0o8J64P7l2j00
$$ 62 22 142 -92 129 -165 43 80 -94 -94 -92 109 -47 126 -106 138 18 -29 -21 -108 -78 -146 18 95 63 -37
3610c7L8k48L93k68J46K13k38r7O2j10R1K63k07jn6K5m2j35J32J39l0j77O4J09
$$ -37 1 -247 146 -122 24 237 -1 -98 -36 -146 -55 208 1 0 -56 -31 -73 -208 -76 63 33 -144 -80 29
3634B9k09K06j39K53j25P9l2m7Q5L2k01Q7l8j72J00J67k40J02n5M4M3r7J92J16
$$ 29 -180 26 -113 140 15 94 62 15 100 132 -69 18 -20 -192 -92 75 -165 -63 -118 -74 -31 -128 64 180
3658A80n1k69j02M09j04K2M7j00j18J34k2J83r3j60J67j35Oj55K19Rm7M8k8Q9
$$ 180 129 -140 -242 167 63 85 132 32 -86 48 26 209 116 -44 123 -12 -6 -161 58 67 20 68 40 129
3682A29k04N8O8J67m35K46J20r7l1k85L41j18J29k27J69J9j00J78j06J05j06j6
$$ 129 -75 -17 51 218 -217 29 149 52 21 -264 77 -41 88 -139 30 49 -51 127 21 126 20 4
3704DK93k82m0O1j2j55K31r8QJ23J5J2l22K90k66R4M5j68K03L7J53j97k6j71J97
$$ 4 297 15 -25 36 24 -131 100 2 10 133 148 160 -162 128 -138 -44 1 -167 36 73 226 29 3 -168 29
3729B9J5O1m9Q7j39j45J50j3K21k05J2L2k38K54J1j36J00J62l40J19O5l26K31
$$ 29 44 105 56 143 4 -141 9 -4 217 12 24 56 -182 72 83 -53 47 209 -131 -12 53 -273 -42
3752d2J17j73J89p1j45Q9K5K43J4k27J16j70o9K00l3j36J07j56O5k4Q9qj5j1J12
$$ -42 75 -98 91 20 -125 -36 -11 232 246 19 135 -35 -104 96 63 -73 34 -122 -57 -81 8 0 -15 -26 86
3777H6q5k19L08M1j81m3J54j31P6O8j65J00O5r0mK1j20j45K93P4p8RJ73n68L82
$$ 86 1 -218 90 131 -50 -93 61 -70 6 74 -91 9 74 -16 -20 1 -119 -264 29 103 25 34 207 -361 21
3802B1J2O2O6j20j27J1J12k7n3J93j35k38K06j4K07k52n6K33n0p5N5J6k01K60
$$ 21 33 95 161 41 -86 -75 37 10 -43 150 15 -223 -17 -31 176 -76 -132 101 51 -24 31 47 -154 106
3826A06k62J3m7J65K3K84p2k09q8J34J5l30Q3K39k07K25o2q8L2J69k4Q6j39J5
$$ 106 -156 -143 -190 -25 -2 282 210 1 -87 47 62 -268 -185 54 -153 72 10 -78 -46 123 99 185 46 61
3850F1N8k74J19Q5j2J09K4j71L0m1j01K26o4k1J52k22O2j23rJ68o0K4j1K7P8M8
$$ 61 119 -155 -36 49 37 146 170 -1 29 -12 -113 113 49 28 180 -42 20 -103 -112 56 -4 20 9 36 114 162
3876A62j96n7j04J95K27l57K8J42P4k19R0K65j43J35l27M8J81k07O9j31M2K67
$$ 162 -34 -91 -195 0 227 -130 -102 40 114 -105 -15 250 107 242 -85 -37 144 -63 6 -125 -83 184
3898A84j84m1j31K02mK7J08l5J9q5o0r0Q1j35J69L2l2J10n8l6q7%J54r1L4k20
$$ 184 0 -41 -172 30 26 53 161 126 145 60 0 -90 -9 -144 25 57 25 135 77 41 -46 -46 108 17 51 -169
3924a69J15J35j23N7j70K73N5p6K3j75Q2RJ58k68N7M0j4l5K9J27m1J7l2J05j23
$$ -169 -54 81 -42 15 -155 118 173 97 120 -55 27 36 194 -74 -17 23 9 -26 3 130 89 106 74 179 56
3949E6J11k89K28j42jJ45k9q0Q9j10K6j33K81k67K42l22K27o5J63k4j40L9k36
$$ 56 167 -122 106 -36 -37 108 79 -1 88 -22 4 -129 152 -115 127 -195 32 -33 130 106 -34 5 -231
3972b31L94k67L2J75j3k6Q3j66K83l47J64k98N22m43N9J02l6J24j37j13K04k34
$$ -231 163 -104 -72 103 90 64 147 -19 264 -83 81 -217 305 -138 -79 23 -13 111 -26 -139 65 -169
3994a69J72J3r9K96l45L97m27K28J32j73q2K9o5R7J80j96o7J32j78PK64k03J87
$$ -169 3 16 -83 213 -132 265 -162 66 198 25 -57 -28 -93 4 184 -12 -79 53 -125 -118 146 -57 130
4017A30L8k54J73l66M9J11MP8R2rJ64k76m3J97Ok50K19j84M6J45J7j00o7K58j36
$$ 130 168 -86 87 -279 -230 -119 -115 -37 55 46 210 -66 -109 88 94 -156 63 -121 -75 70 87 -13 -80 178 42
4042D2K8kp7j75J73J15j16L28j05k54N9J38k12K7kj7K27l9j88K48j79J74rj39
$$ 42 70 68 -9 -184 -11 104 -12 316 211 -43 16 154 -58 -31 -33 -50 177 138 -50 198 19 193 184 45
4066D5J3p3Q6p6R4k41L42k5k29K8P9j84N5K11o3q9j2K07O2j35r9O6l0k12K49R8
$$ 45 58 -15 71 -5 89 -152 190 165 -64 -36 43 -141 -86 125 62 -27 -39 168 230 95 -4 62 32 -180 69 167
4092A67p3k19L10l24J24J27j33J44J75k47Nj29J3p4M7K1Q7P5k81K11l1n9Q0N9
$$ 167 94 -125 185 -139 -15 112 -21 123 298 51 56 -73 -60 -134 -87 -66 21 96 -185 26 -5 -64 16 75
4116G5j31J73j19m7j59K28j49J4J35j1j49L30k60J85j41l9N2p5j6P2K63k41j08
$$ 75 -56 117 -2 -49 -208 20 -129 -115 20 9 -140 190 -70 115 -26 -65 -13 -88 -104 -32 231 -10 -118
4139a18p4J77q4K20j00o3K05k26M5J65j15J10rm1k50K07L9q3J03p9j06k10M43
$$ -118 -192 -15 -99 121 21 -42 163 -63 -18 147 32 142 133 92 -158 49 88 5 108 29 -77 -287 156
4162A56l0L8O4k42n4m9O0j0J5J74q5J25lk36o1O9L0j85K40O9m2j47J47L1j23N0
$$ 156 126 164 228 -14 -68 -117 -57 -67 -52 122 37 162 159 -77 -138 -69 -39 -224 16 85 43 -104 43 74 -49 1
4188AJ46l73K55J6j00N5k68L34L5o7J65j75j88oL30k80K44k29m8j0K66J28l02
$$ 1 147 -226 29 45 -55 0 -268 66 101 34 199 24 -164 -170 160 -120 124 -105 -153 -163 103 231 -71
4211g1K2Q1N7P2l52J5J31J02Ln7J71J1k28l6r8J87J90j44J9j92M4J38N6j88L80
$$ -71 -49 32 89 161 -191 -176 -45 57 60 3 174 185 -43 -79 -177 10 200 56 75 -117 -73 65 121 -67 313
4236C13j82k25J72k49K79n3o7P0r4M0J00o9p6M3P1J58j80j24N2j37J56j87N9J26
$$ 313 131 -94 78 -171 108 55 -12 58 -36 4 104 35 -41 2 73 231 51 -73 -21 -158 -2 -189 -130 -4
4260dK70l48J91k3j61N0M4N7jj84r4J96K9j05Q7j40M59j62k05J84j91K4J19j76
$$ -4 266 -82 109 86 -75 -25 19 76 75 -109 -203 -7 22 -83 4 -136 323 161 -44 140 -51 -27 92 -84
4284h4L1J17j01j42J19R0J02k01j44L07J62l27K50k06K3oJ89k3j78M5o3M4nj36
$$ -84 -53 64 -37 -179 -60 30 132 -69 -213 94 256 -71 179 -27 -4 -10 179 156 -22 23 -40 4 -1 -137
4308a37K47j49J32LJ8J03q6k40K58k17J33p8j21J91j43J92l11J17J75p6Q3n3j45
$$ -137 110 -39 93 96 114 217 131 -109 149 -68 65 -13 -134 57 -86 106 -205 -88 87 11 94 41 -104
4331a04O7k6J74q9P5o7K2K8j12J61J46k61LJ12M3k18N2Q0k01P8J7K5J57l77K99
$$ -104 -37 -63 111 22 97 30 52 80 -32 129 275 14 17 129 172 -46 6 86 -115 -37 -20 5 162 -215 84
4356H4j56Nl1K30m03K22N0P9Q8j67k5o4n0N7LR0KK5j9o4J72j14J2q8P6J37j19
$$ 84 -72 -67 -98 132 -271 -49 1 80 168 1 -24 -88 -138 -81 -78 12 14 39 20 -44 128 14 26 -62 14 151 32
4383C2l6k1n4K11N5j76J11l4k61J39j09K94p6J4j9k02P9j17K64k87K53Jj04J34
$$ 32 -4 -25 -79 132 187 11 122 88 -173 -34 -143 151 75 89 70 -132 -53 -170 94 -193 60 61 -43 91
4407I1j67L05l37M7K69qj46o4rK51l03j17L39k11J5M4j97K17j21P7N8j77K08j02
$$ 91 -76 229 -108 -61 208 200 54 -10 -19 232 -71 -188 151 -60 -45 -1 -198 19 -102 -25 33 -144 64 -38
4431c8P8j89J31l0Po5P5Nl3k9j0J30M9k29R4P7l0J55k19O6M5j04J26j04O5P9O
$$ -38 40 -149 -18 -48 -41 -106 -31 -26 -59 -88 -98 32 81 -148 -54 23 -7 148 -71 -5 40 -64 62 -42 23 102 108
4458A08j11J19j71q8K87j64l6K36j97K11k34J97q8j32K9K2K2p6k1O8k17K58j68
$$ 108 -3 116 -55 -143 144 -20 -56 180 -17 194 -40 157 69 -63 -34 -12 10 -66 -87 -19 -236 22 -146
4481a46J02m4J74q7P2j46l3L19l07J3Rj4L19j93R2p0q6l5J84k15J74l8j07K0J07
$$ -146 -44 -88 86 -1 71 -75 -108 211 -96 -83 -74 -88 231 38 130 60 -26 -61 123 -92 82 44 -63 -43 64
4506F4q8Lq3LK5m5m2J50J95j80L2l6P4M0q1k1j0m8K27p4j16K8Opj29J27L0p3J16
$$ 64 -24 -21 -104 -101 -76 -121 -163 -13 182 2 34 -2 72 112 31 10 0 -48 179 105 -11 17 23 16 -113 14 44 -29 87
4535H7N0m0O7k39j3J9K8K0qO5J14r6Q0R1k55L1N1J4j05L1j07J12n7J6N6k5j01
$$ 87 137 97 164 -75 -88 -69 -41 -21 -29 36 150 54 134 225 -30 1 52 66 -39 -8 -115 -3 -60 -44 12 -13 -114
4562a14P2K8N8k0j93L7J95pj27J45k56K86j60J47kj08O3P0o9Mo2j6J52j99L34
$$ -114 -42 -14 44 24 -169 -132 63 56 -71 74 -182 104 -56 91 89 -19 44 114 45 49 -13 -29 123 -76 258
4587B58k45o1J24k94J44R9rj1j31J48n6j29K35k33J22j2rR1K00j60J7o0k4j10
$$ 258 13 -48 76 -218 -74 25 16 5 -126 22 -34 -163 72 -161 -39 -51 -60 31 231 71 88 28 4 -106
4611a06J58j63K31j15j2K1j81J63k2m4r8K45L7M3j97K37j06q6O8j53J65l5k36
$$ -106 52 -111 120 5 -7 14 -167 -4 -26 -70 -168 77 114 157 -40 197 91 5 73 -80 85 50 -186
4634a86K90k03R3K6k00J45J8j26J13P3o2O8r9J00M5k07o4J38m7QK64j67M1r2J87
$$ -186 104 -99 -6 20 -180 -35 -17 -143 -30 43 -19 49 -50 50 95 -112 -176 -38 -85 -77 187 20 61 -31 156
4659A56k44L6L8N5q2m6L23j51q8j71J02O8p5m6J87l33K34L4o2J80j05J01k8p3
$$ 156 -88 -52 -14 41 -41 -87 236 85 -3 -174 -72 -4 -79 -125 62 -271 -37 -3 -65 115 10 111 83 10
4683A0j72Q9J59j1N4J09k25K65k86P9J41k73M8Q3p0M0j10qo6J61J05J4j44J04
$$ 10 -162 -73 86 75 129 238 13 278 -8 71 212 -61 -13 70 0 40 -70 -78 -144 17 122 136 -8 96
4707I6R0j48q2K02l8O6l20o1J46L3l7J68p2m7p2K17j1j80J02j8j05O5J35J21l03
$$ 96 186 38 -44 158 120 186 -134 -195 -49 -16 -53 115 43 -4 -76 141 130 -50 52 34 -71 -6 129 250 -53
4732e3j09J75J0o4k98L49kJ04j38j51L07p3k04J11L3o6K33m32K23K14j27J11j07
$$ -53 -162 13 23 -41 -339 10 8 112 -26 -177 130 57 -147 -36 -3 -69 164 -268 -45 169 42 153 46
4755D6j38J70rR9Lk19N5mq7J02Q0j62J06p5K01Kk02K7jM2J14j81o9J81j32N6j92
$$ 46 -92 78 69 168 171 -48 7 3 -84 18 98 -64 42 -33 168 170 -32 -5 -6 36 150 -31 -100 81 -51 5 -187
4782a87M01m96L67j67O2p8K54q8P0j93m8K88k03pJ16j41l5R3RJ5J00j2k78K60
$$ -187 214 -282 85 -82 -20 -98 156 68 138 -55 -103 185 -18 -25 91 -50 -85 8 17 32 132 120 -158 102
4806A02J0j93R9P7K8k2k11J17J40r1l6j18K5J74M5k86K85o9O5l5k25rK99l16K38
$$ 102 112 -81 18 95 123 101 -110 7 147 56 20 -98 -73 101 146 -140 145 76 141 106 -119 -128 171 -145 93
4831I3j40N8J76r6M4j61j57K94rj23j34K31J44l40L28j40p0K7j21M3l8J21%k75
$$ 93 -47 11 187 91 135 -26 -183 111 102 -21 -155 76 220 -120 208 68 -2 25 -96 -53 -91 30 30 -245
4855b45J19K34l19J79J61j80J7l18M96p7k92J80J19j4k00J61P0k07J47ml0r8O6
$$ -245 -126 108 -211 -32 129 -51 -34 -352 144 67 -225 -45 74 60 -140 21 91 -116 31 27 -3 -101 -35
4878c5Q8k13J3J14Kk4j14k2K35j06K79l05J49j18o2j97K65N1kN0j20K51m07L44
$$ -35 53 -160 -147 -33 -31 -55 -169 -191 44 -62 217 -88 61 -57 -119 -316 -51 0 -2 48 -72 179 -228 116
4902A16j08j09K12r4J4J2j14j8J22j28mL8J9R9r6LJ21k18J12Q7j75K59l1j15q3
$$ 116 8 -101 111 17 31 43 -71 -89 33 -95 -99 -61 -42 57 -39 -36 85 -133 -21 66 -109 150 119 4 -79
4927g9L6J02j23n7J65j30q1R3J8P7N5j92R3L9m0J33j01J3k0k3J75P2k55L9N9j64
$$ -79 -43 59 -64 -121 44 -86 -167 -74 -56 21 76 -116 -23 16 -24 109 8 21 1 -22 153 225 -30 9 68 -96
4953i6J17M7J7K8j86J49o6R6r6j53K7M08l21nK54m45J77Q6j11J65J1j73K09k56
$$ -96 21 68 85 113 -73 76 10 106 10 -143 -116 292 -29 -34 220 -225 -48 38 -73 92 103 -70 139 -117
4977a17J44k9l4oj1K2o7J89j08K1j00J79o1r5o5J78O4ok08J5J61j47R7oJ32m8
$$ -117 27 -2 -36 -42 -53 -31 -98 91 -17 4 -96 83 22 -73 -138 40 104 98 -110 -95 66 -81 16 10 142 94
5003I4p3R8j13J57k42r6K53O0K9n6l10L28q1R2p0k86L97k02k1P9J0J38j50j10
$$ 94 21 119 6 163 -79 -175 78 138 167 111 -199 129 48 140 70 -216 181 -21 -42 37 47 185 35 -75
5027g5l5J04J67n8j18q9K20r0q8J48j84L4J77j77Q1L7j22J05o0J31j70J87j93
$$ -75 -110 -6 161 103 -15 -104 116 26 -62 86 -98 -64 113 -64 17 54 -68 37 -23 108 -62 125 -68
5050f8N3J35o0j99J25j82J60K3K7j28J46r8L39m04K9J00J15q9l4J70j00R2q0k21
$$ -68 -15 120 60 -139 -14 -196 -36 -13 14 -114 32 -66 273 -131 -102 -2 113 24 -10 160 60 152 72 -149
5074a49pK30j44O8J14j46L8R7j77O5K7p3J55J26l77j1L92j58j07J77k14R2L3J9
$$ -149 -156 74 -70 -2 112 -34 4 101 -76 -11 16 -57 98 224 -153 -164 228 70 -37 140 -74 18 51 70
5098G0p5P4k17M3M5M9K29r5j46k2P3k17K42R2k64J03j15J69P9Lm5q6j73K02J71
$$ 70 -5 69 -148 -105 -60 -11 218 123 -23 -45 28 -189 53 145 -119 -16 -131 38 117 120 75 -11 -184 18 189
5123A89l06L19k45P1n0p4J70O2k49J55p2N4j2mL7K2p0oo9J87j11j40n7L36j04
$$ 189 -117 202 -43 28 -22 -96 74 136 -113 42 -30 24 12 8 45 67 -3 -9 -78 109 -2 -142 -199 137 33
5148C3M6M8j40M1J78q3m9m3L2N6j38J26j49J24j22nq9K57K6j7j60k18K12n8J99
$$ 33 79 127 -13 28 206 123 74 31 63 119 -19 107 -42 82 -40 -45 -134 123 149 132 -28 -246 -34 -92 107
5173A07r8J29j36NNj18J33j76J46J07k36J49j55K61K6j74k8j1r0J81j28O8J22
$$ 107 9 138 2 7 12 -106 27 -149 -3 104 -132 17 -138 123 149 -25 -53 -64 -154 27 -101 -33 89
5196H9j02R3p2j14N8J81k25m9K27p3Q6J11j85q9lJ59q6J33mjj95J34k45J49N7
$$ 89 -13 80 8 -106 -48 133 -92 -141 86 13 99 210 25 -64 -67 92 6 139 135 134 -61 73 -172 -23 34
5221C4o0M8n8P4Q8O0N0l54R8n1K5Q5j0L1K8j64J1J15j60K58j71J95k33K44j51
$$ 34 -26 22 -36 38 126 186 236 -118 -20 -71 -46 39 29 60 88 -76 -65 50 -110 148 -23 172 -61 183 32
5246C2q8l6j87K23J67n1R9Q8j19k52K16Q0P1p0k84K47j47j82K65jj97j0P2P1j87
$$ 32 -56 -92 -279 -56 111 60 159 247 128 -124 92 172 243 173 -111 136 -11 -193 72 71 -126 -136 -64 7 -180
5271a80L53k95K26k36K94j73o8K07k48J21R1j27J8k7J55m1n4%o1j09J25M3m2J47
$$ -180 173 -122 104 -132 162 -11 -79 128 -120 1 92 -35 -17 -44 111 70 16 16 -45 -154 -29 14 -28 119
5295A19q4j53j18K66l6J58k14Q2j19J38j60j59L71r8N0o3L2q1K02j93J70J64j91
$$ 119 35 -118 -236 30 -6 152 -62 20 -99 39 -121 -280 91 -7 43 -20 12 -69 133 -60 110 274 83
5318H3m0j34K29l6Mj81j02K26j22Nk5K22j76J36j99J53P9k44K8K49k11J06J67
$$ 83 43 -91 138 102 106 -75 -177 49 -73 -68 -93 129 -47 89 -110 43 122 -122 -94 155 -56 50 217
5341B17j36k1k59L36K6k46J85j06L0N0q5j15K03m5j90j13L60j49J49j05J16l38
$$ 217 81 60 -199 137 163 -83 102 -4 26 76 -9 -124 79 34 -156 -269 91 -58 91 -14 102 -236
5363b36O3K43O0m5O0P6l01rk1J00jR0j84J16n0J5K0R9N7k07R8l6o9o2J45K2j21
$$ -236 -173 70 130 85 145 221 -80 -89 -110 -10 -11 79 -105 11 -39 -24 -4 95 152 -55 43 7 -62 -124 21 43 -78
5390g8K81k38K2MJ1n2M4k60K12j35K74j21j33L34n1j50J6Q5o8j01o7J07o7J19
$$ -78 203 -35 -13 -9 2 -50 -6 -266 -54 -189 85 -36 -169 165 114 -36 -20 65 -3 -104 -171 -64 -131 -12
5414a2J30k03KJ19L8j77J02r5J6J61j87J54lj26n6O7J89j58N9K24l30kJ7j16L6
$$ -12 118 -85 -83 36 74 -103 -1 -96 -80 81 -106 48 45 -81 -137 -70 119 -39 20 244 -86 -88 -71 -187 -151
5439a51J69LK8k3o6R0oq6Q9k76K07J28k48M17k02k7k74J06K17k5J1km5j18K15
$$ -151 18 21 49 26 -40 50 44 -42 47 -229 -22 106 -142 275 73 46 -228 -122 95 70 81 79 34 -84 131
5464A31j02r3O0L5J08j1m33J73K67k47J17j20J04j31J64Lp2o1K96j36j13J35N0
$$ 131 29 -64 -4 31 139 128 -305 -132 135 -112 5 -115 -11 -142 22 25 -47 -108 188 52 -61 74 124
5487A24k60j54K94k2J04k55q5L05j45L06j32Ok42Q8n5J44k68J58j33L01J10j84
$$ 124 -136 -290 4 -18 86 -169 -254 51 -94 212 80 86 -156 -68 -123 21 -247 -89 -222 79 189 5
5509EK63r3j04j83J57o0l3J28j22J66j86L34l57K23j22q4r7J70l7J22Pj5j94j14
$$ 5 268 175 71 -112 45 -15 -48 80 -42 124 -62 272 -85 138 16 -68 -165 5 -32 90 97 82 -112 -226
5533b26K95J9j45O7M4j47O9Q8j98J0J78l8k1n6K18k85K16l0J7J54k39J25j80n4
$$ -226 69 88 -57 10 54 -93 -24 64 -134 -124 54 16 -5 -61 157 -128 88 58 75 229 -10 115 -65 -119
5557a19J02M8o9O7j48L1l6J85K4mo6L4P6k20P0N6j02j72K64m7J46k09J11o8n2
$$ -119 -17 31 -38 29 -119 -88 -124 61 85 81 15 49 125 -95 -25 31 -71 -243 21 -26 120 -89 22 -46 -98
5582i8J81L3k85J36J52j62J9M7qj47L14k46J65j39P1j43p0L59j16j59K54q8j32
$$ -98 83 116 -169 -33 119 -43 -24 23 15 -132 182 -64 101 -38 33 -110 -180 179 63 -96 158 70 -62
5605f2J28P5k54p5L65m9N0Pp8k73L01k93M22j99N8o6o7N6k8j47rK8K51Oj15k18
$$ -62 66 141 -113 -188 177 128 178 185 107 -166 135 -158 264 65 123 57 -10 46 18 -129 -138 -110 141 147 32 -186
5631a86J59q6K28j32L1K28k80J49j20Q5k01J62J8J59l66P5J09q6k8K33l02J45
$$ -186 -27 -113 115 -17 14 242 -38 111 -9 76 -125 37 55 214 -152 -77 32 -54 -82 151 -151 -6
5653fj68K23k03l6m2M64j56pK2j31n7K43p8j5r5mJ06j70K37j19r2L29k49M3j28
$$ -6 -174 49 -154 -190 -232 232 76 69 91 -40 -97 146 68 53 -42 -46 60 -110 127 8 -84 245 -4 39 -89
5678h9K06j39J18j24J75k61K81k7m0K5%k3q2K9k05K72j15J10p1Q0m9r7J51q5L7
$$ -89 117 -22 96 -28 147 -114 167 140 100 125 125 102 20 49 -156 116 1 111 40 120 71 -26 125 40 77
5703G7K09k79J47j09n1Q2J18k73R4j12J0lm7J37Q2r0j8K7m1j53L63j80J29j00
$$ 77 286 7 154 45 -6 76 194 -79 15 -97 -87 -90 -137 0 82 -8 -26 1 -40 -193 170 -10 119 19
5727A9q7J56j45K56j80K0j03J32N0q3K42k10j77K55o9l1j05n0j0j05M66l35o6
$$ 19 -68 88 -57 199 19 39 -64 68 118 35 277 67 -110 145 76 45 -60 -110 -120 -225 241 -94 -160
5750a60J57K13n6k41Q0Q7j99K00J87l49k1K99r3l13K83Q2l7k66K64j28J11o6m0
$$ -160 -3 210 154 -87 -7 80 -119 81 268 -81 -102 197 104 -209 74 156 119 -147 117 -11 100 34 -6
5773fm7o4J36Rj37J43j78j9J81L3N9k49Q9N2q9J30N6m5Rj82J31J4N2k54L85o9
$$ -6 -53 -117 19 28 -109 34 -144 -163 18 51 110 -139 -50 2 -87 43 99 54 63 -119 12 26 78 -176 209 140
5799A40j60m7O9j46J54p0J28j24Q8R3k98J30R5lN9O0k5p4k36J01j6L2R0j81K15
$$ 140 -20 -67 2 -144 10 -60 68 -56 32 125 -173 -43 52 49 108 168 143 69 -167 -66 -82 -50 40 -141 74
5824G4q3J71j38o4K24j71J94Q5m42J22J80k46n9K29K7Q9l53L00M5k86K06j3k14
$$ 74 -9 162 24 -40 184 13 207 292 -150 -28 152 -94 -153 76 103 192 -161 139 184 -102 104 91 -123
5847a23j49J98M9M0K39l28O2K9q4N2q9J54L82k80j46k00L09l5N7k24q8J72L1n
$$ -123 -272 -74 -25 15 254 -74 -12 17 -67 -15 -104 50 432 152 6 -194 115 80 137 -87 -175 -3 28 23
5871B3N4M4O1k26p0P1k07M09j7j60K89k76K4jJ0j06l0J96j30j8q1J24k68J79J53
$$ 23 77 121 182 -44 -114 -43 -250 159 142 -18 271 -5 19 18 28 -78 -108 88 -42 -60 -141 -17 -285 -106 47
5896D7J37j30j5j46kJ96r6k9Pm4q0K67r8q0M8n1L3N9j1J73m33K48j66J64J50m3
$$ 47 184 54 39 -107 -109 87 -9 -38 -31 -75 -155 112 14 -66 -18 -69 -36 23 12 185 -248 0 -166 -2 148 105
5922A05j52O5j4l6o7J07P1l3k98K10RL3J89k17j45j96M81p9j42R3K14j71J20j87
$$ 105 -47 18 4 -32 -99 8 79 46 -252 -42 -33 0 189 -28 -173 -369 112 33 -109 -16 198 27 147 -40
5946d0O3j00L35m1k91J06q0J7O5m2M8K8r6l2R6J9j29J38k93J09J84nm1j80J66
$$ -40 23 -77 258 217 -74 32 -48 -31 34 -8 40 68 -28 -60 36 55 -74 64 -229 -120 64 59 18 -162 4
5971DNj6n0j05J43N4L5j78LJ3J86Q5q7J17o8M1j96l6J9J53j93L5R5J9J61j97P4
$$ 4 9 -7 -57 -162 -19 35 70 -108 -105 -92 94 179 92 209 141 182 -14 -50 -31 122 -71 -36 59 78 239 42 116
5998A16k05J8J54j78k7q7K77k1J30j96r1P5N4J6mq5K9L4L7J13q7K9j6n0J46k2
$$ 116 -89 -71 83 -95 -122 -209 68 47 177 -19 -110 -35 19 35 31 -54 -25 9 46 159 72 101 85 35 181 159
6024A59l16RJ08N0r9Mk58K96Pj11k8J96k13K45k06L05j57Q3k37j05K56j02k0L7
$$ 159 -157 -148 -40 10 -89 -85 -343 -47 -40 -151 -179 17 -196 49 -157 148 -9 74 -163 -268 -12 -114 -134 -97
6048i7K30l08K76j55L0K07j57k8MQ1o6R7p4K3O4o1J04k09K0o2R4k79K78L5j17
$$ -97 133 -175 101 -54 -24 183 26 -2 2 83 17 114 40 63 127 66 170 -39 -19 -81 13 -266 12 47 -70
6073g0O5o1Q3mK40m26J66Ro1J53k13L21j87q6j27K45q0k5j26K19R4j09j9j8K8
$$ -70 -5 -66 17 13 253 -173 -7 2 -59 94 -119 202 15 -71 -198 47 -33 -58 -184 35 129 20 1 -17 11
6098A1O3J54k70M5n9l7N6J78k53r1L16q5l6J8J23l41K98k01J48r6O7k74P5K79
$$ 11 74 228 -42 3 -56 -93 -37 141 -112 -203 113 28 -8 10 133 -208 90 -111 37 -59 8 -266 -191 88
6122H8k8k56J80n4l5N6Q2L5R3j43k85K55L7q9K18j46O9j94J90j17J87p5M4k26
$$ 88 60 -196 -16 -70 -105 -49 33 68 161 18 -267 -12 25 -64 154 8 77 -117 73 -44 143 68 112 -114
6146a14R7j1J31J00k01O5mj38p7K75r7j15j3K48j17j23M7Q9k4j27K93j80L6k8
$$ -114 -17 -28 103 203 2 67 63 -75 -152 123 26 -89 -102 146 29 -94 -47 42 18 -109 184 4 40 12
6170A2p7O5J58L4k01K26j88P9l9n7j96J3N7Q8j78K17J21mk14j26J93K5O4J7q8
$$ 12 -65 0 158 192 -9 217 29 108 69 12 -184 -171 -114 -26 -204 13 134 130 -84 -210 -17 8 72 89 1
6195AJ19l03K77l18K31N0L8j63J01j35K43j53rp2J29j0Q8J3J70l93R7J21k13J86
$$ 1 120 -183 94 -224 7 57 95 -68 33 -102 141 -12 -21 -93 36 26 114 127 297 -96 1 122 -91 95
6219I5j18J02k13J32J12n2NJ74j70J17K8j89j11K00j73J70j03l0N8o3n3K4j48
$$ 95 -23 79 -134 -2 110 58 63 237 67 184 212 23 -88 112 -61 109 6 -24 34 -29 -82 -58 -206
6242b06J50k2M19o01K12R3q6N6J07j36R1O9j0j42j35M6L9K9K36j15k74K43j67
$$ -206 -56 -78 341 -260 -48 45 -41 15 122 -14 77 146 136 -6 -141 -95 -56 -27 209 94 -180 63 -104
6265a04j8K11j01No6LK91j19j15j59o8K28J99j35k44J37R8k9l0Lj45J69L9J32
$$ -104 -122 89 -12 -7 -73 -70 221 102 -13 -172 -240 -12 187 52 -192 -55 43 14 -16 -13 -158 11 50 182
6289A82k58J3J02J28r9L4J80l15L7J10k52pQ2J34m8N8j16J36m7j12j10K94j2r9
$$ 182 -76 -63 39 167 68 102 282 -33 4 114 -138 -145 -63 71 23 81 -35 101 54 -58 -168 126 114 15
6313A5N0j0J80l72J95M8p1n1J02o8Q4k36J27k0O3j20J33j15R6j85L05j81N0J72
$$ 15 65 55 235 -137 58 106 35 -16 86 18 102 -134 -7 -27 36 -84 49 -66 30 -155 150 -31 19 191
6337A91j30L8k46R0LJ65qj39J07r6k66L98j27J80k72J48lj93K48K4k11P6O3KJ51
$$ 191 61 99 -147 -57 -54 111 103 -36 71 -25 -291 107 -20 160 -112 36 33 -160 88 112 -99 -23 40 42 193
6362A93n44J98K67j11J38l37J58P3O7j43qlO8M1m1j32N1J71jm1o5q0l3J06n6J01
$$ 193 -351 -153 114 3 141 -196 -38 35 102 -41 -49 -52 16 57 16 -116 -65 106 105 64 -1 -81 -114 -8 -64 37
6388C7N9l6m3l32M97l1l32J83Mq3Jj99M19K40m84J16p7J84j15q1l6L66j11j74
$$ 37 96 60 17 -315 182 151 -181 2 6 -77 -76 -275 144 384 -100 16 -61 123 8 -73 -109 257 146 -28
6412b8p2N9J01Q7k68J70kj51L9O5m9K45j92n0K98j67k12J45l5l0r2K94m3j28P9
$$ -28 -100 -41 60 147 -121 49 47 -104 -65 0 -49 196 4 -46 252 85 -127 18 -17 -47 -139 155 112 -16 63
6437F3p1J03r7O6j67KLK44j60O0R9r5j6j68J10j27J9P2j3p3K17M4j71q0J09P0
$$ 63 -8 95 -2 64 -103 -101 -98 146 -14 46 145 50 34 -134 -24 -151 -132 -60 -73 -146 71 115 -56 -136 -27 43
6463D3j14P6j04P0n9J63Q4k63MMoJ60j38J0J48r8P0MJ47p2o1l9j0j2p2p3J08J76
$$ 43 -71 5 -99 -29 -88 75 159 -104 -100 -96 -102 58 -80 -70 78 -20 50 54 201 129 68 29 19 7 -65 -138 -30 146
6491A46l40P1J56J5l37K55J14p2q5K13j62K45j88J17r0N2O9n2k61J2J96mn4k9
$$ 146 -194 -123 33 48 -289 -34 80 8 -77 136 -26 219 31 148 58 110 179 127 -134 -122 74 70 16 -13
6515a3K22l30L88l42P3k14K51J45j08j36p8J12Q7j51J05k0j3j42J31L06j77k26
$$ -13 209 -121 267 -75 -2 -216 35 180 72 -64 -142 -30 57 -94 11 -9 -22 -164 -33 273 96 -130
6537a30J6L5J01K16j74j58K49j63j5J0j19K47k21K38p1n5p1P4j1l1r4J59J98j94
$$ -130 -114 -79 22 238 64 -94 155 -8 -23 -13 -132 115 -106 132 61 6 -65 9 -2 -33 -127 32 230 36
6561C6m3K25k82J6J71p0o0j5K61l25K15K4n7N2j28P1j92J50J7j43K61j18k8k5
$$ 36 -7 218 -64 -48 123 53 -7 -22 239 -86 129 153 96 148 20 91 -101 49 66 -77 184 66 38 13
6585A3K0j83O4JL0l9O5j54L17j55J82l96L22rJ01k4o1p2l2O4N7J96k19j0j74J42
$$ 13 33 -150 -86 -85 -55 -94 -29 -183 134 -21 161 -235 87 78 179 155 94 22 -10 54 111 307 88 78 -96 46
6611D6j3j60L0J77m4J9j85O9K3o2J1J38J56l20LJ11j45J26Q3N4j34r3J10j25K90
$$ 46 33 -127 -97 80 36 55 -130 -61 -38 -100 -89 49 205 -115 -112 -1 -146 -20 63 117 -17 -110 0 -125 165
6636A65l18k3J33m5J30O8o8N4j26m2j11J73nK7o8K51j77L15k47l8j03N8J06j22
$$ 165 -153 -176 -43 -88 42 110 42 96 -30 -72 -183 -10 -15 12 -56 195 18 333 86 48 -55 3 109 -13
6660a3R3j6k00K03j17J33j50P8k4l5j51K05N7j24o8L32k45j58L76j94q7K8mL2
$$ -13 80 64 -136 67 -50 83 -67 11 -13 -48 -199 6 63 -61 -129 203 -42 -200 176 -18 -105 -77 -81 -49
6684d9J02j2Q2k5L7j19M2L8p7k7q3J10Q8j92n0J99k7n6J33r9J9K02l64J51q9n2
$$ -49 53 41 123 98 135 16 58 96 19 -8 -91 19 107 -85 -135 64 37 -19 114 15 34 236 -128 23 -66 -118
6710a18R8K7j47J4J37Q5p2R7k00J17k9m2J00L0j51P1P3o8o4J93r1j02j10N2K06
$$ -118 -20 7 -140 -126 11 96 24 121 -79 38 9 -33 67 97 -54 17 90 22 -42 151 60 -42 -152 -100 106
6735A06l34K92k38L99k59J99k52J63o8R3r7R9n6j28J20l8P6q7j28J59n3K7l6P5
$$ 106 -228 64 -174 225 -34 165 -87 76 8 101 4 103 47 -81 39 1 77 -10 -138 21 -32 -5 -41 34
6759C4j05R3j96Q0K22j02K26m33j9L27j28O9j66J22r1K17O8l14J64k50J26J09
$$ 34 -71 22 -174 -94 128 26 252 -181 -200 127 -1 68 -98 24 -67 150 218 -96 68 -182 -56 53
6781E3r0J7p8J37K29r1l38J93k49N3J69k19L33j9L5j02qq1l7J52J9j6n3J17k70
$$ 53 -37 -20 -98 39 268 177 -161 32 -217 -164 5 -214 119 100 135 33 25 -56 -93 59 78 62 9 126 -144
6806a44K05o0n6J67p8J0r6o9K59j13j60P7k5J23m3K63m23M0R4J79l6r6L7q6P6
$$ -144 61 1 -55 112 34 44 -52 -121 138 25 -135 -58 -83 40 -3 260 -163 -123 -29 150 114 18 55 -31 45
6831D5J3j61n5M2J0J13j11K9N3J38rj16k7Q9j25J26j57N9K5r3J35j28K37j8j34
$$ 45 58 -103 -158 -116 -106 7 -104 -75 -22 116 107 -9 -36 53 -72 54 -103 -44 -19 -112 23 -105 132 114 -20
6856b0L4j2o9K38r6j38J45lo1j48n3J93j38L8J18K1j46Q9n2J16O4k99K36n5J69
$$ -20 14 2 -67 171 75 -63 82 79 18 -130 -183 10 -128 -90 28 49 -97 -8 -60 56 120 -179 57 2 171
6881A71j87j08L32j81n9Q5p7j1J49N4l52R0J04K0O2mK5O2k15%j29K8N5M6J94R2
$$ 171 -16 -124 208 27 -32 53 -24 -35 114 168 -184 -94 10 30 92 88 113 175 -40 -40 -169 -141 -86 -40 154 246
6907B46j76j42J24j94L5Q5J29p1j60J16j36j16K83l9J54o9q1j01J79j15m6L92
$$ 246 70 -72 52 -142 -107 -22 107 36 -124 -8 -144 -260 23 -16 138 69 -12 -113 66 -49 -95 297
6929B97l83K55k59Q0j60K11J8p1J86k41j03K84j86J46K2p9J20mN2l07K78j74N1
$$ 297 -86 169 -90 -10 -170 41 59 -12 174 -67 -170 114 -72 74 96 17 137 133 185 -122 156 -18 33
6952C3j19J64l04J83pL1o4r3J07R3k0K09n15K77l1J52Q4k10K20k1l73J97K9j26
$$ 33 -86 78 -226 -43 -50 -19 -83 -176 -69 24 4 213 -302 -25 -56 96 180 -30 190 169 -204 -7 22 -104
6976a04O2j01O1j47qL13M0j16Jj6P7O8j07P7n1j02J5J14k75n5J96k00K86J08j50
$$ -104 -42 -143 -82 -229 -237 76 116 0 1 -15 62 130 23 100 49 -53 -38 76 -199 -254 -58 -258 28 136 -14
7001a4q0J67j10L7N8r4N4j66J2J68j18M5JJ51K2j20L9o4k8J14k47M7j0L6J44j02
$$ -14 -94 73 -37 0 58 -36 18 -148 -136 32 -86 -41 -40 111 133 13 52 -12 -40 74 -173 -126 -136 -100 44 -58
7027e8N6j80K13M0J9L1p3m3O7j23L2j32J37N0Rk24J68Rj24L26q2K0j89K58m04
$$ -58 -2 -182 31 71 90 121 48 5 72 -51 -19 -151 -14 36 45 -179 -11 -2 -126 200 118 138 -51 207 -197
7052a97J72j44J67r6J26j67L6K10q2n3Q2j52K89k11L6J70n1k07j42K81O3k11K05
$$ -197 -25 -169 -2 -98 28 -139 -103 107 25 -28 54 -98 191 -20 16 186 135 -72 -214 67 130 -81 124
7075A24n8j60J27Mj02L1J27k28J39p5L4P7J71K9j50O3j0k70J40L8Rp4K5N5l2J39
$$ 124 66 -94 33 37 -65 -34 93 -135 4 -71 -37 40 211 240 90 153 143 -127 13 51 60 -14 11 66 34 173
7101A73j53J2j2m0j86J65K71j73K4J69j07k21J87J3l4m5j06P4j85L32J29l24P3
$$ 173 20 32 20 -20 -206 -41 230 57 81 250 143 -78 109 122 88 43 -63 11 -174 158 287 -37 36
7124C6R0j66J31k0O8k1j83J48P5j54j93L85m16K08q7L8J81l4k1j21J18j47J98
$$ 36 126 -40 91 71 139 118 -65 83 158 4 -189 196 -220 -12 -99 -61 120 86 65 -56 62 -85 113
7147A13k82K27Ko3j16K84r7j25j59L57j85L48j00Mj69m4l50K97J10m9j12l5K04
$$ 113 -169 58 60 -3 -119 165 68 -57 -216 141 -44 304 204 208 39 -5 -355 -58 52 3 -109 -144 60
7170F0O2N5j66r5Q5O8n7k59K82m2q7K46j63j2J9j02J05o9N9J42j08r5K4K42j14
$$ 60 122 177 11 -84 1 69 12 -247 35 -7 -94 152 -11 -23 -4 -106 -1 -70 -11 131 23 -72 -48 194 80
7195H0l9k44J70O3LJ10j77k3O3NoN1j80K43J3k40J20j17J65j2k0j15Q2K0o8J53
$$ 80 41 -203 -33 30 33 143 -34 -57 6 11 5 56 -124 119 132 -108 12 -105 60 48 28 -87 -5 15 -53 100
7221A00k80K30k09J60oR0r8L9jJ02l45j5J70J7J74M1k32J01l6N4j46o7M8J57j97
$$ 100 -180 50 -159 1 -5 85 -13 26 25 127 -218 -233 -63 -46 128 169 -63 38 2 56 -90 -157 -109 48 -149
7246a49O2J74n2j04O6K82m26P3m6N4J99l38K4j8P7J60p9J98j84q1K03r2j08J8
$$ -149 -87 87 35 -69 -3 279 -147 -74 -120 -66 133 -205 -181 -199 -122 38 -41 157 -27 -108 95 3 -105 -87
7270h7j8K28j06L2m4j47J86p0J40j70K10j82Lj71N1M19j05m90N11l03Q6P8j1r8
$$ -87 -105 123 17 49 5 -142 44 -26 114 -56 154 -28 -25 -196 -145 274 169 -321 190 -113 -27 51 40 -58
7294e8P8J31R0l18J35j73N2J86j14Q7P0k19J78r5nK44n10K10j48J22j6m6K27j23
$$ -58 20 151 241 -77 58 -115 -63 123 9 96 166 -53 125 30 25 269 -241 -31 -179 -57 -73 -119 108 -15
7318a5J50K9k01R4j74J39j02L3J6k9K42k38r0K22J80k80n2O4O8p7J5N3Nj91J82
$$ -15 135 164 -37 57 -117 22 -80 -47 -31 -60 182 -56 -146 76 256 -24 -76 -12 56 -21 -6 47 52 -139 43
7343D3j00K4m4N0K23k16J24kj79K42j77J92n3j85J7m0J59r4K4M3nj35J09K89l65
$$ 43 -57 -33 -77 -27 196 -20 104 102 -77 165 -12 180 127 -58 -41 -81 78 -16 8 51 46 -89 20 309 -56
7368e6K71Jk24O9j99J65jm5J57r6%K02j96J9k26J85N6l7qm2L8j99J43J8q9P6J54
$$ -56 215 216 -8 61 -138 27 26 -19 138 42 42 244 48 67 -159 26 82 45 37 -5 33 -166 -23 -5 -94 -18 136
7395A36k80K09m9J3J12N6j10ml7k4N0n7m1J74l1j11j04J33K4j72J74j0k54J45
$$ 136 -144 65 16 29 141 197 87 83 46 22 72 15 -26 148 117 6 -98 35 59 -113 61 51 -203 -58
7419e8J00J09l8j79O7j80J39k8l6J15m5j80RK41j61K16p0J84l24J03q9k8K29J35
$$ -58 42 151 113 -66 1 -179 -40 -68 -104 11 -34 -214 -205 36 -125 91 21 205 -119 -16 -105 -133 96 231
7443B31n2o8m2j43K28r8j19M4O9m8j07Q1N8P3j81J58j63K10m1q3K89m56L15j48
$$ 231 179 111 69 -74 154 56 -63 -19 50 2 -105 -24 34 107 -74 84 -79 131 90 7 296 -160 155 7
7467GO7J6p1j23J12NM8N7k30R7j44K29m0k6K72m54L12p6P8j06j98N4n1J00J4q7
$$ 7 74 90 19 -104 8 13 61 118 -112 -15 -159 70 30 4 276 -178 134 58 136 30 -168 -114 -165 -65 -51 -138
7493a38K41k01J95j6k05J05n1j37J76J0o2K39n6Pk48J93K6q8J87j28j47J81n2
$$ -138 103 -98 97 81 -124 -19 -70 -207 -31 -21 -83 156 100 107 -141 52 78 -10 177 49 -98 83 31
7516C1j71K84j23k04P0J55oj17L5R2j82J7M9ko4R8l9j71J71J17l2OPm3nJ50Q6
$$ 31 -140 144 21 -183 -113 42 36 -81 -46 46 -136 -119 -70 -72 -136 -38 -77 -248 -77 40 8 14 21 -22 -27 123 209
7543B09j14r5j1M4r5R6k00J98j97L69j93k25K59l7K02k47J01K0j00j43K57j46
$$ 209 95 0 -11 33 -62 34 -166 32 -165 204 11 -214 45 8 210 -37 64 84 -16 -159 98 -48
7565d8K6j4Rq7m0J46O9j55J20K2n5m3J76k00p8P9j7m1J37NO1K3p2j84J8J38J47
$$ -48 -22 -36 -27 -114 -154 -8 61 -94 26 48 -7 -50 126 -74 -152 -73 -90 -131 6 11 72 95 23 -161 -143 -5 142
7592A42m32J21L66m42L08k76K43J53j62O9r1J92j75o7Q5j26J18O6P6r6q0K22p1
$$ 142 -290 -169 197 -245 63 -213 30 183 21 90 -1 191 16 -51 34 -92 26 92 168 72 -8 214 143
7615A43j17J3o3J11j13J17n0K4q7j78K16l2L6J61k38k20K10J52n9k1K3j23J48
$$ 143 26 39 -24 87 -26 91 41 65 -22 -200 16 -16 20 181 -57 -277 -67 85 26 5 28 -95 53
7638E3o4n6j4p6J46k24M37k18jJ0n4J84j02m4M1n8L1J34k81P1j35L18o3J04J33
$$ 53 -11 -67 -81 -157 -11 -235 202 -16 -17 -7 -61 123 21 -23 18 -40 -9 125 -156 -85 -220 98 35 139 272
7663B72m32J11J47j88j9m5O8J18K70l17K1n2J94q4j20J05Q6Q3k81J50j74J21r0
$$ 272 -160 -49 98 -90 -109 -154 -86 32 302 -15 6 -46 148 64 -56 49 135 218 -63 87 -87 34 -56
7686e6K90j98J01n4J0P8k56M7J11J5k00L35j61K4j52J02j00m2J63J40j99O9rj46
$$ -56 234 36 137 83 93 171 -85 -38 73 88 -112 223 62 86 -66 36 -64 -106 57 197 -2 67 58 -88
7710h8N6j79N9J44J0m9J63j54n6K23j10J05P1k91J74q8o7K52j60N2j37K03k18
$$ -88 -32 -211 -152 -8 2 -47 116 -38 -94 129 19 124 195 -96 78 -10 -77 175 15 67 -70 133 -85
7733h5j20M04l62K62m3j81j6J72m7n5J98o3O6o4j33Q8Jl4J49K2j60j01J77p7m6
$$ -85 -205 199 -163 99 56 -125 -141 31 -16 -71 127 64 130 66 -67 21 22 -12 137 159 -1 -102 75 -2 -48
7758d8L11k19j26L47j44k11J5j41J53j53K30M3L5k86J38J38N9l6Oj55Q1K6M8j19
$$ -48 263 44 -82 265 121 -90 -75 -216 -63 -216 14 57 92 -194 -56 82 141 105 111 -44 37 63 111 -8
7782hP6K3J09j67j74Q2N3k67K84l2J01m2k36J62O0p2j1J41j33L9j14L56j90M1
$$ -8 68 91 200 33 -141 -59 -6 -273 11 -21 80 38 -198 -36 24 -48 -59 82 -51 -12 -126 230 40 81
7806H1l78L57k7K34j62k52J59j76K16pj86K40l5j23m5n0k8J19k4O2M0L8J13j69
$$ 81 -297 60 33 267 105 -147 12 -164 52 45 -141 99 64 -59 -104 -154 -182 -63 -87 -25 15 53 166 -3
7830cM9j26Q3j43J93P0j38r2K3K02k09k6J27n8l2N7p7n2K74j98M6kr1J62j51Q3
$$ -3 46 -80 3 -140 53 123 -15 -107 -84 118 -91 -117 10 -48 -80 -23 -100 -152 122 -76 -30 -32 -123 39 -112 -29
7856b9j76J94K51l62%L09k02p1j29J5K67k50J35J19Q8N1k34m5J05M9j54J70k68
$$ -29 -205 -11 240 -122 -122 187 -15 -86 -215 -200 67 -183 -48 71 159 210 -24 -69 36 85 -69 101 -167
7879a67J54oK2O3j18K36m04P1J84o1O5j37J03J40k01N8J47j43mPj33J78j6R4j17
$$ -167 -13 -19 3 66 -52 184 -220 -149 35 -26 39 -98 5 145 -56 2 149 6 2 9 -124 54 38 132 15
7904A5j19O1L9P5l9k42J26N7J11j70J09j43O4J40k87L06k18J65j12J66k68K24
$$ 15 -104 -43 -4 71 32 -210 -84 -27 84 -86 23 -120 -56 84 -203 103 -115 50 -62 104 -164 60
7926F0J42j94L5l11J90n7J80j20k4j32J85K2J7J60k44P7M6J89l09J01N0J0j4j28
$$ 60 202 8 43 -268 -78 -135 45 -75 -99 -231 -46 -24 -7 153 -91 -14 32 221 -88 13 63 73 59 -69
7950f9M3J37q3k01P8M6J06k05J19J48KK4j20L2O0k92j4K96j8K6p0j84nK3J18k4
$$ -69 -26 111 28 -173 -95 -49 57 -148 -29 119 121 145 25 57 117 -175 -189 107 89 115 45 -139 -144 -121 -3 -27
7976b7J8j1MJ4L0j53R9j5Q8Mr5P1L1P4j36j0P6O9j01j62j5J91o4o7Q9j74O7m2
$$ -27 -9 -20 -16 -2 28 -125 -26 -41 47 51 -44 27 58 132 -4 -14 62 131 30 -132 -147 44 -20 -87 2 -172 -105 -147
8004a47j64J86J29N0j83M8K38m03l7N31k82N9ok8nk4pK51k01PP2N6j86m3L5L3
$$ -147 -311 -125 4 54 -129 -81 157 -246 -283 248 -34 25 19 -9 -14 -38 -45 206 5 12 84 140 -46 -89 -54 -21
8030b1M9q9Qk0J74j17Q8p9K84l00j24J3q6L31j48%O2l43M50k81K91q7j07m9j3
$$ -21 28 -61 -53 -73 101 -16 72 -7 277 -23 -147 -134 -220 111 -37 -37 25 -318 132 -149 142 55 -52 -101 -114
8055a14LJ37J90j98j04M6J23n6j67oK05p9o0J45j26r9O6Q4pJ46j87K04p4j9j20
$$ -114 -111 26 216 18 -86 -40 83 27 -140 -146 59 -20 -80 65 -61 -160 -94 -10 -17 129 -58 146 72 53 -67
8080f7R9m1J40k40J24j04J43k1p4j8p9J57J40k33K4K01j81J38K9j54P2k7n6J15
$$ -67 32 -9 131 -109 15 -89 54 33 -41 -59 -138 19 159 -74 -50 151 -30 108 137 -17 55 28 -28 87
8104H7J11k49k8N4p1Rl9P1j48J29L34l29P3M2j29M5J89p0o1lj08O7J15oJ9N7l12
$$ 87 198 -51 -79 -25 -96 -87 -126 -55 -203 -74 260 -69 4 46 -83 -38 151 81 20 17 -91 -24 91 85 104 161 -151
8131a51l4K80p6R0J11j92J7mr1M3J51jj54j51K66k6j97M1K05j44l2j38K03p3Q3
$$ -151 -185 95 19 109 220 28 45 41 -50 -7 144 143 -11 -162 104 78 -119 -78 127 -17 -49 -187 16 -57 26
8156B6j37J08o0J58j68Q2Q9L2n5o4J54j02j90J4J44l23J43M0l2J79j07r5K67j62
$$ 26 -111 -3 -63 95 -73 9 98 130 75 11 165 63 -127 -113 31 -292 -149 -109 -141 38 -69 -164 103 -59
8180e9K49j26k3n7K4j26K3m1K12j14N7
$$ -59 190 64 41 -16 8 -118 -95 -136 76 -38 19
8191A9
$$ Imaginary data points
##PAGE= N=2
##DATA TABLE= (X++(I..I)), XYDATA
0@%%%%%%%%%%%%%qJ6j6J6j6K4l2M0m8N6o5P3q8J04j20J37j60J83k08K39k71L06
$$ 0 0 0 0 0 0 0 0 0 0 0 0 0 0 -8 8 -8 8 -8 16 -16 24 -24 32 -33 40 -48 56 -64 73 -87 96 -112 127 -144 162
35A62l44L87m35M87n44O06o73P47q29R17j012J118j236J362j499J651j819K006
$$ 162 -182 205 -230 257 -287 319 -354 393 -436 481 -531 587 -649 713 -786 865 -954 1052
53A052k212K443k702K995l332L719m173M715n372O190p242Q652j0653J3742j9203
$$ 1052 -1160 1283 -1419 1576 -1756 1963 -2210 2505 -2867 3323 -3919 4733 -5920 7822 -11381
68a1381L1808j20601o4509R4424L9193Q0078j3333N977m2328l5487p151j3233
$$ -11381 20427 -100174 -164683 -70259 -31066 49012 35679 41656 -672 -36159 -43310 -56543
80e6543R774R918J098N4724J1226L3310K9601k1277j4511m8839m1761Q796m656
$$ -56543 -46769 -36851 -35753 18971 30197 63507 93108 71831 57320 8481 -33280 -24484 -29140
93b9140L7325K6215J0750J2680l6305j1025k513k2832J1632j8473p391P745j5303
$$ -29140 8185 34400 45150 57830 21525 10500 7987 -14845 -3213 -21686 -29077 -21332 -36635
106c6635K8673K5585J6797J3758l5899j9232l1518l2518K0726J4327M0155L4746
$$ -36635 -7962 17623 34420 48178 12279 -6953 -38471 -70989 -50263 -35936 4219 38965
118C8965l526K0086j2330j8830m907k8870j425j3928j2001K7201J5622L6034J9464
$$ 38965 35439 55525 43195 24365 19458 -9412 -10837 -24765 -36766 -9565 6057 42091 61555
131F1555r128m32m5789l5100j0724j3470K7866J2773J2274K4147j3347K186m375
$$ 61555 52427 51995 6206 -28894 -39618 -53088 -25222 -12449 -175 23972 10625 12811 8436
144H436r937Q414k2876o726j468j2627J8349N921J7857J9447j8775l181j6149
$$ 8436 -1501 6913 -15963 -22689 -24157 -36784 -18435 -12514 5343 24790 6015 2834 -13315
157a3315j5643O078r910J7170J2353m516J5365l149Q698O684j6692M141j4323
$$ -13315 -28958 -22880 -32790 -15620 -3267 -7783 7582 4433 13131 19815 3123 7264 -7059
170g059j1351P897m97K9261J5825o27Q106k2426j5037j5664j6579J5643O43R315
$$ -7059 -18410 -10513 -11010 18251 34076 33449 41555 19129 4092 -11572 -28151 -12508 -11865 -2550
184b550J5634l444J2612p055r075M967k0011o103o577n804J7786J266J3983J3069
$$ -2550 13084 9640 22252 15197 6122 11089 -8922 -15025 -21602 -27406 -9620 -8354 5629 18698
198A8698p792K546j6168o206N309j2117Q836K376l21J1592n561J1670P915p456
$$ 18698 10906 13452 -2716 -8922 -3613 -15730 -6894 -4518 -4839 6753 1192 12862 20777 13321
212A3321M446j3949n557j736j1365J3515N442L734Q251j0463K130q430j3639M270
$$ 13321 17767 3818 -1739 -3475 -14840 -1325 4117 7851 16102 5639 7769 -661 -14300 -10030
226a0030q233M736M571k470J5878n66L89L449j1967J167j0194n614J1891j174
$$ -10030 -18263 -13527 -8956 -11426 4452 3886 4275 7724 -4243 -3076 -13270 -18884 -6993 -8167
240h167J1619O057k173P190j1968m383O30q286O002m279L040J0301n551Q871J417
$$ -8167 3452 9509 7336 14526 2558 -1825 -1195 -9481 -3479 -7758 -4718 5583 32 8903 10320
255A0320k831N569j2667J2l45p875O828k035N440O279p009O541l878n000Q68j1181
$$ 10320 7489 13058 391 403 58 -7817 -989 -3024 2416 8695 1686 8227 4349 -651 217 -10964
271a0964M172Q0m084J0852l49N790K722p114M596p780m309K626m772R056P69k98
$$ -10964 -6792 -6712 -10796 56 -293 5497 8219 1105 5701 -2079 -6388 -3762 -8534 522 1291 993
287I93R398n818R49k957p528M434o832J543N930k155Q125k151n53M910q325J791
$$ 993 10391 4573 5522 2565 -4963 -529 -7361 -5818 112 -2043 6082 3931 3378 8288 -37 1754
303A754k077m006N002o272L784L884l686N918m182l2J460q782L425j671j137N758
$$ 1754 -323 -4329 673 -5599 -1815 2069 -1617 4301 119 87 1547 -7235 -3810 -5481 -6618 -860
319h60l554O152K108l539N134m489P30j84o677N732j582N78N851k934M836l144
$$ -860 -4414 1738 3846 307 5441 952 1682 1498 -5179 553 -1029 -451 5400 2466 7302 4158
335D158n603K507o530J903J087j650P818k669R19L155m829L471m094k584L269
$$ 4158 -1445 1062 -5468 -3565 -2478 -4128 3690 1021 1940 5095 266 3737 -357 -2941 328
350C28n533L274Q10m2O049m482J191K69n807K601l585P71L868m202M456j45l64
$$ 328 -5205 -1931 -1121 -1163 4886 404 1595 1864 -3943 -1342 -4927 -4156 -288 -4490 -34 -179 -543
367e43M555l569L512n68n000K998m299J992K787k682N743k335k132J358m936L492
$$ -543 4012 443 3955 3387 -1613 1385 -2914 -922 1865 -817 4926 2591 459 1817 -3119 373
383C73q86j916M476l156K260M86k467M909l388j042J205m717L355j389M42N063
$$ 373 -513 -2429 2047 -1109 1151 1637 -830 4079 691 -351 854 -3863 -508 -1897 -1455 3608
399C608l151J759j997l370K704m042J729K248k642M017j807J067L758k806L208
$$ 3608 457 2216 219 -3151 -447 -4489 -2760 -512 -3154 863 -944 123 3881 1075 4283
414D283j421k656J565m881K499J613j591M028k475M63L29m089L216j962p00J830
$$ 4283 2862 206 1771 -3110 -611 1002 -589 3439 964 1427 1756 -2333 883 -1079 -1779 51
430E1l747K674k07j203M420k125J469m58l520K793k694J067K538k312L072k625
$$ 51 -3696 -1022 -1229 -2432 1988 -137 1332 874 -2646 147 -2547 -1480 1058 -1254 1818 -807
446h07j262K811l402K692Rj534L142l101J689J736j776L636k271q08J137l944
$$ -807 -2069 742 -2660 32 41 -1493 1649 -1452 237 1973 197 3833 1562 754 1891 -2053
462b053K518K43k08K953k940Q49k57k912K445k194M59J016l452K785p98L60L238
$$ -2053 465 708 500 3453 513 1362 1105 -1807 638 -1556 -1097 -81 -3533 -748 -1546 -1186 2052
479B052k010K219j102k538J931k802J660P93j616L132k322j89J917k203K591j170
$$ 2052 42 2261 1159 -1379 552 -2250 -590 203 -1413 1719 -603 -792 1125 -1078 1513 343
495C43q77J763l134J806L55p43L510k274L65M71k706K363j372L37J763k759J172
$$ 343 -534 1229 -1905 -99 256 -487 3023 749 1114 1585 -1121 1242 -130 207 1970 -789 383
512C83j013j258J932k110J042M00j967J966j485J202K028j770K416j214j241J053
$$ 383 -630 -1888 44 -2066 -1024 -624 -2591 -625 -2110 -908 1120 -650 1766 552 -689 364
528C64k185J954M27j048K270j984R38N38k140K517j502m55J024k624K034l36l3
$$ 364 -1821 133 560 -488 1782 -202 736 1274 -866 1651 149 -306 718 -1906 128 -208 -241
545b41K759k251J325l81j933K171j793M04R11k391J738j209k33J726j977J773
$$ -241 2518 267 1592 1211 -722 1449 -344 60 971 -1420 318 -891 -1124 602 -1375 398
561C98m41j537J952k332J342Q18j072K135j473J21J154j892K052p78l10J471k124
$$ 398 -43 -1580 372 -1960 -618 200 -872 1263 -210 -89 1065 -827 1225 447 137 1608 -516
578e16J033q8j547J784j315L49L28j686J924p05L67J359j644J603q79j088J409
$$ -516 517 429 -1118 666 -649 -300 28 -1658 266 -439 -72 1287 -357 1246 367 -721 688
595F88j490J013J68j360J439j334K34J196j742J841q70q85J264j778J406Oo44
$$ 688 -802 211 379 -981 458 -876 -642 554 -1188 653 -217 -1102 162 -1616 -210 -204 -848
612h48J974j419Q80O97j491J707j102MP50j983J249l66k91J152j498Q58J10j488
$$ -848 1126 -293 587 1284 -207 1500 398 402 1152 -831 418 52 -239 913 -585 273 383 -1105
630a105J220r85P96P65j319J474o62n06J237j705J336n29n10J171j544O53M00
$$ -1105 115 -870 -74 691 -628 846 184 -322 915 -790 546 17 -493 678 -866 -213 187
647A87j242J578j196J47O50j297J573o75k29J558j543J104J72r53J424j422O19
$$ 187 -1055 523 -673 -526 124 -1173 400 -275 -504 1054 -489 615 787 -166 1258 -164 455
664D55J98j250J269j115m0J123j376R40m77o33J191j549R90J76p02J530j292O11
$$ 455 653 -597 672 -443 -483 640 -736 204 -273 -906 285 -1264 -274 -98 -800 730 -562 49
682D9Q12j223J257j058L6P82j403J243m57n80R00j114P10J43r16J137q35M35P14
$$ 49 861 -362 895 -163 -127 655 -748 495 38 -542 358 -756 -46 97 -819 318 -517 -82 632
701F32j230J221n00r6J141j351P96o1r98J203j215K79L93j033J303q89K1P56j157
$$ 632 -598 623 123 27 1168 -183 613 552 -446 757 -458 -179 214 -819 484 -405 -384 372 -785
720g85J006m29n65J382j028P84J92r41R78p19K18N13j167R79n25j53O18j090R93
$$ -785 221 -208 -773 609 -419 365 557 -384 594 -125 93 606 -561 418 -107 -260 358 -732 261
739B61k53p67J102j217Q73M86p35Q53o16L8P21j304J145m75l54Q34j029N49O6
$$ 261 8 -759 343 -874 -1 485 -250 603 -13 25 746 -558 587 112 -242 592 -437 112 178
758A78r31J071r07M07N12j195J178o46J00N99j121J285j13m64Q50q83O54j19q95
$$ 178 -753 318 -589 -182 330 -865 313 -333 -233 366 -755 530 417 -47 803 -80 574 455 -440
777d40J055q00J59K06q58Q45l98o6P94j118R43j48q86J331q35L26L72r12J072
$$ -440 615 -185 -26 180 -678 167 -231 -297 497 -621 322 174 -712 619 -216 110 482 -430 642
796F42o25k86R82j176Q14m06l70Q99j045N48k48l80R10p63J26O87j006J189m57
$$ 642 17 -269 713 -463 351 -55 -425 474 -571 -23 -271 -651 259 -504 -378 309 -697 492 35
815C5p8M62o66P34j65l64M58p30K34J65n67P71m98l3N84j150R84k59q2M89p29
$$ 35 -43 419 -247 487 322 -42 416 -314 -80 85 -482 289 -209 -242 342 -808 176 -83 -165 324 -405
836d05Q86qp47Q55o88K62N21r80Q21q58k10R74j056P83k11m25O33p62M89K54n38
$$ -405 481 473 -274 581 -107 155 676 -304 517 -341 -551 423 -633 150 -61 -486 147 -615 -126 128 -410
857d10R84p60K05O51p54Q64m97l32Q99j233N79j67m17Q88q28K46J15m83O58p56
$$ -410 574 -186 19 670 -84 780 283 -49 850 -383 196 29 -388 500 -328 -82 33 -450 208 -548
877e48K46O55q89R61l33l11Q27j006O80Mo40O79n26J02L39p97Q32p22J00P08j004
$$ -548 -302 353 -536 425 92 -219 608 -398 282 286 -354 325 -201 -99 240 -557 275 -447 -347 361 -643
898f43O66P5l65Q89j034Q21j51m83N99n67M47L42j014P65l18m20O78p59M71j16
$$ -643 23 98 -267 622 -412 409 258 -225 374 -193 254 596 -418 347 29 -391 287 -472 -1 -117
918a17n80J086p01L46K83q03R52m56M2M20p84P38k87l78M99m91L22No41R75q03
$$ -117 -697 389 -312 34 317 -486 466 10 52 472 -312 426 139 -239 260 -231 91 96 -545 430 -373
939c73M59o7p42P43j78r1N09m13M64j48k86Q91p25K39J18m57N39o35K3M07r27
$$ -373 86 19 -723 20 -158 -249 260 -153 311 163 -123 768 43 282 400 -57 482 -153 -130 277 -650
960f50R15l95j14M46n39J97L00m80Q51q95L16L81p56P86l61l8N72q73M76j14l34
$$ -650 265 -130 -244 202 -337 -140 160 -320 531 -364 -48 333 -423 363 2 -36 536 -337 139 25 -309
981c09O21n22K56R6o63Q22m17j3J94l82Q39n27k0M37k96J44J53o89P15p08K56
$$ -309 312 -210 46 142 -521 301 -116 -129 65 -317 522 -5 -25 412 116 260 413 -276 439 -269 -13
1002a3J8l11L89j48l9J66n17M27k0l53Q44p63N73o4k13L76l19J52J28p02P79l99
$$ -13 5 -306 83 -65 -104 62 -455 -28 -48 -401 443 -320 253 189 -24 352 33 185 313 -389 390 -9
1024ij17M27o67O77n81j18N13l29J82J83l20O43o39J04N73o85K43O1p6K38m87
$$ -9 -126 301 -366 311 -270 -388 125 -204 -22 161 -159 484 -155 -51 522 -163 80 141 65 303 -184
1045a84J73J4j77M44o61J52L45m13N51n22K82K31m73M23l1m84P25n60K46K5k62
$$ -184 -11 3 -174 270 -391 -239 106 -307 244 -278 4 235 -238 185 154 -330 395 -165 81 106 -156
1066a56M93l68NK18o09O80n32M9L92m62M58j48k66O51m96K43P8l76O40n55J60
$$ -156 337 -31 -26 192 -417 263 -269 -220 172 -290 168 20 -246 405 -91 152 230 -146 494 -61 99
1087I9L91p99N20m98K44L38m16K51j30k30O84p09J72L26n19M68k47J56Pm47N96
$$ 99 490 -309 211 -287 -43 295 -121 130 0 -230 454 -255 -83 243 -276 192 -55 101 108 -339 257
1108B57L7m27N97n89L69jn38P26p12K36K44m14M49m88J27N45m52K33j82nK35j17
$$ 257 294 -133 464 -125 244 243 -295 431 -281 -45 199 -215 234 -254 -127 418 -34 199 17 12 247 130
1130A30J0M4l05L64l84M5K62o06N45j42j4L72p06M41J56l40M26n70J86L03n43
$$ 130 140 184 -121 243 -141 -96 166 -440 105 -37 -51 321 -385 56 212 -128 298 -272 -86 217 -326
1151c26O29j90L0L20o84L54j86k39O15m30L62j81k55M62m27N2J93l02L74j65J
$$ -326 303 113 143 463 -221 133 -53 -292 323 -107 255 74 -181 281 -146 -94 99 -203 171 6 7
1172GL42m92N02j70k39L83m12P8k8k85K74k32J21L92m52M27k54j69M20m20K06
$$ 7 349 -143 359 189 -50 333 -79 -1 -29 -314 -40 -272 -151 241 -211 216 -38 -207 213 -207 -1
1193al7L3K87m31L06K23n95L21j63J6L41p90N51Q2l63M14l30K15J98l93K78k42
$$ -1 -38 -5 282 -149 157 380 -215 106 -57 -41 300 -490 61 143 -220 194 -136 79 277 -116 162 -80
1215h0J88J84m31L90j16oJ64m71K74r2j22L92n46J32Q4k18K71o0RK62o14L64R9
$$ -80 108 292 -139 251 135 129 293 -178 96 4 -118 274 -272 -140 -56 -274 -3 -63 -54 208 -406 -42 57
1238E7k22N43l67J10q3k01M09l14N8J74l30K76l91j5O17m24k3J95m44N36k24J99
$$ 57 -165 378 11 121 38 -163 246 -68 -10 164 -166 110 -281 -296 321 -103 -126 69 -375 161 -63 136
1260A36J22k99L33k33j7J31l79K90l2K5Q9l09K35k22nO8o7K67n5l32L38n3L3J75
$$ 136 258 -41 292 59 42 173 -206 84 52 77 166 -143 92 -130 -135 -67 -134 133 78 -254 84 31 64 239
1284B39l73J35K47m65L31j83Q4M3m28M29k3q8K91m27p0J47KL59k81K17P4k94M31
$$ 239 -134 1 248 -217 114 -69 15 58 -370 59 36 -52 239 -188 -258 -111 -109 250 -31 186 260 -34 397
1307C97o52L81J33l24K83k68K8J81l30L18k97J54J56k89J63j09j28N38l86J28
$$ 397 -255 126 259 -65 218 -50 -22 159 -171 147 -150 4 160 -129 34 -75 -203 335 -51 77
1327G7Ol32M29j95O0p9L3L84m33p0l5P4J12L9k09L59n22N9K51j90K94j65J1K18
$$ 77 83 -249 180 -15 45 -34 -1 383 -50 -120 -155 -81 31 70 -139 220 -302 -243 8 -182 112 -53 -42 176
1351A76j63o9J60J1K30m50J14K41k32o8Lk31L00j04J19L3j51M82m39J61k19R2
$$ 176 13 -56 104 115 345 -105 9 250 18 -50 -47 -278 22 -82 37 70 -81 401 -38 123 -96 -4
1373dM02l38R3p7k58J83k12K75Q6k84K03L1k67L03k79j79K27j06L02r8j00J60
$$ -4 398 60 153 76 -182 1 -211 64 150 -134 69 100 -167 136 -143 -322 -95 -201 101 3 -97 63
1395F3j21O8r2r2J99K21k65J96k77K06k60K52k50p2K66j44j10J90K10j65J10j3
$$ 63 -58 10 -82 -174 25 246 -19 177 -100 106 -154 98 -152 -224 42 -102 -212 -22 188 23 133 120
1417A20R1p1j9K08l73J85l05J60L43l02l7j83K55l2J6k13K52r7J56j45k5l3KK55
$$ 120 211 140 121 329 -44 141 -164 -4 339 37 0 -183 72 40 56 -157 95 -2 154 9 -16 -49 -47 208
1441B08k03M9P5p4Pj44J08n8j53K52k19J04jj5n1K32l13P5M2J87K08l67Q7J77
$$ 208 5 54 129 55 62 -82 26 -32 -185 67 -152 -48 -49 -64 -115 117 -196 -121 -79 108 316 -51 36 213
1465B13J5j49n0j1Q8k74L78j05j51n8K0J99k39lK12j03J42j60J2L27k82K5K52
$$ 213 228 79 29 18 106 -168 210 105 -46 -104 -84 115 -124 -127 85 -18 124 -36 -24 303 21 46 298
1488B98m34N6k4L34l83J69P8j1o2k1o4K3L0j0N0o2J00J98m97J26qK79m3r9Q7q7
$$ 298 -136 -80 -104 230 -153 16 94 83 21 0 -64 -41 -11 -21 29 -33 67 265 -232 -106 -114 165 122 23 110 23
1514B3j09J39l30pM37k24P1p2k9J81k94J62J81k75L07k15J14j1p7J13j17j02K40
$$ 23 -86 53 -277 -284 153 -71 0 -72 -101 80 -214 -52 129 -146 161 -54 60 49 -28 85 -32 -134 106
1537A06j79k8J05l7K0J68j48k23J66M8J92k59J93J7j09k30K28J60k64L25k32J80
$$ 106 -73 -101 4 -33 -13 155 7 -216 -50 -2 190 -69 124 141 32 -198 30 190 -74 251 19 199
1559A99l19J12l7j06j89L05P8k38K08k79L30j30J87Q7l33J41o0J60l8O6l01K55
$$ 199 -120 -8 -45 -151 -340 -35 43 -195 13 -266 64 -66 121 208 -125 16 -44 116 78 144 -157 98
1581I8o3j07J69q1J41k99Q5RK03q4k51K97M8k40J99k11K34j48j32J66O2q3m5p
$$ 98 35 -72 97 16 157 -142 -57 -48 155 71 -180 117 165 -75 124 -87 147 -1 -133 33 95 12 -33 -40
1605d0J11oO2o8k33K16K20j50LP5j02K6q6J33j75j28J28PN6j42Q2J19j26j21L5
$$ -40 71 65 127 59 -174 42 262 112 115 190 88 114 28 161 -14 -142 -14 -7 49 -93 -11 108 -18 -139 -104
1630a04J01P5k59J59J95k40L0R8l78L76j05J17j37K00j10RN3j85j26K52j74J94
$$ -104 -3 72 -187 -28 167 -73 -43 55 -323 53 -52 65 -72 128 18 27 80 -105 -231 21 -153 41
1652D1j4j9Q9j7j21L66m28N6O8k4L6j85J45L8j61M9J36j34Q5K4K9p8j1P5q1j33
$$ 41 27 8 97 80 -41 325 -103 -47 21 -3 33 -152 -7 31 -130 -81 55 -79 6 30 59 -19 -30 45 -36 -169
1678a69K08j86J00k17L32K6j29J51k26L9J89j84QP7q4J01j02J68q4N6k46J00J32
$$ -169 39 -147 -47 -264 68 94 -35 116 -110 -71 118 -66 -58 19 -65 36 -66 102 18 74 -172 -72 60
1701F0Ok27J69N5k53L34J2l30P0J6N8M8J39j24k00J98n9j34J79j74J10Q6k28K28
$$ 60 66 -161 8 63 -190 144 156 -174 -104 -88 -30 18 157 33 -167 31 -28 -162 17 -157 -47 39 -189 39
1725C9j36N5R3o6k4Q6n4J75k33JK01j41O6q8K7n3k5j45K55j01J14j78j5JK12m2
$$ 39 -97 -42 51 -15 -39 47 -7 168 -65 -64 137 -4 62 -26 1 -52 -77 -222 33 -68 46 -132 -147 -146 66 24
1751B4O4J08n5j63l8j5j8K28J12k26j99J03J36j89K00O8k62J72J10l55N3K26k18
$$ 24 88 196 141 -22 -60 -75 -93 135 247 21 -178 -75 61 -128 72 140 -122 50 160 -195 -142 84 -134
1774a34Q4n0K13k82J39Q5p6Q4k36K40M8j13N2J03j20k99K89Q5k1J3r6J36j18m6
$$ -134 -50 -100 113 -169 -30 55 -21 63 -173 67 115 2 54 157 37 -262 27 112 91 104 8 144 26 -20
1798b0P2J25k4J8l22J32L8m4J26k17K20k23P9K1LpK76l87K44O9P2j08j15p3mP9
$$ -20 52 177 153 171 -151 -19 19 -25 101 -116 104 -119 -40 -19 -16 -23 253 -134 110 179 251 143 28 -45 -49 30
1824C0N6k44O9J88r7k3J0K92l62J08JP2j07MJ29k1j7p4Qj74J84m9j11L75m23J67
$$ 30 86 -158 -89 99 2 -21 -11 281 -81 27 28 100 -7 -3 126 105 88 14 22 -152 32 -17 -128 247 -176 -9
1850ij6J20j80Q1r5P2j96O5RN5J05M9k4j25P4p8NL0M0k9J14j02o1L21j64%k28
$$ -9 -25 95 -85 -4 -99 -27 -223 -158 -149 -94 11 60 36 -89 -15 -93 -88 -58 -18 -47 67 -35 -96 225 61 61 -167
1877a67K48k7nR1k66J64o5j35L21l33Q5J20j16J61rj19m5J23n8QR3o9m9M2j36
$$ -167 81 54 49 140 -126 38 -27 -162 159 -174 -89 31 -85 76 67 -52 -97 26 -32 -24 69 0 -49 -7 -143
1902a43rQ4LO9k22K51K7l70L91o8l6rr9K44k58O3J30P0J02j64o4J73j00j78P1
$$ -143 -152 -68 -65 4 -218 33 60 -310 81 13 -23 -32 -131 113 -145 -82 48 118 220 56 -8 165 65 -113 -42
1927d2k72M42p1k50K00K41k13l9nj03J34M2j67K1K43l44K76pk38K56k61m2J96
$$ -42 -314 128 57 -193 7 248 35 -4 -9 -112 22 64 -103 -82 161 -183 93 86 -152 104 -157 -199 -3
1950cJ02j4p9J58n1J04j09o6O5J9r3J10n4j51l1L22j78l16J48J57j4L2k10M06
$$ -3 99 85 6 164 113 217 108 42 107 126 33 143 89 -62 -93 229 51 -265 -117 40 26 58 -152 254
1974B54Ok44j82J14j84L37m3k33R6j01K54J22l01J44k01P1o2K53j23k77M40j77
$$ 254 260 16 -166 -52 -236 101 58 -175 -79 -180 74 196 -105 39 -162 -91 -153 100 -23 -300 140 -37
1996c7J55R9j55k5J0k41J61J69O3m3l0k18K39l26L96k44J35o1k47J41J86l1q2
$$ -37 118 217 62 37 47 -194 -33 136 199 156 126 -92 147 -179 217 -27 108 47 -200 -59 127 96 14
2019A4j16J5P7Q1k6J8r9k8k00K98n5P3R9q8J31r3j77N7j9Q7r6K22l11K63k4o5
$$ 14 -102 -87 -10 71 45 63 -36 -64 -264 34 -21 52 151 63 194 101 -76 -19 -38 49 -47 175 -136 127 103 38
2045C8j5j87N3k2K10j71M8J42j52P7l6j55J76o6p1L4J0J64o2j22K52j37r5J81
$$ 38 23 -164 -111 -133 77 -94 -46 96 -56 21 -15 -170 6 -60 -131 -97 -87 77 15 -107 145 8 -87 94
2069I4k0j95J63q1N2J01Q1k12J38L7j28O6r1l0j23J1J14o2L06j53l43L84k26N6
$$ 94 74 -121 42 -39 13 114 195 -17 121 158 30 96 5 -25 -148 -137 -23 -85 221 68 -275 109 -117 -61
2093f1Q2N2Om1k40J5J78j77K02K4PK11j56j64J5p9qK82j56j41J83j00P4m7p2J88
$$ -61 21 73 79 38 -202 -187 -9 -186 16 40 47 258 102 -62 -47 -126 -134 148 -8 -149 34 -66 8 -39 -111 77
2119G7k15L6J09j48n7K38j67J36j8p4O7O9J7q7j1K19k03k4Q9j15L8J76j19k2J00
$$ 77 -138 -102 7 -141 -198 40 -127 9 -9 -83 -16 53 70 -17 -28 191 -12 -36 53 -62 -24 152 33 11 111
2144A11J04n8j96m4J46p6L36n00J96J28j22K17k49J23j07r3J38k27K47k23k1K57
$$ 111 215 157 -39 -83 63 -13 323 -177 19 147 25 242 -7 116 9 -84 54 -173 74 -149 -170 87
2166H7L0j7j43J41j31j96K09j2j13J21qM8l7k3K05jk46K05l76R9o8K07J34M1l2
$$ 87 117 100 -43 98 -33 -229 -20 -32 -145 -24 -32 16 -21 -44 161 160 -86 119 -257 -158 -226 -19 115 156 124
2191A24k24J51j61J80r4O5j30Q2J65J33k65l4O1k53L49k25O8ko0L6L9M0R9j85
$$ 124 -100 51 -110 70 -24 41 -89 -7 158 291 26 -8 53 -200 149 -76 -8 -10 -70 -34 5 45 144 -41
2215d1k7J5R4J34k11m6K8r4K62k71M27l12L86j96j18j5qj39Q6k4n4J81r1K36k00
$$ -41 -68 -53 41 175 -36 -82 -54 -148 114 -157 270 -42 344 148 30 15 7 -132 -46 -70 -124 57 -34 202 2
2240Bl7k1jJ38j29%J25j00kk5L5Ll1m8J86p2J63k32j5m2p2L37q2j46o9J31Q6l0
$$ 2 -35 -56 -57 81 -48 -48 77 -23 -25 -50 -15 -12 -43 -91 95 23 186 -46 -61 -103 -175 162 80 -66 -135 -4 82 52
2268E2K3j67J10l9MJ15l5P4p0j40J35q1J13L9l15K20LJ08r9l2rm06L79Q3P3n2
$$ 52 75 -92 18 -21 -17 98 63 137 67 -73 62 -19 94 133 -182 38 41 149 50 18 9 -397 -18 65 138 86
2294H6j53MK47o1k54L13j79o6K85Rm27J42j14K45Q1j65J00m3%j52Q8K12k63j45
$$ 86 -67 -63 184 123 -131 182 3 -63 222 231 -196 -54 -168 77 158 -7 93 50 50 -102 -14 198 -65 -210
2318b10L78o6j39J22K52k41j66J86j7j20P4L6k44J25J6m9J05P9k41K24j98m2J74
$$ -210 168 102 -37 85 337 96 -70 116 99 -21 53 89 -155 -30 -14 -63 42 121 -120 104 -94 -136 38
2341C8L4j33J24L3k54J04M6j89K50j84N2P9k26L09P1j4j50J8l2j82K24O7k4NP4
$$ 38 72 -61 63 96 -158 -54 -8 -197 53 -131 -79 0 -226 83 154 140 -10 8 -24 -206 18 85 61 66 140
2366A40k0j18K07k14J13j24R4p1M4j21K02r2j72K15J33l49O5Q8O3r3Q9n6l3j7
$$ 140 120 2 209 -5 108 -16 78 7 51 -70 132 40 -132 83 216 -133 -68 20 83 -10 79 23 -10 -27
2390b7K85j88j44K25j22L9j46j63K32Q0k6Q3j91J21j22q1J94J1l10L20j22J10
$$ -27 258 70 -74 151 29 68 -78 -241 -9 71 45 128 -63 58 -64 -145 49 60 -250 70 -52 58
2412E8pj77k4J22j37K91j3j4n4j15J86k33j8%K06Q7k45J52j06R2J19j19n1k7j01
$$ 58 51 -126 -150 -28 -165 126 113 99 45 -70 116 -117 -135 -135 71 158 -87 65 -41 51 170 51 0 -27 -128
2437a28K68k06J0q6J44j42L1J86j11J97j80j50R4K7j34J28K28j44J50k76J04k63
$$ -128 140 -66 -56 -142 2 -140 -109 77 -34 163 -17 -167 -73 -46 -180 -52 176 32 182 -94 10 -253
2459b53L09o5j4nP8J0j55K45j94L13l13Q7j11oo3J45M2q4J30r3l5k3J23k20J89
$$ -253 56 -9 -23 -28 50 60 -95 150 -44 269 -44 43 -68 -74 -137 8 50 -34 96 3 -32 -55 68 -152 37
2484C7j9q8J82q1j07O6n4J54j0j11j13J30q7J77m5m0J58l4L8j51k2J04j18r4j54
$$ 37 18 -70 112 31 -76 -10 -64 90 80 -31 -144 -14 -101 76 31 -9 149 115 153 2 -20 84 -34 -128 -282
2509b82N00k98r9J56K25j44Q9l18J21J55l34K72N5r6J00Q1j20j85J21j06j4j6
$$ -282 218 -80 -179 -23 202 58 147 -171 -50 105 -229 43 98 2 102 183 63 -122 -1 -107 -121 -137
2531a37j12J19M0n7J33O6P5R8Lk71M5K2k68L76l25K69n3p5J24n1J60k25J59N9
$$ -137 -249 -130 -90 -147 -14 52 127 225 228 -43 2 24 -244 132 -193 76 23 -52 72 21 181 -44 115 174
2555A74jj76P4n9k42L28j85n6J04l2O3J00j87L11k63j17L29j55mm2P1j66r5K72
$$ 174 173 -3 71 12 -230 98 -87 -143 -39 -71 -8 92 -95 216 -47 -164 165 10 6 -36 35 -131 -226 46
2579D6P7m00L27Oq8j61J33J03L8k3P6m7n2j8m1J77j45j95K75j13k0K75k57j55
$$ 46 123 -277 50 56 -32 -193 -60 43 81 58 134 87 35 17 -24 153 8 -187 88 -25 -45 230 -27 -182
2603a82L20k04L9Q7k38K22N8j42R7J45j57k31J59L8J83l27O4L03j98k48K01r2
$$ -182 138 -66 -27 60 -178 44 102 -40 57 202 45 -186 -27 11 194 -133 -69 234 36 -212 -11 -103
2625a03J18k18J49R5j24L21l01n7J40K3N6j51LJ31l02J96J05j10K05j78N8j8j03
$$ -103 15 -203 -54 41 -83 238 -63 -120 20 43 99 -52 -49 82 -220 -24 81 -29 176 -2 56 38 -65
2648f5J50j8lk12J31k80L17L4J39j86Q1j12Q7M1j01L3j26J0J58k59K16j62mO3
$$ -65 85 67 64 -148 -17 -297 20 54 193 7 88 -24 63 104 3 36 -90 -80 78 -181 35 -127 -131 -68
2672f8k93L54O6r5J38J4j42M6J49k02J33N0j10R4l0J38k94j72J00J50M2j47J03
$$ -68 -361 -7 59 -36 102 116 -26 20 169 -33 100 150 40 134 104 242 -52 -224 -124 26 68 -79 24
2695B4J45l8o8j47J86j71J11r2O4j55J01p1J11K1O3r1J27j23l6K14j14n7J9j93
$$ 24 169 131 63 -84 102 -69 42 -50 14 -141 -40 -111 0 21 84 -7 120 -3 -39 175 61 4 23 -170
2719a70K37j01o7K49j07j39Q8n7O5o1O0L3j11l7K00k31K2J10lJ80n1k85K73k5
$$ -170 67 -34 -101 148 41 -98 -10 -67 -2 -63 -3 30 -81 -118 82 -149 -127 -17 -20 160 109 -176 97 72
2743G2J5j11j17O0J57j28%J86j7l38J97n8L3M6o2m1J81j11r5K50j82R4K17l70
$$ 72 87 -24 -141 -81 76 -52 -52 134 117 -221 -24 -82 -49 -3 -65 -106 75 -36 -131 119 -63 31 248 -122
2767a22M0K65k53j47L55n8j40j4N7j68J87R7l5j67J36n1k2O9o4o3J81nO5j24j00
$$ -122 -82 183 -70 -217 138 80 -60 -74 -17 -185 2 99 64 -103 33 -18 -40 29 -35 -98 83 78 143 19 -81
2792h1K26j65J13k62K47q6J69k12L42l16P0l7K3O6j1o2N4j5K22m02K01k40P8o0
$$ -81 145 -20 93 -169 78 -8 161 -51 291 -25 45 8 31 97 86 24 78 63 285 -117 84 -156 -78 -138
2816a38M8L7M1q3J08k27K18j87J71M3N2r6j64J0K30L5q5r9j23L26k42R6j27K07
$$ -138 -90 -53 -12 -95 13 -214 4 -183 -12 31 83 -13 -177 -167 63 98 13 -86 -209 117 -125 -29 -156 51
2840E1j74J41j37K89j01k09P0j97L69j33N7j88K41j18p9K27p2j1p0j82K98p7j62
$$ 51 -123 18 -119 170 69 -140 -70 -267 102 -31 26 -162 79 -39 -118 109 37 26 -44 -226 72 -5 -167
2863a67n0L70j81K00l00L05j78O3P2l23J53N1J44k02rM1Q8j20J00J08k72R9j34
$$ -167 -217 153 -28 172 -128 177 -1 62 134 -189 -36 15 159 -43 -52 -11 77 -43 57 165 -107 -8 -142
2886a42J78o6j10J81m9J86m17L00r9K08m2j14N6M8r5k72M0K79Jm09K28O2P8k34
$$ -142 36 -30 -140 41 -8 178 -239 61 -38 170 128 14 70 118 23 -249 -209 70 71 -338 -110 -48 30 -204
2910b04J5K03q0K32n6k68J88r2J94k07j7K40O9j42mM8j5k75K14jq2j86L71k10
$$ -204 -189 14 -66 166 110 -158 30 -62 132 -75 -92 148 217 75 71 119 104 -171 43 42 -40 -226 145 -65
2934f5%j2jJ88k34K30k32J32k2j98J74J79o1j64R3p0J65j18Rk53j2K77n7k6k6
$$ -65 -65 -77 -78 110 -124 106 -126 6 -16 -214 -40 139 78 -86 7 -63 102 -16 -7 -260 -272 5 -52 -78 -104
2959a04j1R0k8J32j33J80k26L7Q6N5J38k43J66Pp2j34J99q7n7P5k97K23n8j55
$$ -104 -115 -25 -53 79 -54 126 -100 -63 23 78 216 -27 139 146 74 -60 139 52 -5 70 -227 -4 -62 -217
2983b17L47n2j8R3k44K35j23M1j07L2rl8N0J41l05Q0K12q9L8j46K0j46K98L1j5
$$ -217 130 78 60 153 -91 144 21 62 -45 -13 -22 -60 -10 131 -174 -94 118 29 67 -79 -59 -205 93 124 109
3008A09k29K09O1q9m7j4p5l1R5p7Q2pO7j00J28j37k3L50m34K36J47j20m2PN0j30
$$ 109 -120 89 150 61 14 0 -75 -106 -11 -88 -6 -13 54 -46 82 -55 -78 272 -162 74 221 101 59 66 116 -14
3034a4n2j7J21k19J64K74l31n0J72k67K56r7J50k2l3J49k36kj82K59J12k24Q8
$$ -14 -66 -83 38 -181 -17 257 -74 -124 48 -219 37 -60 90 68 35 184 -52 -54 -236 23 135 -89 -1
3057aK7j45J52K4rJ86k09m8j80J71l7j15J96P5o6n5J23j14k34M07k35K24j31M
$$ -1 26 -119 33 57 48 234 25 -23 -203 -32 -69 -184 12 87 21 -34 89 -25 -259 148 -87 137 6 10
3081A0J16q1j54L49k94j00K1M22l14%J73k75J99N1O3k85J14j09J41J9J45k17J32
$$ 10 126 45 -109 240 -54 -154 -133 289 -25 -25 148 -127 72 123 186 -99 15 -94 47 66 211 -6 126
3104A26l80J11J21K09j70J07k23N5K23l19P6K50j58k6K11l35J97N5q8l20J85J41
$$ 126 -254 -143 -22 187 17 124 -99 -44 179 -140 -64 186 28 2 213 -122 75 130 42 -278 -93 48
3126D8j54R4O1k42J21l9o0J06J13N4j45p7o6J26J78m7m7M2J5n0P2j22L4pr6J6
$$ 48 -106 -12 49 -193 -72 -111 -171 -65 48 102 -43 -120 -186 -60 118 71 24 66 81 31 103 -19 15 8 -88 -72
3152g2l7O8R6J19k82l7J45j50R1J19j07j40K13M7j39K03k0k17L7K29k40J76k10
$$ -72 -109 -41 55 174 -108 -145 0 -150 -59 60 -47 -187 26 73 -66 137 117 -100 -63 166 -74 102 -108
3175a08J43m3N0m8M3J44j12R0k52n3J44j43J66m3qL5r7n4K30nO5o0l08J38LQ2
$$ -108 35 -8 42 -6 37 181 69 159 -93 -146 -2 -145 21 -22 -30 5 -92 -146 84 79 144 84 -224 -86 -83 -1
3201aj25J25K2j23N3L58l80M5M5j8R1k30M6m9J20j08rP5K27r0J08j57N0j98R8
$$ -1 -126 -1 21 -102 -49 309 -71 -26 19 1 92 -138 -92 -141 -21 -129 -138 -63 164 74 182 25 75 -123 -25
3226b5O0J9M0k50L20q8J9M5j89M5l3J07k3kQM4r4J93k04j6Q5j1QlK2r9L00l18
$$ -25 35 54 94 -156 164 76 95 140 -49 -4 -37 70 47 45 53 97 3 196 -8 -24 61 50 58 55 77 -22 278 -40
3254d0J44o5J42J2j80K5n2j19K87r3q6k0K02j84M1j76P2J86K02l98J75j16k9K32
$$ -40 104 39 181 193 13 38 -14 -133 154 61 -25 -45 157 -27 14 -162 -90 96 298 -100 75 -41 -70 162
3278A62k10P2j73L45j41p5L6J65l53J26K6R8p7m5JP7J23n0j34J17j93P2J26j08
$$ 162 -48 24 -149 196 55 -20 16 181 -172 -46 -20 78 1 -44 -43 34 157 107 -27 90 -103 -31 95 -13
3302a3L38k72j41j5JJ68j9K1n3J36q9Kk61K85l8j3J53j87P0M5n9O7o9k52K41m9
$$ -13 325 53 -88 -103 -102 66 47 68 15 151 62 64 -197 88 50 37 190 3 73 118 59 126 57 -195 46 -3
3328cJ94r0k37J58R0R4l0M4k95j6j58M41j31K4p7j32J51P1nq5qN1j58LK68%j80
$$ -3 191 101 -136 22 112 206 176 220 -75 -91 -249 192 61 85 8 -124 27 98 93 8 0 51 -107 -104 164 164 -16
3355a6K26j24J34q0O4k30k78L58m4k46N5N3R7J85j79l4j2K4r4K9J43m9J1n6K10
$$ -16 210 86 220 140 204 -26 -304 54 10 -236 -181 -128 -31 154 -25 -59 -71 -47 -141 -112 31 -18 -7 -63 147
3380A47r5L6j78J05o7K1J77k88l7K34J30k08l0n2J40k46K63k2N8j04J41K4j95
$$ 147 52 88 -90 15 -52 -31 146 -142 -179 55 185 -23 -53 -105 35 -211 52 30 88 -16 125 149 -46
3403d6J65J7j1j54R3j13j5Ln6J37J2Q8j23o2N4r8J74K0k73K67q6m9K05J09j87
$$ -46 119 136 125 -29 64 -49 -64 -61 -117 20 32 120 -3 -65 -11 -109 65 85 -188 79 -7 -56 149 258 71
3428G1J49n4M4l27Q5P4l6K0p7m6J19o2K10J1k93N3j11J93P8l48K75j5j94K61Q7
$$ 71 220 166 210 -117 -32 42 6 26 -51 -97 22 -40 170 181 -112 -59 -170 23 101 -247 28 13 -181 80 167
3453A67q9l6p2J07j01R7k10J09oK27k44K1J37j69O0J2J29o5P9k71K01m6Nj05o0
$$ 167 78 42 -30 77 -24 73 -137 -28 -34 193 -51 -30 107 -62 -2 10 139 74 153 -118 83 37 42 -63 -123
3478a23L68k81Q7m9J05j6k8k41J21l9J95l48J28J48M0K38m18R9J9R1P6j78L5J6
$$ -123 245 -36 51 2 107 91 63 -178 -57 -96 99 -249 -121 27 67 305 -113 -14 5 96 172 -6 29 45
3502D5j77J10J38Q7j63n4n3O7L4L7k00J65k1j77J52j59K51k04K99j02K21j13r2
$$ 45 -132 -22 116 203 40 -14 -67 0 34 71 -129 36 15 -162 -10 -169 82 -122 177 75 296 183 91
3525I1j32J1q3J59m1Oj5q7J03l0m4O9K37k02j36j00K47qN7j38J73k71K29k47J07
$$ 91 -41 -30 -113 46 5 11 -4 -91 12 -18 -62 7 244 42 -94 -194 53 45 102 -36 137 -134 95 -152 -45
3550d5n0p1J44k4J38k2j98K37r9j75J63k0j20j14L36k08O7K40l46J93p7j87J56
$$ -45 -95 -166 -22 -46 92 70 -128 109 10 -165 -2 -22 -142 -256 80 -128 -61 179 -167 26 -51 -238 -82
3573h2K99j98N4K0j73%q2j10K85r2j29J25J72mJ2j8p2R8o0k5J58l45K17n7P8j94
$$ -82 217 19 73 93 -80 -80 -162 -272 13 -79 -208 -83 89 85 97 79 7 105 45 20 178 -167 50 -7 71 -123
3599a23J5J78n9j69J33r8m9K35j53L34q4k54J09j1OK6p0o9J14mj33J65k15J01
$$ -123 -108 70 11 -158 -25 -123 -172 63 -90 244 160 -94 15 4 10 36 -34 -103 11 7 -126 39 -176 -75
3623g5P9J82l58J36P5n1L00m62L50m11K86k02R7j46K77m6r9K3O6n7K9L7Qq5P0
$$ -75 4 186 -172 -36 39 -12 288 -174 176 -235 51 -151 -54 -200 77 31 -68 -45 21 -36 -7 30 38 -47 23
3648B3j01n1K78Jj03j14J16j29K15k1j34j65K72l6j89q4J28J50J12l20K60j03
$$ 23 -78 -129 149 150 47 -67 49 -80 135 114 -20 -185 87 51 -138 -222 -94 56 168 -152 108 5
3670EJ43M0k88RJ81J01j35k26M9J18J52p9q0J18k30R2l2J0J13j66M14j56j08n2
$$ 5 148 188 -100 -91 90 191 56 -170 -121 -3 149 70 -10 108 -122 -30 -62 -52 61 -105 309 153 45 -7
3694gk11K48k9J2K3j11r4J55M8J0k2n3j34K30J44k38NJ63l19rJ75J45j86J30k00
$$ -7 -218 30 1 13 36 -75 -169 -14 34 44 22 -31 -165 65 209 -29 -24 139 -180 -189 -14 131 -55 75 -125
3719a25N3J18J15j70k3j5P6j63J45J76k52K04j57N4K4j55J60j81l6l4L58k43J8
$$ -125 -72 46 161 -9 -32 -47 29 -134 11 187 -65 139 -18 36 60 -95 65 -116 -152 -186 172 -71 -53
3742e3J93k86J48j24M1M3JM9J68m40M37k72K99k29k6M9LN3j75J0K6K7J00K20k54
$$ -53 140 -146 2 -122 -81 -38 -37 12 180 -260 177 -95 204 -25 -51 -2 1 54 -121 -111 -85 -58 42 262 8
3767HJ1j49K34j54J15j09K6P1j9K1M7j31q7J52j1j90K50n6J16k75Q7l7m6P3j74
$$ 8 19 -130 104 -50 65 -44 -18 53 34 55 102 -29 -116 36 25 -165 85 29 145 -130 -43 -80 -126 -53 -227
3792b27L31j14O8j16K60k56J29j24m2p4K33l6K03k83Oj07Q8J25N5K8l1k2r6R6
$$ -227 104 -10 58 -58 202 -54 75 -49 -91 -165 68 32 235 -48 -42 -149 -61 64 119 147 116 94 -2 94
3816I4j25j5r5L71k31n2K18m0o5j74R6j3j30K15P5P5k69n7J58o3K00N9l74J66
$$ 94 -31 -46 -141 230 -1 -53 165 125 60 -114 -18 -31 -161 54 129 204 -65 -122 36 -27 173 232 -142 24
3840B4j06k20J51K04j05k0R7O8l17J70K43l56J56L6K1J28r7k35QK38q7L2R0j16
$$ 24 -82 -302 -151 53 -52 -72 25 93 -224 -54 189 -167 -11 25 46 174 77 -158 -150 88 1 33 123 7
3864GO8j69J08PL4j24J59j09J73k64N9J42j81R3q5L3R4k73J69M4k3K78j38o0J9
$$ 7 75 -94 14 21 55 -69 90 -19 154 -110 -51 91 -90 3 -82 -49 45 -228 -59 -15 -38 240 102 42 61
3889F1L0j58N7J12k42M6M6M2J50j39p1K64nk22L7N3k3P9j25k17K36O5O5r3k52
$$ 61 91 -67 -10 102 -140 -94 -48 -6 144 5 -66 198 193 -29 8 61 38 117 -8 -225 11 76 141 48 -204
3914b04L04j91N5J18k03K60k80O8J71j80j6N5m8K02j46jM1J8m1J50j31J4n2kR4
$$ -204 100 -91 -36 82 -121 139 -141 -73 98 -82 -98 -43 -91 111 -35 -36 5 23 -18 132 1 15 -37 -39 55
3939E5m3j29K08m3j70K81q6j89J21k5M6j91K44K9j92MP4Q0L0k88K22o9M4m1j12
$$ 55 12 -117 91 48 -122 159 73 -116 5 -20 26 -165 79 108 -84 -80 -6 74 104 -184 38 -31 13 -28 -140
3964a40L22j54J99k78J00q0J93pk19K42j11L2k55J14N7n1J10q5R2k8r6r1J39n8
$$ -140 182 28 227 -51 49 -31 162 155 -64 178 67 99 -156 -42 15 -36 74 -11 81 53 -43 -134 5 -53
3988e3J13j01j0m6MK26k20K97k91J47j9j00J19j48J53l5o1O4J14P3l70J77J45
$$ -53 60 -41 -51 -97 -93 133 -87 210 -81 66 47 -53 66 -82 71 36 -25 39 153 226 -144 33 178
4011A78j31K21k23j60J65L7k01O5J76K2l32M18j40j72j2N1P5o6p0J44j44K04l7
$$ 178 47 268 45 -115 50 87 -114 -49 127 149 -183 235 95 -77 -89 -38 37 -29 -99 45 -99 105 68
4034F8r4J30j56J60k02K67k72J11n5j9J99j22n5J8r6J44qK8j9k27K48j8P2j67
$$ 68 -26 104 -52 108 -94 173 -99 12 -43 -62 137 15 -40 -22 -118 26 18 46 27 -200 48 30 102 -65
4058f5Q0L7K7L6j58R7j48K27k05j49J65P1J31k37J26j57N03l58P6j57L0J89j75
$$ -65 15 52 79 115 -43 54 -94 133 -72 -221 -56 15 146 -91 35 -122 381 23 99 -58 -28 161 -14
4081a4M9l8Q3j89J24on6m7O6q1J89K3j2o4K7n8P2j3m5R7j76J89j50j07K92j44
$$ -14 35 -3 80 -109 15 9 -47 -94 -28 -109 80 103 91 27 54 -4 68 55 10 107 -69 120 -30 -137 155 11
4107A1M6m3pk1R7Q7k45J60lj24PP9j24l6l2K39j35N0j14O4K14l48Q9J49l3P6L7
$$ 11 57 14 7 -14 83 170 -75 85 82 -42 -35 44 -80 -116 -148 91 -44 6 -108 -44 170 -178 -89 60 27 103 140
4134A40m48L99n6p4k08P6M3R2j6j00M33k19k5j2N4q2J27j90j15K45j50L4l4R5
$$ 140 -308 91 35 -39 -247 -171 -128 -36 -52 -152 281 62 37 25 79 -3 124 -66 -181 64 -86 -52 -86 9
4158Ik2K3J55j50J93r0J89l76L5M0j8m0j62K06N5r6l7j7P4K67m43K70k00J42n7
$$ 9 -13 10 165 15 208 118 307 -69 -34 6 -12 -52 -214 -8 47 -49 -86 -103 -29 238 -205 65 -135 7 -50
4183e0J20J36j77K61l44K06k29j7J73N5k49lJ14j0nj13M9R5j06K73j47L1M8j33
$$ -50 70 206 29 290 -54 152 -77 -94 79 134 -115 -118 -4 -14 -19 -132 -83 12 -94 179 32 63 111 -22
4207b2p2J86j13jQ7Mj17J56q5Q7j73N9J63l05J10J03j04Q3k80K1L21Q6j55K6j37
$$ -22 -94 92 -21 -22 65 69 -48 108 23 110 -63 -4 159 -146 -36 67 -37 46 -234 -213 108 194 39 65 -72
4232g2J0k8Q8L24n13L45j88j68J92j01k2P2j03K67k51J22j10J37k54K69j4j28
$$ -72 -62 -90 -2 322 -191 154 -34 -202 -10 -111 -133 -61 -164 103 -148 -26 -136 1 -253 16 2 -126
4254a26K2j0J60j18R3j46K59j88J7LM1L7r8J80k91K63j50M9k42K21P5j12P8J3
$$ -126 -104 -114 46 -72 21 -125 134 -54 -37 -34 7 44 -54 126 -165 98 -52 -3 -245 -24 51 -61 17 30
4278C0O0m2l7j64L30k02pQr7j2RQJ69n4mn8J6J12k53K75p5Q4k39J59R3k13J28
$$ 30 90 48 11 -153 177 -25 -32 -24 -121 -133 -124 -116 53 -1 -5 -63 -47 65 -188 87 12 96 -143 16 109 -104 24
4305B4j78J71l5L8M3p3l7K21j93J13j19J00P5k00K13k64J84p8j30L53l21r4ML59
$$ 24 -154 17 -18 20 63 -10 -47 174 -19 94 -25 75 150 -50 163 -101 83 5 -125 228 -93 -187 -183 176
4329A76n8j48K2O6J06p4o3k33K25p2%J46J2k70k4L29J6M2j78K2n3J25j49k0J68
$$ 176 118 -30 -8 58 164 90 27 -206 19 -53 -53 93 105 -165 -189 140 156 198 20 42 -11 114 -35 -55 113
4354A13K01j85o9k00J95P5j25k15K83L5j77R1j61O5j3J54j36M3nP1r6q3J68j64
$$ 113 314 129 60 -140 55 130 5 -210 73 108 -69 22 -139 -74 -87 67 -69 -26 -31 40 -56 -139 29 -135
4378a35J22q5k6J52j59K04j44J50k41J74nJ88k76K71q8j71J97j27O5j10J1K75
$$ -135 -13 -98 -124 28 -131 73 -71 79 -162 12 7 195 -81 190 102 -69 128 1 66 -44 -33 242
4400B42l77K76J13l33o3J60j9N1n7m7L29k72M0j04p2M20l91N8J00j52K38j83l2
$$ 242 -135 141 254 -79 -142 18 -1 50 -7 -54 275 3 43 -61 -133 287 -104 -46 54 -98 140 -43 -75
4423g5j30J52pQ4J34j04j19j9O0m2J31L3K2J3K7k56J43j54q2L45k75L56m22M01
$$ -75 -205 -53 -60 24 158 54 -65 -84 -24 -66 65 98 120 133 160 -96 47 -107 -189 156 -119 237 -185 216
4447B16j44k32K0J43j78J12K43r9j19J74lj26mr9R6p1J07n4m7Kj11K37j55K13
$$ 216 72 -160 -140 3 -175 -63 180 81 -38 136 133 7 3 -96 0 -71 36 -18 -65 -63 -174 63 -92 121
4471A21p6k41J92J59r5J50p5j95K2K11r3k87J31j9J54j31N0N2r1J51L8l40L63
$$ 121 45 -196 -4 155 60 210 135 -60 -38 173 80 -207 -76 -95 59 -72 -22 30 -61 90 128 -212 151
4494A51loJ03j40j29K5j00J50j69J03MP7r6j58K60O6k01J69j94K31j07jO3l22
$$ 151 148 142 245 105 -24 1 -99 51 -118 -15 -11 66 -30 -188 72 138 -63 106 -88 143 36 35 98 -224
4518b24L83j17K04l03K35m7k08K90k42P8j40J77l8j64J19M0j44J75j06j8l5J20
$$ -224 159 42 246 -57 178 131 -77 213 -29 49 -91 86 48 -116 3 43 -101 74 -32 -50 -85 35
4540C5r4J11M7L2k16K3k2J67J64l63K89L4q7k80L20k71N3L9n9K16n4j23O2km6
$$ 35 -59 52 99 131 -85 -62 -84 83 247 -116 173 207 120 -160 160 -111 -58 -19 -78 138 84 -39 23 21 -25
$$ [...]
8191a26
##END NTUPLES=NMR FID
##END=
