##TITLE=1H_20-2025
 200.13MHz, CDCl3,
 8 sc
 
 3.2.2025
##JCAMPDX= 6.0         $$ Bruker NMR JCAMP-DX V2.0
##DATA TYPE= NMR FID
##DATA CLASS= NTUPLES
##ORIGIN= UXNMR, Bruker Analytische Messtechnik GmbH
##OWNER= pz
$$ XWIN-NMR		Version 3.5
$$ Mon Feb  3 14:20:03 2025 Russian Standard Time (UT+4h)  she@DPX200
##.OBSERVE FREQUENCY= 200.1313
##.OBSERVE NUCLEUS= ^1H
##.DELAY= (6, 6)
##.ACQUISITION MODE= SIMULTANEOUS
##.ACQUISITION SCHEME= undefined
##.AVERAGES= 8
##.DIGITISER RES= 18
##SPECTROMETER/DATA SYSTEM= spect
##.PULSE SEQUENCE= zg30
##.SOLVENT NAME= CDCl3
##.SHIFT REFERENCE= (INTERNAL, CDCl3, 0, 14.3821)
##AUDIT TRAIL= $$ (NUMBER, WHEN, WHO, WHERE, WHAT)
$$ ##TITLE= Audit trail, XWIN-NMR		Version 3.5
$$ ##JCAMPDX= 5.01
$$ ##ORIGIN= Bruker BioSpin GmbH
$$ ##OWNER= she
$$ F:/spectra/data/she/nmr/H-C/1/audita.txt
$$ ##AUDIT TRAIL=  $$ (NUMBER, WHEN, WHO, WHERE, WHAT)
(   1,<2025-02-03 14:18:04.07 +0400>,<she>,<DPX200>,
      <created by zg, POWCHK disabled, PULCHK disabled
       configuration hash MD5:
       00 E9 B6 7A A2 85 ED C7 34 08 36 98 17 FE 4E 26
       data hash MD5: 16K
       A1 8A 9D 4A 59 20 BA 7C AA C7 39 D1 B8 CA C3 B3>)
$$ ##END=
$$ 
$$ hash MD5
$$ 9B 08 52 7F B4 C2 E2 BD 22 DD EA EB A1 96 6D 6F
##$RELAX= 
##$RELAX= 
##$RELAX= 
##$RELAX= 
##$RELAX= 
##$RELAX= 
$$ Bruker specific parameters
$$ --------------------------
##$DU= <F:/spectra>
##$EXPNO= 1
##$NAME= <H-C>
##$PROCNO= 1
##$TYPE= <nmr>
##$USER= <she>
##$AMP= (0..31)
100 100 100 100 100 100 100 100 100 100 100 100 100 100 100 100 100 100 
100 100 100 100 100 100 100 100 100 100 100 100 100 100 
##$AQSEQ= 0
##$AQ_mod= 1
##$AUNM= <au_zg>
##$AUTOPOS= <>
##$BF1= 200.13
##$BF2= 200.13
##$BF3= 200.13
##$BF4= 200.13
##$BF5= 200.13
##$BF6= 200.13
##$BF7= 200.13
##$BF8= 200.13
##$BYTORDA= 1
##$CFDGTYP= 0
##$CFRGTYP= 5
##$CHEMSTR= <none>
##$CNST= (0..31)
1 1 145 1 1 1 1 1 1 1 1 1 1 1 1 1 1 1 1 1 1 1 1 1 1 1 1 1 1 1 1 1 
##$CPDPRG= <>
##$CPDPRG1= <>
##$CPDPRG2= <>
##$CPDPRG3= <>
##$CPDPRG4= <mlev>
##$CPDPRG5= <mlev>
##$CPDPRG6= <mlev>
##$CPDPRG7= <mlev>
##$CPDPRG8= <mlev>
##$CPDPRGB= <>
##$CPDPRGT= <>
##$D= (0..31)
0 0.7 0 0 0 0 0 0 0 0 0 0.03 0 0 0 0 0 0 0 0 0 0 0 0 0 0 0 0 0 0 0 0 
##$DATE= 1738577883
##$DBL= (0..7)
120 120 120 120 120 120 120 120 
##$DBP= (0..7)
150 150 150 150 150 150 150 150 
##$DBP07= 0
##$DBPNAM0= <>
##$DBPNAM1= <>
##$DBPNAM2= <>
##$DBPNAM3= <>
##$DBPNAM4= <>
##$DBPNAM5= <>
##$DBPNAM6= <>
##$DBPNAM7= <>
##$DBPOAL= (0..7)
0.5 0.5 0.5 0.5 0.5 0.5 0.5 0.5 
##$DBPOFFS= (0..7)
0 0 0 0 0 0 0 0 
##$DE= 6
##$DECBNUC= <off>
##$DECIM= 32
##$DECNUC= <off>
##$DECSTAT= 4
##$DIGMOD= 1
##$DIGTYP= 9
##$DL= (0..7)
0 120 120 120 120 120 120 120 
##$DP= (0..7)
150 150 150 150 150 150 150 150 
##$DP07= 0
##$DPNAME0= <>
##$DPNAME1= <>
##$DPNAME2= <>
##$DPNAME3= <>
##$DPNAME4= <>
##$DPNAME5= <>
##$DPNAME6= <>
##$DPNAME7= <>
##$DPOAL= (0..7)
0.5 0.5 0.5 0.5 0.5 0.5 0.5 0.5 
##$DPOFFS= (0..7)
0 0 0 0 0 0 0 0 
##$DQDMODE= 0
##$DR= 18
##$DS= 0
##$DSLIST= <SSSSSSSSSSSSSSS>
$$ [...]
##$SUBNAM0= <"">
##$SUBNAM1= <"">
##$SUBNAM2= <"">
##$SUBNAM3= <"">
##$SUBNAM4= <"">
##$SUBNAM5= <"">
##$SUBNAM6= <"">
##$SUBNAM7= <"">
##$SUBNAM8= <"">
##$SUBNAM9= <"">
##$SW= 18.0517328524113
##$SWIBOX= (0..15)
0 0 2 0 0 0 0 0 0 0 0 0 0 0 0 0 
##$SW_h= 3612.71676300578
##$TD= 16384
##$TD0= 1
##$TE= 0
##$TE2= 300
##$TE3= 300
##$TEG= 300
##$TL= (0..7)
0 120 120 120 120 120 120 120 
##$TP= (0..7)
150 150 150 150 150 150 150 150 
##$TP07= 0
##$TPNAME0= <>
##$TPNAME1= <>
##$TPNAME2= <>
##$TPNAME3= <>
##$TPNAME4= <>
##$TPNAME5= <>
##$TPNAME6= <>
##$TPNAME7= <>
##$TPOAL= (0..7)
0.5 0.5 0.5 0.5 0.5 0.5 0.5 0.5 
##$TPOFFS= (0..7)
0 0 0 0 0 0 0 0 
##$TUNHIN= 0
##$TUNHOUT= 0
##$TUNXOUT= 0
##$USERA1= <user>
##$USERA2= <user>
##$USERA3= <user>
##$USERA4= <user>
##$USERA5= <user>
##$V9= 5
##$VALIST= <valist>
##$VCLIST= <CCCCCCCCCCCCCCC>
##$VD= 0
##$VDLIST= <DDDDDDDDDDDDDDD>
##$VPLIST= <PPPPPPPPPPPPPPP>
##$VTLIST= <TTTTTTTTTTTTTTT>
##$WBST= 1024
##$WBSW= 4
##$XGAIN= (0..3)
0 0 0 0 
##$XL= 0
##$YL= 0
##$YMAX_a= 452506
##$YMIN_a= -509117
##$ZGOPTNS= <>
##$ZL1= 120
##$ZL2= 120
##$ZL3= 120
##$ZL4= 120
##$ABSF1= 10
##$ABSF2= 0
##$ABSG= 5
##$ABSL= 3
##$ALPHA= 0
##$AQORDER= 0
##$ASSFAC= 0
##$ASSFACI= 0
##$ASSFACX= 0
##$ASSWID= 0
##$AUNMP= <proc_1d>
##$AZFE= 0.1
##$AZFW= 0.1
##$BCFW= 1
##$BC_mod= 2
##$BYTORDP= 1
##$COROFFS= 0
##$CY= -3
##$DATMOD= 1
##$DC= 2
##$DFILT= <>
##$DTYPP= 0
##$F1P= 0
##$F2P= 0
##$FCOR= 0.5
##$FTSIZE= 0
##$FT_mod= 4
##$GAMMA= 1
##$GB= 0.15
##$INTBC= 1
##$INTSCL= 1
##$ISEN= 128
##$LB= 0.25
##$LEV0= 0
##$LPBIN= 0
##$MAXI= 10000
##$MC2= 0
##$MEAN= 0
##$ME_mod= 0
##$MI= 1.114404
##$NCOEF= 0
##$NC_proc= 0
##$NLEV= 6
##$NOISF1= 3.799351
##$NOISF2= 2.8
##$NSP= 1
##$NTH_PI= 0
##$NZP= 0
##$OFFSET= 14.38212
##$PC= 1
##$PHC0= 251.7634
##$PHC1= 11.79222
##$PH_mod= 1
##$PKNL= yes
##$PPARMOD= 0
##$PSCAL= 0
##$PSIGN= 0
##$REVERSE= no
##$SF= 200.129724274929
##$SI= 16384
##$SIGF1= 3
##$SIGF2= 2
##$SINO= 400
##$SIOLD= 16384
##$SREGLST= <1H.CDCl3>
##$SSB= 0
##$STSI= 0
##$STSR= 0
##$SW_p= 3205.1282051282
##$SYMM= 0
##$S_DEV= 0
##$TDeff= 0
##$TDoff= 0
##$TI= <>
##$TILT= no
##$TM1= 0
##$TM2= 0
##$TOPLEV= 0
##$USERP1= <user>
##$USERP2= <user>
##$USERP3= <user>
##$USERP4= <user>
##$USERP5= <user>
##$WDW= 1
##$XDIM= 8192
##$YMAX_p= 0
##$YMIN_p= 0
$$ End of Bruker specific parameters
$$ ---------------------------------
##NTUPLES= NMR FID
##VAR_NAME=  TIME,          FID/REAL,        FID/IMAG
##SYMBOL=    X,             R,               I
##VAR_TYPE=  INDEPENDENT,   DEPENDENT,       DEPENDENT
##VAR_FORM=  AFFN,          ASDF,            ASDF
##VAR_DIM=   8192,          8192,            8192
##UNITS=     SECONDS,       ARBITRARY UNITS, ARBITRARY UNITS
##FACTOR=    0.0002768,     1,               1
##FIRST=     0,             0,               0
##LAST=      2.2672688,     0,               0
##MIN=       0,             -509117,         0
##MAX=       2.2672688,     452506,          0
$$ Real data points
##PAGE= N=1
##DATA TABLE= (X++(R..R)), XYDATA
0@%%%%%%%%%%%%%%Mj2J6j6J6j6K4l2L2l7M5n3O1o8P8q9J00j13J28j44J61j81K01
37A05k23K48k74L03l34L70m09M50m95N44n97O59p26P96q77R69j075J195j328J483
57G84j669J893k165K502k937L517m316N479p302J0463j6888L4278j57695l75061
71e09117O98911J05973o20773K97710M28786n29932j99054N92022m2158n48627
81c26259K30068L64969l42433p8297L82929j61252l55492K19924K53009j83707
91C459j23599J98645K5976k44419R3031K48437k40133j85336L32754P4790k97944
102a14339Q4948J99509k75831j22760L94382k093l90524K12634K56059l98025
112a56040j4936M22106k59174k86948M39049R6840m28849J23774L04813l35542
$$ y = [0, 0, 0, 0, 0, 0, 0, 0, 0, 0, 0, 0, 0, 0, 0, 4, -8, 8, -8, 8, -8, 16, -16, 16, -21, 24, -29, 32, -36, 42, -47, 53, -60, 68, -76, 85, -96, 105, -118, 130, -144, 159, -175, 195, -214, 236, -259, 285, -312, 347, -379, 417, -460, 509, -566, 629, -699, 784, -885, 1008, -1157, 1345, -1592, 1925, -2391, 3088, -4214, 6249, -10639, 23639, -134056, -509117, 189794, 295767, -325006, -27296, 401490, -128442, -327496, 264526, 222368, -326259, -96191, 268778, -73655, -151952, 230977, 69725, -285767, -65843, 187166, 3459, -120140, 78505, 104481, -139938, -46907, 201530, -38603, -223939, 108815, 183605, -114339, -29391, 170118, -105713, -228473, 165909, 163816, -226708, -14074, 241985, -156040, -170976, 251130, -8044, -294992, 144057, 240897, -187952, -64178, 240635, -94907]
122i4907j56339M51759k6523m17586K38580K60386l82664o5345L62369j18945
132E0785k60524K30155J83125k50941j08821K48916n456k58161J33824K39294
142B02196k06314j38150K43591J5435k75420O8436K65228j64949j91582K90826
152A09297N2857l61544J19460K82466k85366j09364L65572m8070l05241J82891
162B958J72743k93347l3036L33724j07203k54468K43974R4974k99543O1037K16969
173A38782j80607r1902K23018J4065j89062L7931J23517j13855o7777J80986J4684
184H9780j71250O4429J20601j16821p3622J18431K6414j26374L9112J64426j15946
195A9180j66004J71975N9093k05849Q5710J87470j74571j03929K10809K106k19255
$$ y = [-94907, -251246, 200513, 173990, -243596, -5016, 255370, -127294, -192639, 169730, 50785, -209739, 20416, 203541, -47400, -156221, 92695, 87239, -170922, -37098, 202196, -4118, -142268, 101323, 116758, -158662, -90226, 175002, 10053, -181529, 109297, 162154, -199390, -79930, 202536, -82830, -192194, 173378, 125308, -179933, 2958, 175701, -117646, -150682, 183042, 75839, -178629, 65345, 160319, -139224, -78187, 138782, -41825, -133727, 89291, 103356, -85706, -47775, 75742, -38113, -105890, 75096, 89780, -81470, -17041, 103560, -13261, -86883, 31548, 57962, -68412, -29300, 135126, 19180, -146824, 25151, 84244, -121605, -35895, 151575, -22996, -126925, 83884, 85990, -133265]
206a33265Q6754J83041j65094o9358K37378o6761k32979J57137J17551j94062
216g9658J9195J79005r9246j27457J32636N6071j67208P645J70390o8390j01566
227g8583J34762J7767j55636K9943J19272n0359p1479Q1719N3227j17474k5191
238f2032J25263n6036j09626J26173O0779j33140J3080J04287q0041q5915J17456
249B0248N6786j31655K6052J38600j14243r4419J53901o694j41835R5968R9054
260A01763j22463m2117J12993k6189j18186P7781R9168j11063k3918J27011n5792
271A8988j02738Q8718M3369q2540J2506Q4323k9801q1025M6312M9107r0373m128
283d7282J09539m0081p3998P2410J8819r1195M227Q5271k0683o6742P0078M9602
$$ y = [-133265, -46511, 136530, -28564, -97922, 139456, 72695, -160284, -3147, 114404, -79658, -60463, 118542, 19296, -108161, 24475, 80546, -86662, -79017, 91373, 22983, -78583, 56179, 73946, -81690, -51747, 67525, 17166, -54313, 27406, 80633, -36841, -62032, 63231, 7195, -102431, 23742, 84521, -48619, -35539, 68748, -11293, -97208, 20248, 77034, -54621, -28569, 110031, -4212, -98631, 55270, 48576, -93259, 2709, 101763, -20700, -62817, 50176, 23987, -94199, -16418, 82750, -28313, -52231, 74780, 18988, -83750, 4968, 48337, -34203, -21697, 62626, 32825, -48200, -1888, 47219, -43154, -47282, 62257, 22176, -51822, 20588, 39407, -51788, -47561, 37710, 17027, -49715, 20363, 69965]
295F9965j11393o239J05557n9911o0845J04754J7590r4903J9223O3180o0031n3022
307f6075Q5393K6764r0741L5422P4484r2218l4110R3400j9483n9737O0420M2695
319E6214o3824k5686O2428j1202p2732N3135O1231p3709j0923O8949m0859n6986
331e3964M6691L4196m1589r434N9159j0090o9998L7327M2946o7723O765P7639
343E1925l3677m5429M3633R554n7743K186O3505k0213n1393N9444J8986q6845
355d6067J7647O2315n1576j8082O8192j100n5203J2806L9656l7489l0790O4059
367B4368J0338n9325L1780L2092o1050j0236M6020r053k4966K3524K6094l5410
379e824k6540M4244l588m9008M2976L8529m8143l034L8096k4391l6196K8814L5512
$$ y = [69965, -41428, -47667, 57890, -2021, -62866, 41888, 59478, -35425, -16202, 46978, -13053, -66075, 19318, 46082, -44659, -9237, 65247, -26971, -61081, 32319, 12836, -46901, 13519, 56214, -7610, -33296, 29132, 17930, -54802, -1667, 59564, -14145, -25068, 43881, 3022, -53964, -7273, 26923, -14666, -24100, 35059, 24969, -45029, -7702, 35244, -32479, -25714, 51925, 18248, -27181, 16452, 26006, -31737, -29551, 33954, 13741, -37652, 21792, 40778, -46067, -28420, 33895, -17681, -35763, 32429, 31329, -23874, -11068, 28588, -8901, -39691, 24368, 34706, -24619, 7161, 39253, -21797, -32033, 13987, 4934, -20032, 3492, 29586, -5824, -32364, 11880, 8292, -40716, 2260, 40789, -7354, -10388, 27708, 3317, -32879, -4065, 31447]
392C1447l4099j6240N1727j7802n7083M1587K1292n3892J8619M8571k8086k6003
404a9962K5557M182l6039J0154M8581k3820k8407M5255n502m9145K4835K1423
416A7112l0531J992L1662j192l3715j817K6779k2217j6939M7583K413l9669K0547
429B008J9051l1519r964K7327P875k3849J1997L1524l8038k6581M4223j0429l4968
442c1343M1987J5708m0888L607K5878k0370k4105K9161K3622l2779L705L8771
454C2954l2708k7189L7316j922k4467K1486J6171j6178j5796O951O659k0767M603
467a2887L0947j5233j5788K4009m730k3392Q041J4983l999p073K0539J0119l9641
480a4105k080L4614k5720j1865M3407j1316l4356K3193J4564l0646r659K9533
$$ y = [31447, -2652, -18892, 32835, 15033, -42050, -463, 20829, -33063, -14444, 34127, 6041, -19962, 5595, 9777, -26262, -16108, 32473, 8653, -19754, 25501, 19999, -29146, -4311, 17112, -13419, -11427, 20235, 19043, -14672, -16489, 10290, -11927, -28866, 18717, 21130, -18539, 2008, 21059, -10460, -20424, 6903, 14778, -9071, 2926, 34450, -3588, -30169, 14054, 3625, -31343, 10644, 26352, -14536, -10929, 14949, -5421, -29526, -365, 23257, -9522, -5817, 32954, 246, -26943, 10373, 8451, -16016, 5470, 21641, 5463, -10333, -3382, 3277, -17490, -12887, 18060, 2827, -12961, 11048, 6318, -17074, -9033, 5950, 1951, -5122, 15417, 25536, -14105, -16185, 18429, -7291, -19156, 24251, 12935, -21421, 1772, 16336, -14310, -23969, 5564]
492E564K779k2537K5009J6803m6919j506L7332j8020p725K7904q390j7827Q991
505A458Q508j1809j7389J4199J7114j4127L997J1677k5226j1005K0448J0090o052
518A883n994J2028L657k2421J1570J6416l4153J479M0485j2799j8874J4909q858
531f72k2367J3859K5493j3649j8713K5039J932l0025K0239J2375l6083J3952L4568
544B5948j7096j1510R501q262j2129R171J8687p089j7827J4601M834j9584M572
557f183N449r229N340J0184O807o456j9266R813R117j6558J5350J6687k5351r79
571e275J9850j3391j6422J1494J1170j3828P68K6079j7242k9902K7715O686k7722
584b0020K2588J8227k6043L22J6823j1148j1586R043J1295q344j504J4635j2641
$$ y = [5564, 8343, -14194, 10815, 27618, -19301, -20807, 16525, -1495, -9220, 18684, 10294, -7533, 1458, 9966, -1843, -19232, -5033, 12081, -2046, 1951, 13628, -11598, -22603, -2155, 7935, 1883, -4111, 7917, 11574, -10847, 723, 17139, -17014, -15535, 24950, 12151, -6723, 8186, -672, -23039, -9180, 16313, 2664, -16049, 8990, 10922, -19103, 1136, 13511, -22572, -8620, 25948, 8852, -2658, 6843, -1419, -13548, -4377, 14310, 7221, -10606, 3995, 8829, -10755, -6183, -734, -9963, -4623, 5561, 12368, 5912, -13354, -3541, 5576, -10982, 4368, 21055, -4296, -5275, 14575, 1184, -15238, -3744, 7426, -6402, -5634, 20445, 3203, -26699, 1016, 7702, -20020, 2568, 20795, -5248, -4926, 11897, 749, -10837, -1794, 9501, 1157, -347, 14288, 1647]
597A647j6172J3632p98q072J3148J715m148o08o273M598p26q148J6745N562j5406
612c304Q112N971j6709l517J1726L434r533M827J4960k0145j4368K4572p205j7965
626a9144K7418M646k2962J1372Q841j7403l178J4381L561j0215Q252J1133k1902
639e200o796J9171j0353o880J7967k964q578L511k340j093l692k39J4049j101
653E462o785Q887m609j0567M873N491N66k798M061O010j5299m031J5105j4286
667g920n773K5283o506j4708J4609o67j6726N122J3112k137p778J2418N432k2038
681h277K490J5398j6164k6J8925q975p207O400m493n045l25M525O705m604K166
696A493N606j1653j706P988k051J414L389J520L19r626J025O699j3890L128J8353
$$ y = [1647, -14525, -893, -1691, -9763, 3385, 5100, 952, 344, -5929, -1331, -2057, -10205, 6540, 12102, -3304, 4808, 10779, -5930, -9447, 2279, 5713, -3820, 1007, 15967, -4178, -18546, 6026, -1179, -19144, 8274, 12920, -10042, 1330, 10171, -7232, -10410, 3971, 7532, -2683, 5569, 16702, -5200, -11996, 7175, -3178, -10058, 7909, 4945, -3633, -122, -2462, -3555, -7247, -7486, 6563, 5462, -1323, 7564, 2955, -7612, -2739, 2752, 3318, 520, 4581, 10591, -4708, -8739, 6366, -7920, -13693, 11590, 5084, -9624, 4985, 4318, -12408, -7286, 5826, 3689, -4089, 8329, 13761, -8277, -5787, 9611, -6553, -6579, 12346, 3371, -3836, 2564, -1929, -6974, -7299, -2774, 3931, -673, 1493, 7099, -4554, -6260, 1728, -323, 1091, 4480, 6000, 6319, -3307, -2282, 4417, -9473, -6345, 12008]
711A2008j1397o240J1916q819r615Q417P478l675l074J0873j8j6253Q524P037
725G162j6802Q578J4986j3116j998O725q707n115M469N706q23n287Q237O72j3710
740i023N554N762p958N640P220k046j523n289J508J516q359Q489P954j1987K069
755d73O345j1765k270O912L98j461K079P228n100j0221J0167N88j2159J3951Q183
770A2402j4178L044N075j0034k156N208L561l344k268Q391m483j0833Q543M26
784f46p414J0388M131m954Q03l109j18N79k442P810L48q037P811q35j0869L237
800c317K345k900L187L266K205o731o139R598k217o619J3431M96j0324Q203J385
815E869r246J92K811K165p09R75M449r196o104J0120l566m781J1006j557n195
$$ y = [12008, 611, -5629, 6287, -2532, -12147, -3730, 3748, 73, -3001, 7872, 7854, -8399, 125, 7162, -9640, -1062, 13924, 808, -1190, 5535, -3172, -8287, -3818, 1888, 1065, -4222, 4015, 4687, -9023, -3469, 2293, -5665, -25, 7195, 5149, 3626, -1663, -155, 1361, -6998, 1491, 9445, -2542, -473, 5872, -5893, -8163, -1251, -853, -2314, -235, 6993, 1893, -8328, 1839, 2427, -9732, 4219, 12402, -1776, 1268, 6343, -3691, -5847, -639, 2922, -422, -2690, 5701, 1218, -9615, -1072, -646, -8060, 2328, 6459, 1505, 2308, -801, -919, -340, -2782, 5028, 5376, -2661, 5150, 4315, -6554, -3317, -972, -3872, -685, 2581, 4786, -1945, -8084, 1514, -703, -7322, 6109, 6605, -3719, 4484, 5869, -3377, -3185, -374, 1791, 1082, 2057, 6506, -2690, -8794, 1326, -2240, -7021, 3985, 2428, -2767]
830b767N090j139l175j444J003P692j745k641O465p037p326P818l64k840L545
845A135O5O42l380k824M762n115j557J2460k927n074P155m816n591N269J479K15
861A898m35J474K673q342j426O979q037o35J1633m367m316M532l566k071J231
876b775K113M916l467Q00N142p807k244N911m728J079N564k407p89k200k537K525
892i04m502K265P967n873l32O181p098k271N206l16Q49J016J801J056p744P22
908a977M701p799L146Q034o912o09L429n467n84J424J422L024k073K732J875q058
924c692K505M049n858M123M594m635L45j078k205Q72l510L626M547n794K421K674
940B984p948J312L916j716K614R28N52N94n115K134J454o041N575M375o892K656
$$ y = [-2767, 2323, 1184, -1991, -3435, -2432, 5260, 3515, 874, 7339, 302, -7024, 794, 430, -2410, 1135, 1200, 1842, -1538, -4362, 400, -4715, -6272, 6188, 3261, -1813, 5342, 526, -5065, 204, 1683, 1898, 1463, 2937, 5610, -2732, -4158, 2821, -5216, -5851, 5782, 1415, -2901, 1631, -1935, -4006, -2775, -662, 4254, 787, 1587, 6729, -1078, -3322, 2589, -2139, -1060, 4504, 2097, 1308, -892, -3429, -904, -5406, -3141, 4826, -1047, -1379, 4802, -2296, -4567, 639, 323, 1172, 2188, 3989, 5045, -2699, -1977, 2724, -5075, -1929, 6105, -807, -1416, 2013, -3454, -4038, -2614, -1192, 1832, -241, 2491, 4366, -3692, -1187, 2862, -2996, 1127, 5721, 1086, 1431, 353, -1852, -980, -4490, -864, 3683, -2111, 310, 2984, -4964, -3652, 264, -1452, 1162, 2090, 2642, 3236, -1879, 255, 1709, -4332, 1243, 5618, -1274, 1382]
956A382O72o794J243K038M99J692j915L174j72o077M529Q66n445O610L432m224
972A510J164k317k430J579j874L742J169m852L674o2o099L001J52k208N190J116
988B455m74l43m240K554Q75l431O464M73o253N020o49n940K127m31N43J966o96
1005B0K332k674n119N130Jk676O427q14k962L442k124k011J016j833L537Q66k519
1022C9L460m019m758M940j064j380M241j156k25O72k594J891r98k075O852p37
1038C089l124M125l657l296L242r05M49J562j787J689k407k874M119l074n95O600
1054C156k146j657L660l765p61J683p09K995p02r37L093m581k625M154k995o0
1070b197M411k301R2n6k833J951j021N6N165k146o69L279m534r93L309k133J285
$$ y = [1382, 2054, -4740, -3497, -1459, -960, 732, -1183, 1991, 1819, -4258, 271, 1137, -4308, 2302, 5734, 1510, 2674, 357, -2073, -494, -2368, 1374, 2543, -2309, 1365, 1303, -4796, -1795, -1643, -3851, 1339, 2455, 1981, 1638, -2602, -48, 827, -2604, 3860, 4333, -1920, 3100, 2451, -3489, -1362, -1793, -1250, 716, 20, 2352, -322, -5441, -311, -310, -2986, 3441, 2627, -335, 3107, 983, -1028, -12, -1845, 1692, 2558, 39, 3499, -520, -5278, -338, -1402, -2782, 1459, 303, 78, 750, -1844, 47, -951, -3026, 3826, 3089, -35, 4090, 433, -2863, 379, -526, -77, 1485, -302, 1387, -1020, -3894, 225, -2849, -3444, 3156, 1010, -647, 3013, -752, -1513, 170, -539, 2456, 1754, 817, 3910, -671, -3296, 858, -2137, -2197, 2214, -87, 5, -51, -2884, -933, -1954, -1898, 3267, 1121, 452, 3731, -803, -1796, 1513, -620, 665]
1087F65J531j679J406l023j431K378l197R28N437l801J95K306m139Q51J345n89
1103h17L340j262L1K455m511p74K977l925K203L169l354Q55n40k571J331j090
1119b483J205L460k997J344K494n207J294K553k901K749J360j915J348k903j027
1134a626J996l114K011K919l426J195R46l987J699N51q72L661j131L35J723m189
1150a309J293J472l370L274J927l652J243p14k543J336j304J749J890k874K470
1165H88Q07m855K600J131k411L898N27j708J309k739k68J294k396K969O87k892
1181a159K312j121l316K282n07l23L408j386P96N16l661K230Q59k598L800O08
1197B740k946J935j518j560Q24j375J748J250k220K296j244l634L326l81j572
$$ y = [665, 2196, 517, 1923, -1100, -2531, -153, -3350, -2422, 3015, -786, -591, 1715, -2424, -1573, -228, -817, 2523, 1261, 1292, 3747, -764, -1538, 1439, -2486, -283, 2886, -468, 387, -153, -2724, -1393, -2483, -1278, 2182, -815, 529, 3023, -2184, -890, 1663, -1238, 1511, 2871, 956, 2304, -599, -1626, 370, -2744, -733, 2186, -1240, -45, 901, -3086, -1387, -836, -1708, 1953, 822, 1157, 2880, -1309, -16, 1456, -1914, 1360, 3287, -365, 878, 164, -2379, -1043, -2347, -598, 1292, -1582, 888, 1695, -3160, -560, 571, -1840, 2058, 2585, 877, 2186, -553, -821, 473, -1923, 1046, 1733, -1159, 1153, 32, -3284, -1002, -1509, -1832, 1576, 190, 986, 1502, -2159, 71, 930, -1668, 2132, 2740, -206, 1729, 211, -1349, -525, -1900, -152, 1098, -1122, 1174, -70, -3704, -378, -759, -2331]
1212b331M608p77j369J946k372O1L76j286L151l24k138K722k737k314K555j730
1228a959P20K527j836J073j40l057K587o2j332L634n31j256J914k575m94Q62j304
1245a229K130N78k003K056k522k380L613j678p71M131j632k21J549k239L30J8
1261b70l40L155r94q70J793l323r67K632k554J169J816k289J549l18k447J587
1277f71l91l75L447j156n58J682k995P55Q75j430K327n37j075K258k888j583K866
1294E51k481J22L656k152J86K78j891J221L9j32K559j624M58J966l588K19J662
1311A049k971K464J621k732J172j007j815J655q81L93K391j830R68Q29k605J202
1327i7M02j120K997q08r70J583k821m93K138k466R65K154k183Q55n2k083J343
$$ y = [-2331, 2277, 1500, 131, 2077, -295, -234, 142, -1144, 2007, 1683, -455, 2267, -470, -2784, -229, -1959, -1239, 1288, -548, 525, 385, -2672, -85, -147, -1479, 2155, 1624, 368, 2282, -293, -787, 75, -1229, 901, 1479, -524, 1532, -990, -3370, 243, -1435, -2206, 1925, 293, 72, 1621, -618, -288, -270, -610, 2545, 1551, 681, 2474, -849, -1816, 816, -1738, -569, 1247, -1042, 507, 189, -2258, -671, -1062, -1437, 2010, 854, 296, 1978, -1017, -262, 613, -817, 1510, 973, -102, 2156, -732, -2315, 551, -1930, -1808, 1848, -304, -118, 160, -1731, -510, -471, -603, 1956, 332, 790, 2756, -832, -613, 1049, -1922, 542, 2163, -569, 603, -404, -2219, -564, -1445, -1052, 1339, -491, 477, 1306, -1299, -97, 305, -815, 2182, 1374, 404, 1987, -834, -1327, 811, -1655, -690, 1464, -719, 136, 84, -1999, -656]
1344f56n27M65K379j733J299R00l662J462J380k559K750L90k176J320j231j510
1360a709J293j433J154J326j315J343l25k393K029l46o18L376j510l47J737k684
1376d22o4J221j935J801Q37k163J335q44j635J224r75R46J793j802J606K37k858
1393a698J877M44j824K881Q8j477J240j662q12O83q81J294L96j455J752j270k090
1410b514K574j225j19L210j539n8J320k576O27J124j538J860J61j235J222j509
1426b15q31O92j307J318J340j887J606o66k485K625j01j143K936r71p60J449j342
1443B58o94M96j036J749o7j050J530j842j108K192j661K8K303j933J028R01k034
1460i40P77L86q26K013k32m25M01j947K28P45j422J664K02j835K033j082j829
$$ y = [-656, -1183, -718, 1661, -72, 1227, 2127, -1535, -73, 1307, -1252, 1498, 1888, -288, 1032, -199, -1709, -416, -1849, -695, 631, -684, 659, 334, -2059, -30, -376, -994, 2382, 872, 525, 2262, -422, -486, 735, -1200, 601, 1438, -725, 610, -234, -1869, -645, -1620, -674, 1119, -683, 923, 1160, -1698, 179, 623, -1201, 1680, 1768, 291, 1531, -131, -943, -260, -1141, 153, 549, -906, 846, -424, -2514, 60, -1165, -1284, 1926, 387, 329, 1649, -927, -300, 824, -714, 1146, 1307, 72, 1294, -215, -1046, -354, -1661, -343, 997, -890, 716, 50, -2435, 190, 89, -1054, 1882, 911, 151, 1600, 258, -436, 60, -976, 773, 706, -344, 1186, -656, -1764, 428, -1233, -1205, 1098, -835, 193, 1094, -940, -163, 223, -603, 1410, 1178, 753, 1154, -793, -565, 180, -1242, 422, 624, -1211, 822, -260, -2089]
1477b089K107r95k44K814p91o53P62j270K03L77m03J482q93k02J470k650k11J628
1495D42k251J042J888j845R71J35j899J299J77k96J683p75K57M77j711Q27p2j377
1513a028K110j86j586K098k119j422K385j440J67K404j337L9L31j025Q16l98K57
1530F6J431j110M35J011k994Q39P76k019J739R87k200R69K50j941J350l45K57
1547d99J095q18J257m27j399J257m97o09K549j137r48J553k018q58J850j498P20
1564d27J047j171P66l64q57O14k13Q10R54j109R70J88k353J396Q40k233J728N88
1582A174j985J258o88j118P37j89L88P33o65R68n33j029J612q80m65K734j157
1599H95q64J423k114O1R68j261O35J085j427Q17q01l51N80o76J114N68j102J345
$$ y = [-2089, 18, -977, -1221, 1593, 802, 149, 911, -359, -156, 221, -182, 1300, 407, 205, 1675, -975, -1186, 442, -1809, -767, 1121, -724, 247, 382, -1517, -218, -41, -337, 1346, 571, 828, 1305, -406, 421, 349, -1028, 1082, 896, -690, 1408, -711, -2133, 252, -1188, -1021, 1383, 46, 85, 416, -609, 207, -191, 66, 1497, 387, 822, 1833, -1161, -322, 454, -1565, 174, 1161, -1039, -70, 180, -1761, -411, -756, -499, 596, -222, 1035, 608, -791, 466, -31, -640, 1909, 772, -176, 1377, -641, -1499, 351, -1147, -427, 620, -551, 215, -149, -1006, -392, -605, 205, 1159, 50, 1020, 1208, -1145, 251, 1091, -1142, 586, 1174, -811, 447, -241, -1359, -622, -811, -423, 310, -355, 613, 80, -949, 663, -217, -682, 2052, 895, 31, 1454, -660, -599, 369, -892, -257, 828, -599, 218, -583, -934, -354, -1030, 84, 652, -450, 895]
1617H95k7k160J994J50j863K426j30j614J326r75q21M94k27L48l1k13J164j689
1635i53p0J557j262J40K268j489n9J469j882r6R42j018O80N19q80M79j061j89
1653i05P75j083J139N67j376J683l71j642J910m89p66J921o46q41J238r08o11
1670d05M05l89Q23n35r9P44j740k2J443j421O18K038j926N89R41j561N26M09n88
1689a50N79L75l25J6j051K03O8j185J642P3j370K022j008j533K169q61m36J945
1707A173o71l25Q42j021k26J98J38Q91r83lP68j925M33R13j614R35J486j819Q95
1726H5O98j755Q52M92n12Q21L7Rnr97L61j83p79J596o90p81J222r28r64J673r58
1747g06R1J448q82K33L36p39K72r7L53O63n99N4O21k013P35N08j665J224P73j596
$$ y = [895, 868, -1292, 702, 852, -1011, 1415, 1285, -329, 997, 22, -799, -305, -532, -184, -215, -428, 736, -953, -1023, 534, -728, -588, 1680, 191, 132, 1601, -281, -377, 565, -453, 227, 746, -134, 345, -716, -905, -130, -1213, -74, 493, -883, 800, 429, -1213, 697, 208, -558, 1363, 717, -124, 1114, 206, -405, 0, -389, 434, -101, -200, 544, -1196, -1218, 225, -1196, -578, 1460, -466, 123, 1064, -497, 29, 438, -150, 429, 804, 479, 495, -556, -353, -285, -1470, 172, 245, -1125, 897, -111, -1644, 525, -336, -772, 1173, 502, 177, 1019, -2, -228, -30, 108, 999, 16, 13, 781, -1144, -711, 202, -1412, -477, 1009, -810, 85, 783, -972, -120, 372, -140, 681, 718, 727, 722, -275, 86, -97, -876, 720, 30, -751, 471, -457, -1421, 252, -706, -615, 833, -49, 184, 520, -219, 53, -44, 309, 972, 373, 427, 1048, -965, -230, 278, -1387, -163, 610, -986]
1767i86P88L18j238R20J27M6N20j63L49r7j006Q67l09p95J717q50n99J364j400
1786d27q65J474j005J18J212q26K66L8n20P77n12K79J062j220O24N08j769P50
1804c6N89j689J510J22j323J168m34q32O36k42K08R15o41P62p04o84J513r47k97
1823d06J836j271m06J150j460N7Q28j170P36L65n90K15j33m09M97l41M52Q44j144
1842c50R86K15j737J380K27j402J576j92j043R30q66m64M56m72P87j10k22Q34
1860E33q37m48J439j160J26J719j282kJ122j672J62P14p57M64L29n46K91r96K54
1879e47N04q95J066L02j029J216R3j407J131l65n49J380m00n21Q97j062j96L32
1897e0m41O76n00k20Q63r48J60Q37j030L70J371j286N45L88j185N69J54o51R05
$$ y = [-986, -198, 120, -1118, -198, -71, -25, 495, 332, 681, 584, -422, 445, 136, -659, 1058, 208, -391, 973, -427, -1292, 182, -823, -705, 507, -319, -53, -15, -535, 242, -270, 9, 1071, -149, 475, 983, -786, -36, 553, -1136, 374, 496, -827, 341, -93, -925, -289, -531, -323, 592, -49, 713, 9, -675, 838, -109, -406, 1430, 159, -247, 903, -557, -500, 328, -842, -106, 259, -331, -116, -249, -658, -161, -502, -50, 794, -350, 636, 851, -886, 494, 721, -681, 895, 703, -340, 590, -276, -740, -284, -756, 31, -79, -301, 533, -304, -752, 687, -473, -347, 1372, 90, 88, 1210, -462, -300, 414, -343, 121, 450, -96, 195, -801, -547, -43, -938, 128, 430, -599, 617, 710, -697, 434, 69, -480, 900, 500, -21, 876, -186, -382, -50, -491, 185, -315, -535, 328, -620, -460, 377, -653, -283, 1088, -198, 347, 735, -450, 119, 273, -378, 527]
1916E27k75k93M00j061J13M21r75J130K57r77J153l91r73J343l16k61J082m07
1934D97l01N29r11M1Pl84J096o76j9M91j116N1P75r34O04Q48j132P94M73j155
1954d22O57N2k94P67n30M12l16r47O34J1r94J184J04r58J332j059p42J288n41
1973c62k2J152n17j30K53k91K41l61m99J229p14K2N61j239J00O20j148J005L87
1992B87q66Q26J6q80P33n9J05L04l03L63o0q95P27m11o40J408p12l49J220j246
2012d32m38J053p28L28M47l36K20J86n31N26n74K33Q06r88O29J81j285O90J98
2031A85r34R78j00p51R07l11m68N88l07J27M82m45N86l95o15J002n20l81J437
2050A065j185k11R42j093n4R72j026L43L88n36N18l80j1M88k34J17Q21j150P17
$$ y = [527, 252, -41, 359, -702, -589, -168, -1143, -13, 244, -733, 420, 29, -944, 399, 83, -178, 904, 497, 196, 725, -186, -145, -138, -522, 574, -102, -121, 370, -746, -695, 80, -854, -250, 598, -534, 260, 733, -422, 235, 287, -7, 760, 230, 642, 326, -621, 13, 24, -970, 214, 318, -640, 692, -367, -1109, 179, -362, -384, 768, 251, 121, 374, 83, 324, -37, -536, 693, -21, 1, 562, -677, -577, 43, -1105, -100, 287, -579, 247, 263, -617, 116, 57, 162, 466, 163, 526, 466, -429, 298, -113, -753, 655, -57, -406, 814, -432, -870, 183, -545, -217, 230, -106, 114, 300, -231, 295, -279, -46, 760, -228, 401, 582, -703, -13, 185, -749, 229, 129, -622, 285, -26, -494, 94, -213, -86, 396, -49, 537, 142, -473, 529, 9, -372, 1065, -120, -331, 611, -482, -536, 436, -590, -247, 141, -395, 123, -257, -268, 220, -14, 103, 924, -226, 491]
2069D91l0j215J032K7r32R49j16n50M74m23l46N74l83N27J34o09P70l70l62Q36
2089D78o69M6J023j013J45Q87j171n8M55o58M27N2k67M22m58M3L68p11P56K07
2109C04p35J133k97r44R92q2m02M93j97l42L41n06j04K24m53O93j27m16Q49o23
2129a99l8N07o55M17Q16j000N04N98j323O53l7m83M31q0k33K83p50N76On59R99
2150D33k94o13R91l39n65R09l69l45R96o50r1L79p55P3J48l91O24l73j80P37j073
2171g48L53N86p33N99O85r88M09J06n54L46J41n1R5j86lN3n50M70k99o11J025
2192A45j47m16P58l79m84P35m53p6R61p11K92M9l40K80l13o3O97o66M5M59j025
2213f52L22N06j016R46J58q63P44K18o23N36j89j22M28k68J13J08n37J81r7n08
$$ y = [491, 461, -754, 278, 305, -627, 322, 206, -344, 130, -293, -639, -65, -448, 79, 213, -396, 374, 4, -358, 478, -191, -145, 878, -135, 10, 897, -274, -332, 123, -535, -108, -56, -323, 99, -359, -316, 52, -659, 97, 304, -431, 702, 405, -539, 453, 371, -31, 462, 265, -77, 264, -242, -346, -122, -575, 118, -9, -425, 424, -199, -237, 270, -385, 32, 848, -152, 352, 950, -373, 280, 243, -240, 191, 111, -122, 161, -589, -13, -7, -566, 433, 139, -474, 517, 178, -387, 522, 153, -192, 804, 154, 63, 442, -313, -240, -92, -483, 141, -232, -412, 325, -748, -395, 191, -542, 57, 742, -246, 163, 269, -285, 61, 202, 151, 246, 60, 57, 110, -440, 30, -269, -880, 145, -2, -418, 340, -39, -523, 212, -241, -317, 644, -67, 225, 274, -66, 214, -99, -162, 535, -131, -86, 373, -652, -330, 176, -840, 106, 264, -599, 145, 363, -260, 276, 87, -35, 393, 125, 238, 346, -191, -10, -107, -615]
2233f15J017n44l08P40o43j55N87l64J31N43l76J82O5l00K74l60M44J96o94J98
2253A8J86p65M76J1p06Q80j78m00O81j67m23L74k08M21K07m16N30j93p88P88m64
2274a36k41P69n31j96P25r92K23N02n54L18N26q36O14m61L5N42l17K48K29o45
2294a78N51j7p37M91K1o32O19J00o06N35l72r8L86l57L49k0l11O80n06j74O88
2315D12n13q5P01p32K21L09n19K53N4n77O02l11j43M30n58K93K84l42N06m2n15
2336b72Q85k70p64R25l09o12P74j37m07L65m59%J21k87N78q1l09O62m37l53P35
2357C48m51qQ66p94K66M15q70J66K98m64J89J2l54K23k06K89J51m58N03P4m15
2378b20O55m27k09N60m36nP65k56l79K63n00J62j40j39N35k92J13J84o02P1M65
$$ y = [-615, 402, -142, -450, 290, -353, -508, 79, -285, -154, 389, 13, 195, 260, -40, 234, -126, 318, 514, -180, 18, 204, -561, -85, -74, -780, 100, -78, -478, 203, 36, -387, -13, -221, 200, 407, -9, 521, 328, -460, 328, -136, -377, 392, -139, -335, 390, -602, -379, 123, -431, -113, 413, -423, 191, -270, -235, 307, -10, 238, 467, -178, 373, 356, -381, 110, 131, -501, 118, 218, -388, 147, -225, -323, 63, -294, 55, 35, -276, 404, -102, -276, 412, -101, -186, 515, -217, 4, 313, -206, 47, 101, -476, 126, -185, -328, 102, -456, -163, 121, -221, 285, 243, -272, 613, 343, -421, 504, 195, -417, 357, 220, -187, 178, -281, -281, -160, -447, 131, 50, -259, 403, -34, -387, 348, -103, -111, 755, -39, 227, 642, -228, -62, 236, -228, -39, -27, -381, -158, -364, -75, 76, -382, 121, 195, -220, 435, 8, -201, 359, -77, -82, 683, 427, 48, 311, -189, -27, -167, -306, 229, -63, 50, 234, -368, -297, 168]
2399A68n50O17L11o49N53j25o26M45J86l88M01m48L15l3o34L92j58k87P91j63
2419A18m57P07n03k85M87k98J00O97o03L79m38j56K83l06J60J81j33j23K47l09
2439b52M9L36o19M16K04n82N94j94l21O00j37r7M54l91K17j22m24M46l31k06O18
2460B58l49l45M63l04k3K88l33L56J92k59L79L9m86K62k37K5L18m10J9L31n17
2481c33K03J08n36O05Rj74L23l45l02P35l54J05J37k90N30l66k94M53j74l91N43
2502A92l66N0L99n50K32J62k78K22q8kJ90k04J05M04k87j66L69n15M17j76k14
2523a04K17k37j47L58k92O9K50o18L01L54k89L00K31m57N01m27n7M92n35QM69
2544C87m95m5L56o32L70Q7m66L05l2J26K04o5K4Ok71J67L46l19M04l91k84L79
$$ y = [168, -382, 235, 546, -103, 450, 325, -301, 144, 330, -58, 343, -105, 210, 177, -457, -65, -223, -510, 281, 118, -339, 368, -135, -420, 67, -231, -131, 566, -37, 342, -96, -252, 31, -275, -115, 66, -67, -190, 57, -252, -203, 133, -486, -70, 134, -448, 146, -48, -369, 231, 94, -3, 451, 60, 277, 155, -269, 177, -154, -360, 258, -91, -436, 27, -277, -300, -12, -345, 11, 203, -56, 323, 362, -124, 138, -99, -74, 244, -166, -147, 184, -333, -130, -22, -558, 47, 56, -118, 205, -140, -442, 293, -61, 44, 181, -109, 421, 55, -239, 214, 40, -351, 192, -174, -124, 275, -275, -43, 119, -159, 63, -25, -27, 163, -41, 64, 468, 181, 15, 384, -131, 286, 110, -104, 113, -124, -271, 87, -205, -136, 114, -504, -203, 151, -138, 162, 393, -64, 437, 10, -47, 445, -90, -82, 387, -108, -153, 203, -429, -59, 28, -438, -133, -165, -39, 165, 100, 124, 130, -141, 26, 372, 53, 457, 66, -218, 161]
2566A61k02l8O1j0L0M4l18k5K45j02J55m7j6K87l69K88K62n13L55J35n32J6M89
2589C56o06K02J14k16Q2QJ74o3l59K20J41k33M24o8o0K54k92k86N67m83K15K82
2611C73l87k3J14l21J66j59p3L89j46j51M01k23j24N40o60L27K81m17M64k12k13
2632e4J09j22o5O5NN9J88n71K80J44m29M45l5o3L83l04j95N89m45L1K20o8j34
2655C3Q5k65K01k05q0K82l32L13j57O1N4J38k92L03R0l95L57k81J80j44P1p9K46
2678A84j90jK16l50K34m0l29M14k66k7J19Qk21L65j12N3Q3m6R4j32k2K24m83J41
2702h4K42m02J88K47m59J67o6P0P1k0l54O55l05J36J45l57M46k34Mq8J56l29J71
2725@j95k64N63l68J08K32l59K87L7l34L13J43j50J98J08k97O7j77J69J30k76
$$ y = [161, -41, -79, -18, -28, 2, 46, -272, -297, -52, -154, 1, -46, -62, 225, -144, 144, 406, -107, 248, 383, -149, -133, 356, -250, -48, 66, -150, -68, -60, 114, 51, -308, -88, 53, -180, 244, 176, 116, 370, 78, -208, 359, -124, 91, 373, -14, -37, 77, -244, -78, -237, -310, 79, -67, -218, 183, -40, -164, 376, -284, 43, 324, -93, 371, 159, -54, 55, -67, -132, -67, -62, -3, 185, -386, -106, 38, -391, 54, 19, -44, 339, 35, -160, 429, -16, 15, 235, 167, 33, 118, -147, 54, -151, -231, 51, -281, 32, -125, -64, -10, 128, -164, 139, 229, -166, 191, -90, 90, -54, 17, -62, 184, -6, -7, 209, -141, 93, 53, -276, 138, -128, -155, -36, -28, -249, 116, 4, 57, 140, 94, 188, 56, 34, 258, -225, -84, 158, -244, -56, 191, -268, -101, -167, -97, -26, -46, -400, 255, -50, 86, 231, -126, 320, 86, 90, 2, 158, -171, 0, -195, -459, 104, -264, -156, 76, -283, 4, 41, -293, 20, 163, 13, 211, 319, 22, 89, -88, 81, 211, -65]
2746f5O7J34m83L33j34j75L19rk44M34k51j1K18k34K27J5k67K97p7m1j5k66K72
2769D4K19k89j8J76m59K92j58M6J95k2m19O04j12L7K4m23L44K21o10L63j21j74
2791b40L62n1j80K05k3k59J64k13J86J70j89O9J58k67L93j03j84J60j14o1K25
2812B08k69O0L07l89J12j8o1J35j5j10O1j92J76J3j33J57K63l25J80J5j38J75
2834B12k23k83L67j61o7L54m49J66R2k57L78j21r0K59r7r3K08j54J12Oj33L1q7
2857c0k5J84j15j64J92o6j90L06k53K7K76m89M84j70j69L54p2n6J76k89qK19j49
2880b7O2j44j43K14p9p8N04m86j70O23m57J76J03j73O1K24j78K10l05j6J10j54
2902a23L0L22k81j37Q4p9K99k17Q3j6j12N3J97l14K32K07j44q8L98m78J82k19
$$ y = [-65, 2, 136, -347, -14, -148, -323, -4, -13, -257, 177, -74, -85, 133, -101, 126, 141, -126, 171, 94, 53, 38, -228, 44, 263, -26, -44, 132, -327, -35, -193, -147, 48, 26, -393, 211, 99, 136, 160, -263, 81, 302, -308, 55, -66, -240, 122, 71, -109, 96, 73, -186, -22, -235, -49, 121, -68, 1, 159, -108, 285, 182, -2, 158, 44, -17, 208, -61, -1, 306, -83, 29, 11, -50, 85, 70, -40, 21, -171, 5, 18, -115, 42, 305, -20, 160, 175, 37, 212, -11, -294, 73, -88, -155, 199, -250, -84, 8, -249, 129, 8, -82, 177, 80, -13, 195, 41, 153, 159, 26, 57, -30, -55, 129, 14, -150, 42, -24, -214, 92, -161, -134, 142, -347, 137, -33, -202, 152, 80, 24, 200, -89, -97, 122, -27, 35, -109, -252, -38, -117, -195, 309, -177, -347, 276, -181, -5, 98, -75, -14, 210, 32, 242, -63, -79, 31, -123, -93, 229, -52, -189, -105, -184, 115, -102, -19, -35, -147, -94, 103, -211, 21, 228, 84, -4, 394, -84, 98, -121]
2924a21Q0J08j06k02M20k94o9L49l46J71J03k69R8J80p6K62j35k15L8J9L6J89
2946B20k79J56m1l90L78j62L05m4k60J96j28K53l04J87k45O4K02k82L41r2j13
2967c8O5j07J61J19l98J74j15Q5L9Q6K1R2j25q6j20OO6kK7K53o7o8p8m2J11r8
2993c9j49O8K32l82L00J31m91K30J69k81K24M0k72L14j00J59j98j3PJ11j31p9
3015a50K74l10J76J17j70R4j57L4J68j45N0K0l04J26K23j87J25J30k39K22l13
3036b16K00o5N7j93K67r9J12l9n0J04L2k74K34j07o3Q7m1J43J06l24L8J17j21
3059i5R8k43L74k60J9Q0L3n6k39J10J56R8Nk6n0n0LK76j07n3k5m0R7j42q4K3q6
3086a84L9M48k57k2L5k37K18R1k65J87J20j58J34r7j98L36m01K87J0k69K34j52
$$ y = [-121, -41, 67, -39, -241, 179, -115, -184, 165, -181, -10, 93, -176, -78, 102, 26, 288, 153, -62, -24, -5, 31, 220, -59, 97, 56, -334, 44, -118, 187, 143, -117, 79, -49, 204, -100, 87, -158, -94, 108, -174, 167, 75, -38, 27, -80, 81, 200, -198, -24, -139, -54, -15, 71, 92, 184, 59, -27, -147, -141, -75, -77, -50, 203, 136, 68, -10, -52, 59, -39, -188, -120, 112, -270, 30, 161, -330, -100, 69, -212, 12, 52, -220, 94, -6, 153, -45, -58, -51, 60, -71, -150, 124, -186, -10, 107, -63, 31, -126, -92, 76, -69, -19, 1, -303, -177, 46, -141, -16, 114, -125, 97, -216, -16, -81, -24, -217, 50, -49, 63, 24, -26, 78, 110, -164, 70, -37, -100, -13, -54, 89, 195, -129, -91, 26, -95, 3, -240, 134, -126, -107, -27, 6, -50, -289, -179, -23, 75, 80, 54, 4, -46, -43, 233, 126, 73, 48, 8, 105, -37, -121, -98, -184, -145, 303, 46, 24, 59, -178, 40, 131, -134, 53, 173, 15, 149, 52, -146, 190, -211, 76, 86, -183, 51, -101]
3108a01O8K3m6m8Q9M6k38J90p4k6%m7L57m1l12L4J10N5N1j51r1L33j62m9J49k67
3134a48Q4J00r0K08j81o2J55k24J86l3j81J94K16m33L14k12j23K02M4p5M6J3j59
3157a59J99k27M26j32k74L97k06q1O4j7L5O8k03P6P5j61M64l10j64J7L78m35L80
3180B10k36J12J25j16K3l8o9K0r3j53K12n9K9K04j84O1R9l42J62r3m2K11K47m98
3204b08M41J9l71K27k39Q7Q9l11J85K4P5K02q8q8J9k22LL60l03q7L42l63J09J75
3228G7K6K0m1k46L54l18M2N4n0P1J18m08L98j20J33j30J14l70L76P4o0Q1q5n4
3252E6r4R2n3R5j76K28L9k96J90o1l1mk21M00r9o6Q0j51L2QO9k30L16j57kL30
3278B94m18L36j81k51J62m1O7K06k02k8J42o7j66L50k87J20K04l39J58M4j48K05
$$ y = [-101, -33, -10, -56, -104, -15, 31, -207, -17, -91, -117, -117, -164, 193, 152, -160, -126, -16, 39, 90, -61, -152, 181, 19, -30, 119, -148, -64, 36, -54, 154, -27, -89, 66, -158, 28, -5, -186, 8, 224, -209, 105, -107, -230, -28, 16, -59, -13, 0, -159, 40, -187, 239, 107, -167, 230, 24, -57, 7, -10, 25, 93, -110, -34, 41, -120, 344, 34, -130, -113, 265, -170, 210, -26, 86, 211, 95, 118, 80, 11, 31, -62, -215, -3, -62, -33, 171, -13, 48, 147, -195, -33, -126, -168, 43, 290, -208, 233, 252, -119, 108, -131, -44, 45, -266, -81, -57, 18, 220, 132, 44, 63, -159, -156, 204, -99, -186, 156, -207, -98, 77, 103, 123, 82, -164, 190, -128, -86, -32, -82, -11, 107, -301, 97, -23, 110, -20, 94, -276, 100, 174, 114, 195, 110, 56, -38, 54, 1, 96, -80, 148, 187, -109, 81, 20, -11, -15, -236, 164, 65, -1, 79, -72, -40, -32, 37, -193, 123, -34, -36, 294, -124, 212, 31, -220, -58, -99, -32, 174, -28, -56, 86, 19, -147, 203, -84, 36, 240, -99, 59, 103, -45, 160]
3300A60O9k89K95l33J09L5k73K70q2L3o3q0mJ52o9m1J23p8o2K00j60J1J95j51
3324c3J47q1m9n3j9L2m5J96l43L34m24L18P2k39L21k55oK01j69L98j77k51J08
3347a7K07l44L64k01K1q5j96K03o2O6o8K68m79L63j72J3J11J35j57K78q4m09K98
3370E3J5j41K77n05K1L91k57J29k7j68K46k0j82L35k32Q8J14k76O5M7l5K2L9J51
3394A50j63O5K5J66l21P9J55J2j56J08o5J35k84j7L41k37J88j24N8j04q3L9o0
3417i3P0m8J69m12J52L98m41J42J32J7m9k50K07p6J11M0r8j24J68K41j53o4K46
3440B85l42J64l32K16R1k09J80k11L83l55O1j2q8K68p0J10j20J4k47K05k71K96
3462A6p0JJ24L3K7j58p3Rp5k3K68j0k33J82j49J15j22J1j04J13J67k01J67j89
$$ y = [160, 229, -60, 235, -98, 11, 46, -227, 43, -39, -6, -69, -149, -153, -1, -70, -111, 12, -66, -128, 72, -88, -77, 118, -33, 114, 33, -16, -69, -88, -56, -101, 95, -248, 86, -338, -20, 52, -187, 134, -121, -127, 74, -95, 303, 126, -125, -17, 190, -154, 210, 9, 30, -55, -251, -48, -110, -44, -112, 156, -323, 40, -132, -119, -8, 127, -30, 248, 164, -245, 53, 68, -73, 204, -301, -280, 111, -146, -17, -44, -212, 34, 14, -168, 167, -65, 23, 137, -139, -74, -27, -62, -40, -1, 150, -13, 52, 77, 243, -78, 1, 156, 168, 12, 120, 55, 190, -94, -111, 230, -7, 181, 57, 115, 11, -72, -33, -93, -23, -71, 98, -314, -162, 236, -205, -63, 69, 86, 37, -213, -6, -82, 29, 69, -29, -153, 15, 256, 103, 39, 285, -57, 107, -225, -9, 82, -127, 53, -158, 225, -130, -69, -81, -169, 99, 29, 139, 19, 33, -214, -9, -280, 16, -54, -53, 71, 104, 131, -27, -100, -91, -166, -189, 79, 69, -164, 18, -131, -16, -138, -127, -231, -118, 49, -152, 15, -174]
3486a74K2R3o8R1n9O3J9j86L28j69K24l64K69mk0K5l45K15J39k33R1N3O8r2J28
3511A14j96J11k92J50P3OJ33L8L2j57M8K1Nj24J12l9n7j89P5j3L30l34m1L77q6
3536I7j58P9n5J61j86m5K99j60j14L16j40j56J08j44j0K16k60Q5q4l6K40j6j43
3559a06J83l0k10L19k16j6j67R8L14l03k28M45Qk62L15k73J38N0j50K25j06m7
3581a9l0K36j53P9k64K41J1j0oK11k92J53k34j9N0j49j32M09k9k26L0L02k52p7
3605a70K53J5j35nJ36j90m1M26o1k14j55J06j28K36J81k73Q2j09L4j7N2R1o5m4
3629EQ6j5L1j07N5M4j17K33o9k37j18J69j76L83k2k28J15J21o1j1j25QK20k22
3653c8q8K36k39J88q3P1k77R0K17k06J39j30K52k04L4q8O0J33O5n6P8k40L3L28
$$ y = [-174, -152, -59, -127, -36, -95, -32, -13, -199, 129, -40, 184, -180, 89, 85, 65, 90, -255, -40, 99, -134, -43, 10, 78, -14, 114, -82, 29, -263, -113, -40, -34, 99, 137, 169, 12, 60, 81, 86, -38, 74, 35, -22, -211, -136, -149, 181, -153, -194, 183, 97, -61, 18, -37, 124, -62, -107, 192, 32, -82, 234, 94, -62, 46, -98, -108, 108, -152, -67, -151, -187, 53, 37, -106, 77, 47, -163, 156, -60, -76, -243, -145, 169, -134, -362, 83, 91, -171, 144, -129, 9, 59, -91, 134, 28, -19, -49, 187, 34, 113, -151, 90, 101, 91, 85, 296, 4, 157, -77, -96, -46, -195, -327, 82, 53, -173, -143, 159, -93, -170, 83, 98, -37, -42, 94, -96, -137, 289, 228, 14, -141, -35, -163, 73, 254, -19, 63, -46, -12, -29, 23, 114, 49, 5, 91, 76, 107, 0, 55, 99, -18, 215, 146, -91, -209, -40, -216, 167, 145, -83, 32, 153, 92, 81, -44, -36, 184, -38, -126, 110, -129, 59, -24, 47, -230, -140, 77, -129, 10, -120, 132, -72, -38, -126, -66, 67, 132, 76, 154, -86, -53, 275]
3677B75j65j99K96k50J34J0l28L11Q3k82K6n1n4K34o2J51M0k22Q4J3l3J52j13
3700E0j10L0J44p6p6j06j06K54O1j08J20j43m4K60k48J54q6j49K95k8j11K45k97
3723g5J20J01k23J48k60K69j05r3K9J8RK3J6m3K07Mk66J45K03m00L12k47nL18
3747B05j15j28J50j76m3M1j21L47j68j42K05M1p3L6k61J13K04j60L7L4j16J45
3769E5J18l43J2J39L09j91k58O6K30k26J11J43r2j4o4k17M67k35j50L06k08k7
3791f9K20j45J33J28q3j71n0j00M9J44M7J20k12k0R2l40L23J99k49J20j4j35J11
3814I8m7k33j5J21K11k74m8J37Q9o7J80j75j0PJ16j1J61k68k1J04k2p2N7J10k13
3839h5J09n6J8o1J7J45j59J9J23n6J23J44m67M43j53j74J58k09N6J61j99K06k31
$$ y = [275, 110, -89, 207, -43, 91, 101, -227, 84, 167, -115, -89, -140, -194, 40, -22, 129, 169, -53, 31, 44, 11, 163, 50, -60, -30, 114, 38, -38, -144, -250, 4, 65, -43, 77, -66, -110, 150, -98, 56, -30, -179, 116, 88, -23, 222, -75, 45, 146, -77, 71, -189, 80, -25, -118, -89, -71, -62, -39, -23, -66, 141, 145, -121, 24, 227, -173, 139, -108, -113, 205, 90, -38, 112, -64, -107, -66, -187, 160, -8, -150, 55, 96, 23, 59, -202, -89, 115, -45, -8, 26, -90, 55, 173, -170, -158, -19, 290, 99, -159, -93, 137, -89, 22, 165, 73, 59, -5, -222, 245, 10, -140, 166, -42, -69, 151, 6, 139, 267, 184, 13, -37, -137, -88, 56, 103, 223, 11, -9, 83, -257, 66, 265, 16, 136, 122, -13, 98, 51, -182, -197, -76, 135, -139, -187, -50, 39, -28, 152, -23, -33, -26, 90, 79, 240, -28, -49, 55, 33, -39, 18, 128, -85, 24, -32, -14, -75, -58, 87, -72, -53, 70, 14, 137, 281, -186, 257, 104, -70, 88, -121, -65, 96, -103, 103, -128]
3862a28P4Kk7O3j08J30k33K73j17J30O7l36L31o9k41J80J10j06J88l19J88j11
3884e9j1l0K98n53M75K5j96n9J81j1K0q3J68j64O2M4P2k17J35k8k55K85q7l6J06
3909H2j11Mkj40K04j0j98J88q0j2K21j82K6pj59K61pl3k9M8k62K41o5j42J65J26
3935A27k87J29j49L11j72q4L65q5q3K1k62K26k14K09q2O2j53L1J37k9k90K27O
3958c9j02N0k1K11l50K22j22P2L21k60j70L65k80L3l9Q6l02M61r6j92K75k27J93
3981H9j26j7j20J27J10J03k65K4N1p8N9J55m8j75K06j79K2P6O3j36O8M1J1k87
4005b26M20K9m14K37L4o2L4n5k19K62p5J1K40j40j51K96k83P2J9k0K6j40j6K68
4029A47k75J61m4j82J08L44k35K44m15L38k35m6J14P8j34O9M6m56N66j31j82J82
$$ y = [-128, -54, -52, -79, -16, -124, 6, -227, 46, -71, 59, 126, -210, 121, 52, -189, -9, 101, -5, 183, -136, 52, -59, -70, -100, 198, -355, 120, 145, -51, -110, 71, 60, 80, -3, 165, 1, 63, 107, 179, -38, 97, 69, -186, 99, 12, -24, 82, -29, -25, -27, -167, 37, 27, -171, 17, -63, -75, 146, -36, -10, -17, -176, 85, 78, 45, 16, 64, -198, 43, -22, -164, 1, 127, -160, -31, -180, 131, -41, -125, 240, 155, 72, 93, -169, 57, -157, 52, -30, 32, -121, -90, 47, 18, -272, -45, -39, -141, -91, -112, 99, -251, -29, -151, -79, 242, -18, -188, 177, -103, -70, -109, -23, -325, 136, 40, -152, 123, -104, 89, -37, -54, -174, -47, 63, 166, -99, -75, -24, -102, -43, 112, 64, -111, 95, -84, -62, 14, 77, -59, 9, 50, 61, -226, 194, 223, -191, 46, 80, 18, 52, -3, -222, 40, -35, -24, 216, 76, -75, 221, -62, 10, 29, 9, 35, -105, -121, 147, -128, 33, -11, -193, -85, 259, 24, 268, -147, 191, -44, -90, 24, 102, -32, 37, 83, -373, 193, 62, -120, 62]
4051F2m0Jnk7J30J54l63R9J03k49Q3O6l24N53m58PL61m88M56l3r5m4J58k10K55
4076A52m0k96M80k13K5l38nQ5K61j60J40M6l42K70j54m0K43o4j20P3p8J83k3k13
4100a28J32J9j41K25q2j1K51m08K51j68j6m0j02J27J49M3k64K99k48n4M73n05
4122a98J70J18l0j2K93j92l8j17j70J29Q2j37K83j24j89K1J70q5K6m4l6J90r7
4145A3P5j94O0J17j31j52L04j50N1l1j40K26J9O7m6L3J2J15m44J99L4j44J82L8
4169A13j20L7l8kJ51k05K6L3n1J07Q1k10r1K8kL25k89J74J08k42m2N5L59k96J96
4194B05k31K33j65j64K24L3l15L94l39l8L29l70L10j39lR1M4o2K75q7o8j35q1
4217e9J03K7j35K2j64K63j38r7p6J78k75M31j06J7n7J80l10L70k48J85r2n1j4
$$ y = [62, 22, 23, 18, -9, 121, 275, -88, 11, 114, -135, -52, 14, -310, 243, -215, -208, 153, -335, 121, 88, -7, -51, 107, -103, 152, 112, -184, 296, 83, 108, -230, -235, -150, 111, -49, 91, 137, -205, 65, -89, -129, 114, 50, -70, 3, -75, 108, 85, -128, 4, 23, -118, 107, 25, 14, 265, -143, 108, -60, -76, -116, -218, -91, 58, 101, -163, 136, -112, -166, 307, -198, -28, 90, 60, 48, 341, 149, 111, -6, -176, -47, 35, -102, 181, 57, -132, -111, 59, -26, 0, -44, -80, 110, 13, 88, -106, -46, 71, -60, -212, 92, -58, -7, -38, -178, 48, 67, 134, 88, 121, 133, 248, -196, 3, 37, -107, 75, 113, -7, 30, -8, -10, 141, -64, -38, -5, -56, 51, 132, -78, -169, -141, -143, 182, -107, 67, 175, -67, -109, -54, 305, 9, 205, -26, 207, 42, -122, 102, 135, -180, 214, -125, -163, 166, -204, 106, -33, -36, 55, 99, 37, 312, 225, 157, 22, -59, 44, 71, -64, -42, -206, 57, -81, -178, -254, -76, -351, 80, -26, -9, -66, 114, -196, 174, -74, 111, 19, -32, -46]
4240d6O6p1o6k1Q5K83k64j23K7R3J07K22n80J97J56k22K86L4j94J41N0k49K62
4263A73k24q3J12l2J7Qr2K07n6k00K6J74K5L19n89L07J58m7k05J95k81Q6L8j15
4287g9j13K49J2j14Q2l36K78j61J40J25j62r7K63k58P7J94k83M13l17L04j80j49
4309a12K19k30R9K67k92k3j0K0P5J93j61l8J3j69K87L0l67Q7J53J76j1j17m7j81
4333a39j21o0L22o3J10p2j18K4K87j30J64j17J1N1j14j8k96J00K04J03j61J58
4355A25j97k6k14K63l4J55k59L5L69j92M1N7k50K55j70q8K83j82K9mK9n7K18k13
4379b7N5j90J92j62J16j22J06J20j64L29k02Kj51O1P4M5j80J77Nk40K72q6k20
4402a90L05l65n4M41j55N1L2j22J83j02J26j02J19j80J99k08P7k37J36K19l65
$$ y = [-46, 20, -51, -117, -138, -53, 230, -34, -157, -130, -37, 70, 292, -288, -91, 65, -157, 129, 163, -31, 110, 160, -89, 173, -51, -134, -22, -54, -37, -29, -121, 86, 30, -170, -144, 30, 55, 374, -215, 92, 250, 203, -2, 193, -88, -2, 36, -79, -192, 57, 69, -45, 37, -299, -21, -182, -42, 83, -79, -176, 87, -171, -94, 100, -183, 230, -87, 217, 37, -112, 107, -123, -24, 243, -49, -72, -82, -62, 13, 206, 45, 7, 20, -149, 138, 168, -199, -112, 41, 217, 206, 89, 42, -139, -260, -320, 2, -61, 49, -23, -141, -117, 170, 40, 204, 87, 98, 149, 35, 17, -279, -179, 25, 128, -33, 125, -72, -98, -312, -49, -83, 72, -187, -152, 217, 25, 66, 123, -127, 128, -42, -130, 153, -29, 0, -4, 25, -32, 186, -27, 28, -162, 30, -132, -16, -138, -32, 88, -76, 253, 51, 53, -98, -37, 37, 82, -98, 79, 84, -156, 116, 30, -190, 115, -250, -304, 137, -18, 33, 65, -57, 126, 24, 150, 48, 167, -13, 186, -22, 55, -182, -46, 173, -192]
4423a92M6J70n0o6O7Q3j16q1k9J96P4k41L49k49J55k9j92P8O8o6Q3n9q8Q1j87
4448a95P1P7J2j6K10k43K28k44K27r3M9r6JO1j54K6J44j14L61n61J29K83k28M5
4472b0N4j31K48j26j82K07L8o1J44l53J77J91l58J65R4m5J0l11K32M9l21J80J76
4495E7k33K40j71J99O4j66k0Q1l8k89N91k56J00k64K38k28K84j53L3r7j42L23
4517A53j67J1K46J8k78L42l14k4P1m9Q4n8j9l4j04K53k22l6K80J33l06K9j11j68
4541b70L03k0J14J85l25r3K9J04j28J62j67P0J20j19L7j50J27K24k71N5j07Op5
4564a89K15l6o5K22j46L6q6L55K9l56J63m3j11j21R1j64J75j24j6J10L8j3R9q2
4588a9Ql7K50M2k35j6L6J2j21L24k32J08oj08j18J0L5J30N7j30r8J29R2n4r6j56
$$ y = [-192, -146, 24, -26, -92, -25, 58, -58, -139, -168, 28, 102, -139, 210, -39, 116, 87, -105, -27, 41, -25, 58, -1, -89, -8, -195, -124, -47, -35, -51, 159, -84, 144, -100, 127, 34, 83, -13, -12, 49, -105, -79, 65, -49, 312, -249, -120, 163, -65, -20, 34, -97, 151, 25, -157, 50, 88, 27, 171, -182, -5, 186, -172, -7, 87, 42, 52, -259, -27, 22, -299, -119, 57, -176, 64, -107, 92, 156, -10, -30, 51, 13, -276, 315, 59, 159, -105, 133, -95, 189, 36, 69, -28, -170, 153, -14, -3, 243, 261, -17, 325, 11, -13, 58, 9, 93, 35, 16, -18, -122, 131, -91, -127, 153, 286, -20, 9, -102, -270, 33, 13, 127, 312, -13, -106, -77, 27, -101, 61, -106, -36, 84, -35, 2, -148, -21, 203, -68, -13, -120, -114, -189, 26, -10, -75, 147, 1, 37, -49, 306, 335, -21, 142, 99, -12, -133, -42, -206, -31, -155, -171, -61, -23, -36, 63, -19, -11, -48, 202, 244, 9, -7, 29, 41, -80, 244, 12, 120, 114, 6, -112, -102, -67, 63, 120, -10, -108, 21, 113, 59, -37, -193]
4614a93J86Q3k07j38L7L40j08k8P9j02j41J2L09j39J79j69J2P0o2P9j19l8KJ66
4638A10m45L93n8J36K3j84j74O4J93Rk26o5L3J56mn7R7l2JQ0R7j25R2j88J96N8
4664A80k71J08k3J3p0M0j7M2M3k89J47JK29o3q2q3J46R6j09J23j09j73K61j83
4688d3R2J55m12K51q7j68K75k04%K25k61J68J68l3k63L10p2j43j82O9J00J21n1
4711A5m6J06p5k4l2J8P2m4j5K24k90K38l46J57O5n3p5q7L92p3k18J99j24J76l86
4736b26K31l5j47L69l20j32M76j21M4j53R0j2J15j25o6K0q6K44m5j27j5P9j86
4759a28K07k90R6L3j7K14j81J09Q2k28J01K90o31R8K36R1j6j12Q7ln4k2K28k12
4783b2J46p7j87J85r1k7J49n7RM8M0j42N2j8L1L2k20J59J67k01o3M0j58Q3J60
$$ y = [-193, -7, 76, -131, -269, -232, 108, 0, -28, 51, -51, -192, -180, 129, -10, 169, 0, 12, 82, 20, 99, -20, -58, -56, 110, -335, 58, 0, 136, 159, -25, -199, -135, 58, 67, -159, -224, -191, -35, -39, -96, 1, -31, -30, 50, 147, 22, 114, -74, 122, 180, -91, 17, -6, 7, -63, -23, -40, 2, 45, -244, -97, -96, 133, 70, -12, -95, 51, 147, 38, 161, 52, -121, 140, -43, 49, 204, -208, 43, -44, -212, 63, -141, -141, 84, -177, -9, 159, 126, -137, 173, 101, -42, -224, -155, -55, 66, 15, -31, 75, 0, -24, -56, -38, 34, -10, -25, 199, -91, 147, -199, -42, 23, -30, -105, -192, 200, 127, -91, 108, -16, 160, -226, 5, -30, -177, 192, -128, -260, 216, 95, 139, -14, 76, 64, 179, 54, -12, 8, -78, 166, 121, -6, -21, 58, -128, 79, -211, -115, -82, -99, 115, -66, 43, 125, -103, -2, 288, -343, -245, -9, 82, 66, -46, 41, 38, -16, -38, 190, -22, 124, 47, -140, 45, -46, -73, 76, 19, 28, 76, 116, -26, 26, 8, 39, 71, -149, 10, 177, -24, -87, -47, -205, -122, 38]
4808C8k0J97k25J36J09k44j21K11L7n0o7J57pk04J67n0r9j50J60O2k72Q0O2P2
4832b1q3M2j14K43k3J5O3r1O9k48J6J18j37K71k10J96p3kK5ok42J90J9l04L02
4857A5j52K52k58K08j95K16p1L3j8j12L02k16J70j31j32q1K26l1K1j51l6K72k49
4880a18K45l02K45j40K84j03p4J37o3j24J63j88j19J94k51J85l9Q4N6k73J55N8
4902A2qk6NP6J08q9j21m8L0j41M7P2p7R4j21L42j00r1qJ71m0l0K12k90K62k77
4928c6J41j3r3J04j01J23j66J67k5r2J59j54j10o1nN4j1J49j23N2p2j4M5l3J70
4953E5p2k30J66O1K29k61M0o6j2K8q4K9J09o9m6K05j98K87j88j38K75j46o8L39
4977B45m24J40Q6k34J18k28L30k65J14m8K11J31j84R4k62L3j17P2J48L62m24J69
$$ y = [38, 18, 215, -10, 126, 235, -9, -130, 81, 118, 68, 1, 158, 151, -53, 114, 64, -35, -185, -25, 37, -235, -155, -93, -21, -104, -62, -176, 67, 44, 59, 122, 31, 100, -148, -132, -14, -151, 120, -90, 106, 33, 31, 56, 50, -192, -2, 17, -287, 15, -137, 115, -143, 65, -130, 86, 15, 48, 30, -82, 220, 4, 174, 43, -89, -170, 56, 25, 46, -105, -141, 131, -118, 127, -175, 70, -70, 214, 111, 37, 174, 111, -13, 150, -38, -157, 37, -214, -29, -68, 16, 72, -201, -46, 12, 4, -22, -17, 59, 167, 78, -43, -91, -61, -202, -155, -83, -160, -66, -187, 155, 55, -36, -44, 127, 87, 57, 269, -21, 241, -36, 105, 92, -1, 103, 2, 125, -41, 126, 101, 9, 168, 14, -96, -157, -162, -108, -119, 30, -93, -41, -113, -127, -82, -115, 55, -17, -247, -81, -20, 209, -52, -12, -78, -90, -62, -146, -117, -8, -77, -123, 82, -116, 171, -17, -155, 120, -26, -94, 245, -179, -39, 47, -187, -69, -297, 33, -232, -118, -166, 45, 176, -8, 86, -176, -143, -260, -188, -40, 322, -102, 67]
4999F7Mj14K25q5k17J67m6l3J8J80l49j6L61k86K29r6n4P3j01M7K2m7J60j80P9
5024Hm6R1j47P3MQ4j07J4o2p7K56n0R0j9Pr9k9r7J05j02M4J13j01L4jK18j43J83
5052B44j41j31k31K82J95j71j74QJ7J12k62L58j38r9K42Q8j41oJ8L9j03j94L22
5075A34l50L16j99L2P8j75L07j67j62J26J89L9m9k21J7J96P0l09K62J17p9r8k29
5098a55K74k7j30p1K51k30R5J07k1m5k30L31N0j43N8j03r6l8K25j27M5j9q8K13
5122A26j42l7M4J68m8j57qJ19n2N6o1l2J24j2J9j47J27j19j3J14j08j02Q0J30
5146F9q1j26K6J64n5j54K48l43K18L40k71k1O3j18N9Q6l00J2k7K42K00l65K91
5169A57O6k47K6K2po3o5J47p1J48J3j37lJ36Q0k64j6j1K5J35j77J68R9k32J18
$$ y = [67, 71, -43, 182, 97, -120, 47, 1, -32, -14, 166, -183, -199, 162, -124, 105, 9, -45, 28, -73, -26, -4, -51, 109, -71, 8, -38, 53, -94, -21, -17, 67, -40, -26, -88, -165, 91, 41, 131, 112, 119, 20, -9, -106, -1, -103, -59, 54, -47, -13, -14, 204, 61, 244, 103, -28, -259, 23, 218, 47, -127, -119, -102, 10, -252, 106, -32, -131, 111, 199, 58, 52, 70, 109, 6, -188, 134, -216, 100, -99, -67, 11, -164, 143, -24, -186, -60, 129, 168, 119, -102, -85, 111, 181, -128, 134, 251, 172, 74, -155, 119, 92, -38, -109, 142, -88, 7, 114, 93, 48, -182, 149, 199, 56, 114, 11, -85, -123, 102, -25, 20, 1, -87, 126, -16, -53, -9, 159, 111, -46, -54, 65, 13, 69, 8, -24, 100, 88, 107, -40, 87, -32, -45, 69, -39, -141, -61, 69, -12, -138, -112, 52, -3, -157, 91, -252, -34, 306, 35, 14, 77, -41, 18, 104, -196, -184, -211, 31, 231, -134, 157, 223, -24, 2, 24, 17, -46, -111, 36, -35, 113, 126, -11, -14, 122, 202, -62, -78, -89, -64, 71, -106, 62, 161, -71, 47]
5194D7L1J2L6j15L0k6K6j76K05k31Q9J1o7kJ74l0Q3N4j04j00J57j38K10j22n5
5219aJ85k11J36q4J42j90r6R2q8Q1M1R7p3r5QK8R6j22N9L3j13J61rm7k9O6K4L4
5247A25K81l16o9Q2L4p9j5J33j11k7j80K10q2k4J68m43K95J07k51K96k65PQ8J31
5271I5j19M2m8J57l4M0j72P5J48j77M7Q5J03j60j08n2J27K0K3k02J57j07r9P2
5295h7J50L4j28M2J2j22L3q8J15k7J20p7k8J58j32J37J6j81J03o9o8R1j14K2j3
5320a01j03K35N8k89R3P4o9R9Nj59L93k15R3r4j26K45j37r8NL7J06K9n3j42L05
5345A91j87j34J07k00K58j68M1nK8K9n8K30k12J0J0L7K99l36L4K16l72p5J35J51
5369B9j0k31L88j03j07j08J61j01J2J23l9J20l9P4j29j70J05J62k31K50k6j40
$$ y = [47, 78, 90, 126, 11, 41, 15, 41, -135, 70, -161, -72, -61, -128, -130, 44, 14, 97, 151, 47, -53, 104, -34, 176, 54, -1, 184, -27, 109, 25, 167, -23, -119, -27, -115, -34, 7, 104, 31, -64, -56, -28, 68, -54, 5, 38, -75, 86, 77, 30, 1, 67, 91, 125, 406, 90, 21, 103, 137, 58, 43, 176, 65, 38, -142, 68, -14, -38, 130, -313, -18, 89, -162, 134, -131, -124, -36, 95, -24, 18, -30, 127, 93, 133, -39, 36, 184, 7, 54, 139, 242, 82, -26, -78, 49, 69, 92, -110, 47, -60, -159, -87, 63, 97, -31, 11, 23, -99, -66, -154, -39, -66, 54, -23, -51, 107, -25, 112, 128, -53, 50, -19, -87, 4, -110, -88, -101, -204, 31, 89, -200, -107, -33, -102, -3, 2, -157, 236, 21, 114, 20, -106, 139, 2, -96, -91, -54, 52, 81, 28, -114, 191, 4, -130, -23, -223, 35, -133, -92, -97, -69, -40, -98, 132, -80, -70, -60, -23, 276, -60, -26, 190, -182, -257, -122, 29, 19, -212, 176, 73, -34, -142, 19, -82, -70, 53, 14, 134, 95, 169, 40, -130, -25, 137, -94, 156, 130, -10]
5391a0m9J68l3j86R8M7n9N2j70n4J97k0J04qn4n7r7K60o7k61M36l15l2K8J42j50
5417i0J60K1j29o0k3K53l61%K29q0J23P0j95j39L53m4M9j51%N4P5p5K32l77J8
5442h7L4n6K06m9Om6L5k10K91n0j48R0k0l0j8QO4j33j2J60R7k26jJ89J5Q3k5j15
5470E2r9j6O9P2j63R2L4m2J23l35K89K64l32m04L40K57k05j24nK21j61r8L31j41
5494A9j26J9k70M03J59k12J02k47K39j50J47k70J92K5J02p4j26o6P7R9J0j36K7
5517e7J3P2k08K47l4j41K63R8l94J60j78K14j46J51j66L35k47p5J42N3j3n0L0
5540F9p0P9lJ42l55j04K34M0Q3j10MJ51j39K4O9j98J84L2O6n4j70K7Qj81J13J19
5566F0Jp6j34P9J05J2p4L8k2N5r2k22J91qK08k39K3J66j6R6k22K23o6m7q2K52
$$ y = [-10, -59, 109, 76, -110, -12, 35, -24, 28, -142, -196, 1, -19, 85, 77, 23, -34, -131, 129, 62, -199, 237, -78, -110, -82, 60, -90, 70, 91, -38, -98, -121, 132, -229, -229, 0, -80, 43, 113, -82, -221, 132, 88, 137, -14, -14, 40, 115, 40, 272, -105, -87, -53, -109, 97, 48, 54, 8, 43, -167, 124, 74, -74, 16, -4, -34, -52, -44, 20, -113, -125, 35, 132, -94, -95, 94, 109, 192, 167, 52, -47, -63, 6, 78, -85, 7, 41, -1, 122, -213, 76, 340, 8, -396, -56, 201, -4, -128, -133, 88, -73, -171, 160, 19, -107, -88, -358, 45, 204, -8, 94, -153, 86, -64, 83, -187, 5, 30, 132, 58, -68, -134, -57, 42, 52, -84, -57, -44, 28, -180, 67, 33, -108, 155, 253, -141, 19, -159, 55, -91, 60, -106, 229, -18, -93, 49, 102, 89, 39, 69, -1, 78, 75, 217, -138, -242, -8, 32, 115, 5, 9, 160, 21, 45, 114, -84, 100, 132, 198, 144, -26, 1, 9, -172, -59, 60, 61, -15, -149, -70, 35, 47, -27, 11, -11, 44, -48, -270, -79, -87, 121, -118, -95, 71, 55, 151, -71, 152, 86, 39, -43, 209]
5592B09k71K49k72L84k55o5k2l0J81j61P1k10K05r4Q4op8K8J22k43L29k82J63
5615C6J73k2j37J2q1K52l5j55p5P1n1J44k35K39j88o5Q3no0P5K1m1L8j53Q5k2
5641i6Q7j06N0J18k57J06K55l25J35l1j1J31J59k36q5J98K5j41P9jj01J48l78
5664b77k4L54m14M58j86J29j82N3J09J44n0n8Q1j68KJ3J3k8J68j26l5J17k49J64
5688HrM5k01L37j66M6k96J42J10K2J16j79M0q6J68j31J00j46J06N9n4O5j40M6
5712Bj02K20q2J20j51m6P6j83J54l41M24q2j6J12P2k12J49k10J04n7M0N1o5j89
5736b12P5K56j31J48k50J25j04O7n3N3P4l4K4R1j50l9mP5k28J97P8j64J4Q0n7
5761f9r5L31k31K43m59M08k9p2j46K7P1J35l53K36l1nP5n9R4j59k8O5o6J55j12
$$ y = [209, -62, 187, -85, 299, 44, -21, -43, -73, 108, -53, 18, -192, 13, -81, 3, -3, -81, -53, 69, -174, 155, -127, 36, 209, 187, 50, 62, -19, 233, 198, 43, -32, 39, -12, 132, -103, 136, -52, -117, -34, -39, -99, -24, -3, -44, -6, -159, -74, -96, -9, -115, -65, 53, -204, -98, 157, -168, -33, -64, -75, 56, 215, -21, -106, 92, 117, -24, 55, 54, -47, 101, -277, -301, 53, -361, 97, -89, 40, -142, -89, 20, 164, 114, 56, 137, -31, -29, -16, -3, -31, 137, 11, -24, 93, -156, 8, -1, 44, -157, 180, 14, 60, -236, -94, 16, 38, 154, -25, 15, -71, 97, -34, 66, -80, 26, 85, 31, 96, -44, 2, -100, 120, 38, 158, 7, -39, 37, -146, 8, -333, 91, 9, -7, 105, 177, -35, 114, -96, 8, -49, -9, 42, -23, -212, -137, 119, -12, 136, -114, 11, -93, -26, -79, -26, 48, 14, 38, 129, -21, -60, -64, 11, -217, -20, 58, -106, -92, -12, -69, -164, 167, -64, 179, -280, 128, 99, 27, -119, -92, -21, 114, -239, -3, -34, -39, 36, -23, 71, -88, -116, -51, -117, 38, -74]
5786g4j5J65j72Q6J40P1j35l66M12k58J96l7l0r0K43j67j8M5K04k07j24R4J07
5809G0p2K2n4m2q7R2J02m5k4l8J65k33J44Q4k72K29O8q4n0n9Q5j84K28J04j07
5834D2O6j52K9o7Q2K07k09j36O8L4n5p4J30J44o3K5j26r2j8K72l7Q2k03J35j50
5859f6N6K7J31m5ll92J41J50k5j6P1J65k9k63L21k87J99J18k83k30N75m19K18
5882A14j15r9Q8P8k69J58J22l08L81k27K33j19n9j52Q7M27l23l1j1J62K6k73J79
5905F9r4j00K92j20k19k0K6J54K15m15L6L30k35N7j91J39j15K63j39M5j97J95
5927b4J20k4j0j28J80o8j5p1m4K05m5J9l10J52J74Jj12r5J58k02J71k01J44J01
5951G6n2O9N8j95m6L1J15j21j70rM18m9m6o2L8p9J04k54%K47j53R9q6J15N0l54
$$ y = [-74, -89, 76, -96, -10, 130, 201, 66, -300, 112, -146, 50, 13, -17, -107, 136, -31, -49, -4, 200, -7, -131, -37, 70, -2, 20, -34, -76, -163, -71, 31, -14, -38, -76, 89, -144, 0, 84, -188, 41, 109, 25, -25, -84, 1, -183, 45, 149, 42, 108, -44, -15, -82, 0, 207, -2, -138, -70, -36, -91, -165, -35, 109, 46, 71, -55, -147, -165, 107, 70, 152, -51, 84, -66, -10, 17, 148, 103, 100, -292, -151, -1, -26, -42, 29, 194, 165, -98, 223, -64, 135, 253, -30, -260, 315, -104, 114, -1, -100, -12, 66, -203, -45, 77, -231, 150, -77, 156, 37, -22, -174, -87, 340, 17, -14, -25, 137, 163, -110, 69, -25, -125, 167, 47, -172, -192, -166, -12, 203, -212, -176, 154, -81, -24, -215, -76, -191, 72, -67, -22, -219, -24, 96, 72, 62, -66, 114, 46, 31, -40, -84, 121, 76, 95, -215, -63, 111, 112, 0, -95, 63, -139, 32, -169, -25, 76, 24, 93, 151, -44, -90, -59, 56, -65, -235, -244, 174, 125, 79, 17, 55, -24, 80, -174, -174, 73, -80, 19, -67, 48, 98, -256]
5977b56K89j66J44o2R7n5j5n0m1K95o8j07j34J59k55K94k71K06J5q5j58L67q0
6000F3j16J25k36R6l1K05k63M5QJ44j98J72m1l8J48j24j91L19o6j83K27n7o3K12
6024A57k70m6M8L5J61o3j83L36k39k5q5K73r1j47J65q4K1J23j3k55K04J5j14K21
6048A44k10R3j99L80k16p0m9O4l4j5M1J19m9p2o8K10k2j62L39k21J14r4LK0lo2
6074a9J35J2j59j65K20r0o8L06r0j23J33o9Q1j09J73j27j14K56l93L27k96q5J22
6097a42P1J38k4j84K95l28J07J45j21J67k05J67j86J71r4Q9M9l00K34j84J4Jj31
6120b51K65Q1l59N0J07J25K8n6J24l29J32J73r8P4J10k91J74j25k8J30jJ0j33
6143h8J33j69j9J28J3p6n1J2q2J99j42pn1J84j98J77j01O4j30K90j28J79j66J
$$ y = [-256, 33, -133, 11, -51, 46, -9, -24, -74, -115, 180, 112, 5, -129, 30, -225, 69, -202, 4, 19, -66, -224, 143, 63, -53, 72, -164, -68, -99, 106, -157, -112, -104, 40, -158, 14, -27, -65, 83, -41, -232, 87, 21, -162, 65, 8, -55, 157, -113, -159, -111, -76, 85, 22, -161, 175, -64, -89, -174, 99, 8, -139, 26, -58, -37, 86, 73, -182, 22, 37, -77, 144, -66, 27, -172, 208, -8, -78, -127, -63, -97, -112, -71, 48, -1, -73, -141, 69, 47, -115, 224, 3, 117, 23, 26, 46, 43, -19, 116, 128, -31, -196, 24, -66, -134, 172, 82, -41, 92, 23, 104, -5, 168, 41, -73, 183, -210, 117, -179, -264, -142, -71, 67, 43, -141, 154, -174, -67, 78, -43, 124, -81, 86, -100, 71, -23, 66, 115, -185, 49, -135, -121, -120, -251, 14, 95, -264, -214, -107, 18, 46, -10, 114, -215, -83, 90, -8, 66, 176, -115, 59, -66, -94, 36, 35, 45, -88, 45, -124, -143, -15, -2, -78, -129, -117, -199, 0, -142, -149, -200, -16, -214, -37, -138, -74, -204, 86, -42, 137, -29, -28]
6167b8L1J03k40J98o3K5jJ0K2p9R2j72R0J47k77L25L3j59K3j55j7p9L13o1k30
6192a49L47j20j16o3K75k38p1o3J6J41j92J20J80n0J9J09k41p5J12m7R4K4r6J27
6216D3r5o9J64J33j59o0M5j8J75n6j00K0j03J80k21J6j16p3K34L8mJ29j67J37
6240G3m1O1j94K3Pl8J17L3J50q5k08O8J14l6nk09MJ99N0j4j8l4k19J99j59K81
6266A19k92L20j29n6m5J3N4l9k0j31L20o5J27j72j03j5K84r2N2j21J86l07J54
6289D2q1M4p1J00p3J39o6j68J72l13K97k3J03j18k32K58k18J11N4l0j9K18qj71
6313e3J38k32N2L8J18k50J11k3J81j88m8K92j11K8l8j09%J72m2K10l20J24qLq0
6338c5R7o5l06O56m00q8O1R0l5p3K80k00J19J7k5j57J60q9j43Q6k1M2J17q0%P2
$$ y = [-28, 3, 106, -134, 64, 1, 26, 25, 35, 57, -22, 70, -102, -12, 135, -142, 183, 216, 57, 80, -75, -92, -171, 142, 81, -149, 198, 78, -38, -101, 174, -64, -135, -198, -182, -41, -233, -113, 67, 17, 36, 145, -96, -171, -59, -106, -12, 12, -84, 43, -52, -121, 43, 176, 17, -43, 2, -16, 159, 103, 3, 23, -80, 100, -121, -105, -221, -294, -60, -22, -26, 103, -64, 73, 32, 93, -101, -78, -71, -109, 8, 41, 191, 106, -102, -34, 80, 44, 39, -170, -166, 33, 83, 69, 51, 17, -202, -3, -162, 119, -173, 147, 18, -38, -83, -70, -16, -55, -75, -206, 114, 49, 176, 4, -99, -114, 170, 78, 130, 9, 195, -112, 42, -39, 5, -66, 34, -39, 100, 34, -134, 38, -275, 22, -1, 102, -16, -248, 10, -208, -97, -43, -73, -92, 126, 118, -53, 85, -147, -95, -57, 61, -189, -78, -101, 80, -108, -156, 136, 25, 53, 15, -94, -94, 78, 36, 246, -74, 50, 42, 45, -35, 62, -3, -309, 347, -53, -141, -80, 10, -25, -98, 182, -18, 101, 118, 93, -64, 96, 7, -136, -50, -71, -29, 88, 8, 8, 80]
6364H0Or6n9J3L7O7k81J23K25j25N4n5R8k07Q3n9K03j98R8J15q5j49k9L20j91
6389a2L0J36j83K22m9o1J06k36q4k1R9L7R4k7%pj9j5k2k07L15M8k65J08K1j07
6415i9j37K08N9n4J22j42j22Q5J30J7j38J65n1qQ8m09M02r1l5P7J62k67m4J63
6439H1l9J34j64J3M3M3l8K5j82j06K72k08P5l0K4%p0K96m0l5r1r7J81l21L14n0
6465C0l6K04k60J60p1n2rj64L44N4k09j3O1j29P9P3p2K33k82j2K28k31j07L34
6489A53q7l1J41k78K6j39K06J14k37K15k7p3q7J55m0j6j27L40N9l77J38q4J94
6512A38j24qq2j17J34J64j15o7m8J66N3j43J44j24m8R2r7L2Pk4R1j0k8Rl3j68
6538b06K65r5j27J78l9M9m9m5J69m04M17j99j71K91j78K99j96J31k37J29J37k86
$$ y = [80, 86, -10, -69, -56, -19, 48, -233, -110, 115, -10, 44, -11, 87, -120, -37, -96, 107, -91, 7, 122, 37, -112, -141, 179, -12, 18, 154, -29, 193, 144, 83, 189, -47, -131, -152, -53, -16, 78, 51, 51, 44, 25, 10, -12, -219, 96, 144, -121, -13, 8, -99, -236, -28, 31, -23, 99, -43, -165, -80, 50, 67, -71, 94, 43, 35, 123, -286, 116, 25, -10, 67, 229, -38, -82, 81, 42, 176, 12, 25, 68, 111, 73, 98, -84, -190, 82, -126, -51, -81, -57, -57, -127, 169, 129, 94, 3, -94, 87, -234, 80, 30, -6, 198, -62, 98, 27, -25, -34, -198, 146, 200, -9, -22, 39, -90, -11, 62, -10, 223, -59, -71, 157, -74, -181, 153, 66, 35, 176, -102, -76, -215, -9, 105, -132, 83, 56, -17, -104, 51, 11, -5, -132, 208, 267, -110, 28, -56, 138, 14, 6, -76, -193, -59, 105, -10, -77, -125, 41, 94, -49, 95, -29, -77, 15, -82, -50, -43, -67, 24, 14, -14, -5, -38, -206, 59, -36, -163, 15, -24, 25, -24, -69, 100, -304, 113, -86, -257, 34, -144, 155, -41, 90, -147, -18, 119, -167]
6560a67K46M4j10J05j11j22P3j52K74j35J2K08j77qR0k10L19j92j27Q3J86M0j05
6583F4j8r1n4n0O5J38j54J56j41J81ORj25L2j9o4O9n9o7J7Q2l0o5O6P3N2j58o6
6611a51K67k43K52j14m8K98l00m5K70k42mJ97k4l7r2Q3j56L18j20o0p2q2J72j93
6635a26Q6Qlj75J99j82L31j84L9n7J14j9J51j63Q4k38j35L26k79Q2J92j96J14
6658c1K52m37K06J97k19o6J70l2O5j62O1N6mn0j75L28j56O1p1J48j0k25K17j21
6682Bj75O8J26l3J20j42R4J30k66K28k44M5K42j96k5J80k82J67rj95J52q0j9j03
6706b15K57j92L55j40k18J85j19J22j17mK46k38P2j22j01K98j04qJ79K0o4q1L0
6729D1N7j54K14Ml1J3k03J10k03L4J35j62J02k6o6K81r4m0M3j86J19j14J8R4l8
$$ y = [-167, 79, 123, 13, 118, 7, -115, -42, -194, 80, -55, -43, 165, -12, -20, 70, -140, 179, -13, -140, -57, 129, 169, 64, 46, -45, -99, -149, -84, 54, -100, 56, -85, 96, 102, 111, -14, 18, -1, -65, 4, -55, -122, -105, -23, -53, -118, -52, 21, 73, -85, -151, 116, -127, 125, 11, -37, 261, -39, -84, 186, -56, -60, 137, 113, 76, -16, 67, -89, 229, 109, 49, -23, -105, 67, -126, -40, -32, -35, -210, -11, -193, 138, -46, -7, -64, 50, 31, 182, 19, 103, -135, -270, 56, -223, -141, 51, -145, -31, 221, -216, -10, 187, -32, -98, 72, 40, 105, -57, 4, 60, 56, 6, -169, 159, 3, 64, -7, 141, 131, -94, 123, 2, -173, -105, 21, -12, 108, -34, 60, 190, -76, 152, -92, -47, 195, -1, -26, 154, -128, 39, 30, -165, -13, -93, -112, -215, 42, -150, 205, 65, -153, 32, -87, 35, -82, -86, 160, -78, -6, -128, -229, 69, -35, -43, 136, 156, 92, 11, 41, 98, -56, 158, 162, 131, 144, -59, 51, -152, -118, 17, -145, -43, -69, -135, 146, 52, 12, 55, -131, -12, -126, -108, -14, -52]
6754e2qM0Jk76K57J44J06r2k11P0ol0J25J12k01j8J58j93L15j30j24J3O7q1J5
6779AL1J14o7l3m60O15j46j13P3q9J77j78RP5k3k45L53k94R8N2J61l8j1l49N10
6804B23j49n4k08J29N0K0P1L9j69J30R2j08j14j4P3J06l6j36N7k2o0J8L1r5J53
6829B7j1j90J40K05k86O2oJ15j46R0J0j79J73p6m7K01Lj63J8q7k70L84j26P5J47
6854F3k44Q0M2K29K2l76K35j67L64j40M6k82J15O5j83r9L70j63l0pq6K44q3J11
6878A26k33J07j43J50Q7j76Q6p6L64n47K72J13j68l2L89k33k00J92K11l08k4j25
6900a68O0L6J8K19k59L5N5j7J29k71K27Mj54L7J83m7J08p9j58J36j36n2Pk2K5
6925h4K4l7J39q9J27k05J35k90L34P7k41J91k21J02J33k41M39k48p7m3J49k82
$$ y = [-52, -60, -20, -19, -295, -38, 106, 212, 120, -91, -21, -27, -57, 68, 180, -21, -39, 119, -74, 241, 111, -13, 0, 67, -14, 1, 32, 146, 79, 46, -414, 201, 55, -58, 15, -74, 103, -75, -66, 9, -14, -259, 94, -200, -102, -50, 111, 73, 62, -287, 223, 74, 20, -188, -59, -9, 11, 82, 121, -48, 82, 174, 66, -48, -62, 11, 117, 81, -55, 2, -20, -80, -62, -31, -126, 27, 16, -174, -34, 171, -115, -53, -59, 56, -90, 0, 10, -169, 4, -72, -119, 82, 85, -78, -60, -147, -417, -33, -159, -84, 63, -181, -101, -59, 170, 192, -184, 51, -116, 248, 108, 154, -128, -13, 52, -131, -230, 140, -23, -53, -60, -146, 98, 15, 126, -107, 0, -143, 7, 94, -82, 4, -72, 292, -255, 17, 130, -38, -70, 319, 86, -114, 78, 289, -19, -43, -168, -108, -72, -54, 165, -94, -59, -4, -21, 108, -163, 64, 68, -86, -49, 134, 87, 195, 116, -42, 94, -42, -94, -87, -109, -84, -60, -97, 42, -47, 80, -125, 10, -280, 54, 131, -110, 81, -140, -38, 95, -146, 293, 45, -32, -75, 74, -208]
6947b08K08q3Q8N3J3r4QO3J74j56k73L51k63N0Q7J48pk32O2l1J68M0k7j78J27
6972H8k9Q1p6k4k11K28J7J95n24J87J25j65K6Q0N6P9j14p7j06K35k14J39o8l8
6996a10J46j96K06o2r6J37r9J04r0M8k12k2K68j56Q7j03K57j87p7O5K57O0k77
7019e2J68p1j48m5K9J43nj6q3J39m4J30j71j33J36K19q9j16l1r7J43p9O5Q0j37
7044f5J11m3K5j3N6m5j00J81k72J54J95r3j70K88k65J15p9J1N4j9lK10l78J24
7068b1K30j96jr4rL2J82k13L09k52J89l20L84j92j07M8j79M62k70j40K19j00J40
7091A01k25J69p1k4J40j03n8kJ36J71r5j89pL4J36J03k11P8j62K03k62K52j21
7114gJ62Ol33M4K30k14P5R9J65k4k27Mj61J32J34p6Jl0q0L8j47K80m7Rm5Q9o3
$$ y = [-208, 0, -83, 5, 58, 71, -23, -15, 48, 222, 66, -207, 144, -119, -69, 18, 166, 159, -73, -11, -42, 126, 166, 139, -39, 88, 59, 140, 64, 40, -171, 57, 74, 269, -255, -68, 57, -108, -82, -2, 54, 133, 19, -58, -164, 71, -143, -4, -72, -110, 36, -160, 46, -16, -112, 25, -74, 30, -60, -12, -224, -246, 22, -134, -47, -150, 107, -80, -157, -92, 165, 225, -52, 116, 45, -103, -148, -119, 24, 19, 3, -80, 59, 15, 145, -26, -159, -23, 196, 107, -9, -40, -137, 6, -73, -8, 72, -65, 46, 3, 28, 15, 71, 26, -74, 107, -165, -11, 184, 91, -79, 209, -56, 59, -20, -9, 45, 26, 23, 233, -145, -21, 209, 13, 12, -82, -91, -59, 123, -90, 219, -33, 156, -164, 220, 28, -79, -31, -210, 252, -18, -158, 61, -39, 101, -124, 45, -26, -50, 90, -13, -71, -73, 63, 234, 139, -50, -57, -23, 113, 216, 5, 83, -79, 124, -138, 114, -7, 155, 161, -172, -128, 102, -112, -37, 62, 227, 203, -24, -20, -181, -49, 85, 9, 10, -20, -100, -62, -209, 71, 24, 33, -12, 77, 14]
7141A4J35k11L35l07m9J42p2J36k34K64n6o4l0j9q4J63p4m0j41J16j3J76q5P6
7165G8n8j12R5LM6j1L6N1J02j74j07N4l7RO0P5k77L62l97K88J01j36j18r8J04
7190f1k3K7J6p6J9J92k17N1J7N2j10J46ok56L28k8j70M3J36l25j6K35l4j05J54
7215a1J89j14j41N1L6O4j91m7J5K86j47k9n8J9Q5j29j9K69k98J28K63k79M3J02
7239H7k74n0L45j63K50j20j24jn2K69Kj30k7j70L06k07O0O5k37J96j59K07K5N1
7263A49k75M0R7J71k09m0O1R8j08p9pJ54O1j24J99k63JJ81Q0l19J58o2J17j40
7287e9Jm6L9L2O8q3Q4o8J04q8J10Qj23k65J88P8L0o1J14k75J71J31k9J40k96N6
7313c9M4j10L2J67j48K45k03o5L5L5J03j70K7J46o0K3o3o6m6L04k70L6Q2O1Jj87
$$ y = [14, 149, -62, 273, -34, -83, 59, -13, 123, -111, 153, 97, 33, 3, -16, -100, 63, -11, -51, -192, -76, -89, 87, 2, 78, 20, -92, 3, 6, 52, 41, 77, 128, 230, 56, -51, 3, -34, -25, 35, 110, -167, 195, -202, 86, 187, 51, -67, -165, -61, -84, -57, -41, -117, -98, 94, -123, -72, -55, -3, -113, 33, 27, -229, 99, 71, -99, -56, 80, -245, -261, -26, -60, -165, -11, 178, 64, -77, -26, 10, 74, -117, -164, -149, 137, -10, -39, -97, -78, 7, -122, -141, 128, -170, -42, 221, -58, -15, 87, -187, -237, 108, -55, 195, 75, -49, -50, -102, 167, 169, 39, 12, -158, 148, -59, 1, 66, -171, 25, -134, 73, 98, 149, -126, -86, 11, 182, -27, -67, -6, 92, -16, -95, -102, 52, 113, -11, 188, -75, -74, 107, 187, -132, 26, -36, 81, -59, -58, -104, -65, -33, 35, -48, 36, -32, 72, -16, 94, 102, -21, -286, -98, -20, 10, -51, 63, -212, -41, 90, 61, 201, -95, -39, 5, -105, -73, 94, -54, 191, -12, -77, -42, -7, 96, -74, -47, 99, 39, 62, -1, -67, -113, 191, -79, -43, 39, 100, 101, -86]
7339h6K24j12q5R3j3j30J71r6J08q7m7l2q4K32r8J7O7J25l37RK68j58M9q9J71
7364H0k08M6L1k27K87nj52L7mJ06n5K25j41K5Q8p6k69R3K14L3p4J55q5P4n0r7
7390E1lJ05k4l9N7j70J8J28j86J83k59J40L6K7P5j14o7j2J89k88K7J35m7O5j74
7415a47J74M2k10N5K37j62k41J80N2J70p8k06k6K54l8J0n9k05K97q1j28J24J17
7438A31k37j9N01l77j78K40m0O9j59J63l10L18n6r4J97MJ21n95L57k43L37j96
7460f6n6J60k5J10p0OPKo1J2j10K01O8n5k88L24J5j09J45j58K70l54p2j06O1J44
7486eM6j54J48j79J90N6N2j16K5k4j94J21j06K09l9J10l17L58k79j54Q3K43j15
7509d1R1j71J14j33R4N4R5N1p0n8j9j41K39j75J47j15j5P4m0L6j18L84n7n11K24
$$ y = [-86, 138, 26, -59, 34, 21, -109, 62, -34, 74, -13, -60, -92, -176, 56, -42, -25, 42, 167, -170, -161, 107, -51, -2, -91, 80, -128, -82, -51, -278, 9, 4, -148, -111, -115, -9, -64, 161, 20, 45, 133, 57, -212, -119, 95, 128, 54, 209, 124, 198, 148, 51, 48, 153, 129, 90, 147, -23, -5, 123, -63, 120, -139, 1, 37, 64, 139, 25, -42, -54, 135, -153, -126, 9, -38, 27, -147, 27, 69, -141, -86, 151, -11, -252, -72, -20, 150, 72, -134, -160, 94, 56, 66, 7, -198, 99, 18, -110, 14, 131, -106, -125, 376, -1, -179, 61, 21, 90, -69, 94, -216, 102, 46, -48, 149, 153, 274, -321, 36, -207, 130, -66, -122, 38, 13, 123, 53, 59, 66, 68, 7, 19, -91, 110, 178, 123, -165, 159, 174, 65, 210, 52, 322, -32, -104, -210, -149, -5, 41, -113, 35, -144, 46, 102, 154, 38, 63, 39, -155, -34, -140, 69, 30, 140, -177, 181, -98, -252, -169, 74, -41, 50, -121, -7, -140, -46, 8, 103, 154, 84, 26, 7, -134, 105, -70, 77, -38, -53, 21, -19, 17, -101, 283, 226, -285, -61]
7534f1J96l85L21k73L55k99K60j92J21j73J38Q3n3j6P5N3k05R4p9J14l67M34j25
7557A6l88M38J06j76j27L02k10K45l67M5J11k2P9m1N8j58MJ17o3j36K2K02N0o0
7581D7q2r7k1J76q7l6J11r5K16j15J4J71m45L49Qk26O5J30l1j56rJ98k07J62r5
7606e5j92K15o1K32j06J13j13Mo7n8J43K4n9J29k31J01J29l73R2K45k8k83K48
7629D9j09mr2J42m1j6J76r9J51k60R2o9Q3o7o2Q4J47m8j42J44k00K46J00l18J32
7654A9mL3k5Q4k42N4QM0N0K0n9j40J31jn3J70j38J09M6o3j46L4J40j74J16J4K15
7681B38k52N7k27L39l28j2K02Q2K9j94N5R6o5j36K37j70K01k15Q0M3k19N6L11
7704B08n3k57P6n8r9J55k0J01m3R9n6k01K12j84O7L3r5J53j2P8j47n6L56l67J49
$$ y = [-61, 135, -250, 71, -202, 153, -146, 114, -78, 43, -130, 8, 91, 38, 22, 97, 150, -55, 39, -40, 74, -293, 141, 16, -372, 66, 172, -4, -131, 171, -39, 206, -161, -116, -5, -27, 52, 11, 69, -89, -85, 32, -31, -167, -145, 57, 107, 47, -35, -132, -153, 23, -64, -100, 11, -84, 132, 17, 31, 202, -243, 106, 114, -112, -47, 83, 52, -104, -113, 85, -122, 40, -55, -247, -32, -93, 139, 33, 146, 33, 37, -30, -88, 55, 79, 20, 149, -82, 19, 148, -225, -133, 112, 84, -199, 49, -60, -64, -156, -14, -55, -71, 105, 6, 157, -103, -11, -80, 3, -64, -126, -42, 105, 57, -85, 59, -141, 105, 205, -113, 19, 15, 48, 23, 107, -135, -81, -73, -33, 17, 37, -22, -162, -31, -32, -85, 85, -53, 56, 102, 39, -107, -73, 67, -107, 9, 23, 238, -14, 43, -184, 155, -173, -185, 17, 99, 128, -66, -11, 85, 20, -116, 121, -49, 152, -63, 17, 60, -159, -103, 208, 155, -102, -26, -84, -183, -28, -48, 53, 10, 109, 53, -148, 64, -120, -53, -20, -115, 38, 26, 104, -43, -99, 257, -110, 39]
7729C9K3j73O6K3j61K6L11j77o3L9J16l8J7j67L53j09k10N9j02K22J3j75J35j63
7753i6J42j31o5K38p5q9M4L7M5l4K8j34J09j3J15j08N1q9J74j85n2J87j28R3K5
7778H9n7k40J95K45j12j83J57Nl35K65R0k02P2P6k15J74k09J66J51pn1j71JOO9
7803b1LJ73k79J00L0N2j80O8J85j71p8K11m0n3j85L78l81J41lP4K2j27J18j26
7827h9r0J27J87p5N9q1K7j76l6J61j08K6j0O2k00J67R3l18L08Q4o9j90n5L11k27
7852a12J78O2r6j08K34p3j48Ok6K70k40J30p5j0k43J16K65p7j24JJ91j00J08k71
7876a42J64r3p6J57J13Qj28N3j16J88j97j25J5j43L44o1P5K2L3j01n1J34N0k87
7900a64L6K91j10J49l44J08m7n4l3M06k83L8r9J96j90J46o4J36j12n2K1K49m86
$$ y = [39, 62, -111, -45, -22, -183, -157, 154, -23, -86, -47, 69, 31, 48, -119, 234, 125, -85, -26, -128, 94, 107, -68, 67, -96, 46, -85, -150, 88, 13, -76, -32, 5, 50, 16, 44, -90, 19, 6, 121, 13, 64, -25, 149, -36, -88, 99, -29, 64, 89, 32, -208, -13, 232, 120, -63, 94, 99, -236, 29, 119, -83, -11, 65, -150, 24, -185, -19, 132, 125, 74, -97, -96, -90, -21, -18, 155, -124, -24, 6, 58, -122, -54, 131, -40, -118, 93, 53, 0, -185, 193, -188, -47, -50, 24, 46, -81, 37, -89, -179, -52, 135, 60, 119, 38, 65, -111, -147, 14, -94, -68, -78, -16, -216, -49, 44, -274, 34, 118, 49, -141, -196, 115, -112, 66, 128, 32, -76, 158, 85, -63, -57, -83, 187, -53, 77, 2, -8, -251, -135, 130, 53, -71, -70, 121, 21, 129, -142, 22, -71, -147, 10, 123, 131, 3, 56, -60, 128, -69, -194, -179, -322, 22, -39, 36, 58, 91, -10, -61, 73, 123, -164, -128, 163, 53, 202, -142, -34, -81, -135, -168, 238, -45, -7, -106, 90, -100, 46, -18, 118, 6, -46, -25, 224, -262]
7923b62M02l58K40R7j24j24rJ65jl7n7K62j07k19pK73j33M7J4R3n7q8j36O9K72
7948B15j85n9L8j01J09j77J95p4j30N7r6J87J21K6j44oj4J66q5J07q3K5n0J50
7972A92l60m2PK10l4J15M5J18j01j55o7j0L9p7J76j15N7q2K17k75l2n9L30m6j56
7997a05K52k09k1J21k95L72j8j04L1j57J93J12k59K93l68K11m4J10j27J1j13K22
8019A08Rj51O4n1M3k8N2N5m5n3P7r1N9J13l74K22Q1j85p9k0K43j91J30q2J45J25
8045A76j60j65k4L43m8p2L7N0j21j03J24j01j5J07O8j53j35OJ84l0o6K65k36J50
8069H1K31l74J77r1j51J27j64Q9K65j21j42j44K96R9O6k98r7J77JK9m7Q8k71J51
8093b3j6J59j33K87k01J24j65k6j36J81j32O7R6j40o5L92m09Q9r0r3L44K5j36
$$ y = [-262, 140, -218, 22, 119, -5, -129, -138, 27, 26, -11, -68, 194, 87, -132, -139, 134, 1, 48, 62, 155, 98, 10, -126, -57, 215, 30, -29, 9, -92, 17, -160, 35, -39, -169, -112, -208, -21, 100, 126, -18, -24, -38, 128, 43, 150, 67, 92, 42, 192, -168, -210, -203, 7, -27, 88, 133, 251, 150, -5, -72, -82, -43, -120, 56, -59, -2, -84, 133, -142, -174, -233, 97, 51, -105, 147, -62, -83, 38, -257, 115, 97, -7, 24, -133, 60, 172, -87, 206, -162, 49, 5, 115, -12, -1, -114, 108, 117, -34, 30, -21, 22, -6, 46, 101, 56, 3, 80, -11, 48, 161, -213, 9, 90, -95, -174, -194, 49, -142, -12, -94, 51, 176, 16, -149, -173, 170, 122, 50, 87, 137, 16, -87, 37, -64, -79, 28, 96, -57, -192, -186, -2, -32, -98, 167, -69, 81, 312, -62, 115, 24, -127, 0, -164, -75, 190, 69, -73, -217, 79, 178, 244, -54, -151, 26, 27, 56, 9, 97, -174, -23, -39, 120, -13, 274, 73, 197, 32, 6, -130, 51, -81, -14, 82, -58, -123, 269, -140, -51, -141, -234, 110, 135, -1]
8116aj27P7K1K23j83j92O1N4K8r0K58j86J37k43J47k05J87K85l04J15j12l3O4
8139a9m4j47J88J49j0q7n6J39k09L42j74r1q8j50K37J22Qn6k15K80l0k34n1L39
8163A43k14K37r2L14m04l2J22K1O1j27j2n9o9N4P5j90J29k0K43l8j60J29l4lj16
8188d2k98J34L85
$$ y = [-1, -128, -51, -30, 193, 10, -182, -121, -67, -39, -129, 129, -57, 80, -163, -16, -221, -34, 251, -53, 62, -50, -83, -19, -63, -210, -22, 127, 117, 30, -26, 113, -96, 246, 72, -19, -107, -257, -20, 102, 110, 54, -161, 119, 89, -145, -196, 143, -71, 166, 74, 388, -16, -48, 74, 95, 156, 29, 17, -42, -111, -57, 18, -172, -43, -63, 180, 142, -18, 111, 77, 74, -42, -340, -206, 179]
8191A79
$$ Imaginary data points
##PAGE= N=2
##DATA TABLE= (X++(I..I)), XYDATA
0@%%%%%%%%Qj6J6j6K4l2L2m0N6p2Q8j04J28j57J85k18K54k96L46m02M65n35O15
31C29p03P99r04J022j155J299j456J628j819K028k255K502k774L073l397L749
47A966m132M555n021N531o093O714p403Q174r041J0021j1140J2432j3944J5741
61H360j7917K0621k4083K8690l5159M4968o1751R7975l10202K95148M05856p48193
73b95687J57786M97222m06121l39640O00789N9977n66608J32596M88317l07657
83B0974k18955L59315n4039l89400K16568L03307j99085j93204J85802O7837k18547
94a19427K5567K60471j66821k18184L01042J40355l29679J426K48489j80901j61331
105a98993L48781O9697m10540R6685L36414l22037j48338M31889j25764l68302
$$ y = [0, 0, 0, 0, 0, 0, 0, 0, 0, 8, -8, 8, -8, 16, -16, 16, -24, 32, -40, 48, -56, 72, -85, 100, -118, 136, -160, 186, -216, 249, -286, 329, -374, 425, -479, 543, -612, 687, -769, 859, -960, 1068, -1187, 1315, -1459, 1614, -1783, 1966, -2166, 2389, -2632, 2899, -3194, 3520, -3883, 4291, -4750, 5271, -5869, 6563, -7381, 8360, -9557, 11064, -13019, 15671, -19488, 25480, -36271, 61704, -248498, 46650, 452506, -295687, -137901, 359321, -46800, -386440, 214349, 274326, -292282, -159686, 328631, 20974, -197981, 161334, 107295, -282105, -65537, 237770, 38685, -154519, 31283, 99120, -119427, -93860, 166611, -210, -218394, 82648, 223003, -106676, -105250, 143239, -37662, -198993, 149788, 219485, -191055, -94370, 242044, -79993, -228331, 203558, 77794, -290508]
115b90508L70828J96293m54551J2460L76180k33010k29534M13406P3114m52781
125b18103J33729L48963l29408j65858L89737l4321l15101J84180K14889k50895
135d2188j50870K47809N7081k52203P4890K59079j75349j94611K28751P5707k59645
146a31549L1438K78659j11070k37694K25832J26795l43637K8693L38367k09521
156c687k01471L40186K5262l51145J17465K43148k40924r9966L29210l3240l06398
167a81560J81043J80610k87203j3268K71750j28709j53262K10881M3755k16009
177i1972Q559J54448p4246r4348J53823M4025j84823K4864J48716r5269r3625
188i9848J23714N3901j16329M783J44290p8203j77212J45088J22887j94751J4103
$$ y = [-290508, 80320, 276613, -177938, -165478, 210702, -22308, -251842, 161564, 234678, -218103, -84374, 264589, -64819, -230677, 159060, 124739, -190362, -6182, 208707, -42188, -193058, 54751, 111832, -140371, -65481, 193598, 18249, -176362, 52389, 128096, -131549, -100111, 178548, 67478, -170216, 55616, 182411, -161226, -132533, 205834, -3687, -205158, 135028, 160290, -190855, -73390, 169758, -71166, -171132, 158078, 124838, -181560, -517, 180093, -107110, -120378, 151372, 22663, -130599, 80282, 124037, -91972, -83413, 71035, -3211, -97559, 56264, 100289, -84534, -59670, 89046, -6223, -99848, 23866, 77767, -38562, -33779, 110511, 32308, -144904, 184, 123071, -71680, -57577]
199e7577K02969j41051j53399J95377N1922k18303M4997K11278j23902j32524
209a20213K07450N55k47491J20926J87104j81386m4950J91545o8786j58779J15913
220A888R0324j51934k4325J75132l7776j43764J02512N7576j52699J2886J44792
231G4612l9364r0176O5321O1324j00302m4284J25640j1469j21456R6495Q8098
242A04439j39447k7289J17245n1126r4955J02298P6140j25262k0141J38828p2505
253H225j23488J43274M9749j51254N9262J23532j16527p2846J17200O965j15783
264g1691N3123J13807r7809o8716J20980k0656j21262P9055P6154q5947j0018
275c2980Q3159k3379q4112L6593O9802o5699k6311J06634j9358r9022N7271M2548
$$ y = [-57577, 145392, 4341, -149058, 46319, 98241, -120062, -75065, 136213, 12311, -120213, 87237, 87792, -159699, -38773, 148331, -33055, -78005, 113540, 44754, -114025, 1888, 92212, -59722, -84047, 91085, 53309, -90455, 12057, 69633, -83066, -70180, 74612, 35248, -54928, 10393, 71717, -28585, -72869, 52771, 41302, -80154, 16341, 104439, -35008, -62297, 54948, 3822, -91133, 11165, 87305, -37957, -58098, 80730, 8225, -115263, 28011, 77760, -73494, -14232, 109300, -7227, -80073, 37127, 44092, -71691, -18568, 95239, -2570, -71286, 49694, 29038, -92224, -13169, 62985, -22962, -32980, 50179, 26800, -57312, -20719, 49083, -16616, -42927, 63707, 44349, -54673, 2598, 45146]
287D5146q6220m517Q9659j1005p7063M1815N8935r4858l2129J16508k4673q3937
299f2339R0119L9330j04791J629P8736l9707n6380P4656M3967r1786l50Q3598
311E6682p0501n8196R9001O879p7025M4176M8824o4771l4656O2344J1334o6036
323d1945L4875P3162o6147l9160P3013j9145o4538M7605M5566m3598k2451M6397
335B3634j311o9050K1479O1414n3022j6581P8496k2870o3698L9984K6333m9340
347b4532n16O3099p752o0275L7579L5689p9467k284P9682l6876m0344O2647M703
360C1353o4729O011M6648k2392l3997N4294K5153o4775J0158M7335n0453j9810
372c5204N8236j64l3858J5788K1875l1176l0618L8759J4397m8608K5441M7027
$$ y = [45146, -41074, -45591, 44068, 33063, -44000, -2185, 56750, -38108, -70237, 46271, 21598, -62339, 27780, 67110, -37681, -36052, 42684, 2977, -53403, 21253, 65220, -26566, -26916, 56682, -13819, -72015, 26986, 33865, -43160, 1016, 49840, -14931, -49587, 12757, 24091, -41945, -7070, 66092, -55, -39215, 33798, 14653, -49885, -2280, 43286, -312, -22763, 23634, 22323, -46727, -25248, 36166, -16856, -33437, 45059, 22189, -41509, -1525, 24808, -24532, -25048, 38051, 30299, -29976, 7603, 43292, -36175, -38459, 41223, 4347, -35997, 26650, 31353, -33376, -27365, 19283, -3109, -37106, 17188, 42341, -22434, -12276, 35059, -15394, -35204, 23032, 22868, -10990, 4798, 26673, -4503, -35121, 3638, 18035, -30573, -5132, 41895]
384D1895m9730k1636M3662j2697l4518L0338L8401k8719k7811M2037k98n9043
396c8119L0787M2786n0607K89N2669k8501l9720K5101J3588k8853L936M5261j5148
409A3469m1599L5554J2319n0216J8667L8618k8124o396L0875m345l4145l795L0378
422A1260q327k3595L6768J0088m8393Q759K8952k8294j1857L1200J1305k2932
434e066P58K8163k5447l2075M4475J0534m1201K9270K4963m6242p042L1605j3518
447h23k4182K4716K6038l1016j2546L6877j9814l5167L9910J4582l0513J5924
459C986J9425k0809j5983R051J2085j1906k157K7997j1054k7655J9143L537k5526
472a9866Q642J9662m222r147J0450R177l1029p767M1142r455k3715L8243o76m2401
$$ y = [41895, -7835, -29471, 14191, 1494, -33024, -2686, 35715, 6996, -20815, 21222, 20924, -38119, -7332, 35454, -15153, -14864, 37805, 9304, -30416, -5315, 8273, -20580, -16644, 28617, 13469, -28130, 7424, 19743, -30473, -11806, 26812, -1312, -7708, 23167, 18822, -15323, -19118, 11260, 2933, -20662, 16106, 26194, -22199, -13440, 15512, -12782, -24639, 6561, 17866, -5066, -4308, 23855, -1592, -33667, 10808, 21342, -19859, 9411, 34374, -11868, -18910, 12695, -823, -25005, -289, 25749, -5267, -17813, 19064, -750, -35917, 3993, 18575, -11938, 3986, 23411, 2602, -13381, -4330, 7755, -4151, -6308, 21689, 10635, -17020, 2123, 5660, -19866, -11224, 8438, 4216, -4931, 5519, 14696, -16333, -24100, 17042, 7587, -16128, 22115, 21439, -20962]
486b0962J7744K2625k8667j1231L0250P625k7123Q889J9383l9341j0015M6562
498A5739p394k1811K6359k304k3618J0220J1769r316j1204J2934J9970j5439r313
511c408J2004j8520j1847K5298J0239j2549q140O376N839j7827K620K2630k1755
524i040o663M1759q107l1725J4059L092j8487J3158K4494j3203k4442J7349J0660
537A2904l1074Q716K3592k9612K251L8815j7994k3708J3713N07q125J1052J6567
550A7604o796j9731R748J1431j9644l07J3191q094J684R526k223q708j5266P123
564a0462J7870j2461M121J9268k2248r298K3796p080j7293J3809J4758j1551o445
577c216J8513r899l1577K2608K0169k9624R460K4160k7489r304K2183p010j1968
$$ y = [-20962, -3218, 19407, -9260, -20491, 9759, 17384, -9739, -850, 18533, -20808, -30823, 15739, 8345, -13466, 12893, 10589, -13029, -2809, 8960, -356, -11560, 1374, 21344, 5905, -3408, 8596, -9924, -21771, 3527, 13766, 1217, -6923, -547, 5292, -12535, -9915, 12715, -9040, -15703, 26056, 17949, -13776, 283, 3375, -15112, -1954, 22540, 9337, -15105, 2244, 12904, -18170, -9454, 14138, -15474, -13223, 25592, 7598, -16110, -2397, -1890, -10015, 1037, 17604, 10808, -8923, 825, 12256, -7388, -7695, 5496, -2598, -914, 8612, 6389, -2319, -17585, -10462, 7408, -5053, -932, 18336, -3912, -13210, 10586, 3506, -13787, 22, 14780, 3229, -3216, 15297, 5398, -26179, -3571, 16598, -13026, -3566, 20594, -6895, -16199, 5984, -1026, -12994]
590a2994J1778J2789o806p055J1450o219j7424J4982Q311j1827Q827L824j1838
603b202j375l031J380N276o896R691Q529j7932J287J1203j3144k849J6106M296
617A0339q967l11J1275j2733j7536K3365M529k3082J8817J1149k8510L217J5699
630G251j6022m250J7042M865j1167J707J1203j5800r908K2832m74j3340J6087
643A0026N80j5673L457P30k952N97m69R628L04j2518N047L01j0305P152R372r06
659D371k795P54M553r680o668J6813m353j2006K1936j462k3070J0688N263j6883
673a2539M456J5395k796j0017O360P122j7792k153K1778q609p640K0361o075j4203
687f352Q119j089n507K971M288M181n611m312N299q583m162J1899K31k126M419
$$ y = [-12994, -1216, 11573, 4767, -2288, 9162, 2943, -14481, 501, 8812, -3015, 5812, 9636, -2202, -3577, -6608, -5228, 48, -6848, 2843, 11372, -6560, -5273, 5930, -7214, -10063, 6043, 10339, 1372, 1061, 12336, -397, -17933, 5432, 9961, -13121, 5696, 16845, -11665, -8448, 7251, -8771, -13021, 4021, 8886, -2281, -574, 10629, -5171, -15079, 7753, 7279, -6061, 10026, 10606, -5067, -1610, -880, -3832, -3235, -3704, 5924, 6228, -6290, -1243, -942, -11247, -4095, 5277, 4371, 1576, 2330, 6883, -2797, -9465, 7348, 2995, -9011, 12925, 11463, -11607, -919, 4344, -12539, -8083, 7312, 4516, -5501, 859, 7981, -9811, -11964, 9814, 1205, -6435, 13926, 7851, -6352, 1767, 678, -4829, -1858, 2430, 6611, 1000, -3312, 1987, -6596, -10758, 1141, 1372, -754, 3665]
702C665j425q76n489o87J0572p094k050J8246q547j4660J2009l078j1734R779
716a369Q208n443n583N935J883j4651M178J3819j2163J752J8437j2504q792J0704
730D411n130n206P966N010k154o735K863K446j2595K402J0726p351J373Q343n575
745G94l446k048R56N915m352M039J0101j1460l910R395q434m307J0066O07l429
760D87l08K902l730j0305P438P512j1787Q146J2011j5596k142J0066p582k121
774e009Q587L058l041m341M867j342j1678O405O500r047O232N543r422j609Q23
789c474p69L517n35M666K900r158M392L415j0613K968P505l547J382K009k116
804B542n560n596P910L317q915Q852M112j3484M870O012r455R62P012J480k64
$$ y = [3665, 2240, 1364, -4125, -4812, 5760, -1334, -3384, 14862, 6315, -8345, 3664, 586, -11148, -1369, 6839, 1396, -4187, 1748, 3631, -11020, -6842, 6977, -5186, -3434, 15003, 2499, -6293, 4411, -719, -5925, 2041, 7051, 4897, -1838, 1025, 3471, -9124, -6722, 4004, -3347, -1974, 6369, 794, -2652, -4700, -3744, 2171, -2181, 1858, 11959, 499, -3411, 5984, -2450, -6757, 3309, 3916, 487, 179, 3081, -649, -10954, -3516, 3996, -7791, 355, 12366, -3230, -5372, 4694, -2888, -5009, 3578, 6636, 3595, -746, 4121, 2779, -8899, -2494, 4006, -5041, 1191, 6734, -2688, -4297, -3474, -4243, -726, -1261, 3405, 6305, -2853, 1539, 4954, -5659, -2691, 4814, 1267, 2649, 4658, 2542, -3018, -8614, -704, 2613, -6302, 2550, 6662, -6822, -1952, 4060, -5395, -4433, 2579, 4059, 3795]
819C795j441K062n510o786J0489J833q477Q125O99r938L584J002m598J311J742
834b108N944J56o475M656k176p703R329M054n378K966L97k353j932l126L751o90
850f88m033R731m46j0546N462m93o735O917M040k086K14J29J951m923l113Q675
866D056k784m471J0975k927r320M238j279l300K923J759K817k400l263N094m559
881b441l921Q644q80k080O746k718l360k1k151K777o57o20O550m828n392O239
897A887m668m494P347P92j223J564qL40m854m12P658l844q10Q677n815n025N040
914B152l813k129M143rJ573j901j225K183o037j54P890l902O38O254m899j786
930a022J532j704K020p09R94N010n833j987M044o633q71O969k187K69J240j736
$$ y = [3795, 2354, 4416, -1094, -7880, 2609, 4442, -4035, 4090, 4789, -5149, -1565, -563, -5161, -3850, -2108, 3836, 3992, -2483, 2173, -3, -7706, 1623, 5677, 299, 3265, 3662, 1309, -623, -3749, 2, -688, -4721, 5010, 4564, -5982, -520, -1013, -7748, -831, 3209, 1123, 1337, 1466, 3417, -1506, -4619, 4056, 1272, -3199, 7776, 4849, -4471, -233, -1512, -4812, -1889, -130, 2687, 287, -2976, 2118, -2441, -6362, 2282, 1402, -678, 6068, 3350, -10, -31, -2182, 595, -62, -682, 5868, 1040, -4352, 1887, -2781, -7275, 72, 864, -359, 1205, 1197, 1537, -3317, -3729, 3929, 85, -725, 7952, 2137, -2888, 2152, -1661, -3790, 353, 344, 1917, 16, -1209, 974, -5063, -5217, 2673, -1229, -591, 5663, 764, -1022, 510, -1194, 826, 117, 1111, 6121, 288, -1699, 2345, -4288, -5159, 1810, -377, -108, 1132, -604]
946f04L38k985N16M772l890K858O481p088j107L639n750O42M829j022Q2j794j43
963b26Q56n934K451M353n079L612N282o111o59J001k301L346O93J135K373n325
979e33P97K397o438J784L603l422L078J285l747l41k870J803L812l215L784K782
995D559p052K851K877o019K104K930j242K095j422r31j020n064M011L092m668
1010b899M064J290n732K643O24l217K805N49J846K141l646J124q06m970M816K239
1026B871l970L656j001l356J023k123Q98J459k326M662J409n768K849j21m105
1041c943M901J420j152J802j839m27l90l449L425N0k778N450j380n309L674j858
1057a803k460M001K85J517M83k788K550j599l349N275j69k344M034j801l072R72
$$ y = [-604, -266, -3251, -2735, 2037, -1853, 1005, 7486, 398, -709, 2930, -2820, -2178, 2651, 1629, 1711, -83, -226, 630, -5304, -2853, 1500, -3579, 33, 5315, -796, -1455, -454, -2755, 591, 1284, 2419, 4792, -533, 264, 2661, -3777, -1993, 1610, -1812, 1266, 2551, -1196, -1537, -4407, -2604, 1208, -2007, 1777, 4559, -2493, 358, 3235, -2784, -680, 2250, 1008, 3103, 1681, 750, -270, -5334, -1323, 1769, -2899, 1165, 2455, -3277, -634, -10, -3227, -422, 127, 1973, 4114, 468, 1592, 786, -4184, 632, 2871, -1099, 2557, 1556, -1800, -777, -2900, -2002, -543, -2869, 1793, 3202, -2566, 283, 162, -3943, 958, 2378, 1226, 3028, 1189, 762, 372, -3077, 348, 398, -2380, 3070, 1690, -3619, 55, -1803, -4263, -262, 23, 1540, 2023, -765, 1785, 186, -3163, 2112, 1943, -401, 3633, 1832, -1240, -268]
1073b68k385J113J270j493L801j077l633L107k128k261N372p15l43K970k399j47
1089G84m89k372L498r62j297N043l150l573K870k806p89L299p87J787O2k505K509
1106A122k209j948N330j558l23M079l519j499J301k940J334J225j002K822k400
1121a85j662K791m208k98M907k117R43K641k904N41n77j463L098j038K21L410
1137D100l706j280K162m069R34K514j572J798m53j783J736k667j75M040k376J457
1153F60L522l946m86J140k310J718N29j03K155l388l46J904m673J008L656k922
1169a882K416J483l316J007n32p63K925q74Q20K044l211N56O64l884K040J484
1185I77j804K524j261j793J125k876J027L278k633K200K220l747P44P03k209K239
$$ y = [-268, -2653, -1540, -270, -1763, 2038, 961, -2672, 435, -1693, -3954, 1418, 703, 360, 3330, 931, 784, 295, -2077, 1421, 459, -838, 4205, 1055, -2518, 352, -2454, -3243, 56, -731, 1056, 1118, -1387, 1122, -1087, -3035, 2295, 737, 414, 4493, 974, -525, 776, -2164, -830, 395, -607, 2215, -185, -1847, 944, -3264, -3562, 1345, -772, 171, 2812, -92, 449, -128, -1591, 1507, 469, 690, 4100, 394, -886, 1276, -2793, -1859, 655, -917, 881, 428, -1355, 381, -2286, -2461, 1579, -797, 660, 4182, 236, -250, 890, -1420, 298, 827, 724, 2879, -509, -855, 1049, -3624, -2616, 1040, -1882, 534, 2017, -1299, -292, -824, -1587, 1338, 464, 1284, 3328, 117, 673, 1337, -2547, -507, 977, -827, 1697, 436, -1357, -232, -3108, -2081, 1197, -1436, 764, 2984, -763, -19, 684, -1525, 714]
1201G14n6N91J891l016K23L67l768K204J847l006K925M96l739K083r14q01K304
1218C45o11J874R45k980J667m83l036L331r1j097K460k134j190Q55k749J163K186
1235D55k009K339O67k962J744o18j514K787n39J074J484k885P48l19l214L429
1251F67M20k503K912n39k936J863j502m58J932m87K221j22k242J842j331j607
1267a870L899j083p26K707k602n13R64k867J140R72j278K816r36k454J665j582
1283a748j85K863p71J063N76k311J956q91k577L329n59j370L324j946k222J295
1299a74j646K46J646r76J814p89j203K105k281o55L564j928R62K575l151j60P20
1316F69k176J736M06j226K172j731j231J467k311M57J823j090K304P4k149J576
$$ y = [714, 658, 1249, 3140, 124, 347, 714, -3054, -850, 997, -2009, 916, 1412, -2327, -244, -1158, -1959, 345, -266, 1608, 2553, -427, 1240, 757, -2279, 1052, 961, -136, 2324, 190, -1000, -145, -2894, -1731, 455, -1554, 785, 1452, -1510, 234, -384, -1898, 889, 350, 1424, 2908, 23, 771, 452, -2762, 667, 1087, -1416, 1496, 957, -1979, -116, -1618, -2076, -144, -631, 1590, 1468, -774, 1068, -263, -1870, 2029, 946, 220, 2927, 325, -188, 776, -2091, -951, 21, -1257, 1559, 623, -1831, -166, -1748, -1933, 930, 159, 1222, 1798, -513, 1443, 552, -2025, 1304, 745, -625, 2699, 753, -1469, -174, -1820, -1574, 72, -904, 910, 121, -1082, 1023, -1258, -1913, 1651, -277, 685, 3260, 109, -51, 669, -1507, 229, 635, -591, 1581, -150, -1381, 86, -2225, -1768, 55, -1035, 1269, 1343, -806, 770]
1332G70r04j453L252p55p84K748k538p73Q52k096J020P89p63J870j591o21J422
1349D45k851O58L311k389J550J838k772N13M24j603J503j06k62J672j951m61O43
1366A62k587J427J131j558K311k11k036J932j344n73K813j337O86J795k349J0
1382B72N52k057J369o4l27J570k098n7J345k963J164K155k212K046J043k653J011
1399I6J94j178J676p6J29J065k329Q49N9k413J748M14j699K558q98j732J709j946
1417a774K71K493j239Q16J300k123R85j09j552J733m92j1J567k376J5O24k869
1434b741K187J205k195J769Q25k504J722m93j027J592j17J089N67j707Q87j146
1450h7j737K898o41j424K429j556j154J507j929K36J663r63J316L91j405P12q76
$$ y = [770, -134, -1587, 1665, 910, 126, 2874, 336, -437, 415, -1681, -661, 128, -635, 1235, -356, -977, 445, -2406, -1748, 1563, -826, 724, 2562, -210, 303, 727, -876, 627, 521, 259, 1931, -20, -481, 162, -2425, -998, 133, -1425, 886, 675, -1361, 571, -773, -1346, 1467, 130, 816, 2611, 262, 272, 824, -1233, 136, 72, -255, 1315, -783, -840, 505, -2458, -1294, 861, -1351, 695, 1738, -915, 96, 290, -888, 788, 712, 841, 1906, -423, 426, 485, -1928, -180, 234, -1465, 1093, 195, -1537, 172, -1774, -1503, 990, -249, 567, 1867, -256, 729, 620, -932, 801, 309, 298, 1865, -511, -496, 128, -2741, -554, 651, -1544, 225, 1050, -1454, 268, -225, -1252, 340, 223, 1312, 1879, 172, 1059, -87, -1824, 1074, 433, -991, 1438, -118, -1272, 235, -1694, -1458, 205, -758, 558, 949, -456, 256, -620]
1467f20j01J905r57M53J161k105N94R2k545K129l8j458K632p80j814J046p29N3
1485a082J493l30P36j33r41J520j206j046K308j262l73K450k101p71J002j950
1501a686N73J276p73O89o3p88R46j098K34J553j144J380Q03k151J279n64j955
1518a489K149l5j750K292j024j456J157r71R4Q29j01J262n76q10J440j676m58
1535a123K578j434M66J834k632M7R16j812Q15N97p98J069r98m9M04j367Q61P97
1553A71r49J890j67j847J668l97j405K221m70q28J386j196n99O30j231L30L95
1570c98j93J383j084m74J457j966O24K101k102J202J446k278M23O94j728J068
1586A75J99l21P97j173Jq3j286J235M61j063K148m01j651J909p27j173K270q16
$$ y = [-620, -721, 1184, 227, 680, 1841, -264, 330, 422, -2123, 6, -32, -1490, 1142, 362, -1452, -406, -1135, -1082, 411, 81, 817, 684, -257, 1263, 57, -989, 1319, 57, -316, 2134, 33, -738, 264, -1686, -1113, 163, -610, 79, 16, -772, 174, -924, -690, 863, -281, 1099, 1902, -249, 1030, 466, -1489, 660, 625, -1125, 1167, 143, -1313, -156, -1127, -1033, -204, -305, 957, 381, -429, 1011, -665, -1123, 1455, 21, 487, 2321, -311, -264, 652, -1160, -345, 252, -546, 523, -475, -524, -120, -1487, -626, 171, -778, 1112, 945, -902, 766, 369, -1036, 1185, 715, -113, 1273, 77, -522, 108, -1123, -793, -398, -591, 792, -292, -766, 691, -1275, -651, 1450, -652, 550, 1996, -282, 141, 835, -893, 175, 374, 53, 850, -323, -322, -405, -1691, -456, 5, -1058, 1090, 689, -962, 947, 220, -953, 1317, 501]
1604E01k47J217j243l57L45j080P48k82J87R39j535K89R11k225J122J446j651
1621i15J674P62j921O05K48j156J023K97P4L98j011K37o94j149J910o44q36K224
1639A126j432r97J941j211m64J944p37K42J074j309p5%n11Q01l49L24O64j667
1657f36L71K55j714J130Q71j292J579K73j704Q91o7m95J133p4J78M2p37O38j006
1676c64r62K074j050n40J897j297q47J482j524P1J544o04M51P95r81L06o80J73
1694e6P79p26O39O41j935P85K26j853J405M24j564J705j59j395J238n67l27R73
1712B33k79R54o9q87J195j167p25J770j354OJ629j993j13J304j627L64R91o75
1730d43O95j3m28K91n81L54R71j005J133L07k009J084J4j764J714j14j210J436
$$ y = [501, 254, 1471, 228, -129, 216, -864, -116, -398, -211, 728, -807, -518, 393, -1832, -710, 736, -915, 759, 1521, -400, 205, 453, -703, 320, 617, 691, 1089, 78, 315, -379, -1528, 382, -262, -1098, 1126, -306, -1303, 638, -573, -1037, 907, 170, 412, 1486, 177, 102, 102, -409, 392, 43, 367, 1031, -636, -265, -10, -1724, -594, 277, -1015, 564, 837, -867, 24, -43, -538, 595, 521, 699, 741, 4, 642, -364, -1326, 748, -302, -842, 1055, -242, -1089, 393, -1131, -1060, 484, -120, 331, 1126, 145, 451, -229, -56, 723, -3, 636, 1277, -658, 127, 353, -1500, -95, 329, -1235, 470, 311, -1084, 154, -413, -740, 233, -46, 908, 839, -48, 1147, -20, -745, 1025, -329, -323, 1306, -687, -800, 504, -1123, -759, 232, -443, 252, 239, -189, 102, -479, -125, 846, -159, 974, 1281, -728, 356, 370, -1394, 320, 206, -1004, 432]
1748D32m76q61P78o15O4O24k04Q79m74l48J069j334L52J275j385L35J314j913
1766d88J40R87j509J05Q35l43O00n44j14J59r94J254O24j124J585j47j583J513
1784I56o76j261J830n08o12R18r22m34O31r43O42K19l37J172r01J28P38j321N0
1803f31J744j337O45J029j736K63M12j134N70L79m60O80n99q1P0j126J249J16
1821E3o75J569l23j152J309p25p17J500n15l74R97r26j27P7o95P25j78l7R12j207
1841e09O8P79j447P81J122j275J099Q07j619O95K6r17O40J27l81O55r71K44j25
1860b01q95J042k16l86J430o39j112J602q83m53J534n97L17M55j053N7m3l76O32
1879B15n54J41Q21j698N34J018j730J022O80q86J008J54j255Q55j43l73P81k99
$$ y = [432, -44, -905, -127, -742, -678, -54, -258, 621, 147, -201, 868, -466, -114, 1161, -224, 111, 1425, -488, -348, 639, -870, -765, 70, -273, 327, -217, -331, -172, -1166, 88, 712, -412, 1173, 1026, -557, 956, 280, -981, 849, 341, -271, 647, -275, -709, -78, -1021, -379, -160, -497, 675, -226, -98, 640, -681, -631, 1113, -224, 421, 1450, -286, -23, 389, -745, -175, 204, -256, 424, -175, -256, -186, -1312, -63, 53, -622, 947, 624, -528, 781, 56, -661, 839, 324, -50, 947, 21, -106, -29, -724, 1, -177, -214, 698, -509, -441, 338, -1109, -328, 794, -481, 618, 1425, -194, 501, 527, -390, 250, 377, -4, 651, -320, -76, -201, -1096, -54, -270, -656, 774, 135, -977, 625, -258, -711, 823, 226, 543, 998, -55, 2, -41, -417, 215, -339, -198, 623, -1075, -541, 477, -1253, -231, 449, -437, 571, 725, -530, 325, 182, -191, 590, 291]
1897B91J62K2o03M65m73q06J285n30l65J255j049o03J404j000oJ182o03M08M15
1916H51n45K73o88J9M42o29P01N22j718P07N0j403J305L75r80J048m6o56O12l70
1936a30NL08k5N70o3r67P27m13o11J023o31m90J285j239J50P03j183K52Q49j94
1956g4K20J54k75M46r30N04P14j131Q92L56j366Q27j81j133Q99J0p42J120l32
1975b2o90Q17q42L78O59m83R21l48n58Q36p79l25J300q60j07R51j465L77L69p46
1995f17L59K44k76Q27n82j60L51o01N74M24q24R84K54j461J081k89r91R19l45
2014a29l75Q38n97k84L54k98M52kj64O48p7n33Q02p79n2J306j397O38O96j243
2034a96K27L9p55M96Q3k32M90l91R8Q8n89N99J12n23J088k66p41J141p73l01Q08
$$ y = [291, 453, 475, -128, 337, -136, -942, 343, -187, -552, 703, -346, -949, 455, -545, -551, 631, 28, 436, 851, 306, 579, -109, -90, 352, -277, 424, 946, -772, -65, -15, -1418, -113, 262, -718, 330, 284, -372, 240, -130, -125, 183, 158, 728, 665, -302, 425, 12, -599, 424, -207, -697, 588, -651, -501, 202, -981, -729, 120, -74, 146, 300, 25, 471, -459, 45, 759, -372, 520, 876, -490, 337, 156, -977, -78, -68, -810, 310, -22, -712, 105, -737, -359, 300, -183, 738, 390, -168, 668, -111, -436, 864, 4, -103, 848, -617, -240, 129, -617, -258, -14, -290, 537, -45, -205, 146, -455, 119, 543, -281, 703, 957, -504, 577, 288, -703, 216, -129, -504, 334, -263, -547, -193, -491, -39, -41, -205, 443, 366, -167, 635, -144, -196, 1110, -287, 351, 1047, -196, 31, 70, -685, -189, -106, -338, 152, -239, -141, -53, -642, -43, 69, -454, 634, 368, -373, 768, -5, -306, 502]
2055E02l81j09O46q99J73k6o93O24M6p6P31q93K78P01j244O14Q59j086O83N09
2075I59j253N60P8p56O13k74k5J57m87M03k4q22J060Q4q37J239n61n28R57m96
2095D7j07M99k77K43J99p18J35k98l6M77m92N3O19r35M02N77j279R29O83j249
2115e28R46L96r27M75m06j0M11n07M15P0p76M22j36p43J115l39m35J232p60o62
2135g47J020n75P6P36o20K56L89o76M85m02j49M57n72N11L35j018M39N3q75Q29
2155d8J29m22R11k11n68M17m20K15L31k95O27j89o57O18o66l07J021q00k40J157
2175F03q40j1N33q54L76M86k98J95n0j46K71m49J28N22o79P09J62j208Q99l04
2195D5p80P91j03n74J031m35l03L47l03N05J10m89P83k97k52M43o43l14J006p04
$$ y = [502, 121, 12, 658, -241, -68, -94, -787, -163, -117, -193, 538, -355, -77, 624, -620, -6, 853, -233, 450, 959, -294, 266, 344, -412, 201, -73, -98, 59, -428, -25, -49, -871, 189, 273, -564, 675, 114, -414, 543, 47, -60, 439, 162, 405, 604, -114, 21, -277, -313, 164, -328, -275, 344, -591, -189, 388, -891, 38, 721, -528, 418, 814, -113, 362, -44, -54, 357, -150, 265, 335, -441, -19, -155, -898, 217, -122, -557, 675, -85, -747, 273, -302, -226, 510, -110, 146, 535, -141, 344, -58, -207, 250, -322, 189, 524, -494, -55, -2, -877, -48, 81, -341, 570, 359, -209, 208, -212, 3, 334, 39, 666, 477, -180, 438, -228, -535, 486, -314, -554, 603, -237, -248, 285, -569, -193, 293, -5, 190, 140, -6, 265, -184, -56, 466, -213, 496, 658, -550, 349, 45, -735, 56, -47, -621, 410, -25, -328, 19, -284, 221, 331, -158, 625, 328, 76, 519, -124, -438, 568, -136]
2215a36m0Q46j249L14M73q14M31K36l15L68q1RJ90p44N72M59q33Q60j32r07R36
2236D43m25n60N91k03k34O23m29k66L91o19O28k8K6O75r97J68N98o60L61O39j045
2257c23L52L15n63k38L94o25N94l6R6J69l92J82K63n61O99k2l20O32j09p38O19
2278C88l98n17R81o10K47J66l22l4K3l67L46j9k01Q97q01K29K72p00M23N38o55
2299a14M19K96j138P85j70m74O47k83k23L90l69J38k2k44M50q4m56Q16k67j61
2319f4N99l60k77M85l78J26L2l53L08k52m31P22m59J28L75p10M85J0n31M01M52
2340C08n78Q20j04o93N76m25j20M52k87Q4Q9l69K84j13m40P19l39k01P97m54k87
2361b81P10o16R0L98l61K53J16n85N30n26J03M36o36K65L62p77L43K03p17Q64
$$ y = [-136, -176, 670, -579, -265, 208, -606, -175, 61, -254, 114, 33, 42, 232, -512, 60, 519, -314, 546, 414, -493, 443, 18, -542, 49, -154, -388, 235, -194, -460, -69, -688, -60, -88, -62, 613, -384, -216, 382, -278, 83, 722, -323, 29, 344, -219, -457, -63, -688, -94, -130, -34, 135, -257, -75, 188, -373, 326, 304, -16, 616, 507, -231, 388, -10, -527, 454, -156, 91, 257, -65, -99, -76, -443, -97, -116, -317, 580, -221, 8, 280, -420, 3, 541, -114, 305, 601, -537, 248, 78, -396, 251, -32, -255, 135, -234, -96, -118, -362, 88, 4, -452, 364, 97, -64, 535, 175, -102, 383, 5, 131, 163, -190, 118, -134, -565, 157, -302, -174, 201, -509, -24, -14, -545, -144, 308, -270, 550, 446, -247, 329, -96, -216, 236, -51, 33, 122, -247, 37, -76, -516, 203, -136, -337, 460, 6, -281, 429, -187, -97, 301, -60, 193, 309, -276, 254, -272, -169, 267, -369, -104, 258, -519, -176, 27, -690, 174]
2381A74Q8m39M90q1j07J43k70J71J03m29N55l18l91L67r0n74Q30m14%L45m52P1
2403b28L29n01L77L76l81N17l73j81N64o57J04K23o17N75K34o10J74J22o01P17
2423A63j94k52M74j07k38M27l62J48R5k51O69l35l19M10m36j25M30k00j71M86
2443C12q68J86N35m60J74L2J39J16l13K44K02m91o5L36j42L65r8l53L04l78l61
2464e84Q91m86J2M14k75K21j88l49M50J87k58L49k15l21O45p01L62J32m32J38
2484hJ76m99J80K51n95M28l2k01O00m50m1K71l37M09l3k18M21j7k01K58l40l67
2506c45N30m44J76L18m19N8o5j07O64l42%K39k56J22K20m20J71L58n56M53K3n21
2528a43J11k25j12M60l02J21J24k01K10j35l71O19K2l42M77k52j43O19m61q1K81
$$ y = [174, 262, -177, 313, 232, 125, 268, -2, 169, 272, -157, 398, 80, -311, 56, -34, -608, 222, -192, -192, 153, -299, -228, 101, -400, -23, 353, -28, 489, 116, -65, 499, -158, -54, 169, -448, 127, 361, -249, -75, 47, -554, 163, -31, -283, 191, 84, -154, 273, -89, 59, 154, -97, 572, 237, -82, 328, -108, -233, 197, -3, -174, 312, -556, -370, 165, -295, -121, -89, 50, 166, -147, 97, 299, -192, -257, 79, -63, 302, 204, -149, 155, -223, -584, 307, -179, -167, 247, -28, 193, 5, -344, 106, 293, 35, 384, 169, -152, 493, -208, 154, 286, -146, -8, 168, -331, -151, 100, -495, -67, -99, -300, 300, -150, -191, 80, -257, 152, 119, -99, 322, 305, 104, 362, 22, -345, 185, -259, -83, 235, -184, -126, -191, -298, 366, 24, 24, 263, 7, 129, 349, -71, 100, 458, -98, 355, 378, -143, -32, -257, -369, 91, -211, -90, 34, -167, 43, -92, -463, 156, 178, -164, 313, 61, -82, 537, 76, -5, 276]
2549B76l92J02K19l32M6j00PK72l85K32K86n13M05J42o65M90K74k71K99j04l60
2570g2L30k08k35L32k83R6k1m51M41k8j77K53k51J91N17n18m5M13l59N9K47k04
2592B7KJ3j62P8j16L7L12l67n9M02k36J33J82n54M88j58j10M38k43l17N08k44
2614E4J10J12m00Q5R3j28J71k76j16N20l83N1N68p43J56K99m26L41N2j64J31j51
2636d4R6Q9k43j06K83l84L14Pl94K82M1j34J03J61k72L32J26l09K54k71N8K48
2658B37j75J70j18m54N41j03j77Qj45K39J57m51L20K4j69J47k4O9PR4j77K28k73
2681b5J72m8r2K16k11j26n0J53l20L65l06J42K78k00J41P6m36J78K15j42J89j00
2703F9j55K63l52K74P4l77K68L4j32o%k63J84k6K99m8k52K46R0j86M0J34l17L80
$$ y = [276, -116, -14, 205, -127, -81, -181, -174, 98, -287, -55, 231, -282, 123, 265, -400, 90, 364, 93, 392, 288, -72, 258, 50, -185, 147, -136, -40, -61, -512, -71, -99, -276, -23, -274, -83, 434, -84, -129, 284, -75, -16, 231, 27, 29, 42, -120, -42, -158, -121, 191, -176, -235, 167, -69, 64, 246, -308, 180, 22, -88, 350, 107, -210, 298, 54, 164, 276, -124, -39, 54, -74, 97, -179, -295, 225, -158, -107, 461, -282, -126, 173, -253, 88, 140, -24, 107, -44, 52, 141, -102, -208, 75, -309, 5, 12, -382, -100, -59, -193, -90, 71, -201, 131, 257, -52, 202, -69, -11, 237, 62, 232, 114, -340, 201, 98, -79, -71, -216, 23, 180, -271, 49, 73, -96, 51, 27, 96, 103, 197, 20, 248, -25, 147, 99, 7, 223, 12, -114, -164, -11, -331, 34, -272, -130, 148, -52, 89, 165, -271, -93, 122, -20, 169, 69, -86, 177, -175, 99, 173, -204, 64, 98, -34, -40, -40, -303, -119, -145, 154, 106, -146, 100, 190, 4, 44, 178, -139, 241]
2727B41k29j89L42k32k99N21j74j37M19n52L23M3k68K61l3k9K03l45K64K13m57
2748a14J43L8k30L43r5j09O9K1j24m1k2K57j79j1K23l3j41M8P2m46P27k64l3L07
2772D06n71J18J71j88N3P4k92J87kj61K87k69j2K94j82L60J52n29J97K5k17K83
2794A84n3j56J21m4l29J74m0L51j67m30N38m58j18N39J58l17L17j78p4K80m23
2815a25J49J91k97Q2M1l76K26p1K12Ql1j07K63m07L48J27l30J18M6q9J74k24J09
2838C7J89k62L2K58l89K47q1j39P3K1o7J17k61ML18j04P8P6j56L7J89l11J59k30
2862a65L23M6j70j51N8o2j1N3k87L54j48q8M24N1k9Kj74J8N0k14K99l5n4j04j
2887a5j67M10l66q2N4k5J14J51j26J22J0n00O22l06k1J02l1K43j41O4P0M0l68
$$ y = [241, 12, -177, 165, -67, -366, 155, -19, -156, 263, -289, 34, 77, -191, 70, 37, 8, 211, -134, 130, 343, -114, 29, 67, -163, 180, 85, -24, 45, 66, -58, -99, -121, 136, -43, -54, 169, 136, -5, 43, 115, -331, 396, 132, 99, 406, -165, -47, 124, -64, -11, 63, -229, -42, -44, -205, 82, -187, -199, 95, -87, 273, 425, -104, 93, 118, -99, 184, 131, -25, 96, 52, -277, -103, -143, 208, 41, -389, 149, -309, -427, 112, 270, -47, 270, 92, 18, 298, -125, 24, 215, -82, 0, 41, -335, -109, -180, 32, 40, 9, -98, 165, -242, 106, 233, -97, 21, 67, -22, 152, -72, 37, 226, -36, -4, 254, -135, 112, 31, -108, -35, -14, -81, 36, -225, -221, 97, -7, 71, 147, -9, 28, 217, -94, 65, -165, 158, 204, 34, -117, -59, -121, -132, -79, -366, -12, -160, -248, 176, 227, 198, 200, 26, 44, 94, -120, 179, 144, 90, -14, -15, -182, 228, -138, -220, -166, -191, -77, 74, -52, 70, 80, -420, 202, -104, -125, -23, -54, 189, 48, 112, 182, 222, -146]
2910a46L07n1k46J4J46l70K80l1j47M96j31j43J5M8o4l3k27L12P7j01R1j83N5
2933c2oj5R6J02k62j41L74k94K07O2l8Q6j30m3O2j12J61O8k66M03m56J75J57l11
2957a53J50J46l88K77N6j2Q1k07k54K81j8L7J54j57j03J22J65L8j00j01J31J8
$$ y = [-146, 161, 110, -136, -122, 24, -346, -66, -97, -244, 252, 121, -22, -7, 41, -23, -56, -283, 29, 106, 5, 96, -87, -32, -38, -53, 43, 145, -117, -258, 116, -178, 29, 91, 53, 139, 9, -34, 28, -84, 77, 145, -121, 282, -174, 1, 158, -153, -3, 143, -245, 32, 88, 76, 157, -50, -304, -23, -41, -4, 150, -7, -110, 12, 177, 215, 115, 14, 145, 163]
$$ [...]
8191a54
##END NTUPLES=NMR FID
##END=
