##TITLE=1H_2-2024
 CDCl3
 8 sc, 
 11.1.2024
##JCAMPDX= 6.0         $$ Bruker NMR JCAMP-DX V2.0
##DATA TYPE= NMR FID
##DATA CLASS= NTUPLES
##ORIGIN= UXNMR, Bruker Analytische Messtechnik GmbH
##OWNER= root
$$ XWIN-NMR		Version 3.5
$$ Thu Jan 11 14:27:28 2024 Russian Standard Time (UT+4h)  she@DPX200
##.OBSERVE FREQUENCY= 200.1313
##.OBSERVE NUCLEUS= ^1H
##.DELAY= (6, 6)
##.ACQUISITION MODE= SIMULTANEOUS
##.ACQUISITION SCHEME= undefined
##.AVERAGES= 8
##.DIGITISER RES= 18
##SPECTROMETER/DATA SYSTEM= spect
##.PULSE SEQUENCE= zg30
##.SOLVENT NAME= CDCl3
##.SHIFT REFERENCE= (INTERNAL, CDCl3, 0, 15.7039)
##AUDIT TRAIL= $$ (NUMBER, WHEN, WHO, WHERE, WHAT)
$$ ##TITLE= Audit trail, XWIN-NMR		Version 3.5
$$ ##JCAMPDX= 5.01
$$ ##ORIGIN= Bruker BioSpin GmbH
$$ ##OWNER= she
$$ F:/spectra/data/she/nmr/H-F/1/audita.txt
$$ ##AUDIT TRAIL=  $$ (NUMBER, WHEN, WHO, WHERE, WHAT)
(   1,<2024-01-11 14:26:02.12 +0400>,<she>,<DPX200>,
      <created by zg, POWCHK disabled, PULCHK disabled
       configuration hash MD5:
       00 E9 B6 7A A2 85 ED C7 34 08 36 98 17 FE 4E 26
       data hash MD5: 16K
       87 15 17 14 54 32 28 E4 86 26 39 F5 75 F8 D2 7D>)
$$ ##END=
$$ 
$$ hash MD5
$$ D0 D6 95 96 4C 1E 01 31 F5 D4 00 07 DA 8E EF 30
##$RELAX= 
##$RELAX= 
##$RELAX= 
##$RELAX= 
##$RELAX= 
##$RELAX= 
$$ Bruker specific parameters
$$ --------------------------
##$DU= <F:/spectra>
##$EXPNO= 1
##$NAME= <H-F>
##$PROCNO= 1
##$TYPE= <nmr>
##$USER= <she>
##$AMP= (0..31)
100 100 100 100 100 100 100 100 100 100 100 100 100 100 100 100 100 100 
100 100 100 100 100 100 100 100 100 100 100 100 100 100 
##$AQSEQ= 0
##$AQ_mod= 1
##$AUNM= <au_zg>
##$AUTOPOS= <>
##$BF1= 200.13
##$BF2= 200.13
##$BF3= 200.13
##$BF4= 200.13
##$BF5= 200.13
##$BF6= 200.13
##$BF7= 200.13
##$BF8= 200.13
##$BYTORDA= 1
##$CFDGTYP= 0
##$CFRGTYP= 5
##$CHEMSTR= <none>
##$CNST= (0..31)
1 1 145 1 1 1 1 1 1 1 1 1 1 1 1 1 1 1 1 1 1 1 1 1 1 1 1 1 1 1 1 1 
##$CPDPRG= <>
##$CPDPRG1= <>
##$CPDPRG2= <>
##$CPDPRG3= <>
##$CPDPRG4= <mlev>
##$CPDPRG5= <mlev>
##$CPDPRG6= <mlev>
##$CPDPRG7= <mlev>
##$CPDPRG8= <mlev>
##$CPDPRGB= <>
##$CPDPRGT= <>
##$D= (0..31)
0 1.2 0 0 0 0 0 0 0 0.06 0 0.03 0 0 0 0 0.0002 0 0 0 0 0 0 0 0 0 0 0 0 
0 0 0 
##$DATE= 1704968761
##$DBL= (0..7)
120 120 120 120 120 120 120 120 
##$DBP= (0..7)
150 150 150 150 150 150 150 150 
##$DBP07= 0
##$DBPNAM0= <>
##$DBPNAM1= <>
##$DBPNAM2= <>
##$DBPNAM3= <>
##$DBPNAM4= <>
##$DBPNAM5= <>
##$DBPNAM6= <>
##$DBPNAM7= <>
##$DBPOAL= (0..7)
0.5 0.5 0.5 0.5 0.5 0.5 0.5 0.5 
##$DBPOFFS= (0..7)
0 0 0 0 0 0 0 0 
##$DE= 6
##$DECBNUC= <off>
##$DECIM= 32
##$DECNUC= <off>
##$DECSTAT= 4
##$DIGMOD= 1
##$DIGTYP= 9
##$DL= (0..7)
0 120 120 120 120 120 120 120 
##$DP= (0..7)
150 150 150 150 150 150 150 150 
##$DP07= 0
##$DPNAME0= <>
##$DPNAME1= <>
##$DPNAME2= <>
##$DPNAME3= <>
##$DPNAME4= <>
##$DPNAME5= <>
##$DPNAME6= <>
##$DPNAME7= <>
##$DPOAL= (0..7)
0.5 0.5 0.5 0.5 0.5 0.5 0.5 0.5 
##$DPOFFS= (0..7)
0 0 0 0 0 0 0 0 
##$DQDMODE= 0
##$DR= 18
##$DS= 0
##$DSLIST= <SSSSSSSSSSSSSSS>
$$ [...]
##$SUBNAM2= <"">
##$SUBNAM3= <"">
##$SUBNAM4= <"">
##$SUBNAM5= <"">
##$SUBNAM6= <"">
##$SUBNAM7= <"">
##$SUBNAM8= <"">
##$SUBNAM9= <"">
##$SW= 18.0517328524113
##$SWIBOX= (0..15)
0 0 2 0 0 0 0 0 0 0 0 0 0 0 0 0 
##$SW_h= 3612.71676300578
##$TD= 16384
##$TD0= 1
##$TE= 0
##$TE2= 300
##$TE3= 300
##$TEG= 300
##$TL= (0..7)
0 120 120 120 120 120 120 120 
##$TP= (0..7)
150 150 150 150 150 150 150 150 
##$TP07= 0
##$TPNAME0= <>
##$TPNAME1= <>
##$TPNAME2= <>
##$TPNAME3= <>
##$TPNAME4= <>
##$TPNAME5= <>
##$TPNAME6= <>
##$TPNAME7= <>
##$TPOAL= (0..7)
0.5 0.5 0.5 0.5 0.5 0.5 0.5 0.5 
##$TPOFFS= (0..7)
0 0 0 0 0 0 0 0 
##$TUNHIN= 0
##$TUNHOUT= 0
##$TUNXOUT= 0
##$USERA1= <user>
##$USERA2= <user>
##$USERA3= <user>
##$USERA4= <user>
##$USERA5= <user>
##$V9= 5
##$VALIST= <valist>
##$VCLIST= <CCCCCCCCCCCCCCC>
##$VD= 0
##$VDLIST= <DDDDDDDDDDDDDDD>
##$VPLIST= <PPPPPPPPPPPPPPP>
##$VTLIST= <TTTTTTTTTTTTTTT>
##$WBST= 1024
##$WBSW= 4
##$XGAIN= (0..3)
0 0 0 0 
##$XL= 0
##$YL= 0
##$YMAX_a= 121198
##$YMIN_a= -156818
##$ZGOPTNS= <>
##$ZL1= 120
##$ZL2= 120
##$ZL3= 120
##$ZL4= 120
##$ABSF1= 10
##$ABSF2= 0
##$ABSG= 5
##$ABSL= 3
##$ALPHA= 0
##$AQORDER= 0
##$ASSFAC= 0
##$ASSFACI= 0
##$ASSFACX= 0
##$ASSWID= 0
##$AUNMP= <proc_1d>
##$AZFE= 0.1
##$AZFW= 0.1
##$BCFW= 1
##$BC_mod= 2
##$BYTORDP= 1
##$COROFFS= 0
##$CY= 11.3945322036743
##$DATMOD= 1
##$DC= 2
##$DFILT= <>
##$DTYPP= 0
##$F1P= 15.7292609196834
##$F2P= 12.9074282941183
##$FCOR= 0.5
##$FTSIZE= 0
##$FT_mod= 4
##$GAMMA= 1
##$GB= 0.15
##$INTBC= 1
##$INTSCL= 1
##$ISEN= 128
##$LB= 0.24
##$LEV0= 0
##$LPBIN= 0
##$MAXI= 10000
##$MC2= 0
##$MEAN= 0
##$ME_mod= 0
##$MI= 1.114404
##$NCOEF= 0
##$NC_proc= 0
##$NLEV= 6
##$NOISF1= 3.799351
##$NOISF2= 2.8
##$NSP= 1
##$NTH_PI= 0
##$NZP= 0
##$OFFSET= 15.70392
##$PC= 1
##$PHC0= -24588.55
##$PHC1= 7.252702
##$PH_mod= 1
##$PKNL= yes
##$PPARMOD= 0
##$PSCAL= 0
##$PSIGN= 0
##$REVERSE= no
##$SF= 200.130013532006
##$SI= 16384
##$SIGF1= 3
##$SIGF2= 2
##$SINO= 400
##$SIOLD= 16384
##$SREGLST= <1H.CDCl3>
##$SSB= 0
##$STSI= 0
##$STSR= 0
##$SW_p= 3612.71676300578
##$SYMM= 0
##$S_DEV= 0
##$TDeff= 0
##$TDoff= 0
##$TI= <>
##$TILT= no
##$TM1= 0
##$TM2= 0
##$TOPLEV= 0
##$USERP1= <user>
##$USERP2= <user>
##$USERP3= <user>
##$USERP4= <user>
##$USERP5= <user>
##$WDW= 1
##$XDIM= 8192
##$YMAX_p= 0
##$YMIN_p= 0
$$ End of Bruker specific parameters
$$ ---------------------------------
##NTUPLES= NMR FID
##VAR_NAME=  TIME,          FID/REAL,        FID/IMAG
##SYMBOL=    X,             R,               I
##VAR_TYPE=  INDEPENDENT,   DEPENDENT,       DEPENDENT
##VAR_FORM=  AFFN,          ASDF,            ASDF
##VAR_DIM=   8192,          8192,            8192
##UNITS=     SECONDS,       ARBITRARY UNITS, ARBITRARY UNITS
##FACTOR=    0.0002768,     1,               1
##FIRST=     0,             0,               0
##LAST=      2.2672688,     0,               0
##MIN=       0,             -156818,         0
##MAX=       2.2672688,     121198,          0
$$ Real data points
##PAGE= N=1
##DATA TABLE= (X++(R..R)), XYDATA
$$ [...]
1927B807j795N02J281j522J570K4k992L05j745j769K469j077J55K009k394O85
1943a487R99j331K481P14j006J887j007q48K368j362j89R03l499k18p6j868K313
1960a226P55r44K179j164l59K627j280J030J657k480N41j50k452J925n63j732
1976a636J286k159j014K082j106J632K218j693J573M09j584K427l02j181J709
1991B661k025j323J291j989J006J035k298R94m10j869K377l8O2K054j518k17J428
2008A221j565J367J042j948J033q11j932J736q18k16J698j783j22J346j942J988
2024B94J346j466J822p03j566K070j274m72J445k650j35K33k378J664Q37j217
2040b150K370k87q86K594p44O78J917j993L77m5k662J316L6j885J407j316j467
$$ plain form
1927 2807 1012 1514 2795 1273 2843 2867 -125 180 -1565 -3334 -865 -1942 -1787 222 -2172 -1487
1943 -1487 -488 -1819 662 1376 370 2257 1250 402 2770 1408 1219 2122 -1377 -1595 -1671 -3539 -1226
1960 -1226 -471 -1415 764 -400 -759 1868 588 1618 3275 795 1336 1186 -1266 659 96 -1636
1976 -1636 -350 -2509 -3523 -1441 -2547 -915 1303 -390 1183 1592 8 2435 2133 952 2661
1991 2661 636 -687 604 -1385 -379 656 -1642 -648 -1058 -2927 -550 -588 -526 1528 10 -207 1221
2008 1221 -344 1023 2065 117 1150 339 -1593 143 -675 -891 807 -976 -1098 248 -1694 294
2024 294 1640 174 1996 1293 -273 1797 523 51 1496 -1154 -1289 -1056 -3434 -1770 -933 -2150
2040 -2150 220 -67 -953 1641 897 1575 3492 1499 1876 1831 -831 485 521 -1364 43 -1273 -2740
2057b740J550j396R13K282j376J404Q29j662J968L8j368J695j749j413J245j886
2073a666M62J690k079J163L06j799J721K38m64K283p20l85J642j787O37O62k130
2090b26N47o98k147J535n73o18K129j166p7J528j620J073J490r55J920K11j387
2107I66J632j158j027J298k225p56O14k146J077J059j015J963J27j291J838j043
2123h7k89J992j484K74J100j887Q56L10j891J377r05j313J695q15L26K071r71
2140C59R15Q99k162Q69J9j971J636o50r20J529j233k57J604j910M72N97j688J361
2158e31N28o16K443m06q15J405j724l76J090k096P22O86j538J578J18j267J620
2175H21j141p14J593j633O86J297j117J256M75j805J074q10j728J541j212l60
$$ plain form
2057 -2740 -1190 -2586 -1673 609 -767 637 1466 -196 1772 1810 442 2137 388 -1025 220 -1666
2073 -1666 -1204 486 -1593 -430 -124 -1923 -202 36 -428 1855 1135 750 2392 605 1242 1904 -226
2090 -226 321 -377 -2524 -989 -1562 -2180 -51 -1217 -1294 234 -1386 -313 1177 222 2142 2353 966
2107 966 2598 1440 413 1711 -514 -1270 -656 -2802 -1725 -666 -1681 282 409 -882 956 -87
2123 -87 -376 1616 132 406 1506 -381 475 785 -1106 271 -634 -1947 -252 -1067 -741 1330 359
2140 359 1274 2173 11 880 899 -1072 564 -86 -1006 523 -710 -967 637 -1273 -801 -204 -1892 -531
2158 -531 -3 -619 1824 1418 603 2008 284 -92 998 -1098 -376 310 -1228 350 468 -799 821
2175 821 -320 -1034 559 -1074 -388 909 -208 1048 1523 -282 792 -18 -1746 -205 -1417 -1777
2191a777J989j297R47J393j467J162J47j486J472n41p29K078j165k45J072k028
2207d75L9K0k205J114J98r87K226j0k86K208j286L35J051k068J014K19j331J383
2225A159l8j712J317j232r88J089j738N14J373j002J687P99r67J694p59j159J399
2242A436j430o42J305j612N23R85j855J146M7j675J591n88n60K182o72N69J599
2259B349j377L16J56j869P85n04j450J405m80m64J778j466K10J155j878P90O69
2276A25j047J714L25p63J747j213r46J303k038p3Q78j683J085P58j181J906l91
2293E06q90J337j238l44J508j217N14J314j779R26j36j847J331n90p53J356q99
2310i01K24J680r72Q66Q10j774Q83o21j281J433m49m45J332j247j81R12j706J089
$$ plain form
2191 -1777 212 -1085 -138 1255 -212 950 1097 -389 1083 542 -187 1891 726 481 1553 -475
2207 -475 -436 -416 -2621 -1507 -1309 -2296 -70 -80 -366 1842 556 891 1942 -126 888 1107 -224 1159
2225 1159 1121 -591 726 -506 -1494 -405 -2143 -1629 -256 -1258 429 1228 261 1955 1196 37 1436
2242 1436 6 -636 669 -943 -420 565 -1290 -144 -97 -1772 -181 -769 -1329 853 181 750 2349
2259 2349 972 1288 1444 -425 360 -144 -1594 -189 -669 -1133 645 -821 -611 544 -1334 -544 125
2276 125 -922 792 1117 354 2101 888 -58 1245 -793 -866 12 -1671 -586 172 -1009 897 506
2293 506 -384 953 -285 -629 879 -338 176 1490 -289 637 501 -1346 -15 -605 -1358 -2 -901
2310 -901 -677 1003 31 897 1707 -67 816 195 -1086 347 -102 -547 785 -462 -643 269 -1437 -348
2328c48L95j172J491K0p47J869o94j84J228j860k52L14j556R47P95j311J484n10
2346i1r93J622r25q2J316r81K44P79j312J339M31j547J207j219j354J479j053
2363a140K16J656j262O54M57j565J282P5r69J528q09o65J574r45K54J036j631
2380b54N44k01j471J189j93p61J871r92k27J078j015K62J183j276P62J99j396
2397f98J341k20o52J337j297o04P31j312M88J241r04J065M9j449J502m91n22J326
2415I31r86l11R86j629R23R41r83Q20k54j417J663r55m15J707j107j86P93j472
2433i51O82M73r96J377m02j076J160n23n9J561j241K84M74j633R07M34j084J511
2451H98n01j153J097q62j18J460j159L07M57j566R59J91o32J507n91o60J116j037
$$ plain form
2328 -348 47 -1125 366 386 -361 1508 814 630 1858 -2 -254 60 -1496 -549 246 -1065 419 -91
2346 -91 -1084 538 -387 -469 847 -134 110 889 -423 916 1347 -200 1007 -212 -1566 -87 -1140
2363 -1140 -924 732 -530 124 581 -984 298 373 -596 932 123 -542 1032 87 341 1377 -254
2380 -254 290 89 -1382 -193 -386 -1147 724 -268 -495 583 -432 -170 1013 -263 499 698 -698
2397 -698 643 423 -229 1108 -189 -793 -62 -1374 -886 355 -549 516 565 -884 618 127 -395 931
2415 931 -55 -366 620 -1009 -86 855 -128 692 438 -979 684 -271 -686 1021 -86 -272 521 -951
2433 -951 -269 204 -792 585 183 -893 267 -256 -315 1246 5 289 763 -870 37 471 -613 898
2451 898 397 -756 341 -521 -639 821 -338 -31 426 -1140 -181 10 -622 885 294 -366 750 -287
2469b87J42J142j055L90M94j786Q81L6q12J228l71p22J003j084K73J235q59R59
2487H07L91j302O90l77p20J208p43p86Q53j455K39J243q47J107K32j239J197m16
2505H2l21J447o90k02O58j496K22Q89j339R81j70j019P67o34j20J471l03l6O59
2524H46j375L65N45r94J194n2j110R41q29p5J170q13K19P45j610O30M66p43J358
2543H78l7r24Q11j016n14J104q60L42N71j106O57J48p43J570l57p27J012j021
2561b12k33J171p89P39M08j601M95k16j080J153j08n35J185q34J62R94o70Q91
2579I20M07j273M45m71p66J156l35l12O33j328o6O03r41J021P26p45Q78o0l82
2598A10J254m54k77O68j614k72M57j077R21K47p43P11k63r53J414l29N9J203r49
$$ plain form
2469 -287 -145 997 -58 332 826 -960 -79 -43 -855 373 2 -720 283 -801 -528 707 -152 807
2487 807 1198 -104 586 209 -511 697 -46 -832 21 -1434 -1195 48 -799 308 540 -699 498 82
2505 82 -239 1208 518 316 974 -522 -300 589 -750 231 61 -958 -191 -825 -945 526 223 187 846
2524 846 -529 -164 381 -613 581 529 -581 360 -469 -544 626 -187 32 777 -833 -203 263 -480 878
2543 878 841 -83 728 -288 -802 302 -558 -216 355 -751 -94 54 -689 881 524 -203 809 -212
2561 -212 -445 726 -63 676 1084 -517 -22 -238 -1318 -165 -273 -808 377 -457 -295 699 29 920
2579 920 1327 54 499 28 -738 418 83 -229 404 -924 -990 -387 -1328 -307 419 -326 552 492 110
2598 110 1364 910 633 1301 -313 -585 -128 -1205 -284 -37 -780 -69 -332 -1285 129 -200 -141 1062 113
2617A13K31O75q52P88M6j371Q01j069o71J097o45N83R07j135K78M31q30R50K45
2636E72o59R25q04l33J033p00J11N94j327K15O2j022J311J67l12Q69l53o23R75
2655G01j058K72P01j048N76k8p62J048p6o40R32j098m09Q64p98P80R20j004P29
2674F02j11j050R46l95m33J063j006j63P26p91P73M39q44N12k17r37R11j16j39
2693b30J300q34j26M55q55K91L86r49Q07k40q56J005j64j85J115q40j41L54r89
2712f96R02K35p74R87k58q47Q18p05n9O27o25J83L43r38R19K08n18P44m66p22
2732f42Q17o70K78J027p03M13K40r80P27k43p35Q51p28m54O80p75L89Q15o55L85
2752C7J88j004R65J59m21J196n04l83L35q76J22N61j215O01j27p88Q13K3l7J145
$$ plain form
2617 113 344 1019 167 955 1001 -370 431 -638 -1309 -212 -857 -274 633 -502 -224 207 -623 327 572
2636 572 -87 838 34 -299 734 34 145 739 -588 -373 -311 -1333 -22 145 -167 702 349 -274 701
2655 701 -357 -85 616 -432 144 116 -646 402 326 -314 618 -480 -889 -25 -823 -43 877 -127 602
2674 602 491 -559 387 -8 -441 622 -384 -547 179 -612 161 600 -244 268 51 -886 25 -91 -230
2693 -230 1070 236 110 565 -290 1 387 -562 245 5 -851 154 -10 -195 920 80 -61 293 -696
2712 -696 206 441 -333 654 396 -451 367 -338 -397 230 -395 -212 131 -807 112 320 -198 546 80 -642
2732 -642 175 -495 -217 810 107 520 760 -220 507 264 -471 380 -348 -802 -122 -897 -508 307 -348 37
2752 37 225 -779 186 345 -76 1120 616 233 568 -308 -186 375 -840 -239 -366 -1154 -341 -318 -355 790
2772G90p09j4M57q30N16M87o83O84q1j074O08l94l56Q39p19j58N81q16P06M60
2792B94n71R25j70o26P19n48k28R50p52n5N18j056K77K92p57P32j9o83Q96m59
2812c21J15R46n77L02J67r34N08J54o51P34l84m53P04p38j68R04p11K71M26o84
2832c90N66K33o64P43k34m66O16r14m6P18q09O72K55q38R25j93l73R08m23k29
2852E7O11p17n1M96p34L89R5q06N53k65l50R74l71P8P74r51K77O12q69P78J4r10
2874c16O16l76n85R43n91m1N00o57L13M89o42M93L54o23O86l43k72Q26q65j5M59
2895C53q39L34J90q61Q46l8m82N90l60j24P88l89J31M86o58K82O4m99O37k81n94
2916d24Q28o47k93N51o81L81M79p25N28J80l80O54j36l17O83p79j2N74q32K94
$$ plain form
2772 790 81 67 524 -306 210 697 14 698 617 -457 151 -243 -599 240 -479 -637 -56 -872 -166 294
2792 294 -277 648 478 -148 571 23 -205 745 -7 -62 456 -600 -323 -31 -788 -56 -75 -758 138 -321
2812 -321 -206 740 163 465 632 -302 206 360 -291 443 59 -394 310 -428 -596 308 -403 -132 294 -390
2832 -390 176 409 -255 488 254 -212 404 -510 -556 162 -647 25 280 -558 367 174 -199 709 286 57
2852 57 668 -49 -100 396 -338 51 146 -660 -107 -372 -722 252 -119 -41 733 -218 59 671 -198 580 594 -316
2874 -316 300 -76 -661 282 -309 -350 150 -507 -194 295 -347 146 500 -123 563 220 -52 774 -91 -106 353
2895 353 -486 -152 38 -823 23 -15 -497 93 -267 -391 397 8 139 625 -33 249 313 -186 451 170 -424
2916 -424 404 -243 -536 15 -666 -285 194 -531 -3 177 -203 451 315 -2 681 -98 -110 464 -368 -74
2936g4M21q55N66N9o58P39j81l72Q83o83l6O62q34M78J68m70K65q4o22P09k83
2957b02j36O82n66K84L49p11M64K17n70O33j77o06Q12m97k14N89p68J38M42q22
2977f59N36M30o59N54L8m94O73l17j64O95o60k07N26o34M16J7o49P57m24k07P05
2998B73o86K87Q12q45M44L14o45N69j85m58M43l24l28O25p88k5N70n15J47M72
3018A57o49P41J02m97P45k97m3N20p84M4M10q77M59np46P31j55m40Q57o13J02
3039b38O27n34M19J89m76M41j63l67N49n03l04O30o08LN49q21L93K11m97Q70j72
3060A98n59Q09k99p4M38m94r4N14q67M87P3p55O94j02m56Q10l50j73N39n39K89
3081H9L28o71M14K73q15P31k84m09P72n76n7N52n90K65K01o09O41o3m97P11k54
$$ plain form
2936 -74 347 -508 58 117 -541 198 17 -355 528 -155 -191 471 -363 115 283 -187 78 -6 -628 81 -202
2957 -202 -338 344 -222 62 411 -300 164 381 -189 444 267 -339 473 -24 -238 351 -417 -279 163 -659
2977 -659 -123 307 -352 202 240 -254 419 102 -62 633 -27 -234 292 -342 74 91 -558 199 -225 -432 273
2998 273 -413 -126 686 -159 285 599 -46 523 338 -120 323 -1 -329 296 -492 -517 53 -462 -315 157
3018 157 -492 249 351 -146 599 302 259 779 -5 39 449 -428 31 26 -720 11 -144 -584 273 -340 -238
3039 -238 389 -145 274 463 -13 428 265 -102 447 -56 -360 270 -338 -335 214 -607 -214 -3 -500 370 198
3060 198 -361 448 149 75 513 19 -75 439 -428 59 132 -623 71 -31 -487 323 -27 -200 339 -200 89
3081 89 417 -254 160 433 -382 349 65 -344 428 -148 -205 347 -243 22 223 -386 255 192 -305 406 152
3102A52l09M38n37J27M89p19L79J00n39N40j19m26Q30l91j79P16o58J62M77q57
3122c24M29P0p39N81M1n90O26k24m8O66o63K50J59l50M62J12m91M15l09m25O10
3143B58o06J9L92o59M04K75m50M85Rm42Q83k98j79M43m37m7N00n61M9K60p65N09
3165D2j42n43R10o20N4N48n05K83L11n34L10K31m89M03K6m92N30l95k32N63m62
3186b03K0J72n21M20J16m35O76j04k90N74l64k1K98m31L39j5o56O13k45n24O59
3207G8l12k05N91l85J82M66m10N6N08o12L81N3p23N15k52l12O81n30j9M55o59
3228d53M31K70n44N61P0l67N58n91l55P16n65L8L23n85M63rm03O51j36m02P33
3249D04m42l1M33o08L08K44m27K38j28m65N21k30k26M97n90J22N03o22O12R3l18
$$ plain form
3102 152 -157 281 -256 -129 360 -359 20 120 -419 121 2 -424 406 15 -164 552 -106 56 533 -324
3122 -324 105 175 -564 17 58 -532 94 -130 -178 488 -175 75 234 -116 346 458 -33 382 73 -352 258
3143 258 -348 -329 63 -596 -192 83 -367 118 127 -315 568 270 91 534 97 50 550 -11 38 298 -467 42
3165 42 -100 -643 267 -353 -299 249 -256 27 338 -196 114 345 -144 259 285 -207 323 -72 -304 259 -203
3186 -203 -183 -11 -532 -112 4 -431 245 141 -149 425 61 40 338 -93 246 231 -425 188 -57 -581 78
3207 78 -234 -439 152 -233 -51 415 5 61 569 -43 338 391 -332 183 -69 -381 300 -230 -249 206 -453
3228 -453 -22 248 -296 265 335 -32 526 -65 -420 296 -269 -231 92 -493 -30 -39 -442 209 73 -329 404
3249 404 -38 -69 364 -244 64 308 -119 119 -9 -474 47 -183 -409 88 -502 -380 123 -499 113 206 -112
3270a12N01k8k76M84m71m4N18p72R1K34o17K69J49m19L79j9k02O93l59j3N38n31
3292gM45J95p88M25k53o01O16m01j14N54m72j25O44m69L22M49m40L84J75n65N92
3313E66l40k90N53n83k44K59l55K38K50o67P39l3n77P60j74j70N97m87L3L38n61
3334a48K06L47n01J84j50l95N28l15p6N32m23P1L62n20M35K12m24L78k23l05M92
3355B67l89q1L65m29jM20n84M98J06l17M25j47j76L84m14K70K15m97M1J6m64O08
3377A16m3n29P64k46l49M64l78P2M94m32J40M84p30L13q9l94O49l67l19L71m13
3398d22L50J89k55K62j0m57O04j45k07M76k86j06K97o20K56L07o23M24k09k85
3418d60M59o9l17P01k62l2K74n07L27L73m56L94k06m78L22k43k89O89n33n9J75
$$ plain form
3270 -112 389 361 85 569 98 54 572 -200 -109 125 -492 -223 -74 -493 -114 -133 -335 358 -1 -14 524 -7
3292 -7 438 633 -155 270 17 -584 32 -369 -483 71 -401 -526 118 -351 -29 420 -20 364 539 -26 566
3313 566 226 -64 489 -94 -338 -79 -434 -196 54 -613 126 93 -484 276 102 -68 529 42 75 413 -148
3334 -148 58 405 -96 88 -62 -457 71 -244 -320 212 -211 -140 222 -298 137 349 -75 303 80 -225 267
3355 267 -122 -203 162 -267 -268 152 -432 66 172 -145 280 133 -43 341 -73 197 412 -85 -44 -28 -492 116
3377 116 73 -456 308 62 -287 177 -201 -129 365 -67 73 557 -173 140 51 -343 306 -61 -380 -9 -422
3398 -422 -72 117 -138 124 114 -343 261 116 -91 385 99 -7 290 -330 -74 233 -390 34 -175 -460
3418 -460 -1 -70 -387 314 52 20 294 -213 114 487 31 425 219 -259 63 -180 -469 220 -313 -372 -197
3439a97k08P8L23k78O62r9l97L84n4k98M38k95K2O1m40K35J61m97M29j35m54N34
3461b5k30Q6M63k77L47J53n37K45J61m34M25m27l18M83n90Q5L97l69J64L57l71
3482b12M38k17m2N38K0m75M47n99m3L77o13M26J9o74N82j49k43P81l51k45L98
3503A63l52K28K90m19K94J07l41L9j53k26M71k53j26M99n21L08K13l71M62p0n07
3524b65M89j96k99O01m29L0L65n85Q1J17m02N60P0l08N70k28j70M59l61P7J01
3545B77m99K51J06m24K72j5o02O84m12N3M64m37K49M80n43M45o0m06M49l42k44
3566b54K56l49j94K91j02K74K54m74L09J25l41N13k17j52M94l52j15L90n03L22
3586A75j27l33Q0J06m53N76p9j54N40m96N8L29l51J63K73l13J24p3l60M84r2k25
$$ plain form
3439 -197 -405 -327 -4 -282 380 281 -116 268 214 -84 354 59 81 142 -298 -63 98 -399 30 -105 -559 -25
3461 -25 -255 -169 294 17 364 517 -20 225 386 -48 377 -50 -368 115 -475 -390 7 -362 -198 159 -212
3482 -212 226 9 -33 505 525 50 497 -102 -145 232 -381 45 64 -610 -28 -177 -420 361 10 -235 163
3503 163 -189 39 329 -90 204 311 -30 9 -144 -370 101 -152 -278 221 -300 8 221 -150 312 242 -265
3524 -265 224 28 -271 330 -99 -69 296 -289 -208 -91 -493 67 137 -171 399 171 1 460 99 176 277
3545 277 -222 29 135 -289 -17 -32 -634 50 -362 -309 155 -282 -33 447 -96 349 289 -117 332 -10 -254
3566 -254 2 -347 -541 -250 -352 -78 176 -298 11 136 -205 308 91 -61 433 81 -34 356 -147 175
3586 175 48 -285 -205 -99 -552 24 -55 -209 331 -165 -107 222 -129 34 307 -6 118 45 -315 169 77 -148
3608a48L25m75J49J07l60M82O3o1K81o3m15K70j20k34M32m96R3J52r5K98M9l70
3630a36M46l98m03M64M0j10M36l52M6J45n02M66J3l88M66j66m24M42k34J78L30
3651C59m46J83k2k61K82o9n1K02j53j95K89m10K04K23l18M28j14m42M90K54m45
3672a2L28k77p8J55j97J64O9k35J40o3k58K50j50QL62l94K29J22j07J90J35m27
3694d6L49j70k84J86j01L8K30m02J84J64m36L02K17l25J42Jj74L47k21J1L53m75
3716a10Q1J25l36J15M25l71J79j40k39M08l16QM17k85o8K49l15L48l7k22M16j89
3738A43l47L00k03J4K39l48N4K94n28N46j93k96O71m35J07J35j34q9K46k86Q0
3759c0J79l46M97k12j48K75k98O1J40k64J00M17l74K2m8k53L13j1k15L27j37k70
$$ plain form
3608 -148 177 -298 -149 -42 -402 80 143 82 363 300 -115 155 35 -199 233 -263 -170 -18 -113 185 234 -136
3630 -136 310 -88 -491 -27 13 -97 339 -13 33 178 -324 142 155 -233 233 67 -357 85 -149 29 359
3651 359 -87 96 74 -187 95 26 -25 177 24 -171 118 -292 -88 135 -183 245 131 -311 179 433 -12
3672 -12 316 39 -39 116 -81 83 152 -83 57 -6 -264 -14 -164 -156 206 -188 41 163 56 246 381 -46
3694 -46 303 133 -151 35 -66 -28 202 -200 -16 148 -288 14 231 -94 48 49 -125 222 1 12 365 -110
3716 -110 -29 96 -240 -125 300 -71 108 -32 -271 137 -179 -171 246 -39 -107 142 -173 175 138 -84 332 143
3738 143 -204 96 -107 -93 146 -202 -148 146 -382 164 -29 -325 346 -89 18 153 19 -70 176 -110 -30
3759 -30 149 -197 300 88 -60 215 -83 -22 118 -146 -46 371 -3 19 -29 -282 31 20 -195 132 -5 -275
3781b75L84k73R7J44j47K71Kl56L73l03j72N27k75k43K89l19Q2J15J9K13r4l19
3803b60L23M4k47M51n2j54k0l93K82J20m05M60n5l86M00k83J16K35j84P5J33k30
3825c0L56j71j69L69k83k30J43k76J25L42m72K38J72l40J84l0j17K34R8j94L95
3846C44k88N4L6j45Q9m4m42K59Ok83M31j8q6L06l41K1M07n53L03J55l60L29j5
3869A65k73K25K4k29K19m81L82L53m90P6L45k49P2j90l31N00l25O2L27l50J73
3890EJ27m78M90n9k32L31n1k61K77k59K10J40k50o5K24l72J26n9j70K93l8j81
3912b52M48k23m2L24m39P6Q6l1j4L52k44J86k07p8K99o80J51K72l62K87N2j48
3934a87L10j90O2K40k73%L31k76J5M35n51K02K4m15K01j19j56M10k92P3L04l9
$$ plain form
3781 -275 109 -164 -67 77 -70 201 203 -153 220 -83 -255 272 -3 -246 43 -276 -194 -79 -60 153 59 -260
3803 -260 63 107 -140 311 259 105 85 -308 -26 94 -311 149 94 -292 108 -175 -59 176 -8 67 200 -30
3825 -30 326 155 -14 355 72 -158 -15 -291 -166 176 -296 -58 114 -226 -42 -72 -189 45 143 -51 344
3846 344 56 110 146 1 90 46 -396 -137 -131 -414 17 -1 -87 219 -122 -101 306 -247 56 211 -149 180 165
3869 165 -108 117 141 -88 131 -350 32 385 -105 -29 316 67 139 -51 -382 118 -207 -145 182 -168 5
3890 5 132 -346 144 85 -147 184 133 -128 149 -110 100 240 -10 -75 149 -223 -97 -156 -326 -33 -71 -252
3912 -252 196 -27 -69 255 -184 -108 -22 -53 -67 285 41 227 20 -58 241 -439 -288 -16 -378 -91 -39 -187
3934 -187 123 -67 -5 235 -38 -38 293 17 32 467 -84 118 142 -273 -72 -191 -347 63 -229 -156 148 109
3956A09J32N5l67J91L8r4J74n5k41L16l53J4K11p02M18j3r5M38r9k78L85M0j71
3979E3M16m82o4J75j45R2J27l21K39j26j47K16j68j01K38k19K21K25k94L06N5
4000B96m33L56r8k60L51l76j0J65r0OJ68k28Q5Q7l31M54j44KL17k27L1K64l64
4023B1m7K02l91K98j89k05L43q5L6J92l44J12J77k57J83J05j36J59N1l40J75k88
4045b28L8K39k93j09L62j25K70k4k64M07j57j97K48j64r9M05m41J78J2m33L73
4066bJ7j70K96j24j43K86k63J49K43k27M5K7p9k7M4k80L67l97M3K38j81L0m0j21
4090b69J16M30k96Q0P3j35K98r9l94L32k51n6M8j68K36P8k71K83j35j61L69m6
4112F2j03K07j77J9J93k76L29q8m26K96k72j84M12k77L1O01n33L1K98j72J73q
$$ plain form
3956 109 241 296 -71 120 158 64 238 183 -58 258 -95 -81 130 -572 -154 -167 -262 176 77 -201 184 224 53
3979 53 469 -13 -77 98 -47 45 172 -149 90 -36 -183 33 -135 -236 2 -217 4 229 -65 241 296
4000 296 -137 219 121 -139 212 -164 -174 -9 -99 -93 75 -153 -68 19 -312 142 -2 0 317 90 121 385 21
4023 21 -26 176 -215 83 -106 -311 32 -53 -17 175 -169 -57 120 -137 46 151 15 174 225 -115 60 -228
4045 -228 -190 49 -244 -353 9 -116 154 130 -134 273 116 -81 167 3 -96 309 -132 46 58 -375 -2
4066 -2 15 -155 141 17 -126 160 -103 46 289 62 107 134 55 28 72 -208 159 -238 -195 43 -138 -108 -148 -269
4090 -269 -153 277 -19 61 134 -1 297 198 -196 136 -115 -171 -123 -291 -55 23 -248 35 -100 -261 108 62
4112 62 -41 166 -11 8 201 -75 254 166 -260 36 -236 -420 -8 -285 -254 347 -186 -155 143 -29 144 136
4134A36j86L07l46j34M63k38j8K69m65J14R6l71L94Q8k96K40k89R8M41l64jJ69
4156A07l13K30J1p4J48L8j58J65m77K32K71k04m8L05k00J80k40l2K75k33j81L82
4178A84m27Q1L60k91J00J34l65K33L6k81N19k68J21%j85l6L04j67N4K34n27K76
4200H9k09p0L59j92p3K65m35K48N7k35K30P0j40J16p6m6J10j23l3J90k44j60L74
4223G2j90K21J63m64L75k39k9M85l93l1J77l70K65j29o2J21N4j98L11k64j01L21
4245I5o5L0J94k88J92k1k84L48R4l16J42j86k42N04n12L63J53k76K65j81k89M39
4267A59Jm03M48k47l4J11q6M9N1l81K61P2m37L14M8r9K20m5p2K94m66M19m3j86
4291e2J91j00l77N00k58R9J04k85m7J81k28L11Q6q0K93j26m40K87j97J90R8l53
$$ plain form
4134 136 -50 257 -89 -223 240 2 -16 253 -212 -98 -2 -373 21 109 -187 53 -236 -138 303 -61 -62 107
4156 107 -206 24 35 -39 109 147 -11 154 -323 -91 180 -24 -72 233 33 213 -27 -59 216 -17 -198 184
4178 184 -243 -162 198 -93 7 141 -224 9 45 -236 283 15 136 136 -49 -85 219 52 106 340 -187 89
4200 89 -120 -190 169 -23 -96 169 -266 -18 39 -196 34 104 -36 80 4 -42 68 -55 -88 102 -142 -302 72
4223 72 -118 103 266 -198 177 -62 -91 394 1 -30 147 -223 42 -87 -149 -28 26 -172 139 -125 -226 95
4245 95 30 60 254 -34 158 137 -147 201 295 -21 121 -65 -307 197 -315 48 201 -75 190 9 -280 159
4267 159 160 -243 205 -42 -76 35 -51 -2 49 -332 -71 1 -436 -122 -74 -173 47 2 -70 224 -242 177 134 -52
4291 -52 139 39 -338 162 -96 3 107 -178 -225 -44 -272 39 125 45 338 212 -228 59 -138 52 150 -203
4313b03R0L4j81M41l7j90j42K59k62K72q4q8K55j31M0k6k54J02K09l44K19j1j66
4336a98L04j64J14P2k11O9J18k83J55J33n5L8l9k04L25l91NM13m09J24K5j96L52
4359I7J05j76K22m4l38J82j89Q9J99j92K28Q9n91K03L7j55L10j79J0M50n63J63
4381d3L65l59P5M8j40P2m9r7L49j66k08K46m51J26K27j77K97j32j00L97k80m6
4403d6J08p7N0P1l97K68J88k61J27J38k18K37j62k08L90k19l4N0j52L3J57j49
4425a06K42J38n35K36p5j1K39Kr7M0k06J25O5j88O6ok07N93l24l1K89l14K38N7
4449B30l53J10J04l13N39k31j67K73k20M0M2k22J52q5n5L7K9O6J92o0n3K26l75
4472i4N5J89j06J36n0k31J81n6q2O0r9j91K13j14M4K01l72N13j67k59K69P6l76
$$ plain form
4313 -203 -113 -79 -260 181 144 -46 -188 71 -191 81 -3 -91 164 33 73 47 -207 -105 104 -240 -21 -32 -198
4336 -198 106 -58 56 128 -83 -14 104 -179 -24 109 54 92 53 -151 174 -217 -212 201 -208 -84 -59 -255 97
4359 97 202 26 248 204 -134 48 -141 -52 147 -45 183 272 -319 -116 -79 -234 76 -103 -93 357 -206 -43
4381 -43 322 -37 38 86 -54 18 -31 -128 221 55 -153 93 -358 -232 -5 -182 115 -17 -117 280 0 -46
4403 -46 62 -15 35 106 -291 -23 165 -96 31 169 -49 188 26 -182 208 -11 -45 5 -147 -114 43 -106
4425 -106 136 274 -261 -25 -100 -111 128 130 33 73 -133 -8 57 -131 -65 -71 -278 315 -9 -40 249 -65 173 230
4449 230 -123 -13 91 -222 317 86 -81 192 -28 12 54 -168 -16 -101 -156 -119 -90 -24 168 108 55 281 -94
4472 -94 -39 150 44 180 130 -101 80 24 -58 2 -97 -288 -75 -189 -145 56 -316 197 30 -229 40 116 -260
4495b60K90j19R6J42k47Q3L6l66M28P1k70J36q2j58M41k16n4J07j62Q2K3j80J69
4518a0J92j73J59k00M0Q1j56L5O9k41K37m9j29K47J04k39J00j21k41L55n4oJ14
4541A14j83L4p3n9K99m5j44R8o1j74L09k88K53K3l15K31r0k12L94M6j91K74m93
4564b53J35J45l0J22nk70L00k32lK81j27r0J53j35j5J20o4Kr3j13J48Q0k64M50
4588B42j40k2J54l15P3J42j53R8l2j82J97k13j46M54l06J84L2l10L56R9k36R9
4610G5Q0k95J86M1o2j84K00j26K62k10l1N5l30L05J00j10J51Mp5K15j69m1J16
4633A57l15K20j62q0K00rl6R3l59J25K21j95Q7R1j05K61Pk74K47m2j72J91j60
4656ij62p9N5O9K44l38J94L8l14L41N2j01N7o5rK53l35m5K28j87J05J3k86K77
$$ plain form
4495 -260 30 -89 7 149 -98 -15 21 -345 83 154 -116 20 -62 -220 221 5 -49 58 -104 -22 1 -179 -10
4518 -10 182 9 168 -32 8 89 -67 -32 37 -204 33 -16 -145 102 206 -33 67 -54 -295 60 6 0 114
4541 114 -69 -35 -108 -167 132 87 -57 41 -20 -194 115 -173 80 103 -212 19 -71 -283 111 157 -34 240 -253
4564 -253 -118 27 -3 119 114 -156 144 -88 -91 190 63 -27 126 -9 -24 96 32 34 -59 -172 -24 56 -208 242
4588 242 102 80 234 -81 -8 134 -19 79 47 -135 62 -151 -297 157 -149 35 67 -243 113 212 -24 75
4610 75 155 -140 46 87 25 -159 41 -85 177 -33 -64 -9 -339 -34 66 -44 107 111 36 251 82 41 157
4633 157 -158 62 -100 -180 20 11 -25 68 -291 -166 55 -140 -53 38 -67 194 201 -73 174 132 -40 151 -9
4656 -9 -171 -250 -195 -126 118 -220 -26 12 -302 39 91 -10 47 -18 -27 226 -109 -154 74 -113 -8 5 -281 -4
4680dj07j3L14l16l0K16r5N4J85k40O7O1j98J35m1r2l9K38p7P4j78O8j17r7M37
4705B05l2k74K04m2j26K43k16l6K41k66J26J08m63N13k16k48M65l25QL37j83l8
4727a5K31l54K15k7j21J40j55M8J62j94l2OM0J15M0j6O6jk20K42j77o0J86n8j18
4752e7R2j44J20jj30Q5N5j75J07M6q2L31k92J90P8l46J25l1j83L68j71PM3j87
4776a52J64L3j24r8K25m1J24J44l07K49j18k64K56J7j63J98j52k07J05n6K05p4
4798c6j73L09jL7J5k26L7K16k32J50L8j73K47l54O3j3K08j99R5n1m9L63k96m4
4822f9K07j30R0j12j10L03j60j51K72l40J37J13k28L40j00j27O1J32p0J9l5j42
4844a00M7j1L3K76m03K32j13o3K91j48n7P5%k4Q9l98L72q1m4J39k64J66O9j61
$$ plain form
4680 -4 -111 -124 190 -126 -156 60 -35 19 204 -36 31 92 -106 29 -12 -104 -143 95 18 92 -86 -18 -135 -232 205
4705 205 173 -101 103 61 -65 178 -38 -74 167 -99 27 135 -328 185 -31 -279 186 -139 -131 206 23 -15
4727 -15 216 -138 77 50 -71 69 -86 -38 124 -70 -102 -96 -56 59 99 83 149 148 -72 170 -7 -67 119 61 -57
4752 -57 35 -109 11 10 -120 -35 20 -155 -48 -2 -84 247 -45 145 223 -123 2 -29 -212 156 -15 -8 35 -152
4776 -152 12 45 -79 -177 48 7 131 275 -32 217 99 -165 91 108 -55 143 -9 -216 -111 -167 38 -36
4798 -36 -209 100 99 136 151 -75 -38 178 -54 96 134 -39 208 -146 -83 -96 112 -87 8 -43 -92 271 -25 -69
4822 -69 138 8 98 -14 -124 179 19 -132 140 -200 -63 50 -178 162 62 -65 -4 128 58 77 42 -100
4844 -100 -53 -64 -31 245 -158 74 -39 -102 189 41 -16 59 59 35 124 -274 98 17 -27 112 -152 14 83 -78
4868g8j37M26m6j66J54k29k7J70j86K79j55M3J99k91K4J16k59J13l3k19L13J40
4890A51m38K98l2L7K65l76J58n3j58J84K09l33R0J09k01J76q5j8J8o1Q8K11k59
4913b0J24J3k77L55o7j05P5j54J34j45j9Q4P7o6oo9j61L54n1j80K77k10J72K1
4937A56o6j09o6j8L16j87n1j9o2r6K47j17QR5j49J44J7l8m7O1j83J41J33j29J75
4962A56j90J26Q8k88k5nl4J67n3j0J94k9j35K08k98J90K20l41J03m5j54K27j47
4985g5P9K76l11r0J85r0K5R1j00J2l4n2Q6j34K86J21k37k14K74k36J52n7K2O5
5009D4r5J48j19J84k44L29k37O9M5r8r7O0j17P1o0L7N2N2j95L23k13K65n5j44
5033EJ11j55m3L16k44j76K28j18J78l0k80K72Q7k69K61L0k94K16r0R4Or9M6J48
$$ plain form
4868 -78 -215 211 165 -1 153 -76 -103 67 -119 160 5 48 247 -44 -20 96 -163 -50 -83 -302 11 151
4890 151 -287 11 -21 16 281 -95 63 10 -148 36 245 -88 2 111 -90 86 1 -17 1 -60 28 239 -20
4913 -20 104 117 -160 195 128 23 98 -56 78 -67 -86 -2 75 9 3 -66 -227 127 76 -104 173 -37 135 156
4937 156 90 -19 -85 -103 213 26 -25 -44 -106 -202 45 -72 -64 31 -118 26 43 5 -42 19 -164 -23 110 -19 156
4962 156 -34 92 180 -108 -133 -138 -172 -5 -58 -68 126 97 -38 170 -128 62 282 -59 44 -1 -155 72 -75
4985 -75 4 280 -31 -121 64 -26 -1 90 -10 2 -32 -84 2 -132 154 275 38 -176 98 -138 14 -43 -21 44
5009 44 -51 97 -22 162 -82 247 10 79 124 26 -71 -11 -128 -57 -117 -80 -28 24 -171 152 -61 204 149 5
5033 5 116 -39 -82 234 -10 -186 42 -76 102 72 -208 64 151 -118 143 173 -121 95 5 99 105 6 52 200
5057B00j10m9J14l52P3J87k50K15J64k30K22l9rJ67k86J32R3j54o8J0k39L10r0
5080A1j44K83j72J03J53k49L8N3j25J38o2j07R2q6J20L3k58J65O0j14J02R4l25
5103a97L13l07L30J19m47J69O0o5j5l2J85Nl7k12L60k42k3K65l21J65J01j96%
5126b2Q4j18K13j59j80M45m56J81Pj94J39N6k6j76J03j54M48k05m4J59j06p8J98
5149A15k07N4J4O6K6L7k05J96k23j23L06N9j34J23k26L34k93M8J09Kj50J42j76
5172a06J32J05l78J54K9j41L02K9j57J78l0m08M58r1n5K43j41o6j22n7K45N8k61
5195h0J03M9j57K80j27j32J34k66M9M4K85j96k2K1J12j88NK78k49o3R1P1p4J62
5219A30k93K56j50j35M68l65P3J07j95N0J03k02J62J29k04Nq6PJ10Q4k6M6J2n3
$$ plain form
5057 200 90 41 155 -197 -124 63 -187 28 192 -38 184 145 136 303 17 149 242 88 20 30 -209 101 11
5080 11 -133 150 -22 81 234 -15 23 76 -49 89 27 -80 12 -74 46 79 -179 -14 46 -68 34 128 -197
5103 -197 116 -191 139 258 -189 -20 40 -25 -40 -72 113 118 81 -131 229 -13 -36 229 -92 73 174 -22 -22
5126 -22 62 -56 157 -2 -182 263 -193 -12 -5 -199 -60 -4 -30 -206 -103 -257 191 -14 -58 101 -5 -83 115
5149 115 -92 -38 -24 42 68 105 -100 96 -127 -250 56 115 -19 104 -122 212 -81 -33 76 78 -72 70 -106
5172 -106 26 131 -247 -93 -64 -205 97 126 -31 147 117 -291 167 76 21 264 123 57 -65 -122 123 181 -80
5195 -80 23 72 -85 195 68 -64 70 -196 -147 -103 182 -14 -36 -15 97 -91 -86 192 -57 -120 -29 42 -32 130
5219 130 -163 93 -57 -192 276 -89 -16 91 -104 -54 49 -153 9 138 -66 -61 -147 -140 -30 54 28 74 86 33
5243C3j8M5j89K40l07K56R8q4k1j73o6K73k72J97J16j51j6P1q9Q6j49J27J61k19
5267e1L8J06p8M1j0q3L2M0j85J77l8o3L81l16J02j01J06k47K48j41N7k3q7K18
5291A23j55o1K43l17J6L01j77O9R5j61J83j72R5R0j02j65J19l76K59J83k26J80
5313D4o7j84J73m8n5L26q0j43P2K3p2J01k80K58j6p1J16j59K5J20j48O6K3j25
5337a01L8K42l20L16k19oK12L8j75M1q3k75J89PP6l6K3K16k69J9M3j0Q0j5J9J5
5363F5P1l32L33M1k36J42n7k73J65k2J18L9Jr3M8j67R4K08q4j8k52K04J10k51
5387a46J7J65J00j50O0r3J11J49k97K37k25J89K27l74l9Q8n8J03j54N8j6J05J0
5410F7j10LN2Pj68J41J50k25Q8J2n7N8l9j6mj3l1m4J91o4J29j42J07j6j81J66
$$ plain form
5243 33 15 60 -129 111 -196 60 158 74 53 -120 -186 87 -185 12 128 -23 -39 32 -57 29 -120 7 168 -51
5267 -51 -13 93 15 56 46 -37 -5 35 -150 27 -11 -74 307 -9 93 -8 98 -149 99 -42 15 -8 -95 123
5291 123 -32 -93 150 -167 -151 150 -27 42 137 -24 159 -13 82 172 70 -95 24 -352 -93 90 -136 44
5313 44 -23 -207 -34 -82 -137 189 109 -34 38 61 -11 90 -190 68 52 -19 97 -62 -37 83 -65 1 24 -101
5337 -101 -63 179 -141 175 -44 -50 162 200 25 66 -17 -292 -103 -96 -20 -56 -33 183 -86 -67 -24 -34 46 31 50 65
5363 65 136 -196 137 178 -58 84 27 -246 -81 -103 15 54 55 -38 10 -157 -63 145 61 43 -209 -5 105 -146
5387 -146 -129 36 136 -14 46 -47 64 213 -84 153 -72 117 344 -30 -69 19 -39 64 -90 -32 -48 57 67
5410 67 -43 -40 12 19 -149 -8 142 -83 5 17 -40 18 -21 -37 -41 -54 -85 -129 62 -2 127 -15 92 76 -105 61
5436F1q9J8R2k68K97j8j07Pm4J8j22R4J21j57J42k77M54j90J36j37j35J63q1n7
5460g9Q1K4j59K36j57L8J0m1j34J59L3J85l06L9P6r2J39j20J09m8M8r2J13j10
5484d8Q8J27k10J9L4r0P3L8j05o2J74j48J35p8m0J72j8j21Q2n4q1J80j94J66J5
5509E4j03L9O2o3Q3j9J4N1n5p3o1J34o7K37l30P7l8J43LL3k47J80r4P7J70l29
5535a22MJ84k61L40o5q0P5kj50J73l6j89K39j91J83Pn5j14J20j39N1o8J33L0J4
5560H1k34J78O8J58Kl60K70k04m1L12k02%m4J03l00J72%J99m7k02J69nk0n8n4
5585e9R3k3N2N1l3L7m8J9o0K0q3K7J36k61K14j5j11J64j30j4J47j64j08K56j06
5610Ak5J19k33O5J7R3p0K4j44K80q1j29K44k57N8r3J78jR1J1P9k29M8j2N1j03
$$ plain form
5436 61 -28 -10 82 -186 111 93 -14 -7 -51 -33 -155 -61 60 -97 45 -232 222 32 168 31 -104 59 -22 -79
5460 -79 2 26 -133 103 -54 -16 -6 -47 -181 -22 11 196 -110 -71 5 -87 52 -68 41 -7 41 -51 62 -48
5484 -48 40 167 -43 -24 10 -80 -7 31 -74 -136 38 -110 25 -53 -93 79 61 -60 22 -32 -113 67 -127 39 54
5509 54 -49 -10 52 -11 72 53 67 118 63 -10 -71 63 -4 233 -97 -20 -58 85 88 121 -126 54 -40 37 207 -122
5535 -122 -118 66 -195 145 80 0 75 73 -77 96 60 -129 110 -81 102 109 54 -60 60 -79 -28 -96 37 67 81
5560 81 -153 25 93 251 253 -107 163 -41 -82 230 28 28 -16 87 -213 -41 -41 158 111 -91 78 73 53 -5 -59
5585 -59 34 11 63 114 81 118 70 89 29 49 -34 -7 129 -132 82 67 -44 120 -10 -24 123 -41 -149 107 1
5610 1 -24 95 -138 -73 -56 37 -33 -9 -153 127 46 -83 161 -96 -38 -131 47 46 137 148 227 -2 46 34 85 -18
5636a8J9Q2j6n9J9j26J64j99J66M2j57J88j88M9J8k13J85J63j83J10qj08K6j9
5660f3j44K42r8J26L1q2L9m8j6R5k02J29K8M1k66J65J54k24J34J5q2J50k83K54
5684I5l7j84K05q4kJ06j83m4O1R7O8n8m4O9j37N6J66j37o5J66j29Q5Q0j72J50
5709A28j30o8J81j11N2R8k48K1J81r2o0M3lK0N1j62J62J26l49J31n6Q5M4J05k30
5734h1L9L3qJ76j19J24j52N0l9pn1P2m0j3J13j32Jj6J60k0r4j54J50K1K0j22p5
5761a64J74o4R7P7k06M9k0n3l1K28j59J59J37m73M25k29j34K95j14k16K97K4l4
5784F5k8j49K28j62PJ18R3j90K61l48J63M2n9j59L19k03n6J80j99K74j74m2l2
5807e1J53r5J57j67O8J8k30J04%J22P1k43OR1N4j28L8k7J08j59K49k35J35Pq2
$$ plain form
5636 -18 1 83 67 8 27 -99 65 -134 32 74 -83 105 -83 -34 -16 -229 -44 119 -64 46 38 -70 -44 -63
5660 -63 -207 35 -63 63 94 12 51 3 -13 82 -120 9 37 78 -188 -23 131 -93 41 56 -26 124 -159 95
5684 95 58 -126 79 -5 -7 99 -84 -128 -67 30 98 40 -4 65 -72 -16 150 13 -52 114 -15 70 150 -22 128
5709 128 -2 -70 111 0 52 150 -98 -77 104 12 -48 -5 -8 12 63 -99 63 189 -160 -29 -85 0 44 149 -81
5734 -81 -42 -9 -17 159 40 164 12 62 23 16 -35 37 -3 -16 97 -35 -34 -50 110 90 -4 -158 -8 13 33 -89 -164
5761 -164 10 -54 43 120 -86 -37 -57 -110 -141 87 -72 87 224 -249 176 -53 -187 108 -6 -222 75 99 65
5784 65 37 -112 116 -46 -39 79 172 -18 243 -105 58 100 41 -118 201 -2 -58 122 -77 197 23 -19 -51
5807 -51 102 7 164 -3 65 83 -147 -43 -43 79 150 -93 -87 4 58 -70 -32 -59 49 -110 139 -96 39 46 -36
5832c6L9L6J96j72l9Jj07J68j92J24j11Q4j28OK5J34K2l3M5j59O0K7J06j21J58
5857A33k6k73N6L0J08j53r7J69J98k46k6n9K47pO1p9O9j13j23K98k08J43j63p
5881f8J63p3j6J27n5j25k8R6j1k0N8j01K4J43q1k16P8K11l3K1M8l07J50M0JR1
5907A17k02m3J53J16k37J40j01Q3n0l8J26O4l18J98R1k3j37oj16J11P9j17K79
5930A69j85k7J04j86J24k9J0J00j85O9O0n0J6M5j40qQ1Q9N4j95O2M0n0J6J46k61
5956a31N8o3o0L72j26o4K8k7o0J21m5l8Q6j61L36j56j06K8R7k49K83j2k88J85
5980Hnr2n9K03r4P0K5q7J48j38MJ71J1j29l9p4J8o9J89k41K75j29r0J12n7J59
6006I0n8q0L6J01M5k17O8J87j58MNQ2o0k2o2Q8r6MJ24o1l8l7%J42k1j98K0J66
$$ plain form
5832 -36 3 39 235 63 24 25 -82 86 -106 18 -93 -9 -137 -131 -106 28 50 17 62 -97 -37 -10 96 -25 133
5857 133 107 -166 -110 -80 28 -125 -222 -53 145 -101 -127 -186 61 54 115 36 105 -8 -131 167 -41 102 -61 -68
5881 -68 95 22 6 133 78 -47 -75 21 10 -10 48 -53 -29 114 33 -183 -105 106 73 94 142 -165 -15 25 26 117
5907 117 -85 -128 25 141 -96 44 -57 26 -24 -62 64 128 -190 8 99 76 -61 -67 -183 -72 7 -110 169
5930 169 -16 -43 61 -125 -1 -30 -20 80 -105 -36 24 -26 -10 35 -105 -113 -32 57 111 -84 -22 18 -32 -16 130 -131
5956 -131 -73 -136 -196 176 50 -14 14 -13 -73 48 3 -35 51 -110 226 70 -36 -8 89 -160 123 111 -177 8
5980 8 3 -89 -148 55 -39 31 56 -31 117 -21 -17 154 165 36 -3 -77 -59 -128 61 -180 95 -34 -124 -12 -69 90
6006 90 32 -48 -12 89 134 -83 -15 172 14 18 23 105 45 23 -39 49 -47 -43 81 20 -18 -55 -55 87 66 -132 -112 54
6034E4j36K30o9J9L1k03J67j45l9p8L94k61J50k98O1K36k79K28k3o2l6m4O9o2
6058i6l6J18j2o3J70O6j77QQ1o0m3%o4K11q7o9l8Q7j79L43j61j65J72j15Q5l1
6084e5m9R7L6M7m7N7k13J77j7L0nj83o6K06r1n8L5M5P0l6k18J95l2J14k33P2J91
6111F9k3r6P5r7J51OMj3q3J33o2k8o4J26j38N4J63j09j15J98l01J96q5q5J63j68
6137a29J17n2jp6R0rL34k46r2J65j72K09r4k3J29P7k85O9o7pJ94j59J28n4l4j43
6163a31J61o6R2j09j12L13k72K2R1p3K27m3m5q3M9J27k61K52j93m7J74r1J70k49
6187i7J98r0k21K81P5j00l9n4Qk6J36p3P7r5kp3J61j5k4j76J34R1j94M2J13n8
6213b1M8j04N5J51n0j3n4L1j9K1K5q0n5Q4Q6j77JP9j42J06M2jK9P5l32L30j29
$$ plain form
6034 54 -82 148 79 98 129 -74 93 -52 -91 -169 225 -36 114 -184 -123 113 -166 62 39 -23 -59 -103 -34 -96
6058 -96 -132 -14 -26 -89 81 147 -30 -22 59 -1 -44 -44 -108 103 16 -53 -91 -4 -183 160 -1 -166 6 -109 -24 -55
6084 -55 -104 -7 29 76 29 86 -127 50 33 63 58 -125 -191 15 -76 -134 -99 -54 16 -20 -238 -43 -75 39 -194 -122 69
6111 69 46 -50 25 -72 79 85 89 76 -7 126 64 36 -28 98 -40 14 177 68 -47 151 -150 46 -39 -124 39 -129
6137 -129 -12 -64 -65 -141 -51 -60 274 28 -64 101 -71 138 44 21 150 227 -58 11 -56 -63 131 -28 100 46 12 -131
6163 -131 30 -36 56 -53 -165 148 -124 -102 -11 -84 143 100 55 -28 21 148 -113 139 -54 -101 73 -18 152 -97
6187 -97 101 11 -210 71 146 46 7 -47 -39 -65 71 -2 75 -20 -22 -95 66 51 27 -149 -15 76 -118 -76 37 -21
6213 -21 27 -77 -22 129 79 66 12 43 24 45 70 -10 -65 19 105 -72 -71 8 -134 -28 14 13 42 117 -215 115 -14
6240a4M9j43L8J50j15J59n2k06J75j35J80j33J9J03k16Q0k9J4Oo9J60k6l6K94
6264B53l14J47L1j26K0J9l0j21K07j53L4J54n8j17O1j75L36k20J04o2n0l5n4J4
6288a35J38oQ3K4l3p9m5M3p5R4p8R5j74J69Rl6j14J91p1J01J13n6j77N3k31K30
6314C3r1N6M8n8j46J86n4j41K37o8N7j53L5K05j14o0n9Q3N6n0l6J73j49J07j88
6339i1J10k74L94M8l34K93l14J47Q9j30O4N8nj31J84r5p2J26Jl0r9j3J46j75r
6364a12J27j9j53K15q8K09k17K0J48j41L5k02K08N7n0M5j97J61j03p9M5J0J07
6387B6j73K29rj38j08L8M0J49q3P9J37j38J7L6m0q4N2j40J60L5j22L1O7Mj04Q3
6413D4k47K13j9P4Mr9n4J46k71J77K4j10K1R7M8J25l48L01M4l31M2R8rR1m8j94
$$ plain form
6240 -14 35 -108 -70 80 -35 124 72 -134 41 -94 86 -47 -28 75 -141 -61 -90 -76 -70 -139 21 -5 -41 253
6264 253 -61 86 117 -9 11 30 0 -121 86 -67 -33 121 63 -54 7 -168 168 -52 52 -10 -60 -95 -149 -135
6288 -135 3 -3 80 104 71 -8 -53 -10 -85 9 -69 26 -148 21 30 -6 -120 71 0 101 214 158 -19 34 -197 33
6314 33 -58 -2 46 -12 -158 28 -26 -167 70 2 59 -94 -59 146 32 -28 -87 -4 52 2 -34 139 -10 97 -91
6339 -91 19 -255 139 187 -147 146 -168 -21 68 -62 2 60 55 -76 108 13 -59 67 68 38 -61 -74 72 -103 -112
6364 -112 15 -4 -157 58 -30 179 -38 -18 130 -11 24 -178 30 87 37 82 -115 46 -57 -136 -91 -81 26
6387 26 -147 82 73 -65 -173 -135 -95 54 -29 50 187 49 66 102 62 -22 30 -110 50 85 -37 -6 61 65 -39 44
6413 44 -203 10 -9 65 69 -30 -84 62 -209 -32 -8 -118 -97 0 48 173 -175 126 170 -161 -119 -21 -30 61 13 -181
6439a81K41l6j66K29p5J31o8k60J18J77j02L2lj90J34k7Kp7K84k13K77l20J07
6462A4R4j40r1n1O3M8Q8n1J21J07j20L7k43K66o5M2r9j49K31p6p2K23Ql05J95
6487G5k9j26l2Q0j01N1P2n9K5k11L77o8k33K63q1L4Q7n2j80K07k44J70P3k44J81
6512C5P7k18J62q8L1L8j42J56Po9p7J07K4J06k4k27O8J35k18JJ94j37p4K85j97
6537d5J1j36P2J88m0j03l4J24J9j20P8K30l25l0N1j13J25J72k62nJ17j14J30r2
6561a02J99Qj22k1J14j63J30n7O8j05J07k08K73Lk10J91j55Q4q3J97q6K6j55J56
6585H9r7o7L2J72j09O7j47Pj07L2J60q5l1j2J98j58P8j99J42qk9J58k75Q8J75
6610G4r5J52k6j46k44L52J6K0n6p1O4j3L6j25J38q2J23j07J73j84j18J97j21p9
$$ plain form
6439 -181 60 24 -142 87 12 143 75 -185 -67 110 8 40 37 -153 -19 -46 -44 -121 163 -50 227 -93 14
6462 14 108 -32 -123 -174 -111 -63 25 -26 95 202 82 119 -124 142 77 119 20 -129 102 26 -46 177 185 -120 75
6487 75 46 -80 -112 -32 -133 -82 -10 -69 -44 -255 122 54 -179 84 3 37 124 72 -108 99 -145 25 98 -146 35
6512 35 112 -106 56 -32 -1 37 -105 51 58 -11 -88 19 43 149 125 -102 -34 101 -117 -116 78 -59 -133 152 -45
6537 -45 -34 -170 -98 90 50 -53 -87 37 56 -64 14 244 -81 -111 -60 -173 -48 124 -138 -143 -26 -140 -10 -102
6561 -102 97 105 -17 -38 76 -87 43 -14 54 -51 56 -152 121 124 -86 105 -50 34 -49 148 62 88 -67 89
6585 89 -8 -75 -43 129 20 87 -60 -53 -160 -128 32 -53 -84 -96 102 -56 22 -177 -35 -43 -72 86 -189 -101 74
6610 74 -21 131 105 -41 -285 67 83 103 47 -24 40 27 63 -62 76 -6 117 10 183 -1 -119 78 -43 -122
6634a22J76k7j75J20N5K0M7o0L0k50M6L40j79KM7j10N0N6j31j18K29Mj07J11j71
6659a17J38Pp8J47k66K0J85J1k43L08j32j40J26J42l2j37J1K2J49j67R1o5K8J45
6683A53j35mN9n4K9p6m5J03nj12J74k36P0J04l47L23q9kJk6m3K35l9j73K14O1
6709A40j32o2o3J02NK5m5J46k37J30p2L6j56L33k29J53k01N1K30j44rr6O0N4J01
6734A20p6L0j71J18q7N8k6O9j94L52r9k70J51O2R5r8r6o0J99Q7j8j26j15J60q1
6759a6P7n8J6J66j88j0O3p1p3R8J18p7J21l49J82Q7k40R6J04j37J97L2j00J33
6783A71j82k8J3k1J46k14oK34k01K13j35k0QM6o1L9N7r8J57o6k87L12j12l3J20
6808E2N7j07L9l9q0P4k3l7j17J11J90Kj08J32j30r6J77j77NmO5k7Mj01K01r5k3
$$ plain form
6634 -122 54 27 -148 -28 27 47 94 34 64 -186 -140 200 21 23 70 -40 10 66 -65 -183 46 50 -57 54 -117
6659 -117 21 28 -50 97 -169 -149 36 47 -196 112 -20 -160 -34 108 76 -61 -50 -28 121 -46 45 -20 8 153
6683 153 18 14 73 19 48 -28 -73 30 25 -87 87 -149 -79 25 -322 1 -88 -90 -89 -115 -158 77 38 -135 79 140
6709 140 8 -54 -117 -15 -10 15 -30 116 -121 9 -63 -27 -183 150 -79 74 -127 -76 154 10 1 -95 -35 19 120
6734 120 44 74 -97 21 -66 -8 -34 35 -159 193 94 -176 -25 37 132 34 -62 -122 77 164 146 20 -95 65 -16
6759 -16 61 3 19 185 -3 -13 50 -21 -94 4 122 45 166 -183 -1 86 -154 -58 46 -91 106 138 38 171
6783 171 -11 -39 -26 -47 99 -115 -121 113 -88 125 -10 -30 -22 24 -37 2 59 -39 118 52 -235 77 -35 -68 52
6808 52 109 2 41 2 -78 -4 -27 -64 -181 -70 120 122 14 146 16 -80 97 -80 -75 -79 -14 -41 -37 -138 63 -32 -55
6835e5J61k6q2Q6O7r4L8N4J2k57k9K4N9R9j06R0o7J79j44p8J79j94K12j6Nqj7
6862I2j69N4l5J06kk90K69K9k4k0j15n6K52j94P8J8L5JJ06j72r1J69l5r7K67p0
6888A06j29Q5o5J9j86L08k36K11o2j34m5J70n5rJ64j88J36k06J72j71K91j15j32
6911g1O8M9P3p3j59K28k07k4J26m3l0J46j55R6Mp0J69j77R1j04j32L19n8j53P7
6936a0K7M8j56N7j28J06J71j98M4j17J65q3P1J78l44K04m0m9K89j71N1j89M0k06
6960b40J90J3j76L88k74J55j09j91J77K32k42k9P6k17K47P4m5Q3j16J25J4j33
6982Bl1o6J9L3j0Q1j75K05j05O4j23K10j71K11l2m9r2K0k61K34J2k6K5J30k8q2
7008ep7p9J62l6OK6J01j48K6N9Rp1J59q0n2q5m6J13j4J10j58N7O2K7j39O6p4m0
$$ plain form
6835 -55 106 80 -2 84 151 57 95 149 161 -96 -125 -101 -42 57 -49 41 -26 153 9 -69 110 -84 128 112 117 109 92
6862 92 -77 -23 -58 48 46 -244 25 54 30 10 -105 -161 91 -103 -25 -7 28 29 135 -37 -128 41 6 -91 176 106
6888 106 -23 62 -3 16 -170 138 -98 113 51 -83 -128 42 -13 -22 142 -46 90 -116 56 -115 176 61 -71
6911 -71 -3 46 119 46 -113 115 -92 -116 10 -33 -63 83 -72 24 28 -42 127 -50 41 -63 -195 124 66 -87 -10
6936 -10 17 65 -91 -34 -162 -56 115 -83 -39 -156 9 -74 -3 175 -169 35 -5 -54 235 64 115 -74 -34 -240
6960 -240 -50 -37 -213 175 -99 56 -53 -244 -67 165 -77 -106 -30 -247 0 74 29 112 -4 121 135 2
6982 2 -29 -95 -76 -43 -53 28 -147 58 -47 17 -106 104 -67 144 112 63 -29 -9 -270 -36 -24 -50 -25 105 77 -5
7008 -5 -82 -161 1 -35 -29 -3 98 -50 -24 35 44 -27 132 52 0 -85 -131 -18 -32 78 -80 -23 39 66 -73 -7 -81 -121
7036a21J22n3k3K23k48K60j71k26K15rm3M05l16k7j01P5R9n0k22Q5J02J2J32l20
7060b00P2O9J71j45J99m35K28L04m26K03qk9J07j76K7K08k30K2K01j01j27J62
7082I6j08L6m9J28kk03Q0Q1p5R2l9m2J55m8k55K38k06N6p8mK25k30j08K66r9R6
7108Cp2j8L8J99k34Q5K5N3K40m70R9n8J88o3J0l7K5P1k4j38J19n8N3j20K4N3N7
7135E0n8L1k2Q7n6j53L7J2L5k6J8Ro5J25J9l8J71j77J73j16o3Lj07P6K5l6M5J17
7163A16j74M7J14p5j09K2J18j06J30j84J5K3L58k21r5P9j10J16l4r%lq1P2p6j40
7189b07K22j45J81k4P9M0j32j3J18m0k31R2M8j7k5J11r2Q0j48J8J61k69J79M1
7213B7J08n3J35k16J3l1L9J2k5Q0j25K83j99K7K5j15p2O6K08k07L8L7k20K55j55
$$ plain form
7036 -121 1 -52 -75 148 -100 160 -11 -237 -22 -31 -74 331 15 -12 -113 -38 61 11 -211 -126 -24 -12 120 -200
7060 -200 -128 -59 112 -33 166 -269 -41 263 -163 40 32 3 110 -66 -39 169 -61 -39 162 61 -66 96
7082 96 -12 24 -25 103 101 -102 -22 59 -16 76 37 -5 150 102 -153 85 -121 -65 -143 -147 78 -152 -260 6 -93 3
7108 3 -69 -87 -49 150 -84 1 26 79 319 -151 -52 -110 78 15 25 -12 13 84 60 -78 41 -17 36 -84 -60 -7 50
7135 50 -8 23 1 88 32 -121 -84 -72 -37 -63 -45 -36 -101 24 43 5 176 -1 172 56 -7 -4 -111 -35 -10 -46 -1 116
7163 116 -58 -11 103 28 -81 -59 59 -47 83 -101 -86 -63 295 74 -21 58 -52 64 30 21 21 18 -63 9 -67 -207
7189 -207 15 -130 51 27 106 146 14 1 119 79 -152 -60 -12 -29 -54 57 -35 45 -103 -85 76 -193 -14 27
7213 27 135 82 217 1 14 -17 22 34 9 89 -36 247 48 75 100 -15 -87 -21 187 -20 18 55 -165 90 -65
7238f5k4N0m2Q7J74k62oJ78j67J01o4o8Q8OJ24q0PN5j76q7J15L2j02R6Mj0Q8P2
7266A24j87k4J6O3J82m39K03J71j45J00Pq4N5n6P6J25j06m2k99K42j13L30j29
7289G0O1r1m4O8l9K6J21o0j97R3o1K6N5o0n4j0J7NQ5j8J3k1N6k0J53r8N0j31o4
7318f9J38l0p2R8o9Pj5o8O1L7j57J05O9j34J61j63J31p9J58r8l3Q0Q1j94K8j12
7344a39L9J60l6q3N2j22rL67k81M3or0K99k40R2L7j52r7L27j88n9J56k1l1ml1
7370a7J01l5j72MJ14J70l27K04jJ34j13R9k43R5j04mK6j19L51j77K03j32j01m2
7394h6P2J6p4K7J13j98L0R1J18j98J81k01J35l0p7M5Q9o1l1qj42L37p1k21Q4K9
7420c1N9L0j44J34k5K3J00k0l6O7j85K5r0l9J13l0R9j9k23R9J78j03p5J90k34
$$ plain form
7238 -65 -89 -39 -81 6 180 -82 -88 90 -77 24 -40 -108 -20 -14 110 30 37 92 -84 -171 -56 -24 -126 -30 -26 -36 52 124
7266 124 -63 -87 -71 -8 174 -265 -62 109 -36 64 71 -13 42 -14 62 187 81 39 -260 -18 -131 199 70
7289 70 131 40 -4 64 25 51 172 112 -85 8 -53 -27 28 -32 -86 -96 -79 -74 11 -7 6 -15 41 21 174 76 126 -5 -69
7318 -69 69 39 -33 65 -4 3 -12 -80 -19 18 -139 -34 35 -99 62 -101 30 -49 109 11 -22 58 139 -55 -27 -139
7344 -139 -100 60 24 -59 -7 -129 -138 229 -52 -9 -15 -105 194 -46 46 83 -69 -166 161 -27 -86 70 49 18 14 -17
7370 -17 84 49 -123 -119 -5 165 -162 42 41 175 62 161 -82 13 -91 -95 -69 -188 163 -14 189 57 -44 -86
7394 -86 -14 2 -72 -45 68 -130 -100 -9 109 -89 92 -109 26 -4 -81 -36 53 -8 -39 -47 -189 148 77 -144 -60 -31
7420 -31 28 58 -86 48 23 46 146 126 90 157 -28 -3 -93 -132 -19 -49 50 31 -192 -93 85 -18 -93 97 -137
7445a37R3o1K06J7j87J77K6j5k10J52j71K45o3m1P5j52p9M4O7k2J85k35K29o7
7469G6q1l0Q6j50K1J10q7K15j47j37J21m8o6K00p1q2P6j19K33r1j26N6j4l2J63
7494G6j28q8J12m1O9M2q3K8J05j13Kj20J93J19j61n5K35j64P8j77o3K26n6j89
7518a53L17l28K44j26Q5J21Lj66r7K52k72n7P0N5K00j82J24k4k55K30m6N6o3K7
7542A5QM1O7p1j01o5rJ82jOj47j90J54l5R1J37L0j71N7j8n2J62p1pL8n1M8n4r5
7571a02O6j27N4J34K8Ql5O4p8P7j52N0O9j00K38j25J1j11M1J97l16N9o9P7q1L5
7597h8m9Q8k4l6l3J32J26k15O6J16o0r1J5m2J37l7j11R0j6l3L0J69O2j84J21n2
7623H1q9r8J29j00O5oKOj12J73j89k0J71p1R2mmn5J80j88L9o7O9j6N3MK4L0j61
$$ plain form
7445 -137 -44 -105 101 118 -69 108 134 119 -91 61 -110 135 72 31 106 -46 -125 -81 -14 -36 149 -86 143 76
7469 76 -5 -35 51 -99 -78 32 -55 160 13 -124 -3 -51 -117 83 12 -70 6 -113 120 29 -97 -41 -55 -87 76
7494 76 -52 -140 -28 -69 0 42 -41 -13 92 -21 -19 -139 54 173 12 -43 192 28 106 -71 -134 92 36 -153
7518 -153 164 -164 80 -46 39 160 163 -3 -100 152 -120 -177 -107 -52 148 -34 90 66 -189 41 -5 51 -12 15
7542 15 23 64 131 60 -41 -106 -115 67 66 72 -75 -265 -111 -146 -55 82 112 -59 -2 -20 -72 90 19 12 50 -1 47 -7 -102
7571 -102 -36 -163 -109 25 53 61 26 90 12 89 -63 -13 56 -44 194 69 80 -31 10 207 -109 -50 -119 -42 -123 -88
7597 -88 -137 -49 -73 -109 -142 -10 116 -99 -33 83 23 -68 -53 -95 42 5 -106 -16 -32 -65 -35 134 196 12 133 81
7623 81 -8 -106 23 -77 -12 -18 -16 -10 -122 51 -138 -158 13 -58 34 30 26 -29 151 -37 2 -65 4 -12 41 45 69 99 -62
7652f2N5j00J46o3O4p3Rj56J12O6q7J90j04Q6j23N4J45j15j61O9J26p8Q5j42M6
7677a1O9l5n7o0J59k25K65k59oJ34K4p9q6K32N9j39J50j04m3J64L7l18K10j37
7701e6j13R0N0o8J19j1Q6k6p8j71K53o3L6k56L20j30r0l1J43R4j09R9k27P6K36
7726A73k39J55n8j37J45P6j39L3m0K16J7j81OP7n4L3J02j80l4j3p2K66n9j31l
7751d1q9J78j81O4mJ12j51K88j70M7m5j8o4O2J0o0R1j76N8Q8%j9lj14K56l6j50
7778f7j7R9Q4k87J32m3m6J96j47M4O7l7q7J48q0n3P4k8J3K29j50m5r5R7q4J9P1
7805Go4K0J78j33o5RJ08j2m9Q8j61N0J81k11m7J45Kk6k73J60J2N8m2K4l5K54j03
7832G5J4r2L3j71K7J60p6M5r1m3K18j50J27k7K4k13J45Q1j14m3l2K47j43N8r2
$$ plain form
7652 -62 -7 -107 39 -24 40 -33 -24 -180 -68 -2 -89 101 -3 83 -40 14 159 44 -117 -48 78 0 85 -57 -11
7677 -11 58 23 -34 -94 65 -160 105 -154 -160 -26 -2 -81 -167 65 124 -15 135 31 -12 152 189 -129 81 -56
7701 -56 -169 -79 -29 -97 22 11 97 71 -7 -178 75 12 48 -208 112 -18 -108 -139 4 98 -11 88 -139 -63 173
7726 173 -66 89 31 -106 39 115 -24 9 -31 185 202 21 27 104 50 83 185 5 -29 -42 -114 152 93 -38 -41
7751 -41 -130 48 -133 -69 -73 39 -112 176 6 53 8 -10 -74 -12 -2 -62 29 -147 -89 -1 -1 -20 -23 -137 119 83 -67
7778 -67 -84 15 99 -188 -56 -99 -145 51 -96 -52 15 -22 -109 39 -41 -94 -20 -48 -35 194 44 -1 -96 1 -83 -64 7
7805 7 -57 -37 141 8 -57 -48 60 48 -1 87 -74 -24 157 -54 -101 44 46 20 -253 -93 -81 -23 -65 -41 -76 178 75
7832 75 89 -3 30 -141 -114 46 -30 15 -76 -119 99 -51 76 49 73 -140 5 86 -28 -71 -103 144 1 59 -33
7857c3k5K62k26J5J9k9O8j01Q9n1Q5p0j29J62j73J18m9Q5K0oo6q3o3J01J37k62
7883b05K88j46M9j31J17j2J0J34o7J15j8j39L3j7l9Ko1K94j85R7j57r1P2Qk1M9
7909b1J31q1Q7l05J66J04j90J14K8K8J66j52p0o8J68q0J1k3j11K06j82M8J8p4
7933h2J07p6Q1J1N3n0j39J27n2J02L6j42P4j00J1Q3o3l0Kj16K37J3j05o2R1K3
7959C4j46P6J31k1r6J01j22L7J11k01J36J05k17K88l44J95j48J37q3J59j32l8
7981c8j13L43j13nj57j0K76j74%Mj19N2K5kn7O6n3K1p5K54j99m8J66j44K3K22
8007A45j22j62N5J32Nj36Q9k76L75J9j2q1L6o6N4r6M0n8j2J30l10L26N6o4P2L
8033A42j30J00k96J94J06q7mJ4j56j0J13R9j21OJ27n5r4K7j15N5NK02k09Q8p1
$$ plain form
7857 -33 -58 204 -22 -7 12 -17 51 -50 39 -12 73 3 -126 36 -137 -19 -68 17 37 31 -35 -118 -181 -80 57 -205
7883 -205 83 -63 -14 -145 -28 -40 -30 104 37 152 134 -5 28 11 -28 -26 -87 207 22 119 -38 -129 -57 -49 -70 -21
7909 -21 110 29 116 -189 -23 81 -109 5 33 61 227 75 5 -63 105 25 36 13 -98 108 -74 -26 -8 -82
7933 -82 25 -51 30 41 94 44 -95 32 -20 82 118 -24 50 -50 -39 44 -19 -49 -47 -163 74 87 -18 -80 11 34
7959 34 -112 -36 95 74 -22 79 -43 -6 105 -96 40 145 -72 216 -128 67 -81 56 -27 132 0 -38
7981 -38 -151 192 79 74 -83 -93 183 9 9 13 -106 -54 -29 -31 -88 -22 -75 -54 -129 125 -74 -122 44 -100 -77 145
8007 145 23 -139 -84 48 53 -83 6 -270 105 124 112 31 67 1 55 -41 -1 -59 -71 59 -251 75 131 67 139 142
8033 142 12 112 -184 10 116 29 25 39 -117 -127 -14 85 -36 -30 97 42 -52 -25 -140 -85 -80 122 -87 1 -70
8058g0J6Q9r1O8p1R2L1k5q2J72k09Q8m9R5j11N4o6J65N2l16J27l8O1L6q1P6n1
8085c8j3J5q7RJ77n8k8O3m9j6k5J71j38p0J03j53K31j63L5R4J06m0K6k73Q1J16
8111G6q5K69k22j33J89k70J48M0o1K58k13j56K12p7K6k3p3J44j00J59k07K31p4
8134E8r7mlm0o1J96Nr8O2R0M0j96l4P0Q5q3j19K40q9J02j89M4J7J69j63m9J34
8161H7j16N5n3OJ86k28O1J30m4L6o0o2j32K19p2L2M6j59L06l91K29j71J17q0J5
8186d3R1p1J22j03k6
$$ plain form
8058 -70 -54 35 -56 12 -59 33 64 39 -43 129 -80 8 -41 54 -57 -3 -69 96 148 -168 -41 -79 -18 18 -63 13 -38
8085 -38 -51 -36 -123 -114 63 5 -23 40 -9 -25 -50 121 -17 -87 16 -137 94 -69 -34 60 166 126 152 -121 -40 76
8111 76 -9 260 38 -95 94 -176 -28 12 -49 209 -4 -160 52 -25 1 -22 -95 49 -51 108 -99 132 58
8134 58 -39 -43 -46 -86 -147 49 54 -44 18 108 148 -48 -82 -12 73 -10 -129 111 22 124 -65 -21 -4 165 2 -47 87
8161 87 -29 26 -27 -21 165 -63 -2 128 84 120 60 -2 -134 85 13 45 91 -68 238 -153 76 -95 22 -58 -43
8186 -43 48 -23 99 -4 -30
8191c0
$$ Imaginary data points
##PAGE= N=2
##DATA TABLE= (X++(I..I)), XYDATA
0@%%%%%%%%%%%%%qJ6j6J6j6K2l0L2m0M8n6O5p3Q8j04J20j36J53j77K01k26K58
35A37k90L27l67M10m58N12n71O33p01P76q57R45j043J150j268J397j538J696j871
54i81K065k285K534k819L147l531L990m546N240o133P330r029J1655j6316K7117
69A7438j02249p2007N4297J0713Q5041Q832L3239L7328m676K4192K9050l5486
81H5712J722l6780m8508N490k6994k8133J7295l8773j6431J0528j2296M6291N1972
94A1095P068M3815M056k3019J5628k2395j5603J6810l9949k1594j490k9189J9221
107c5546J4299j5752K5118j1300k4518K6956K758K2828M9216p629P678J0528l3006
120C1630M782k322k4155J1586k7287l3137J2878j7493J348K4217k1590L832N000
$$ plain form
0 0 0 0 0 0 0 0 0 0 0 0 0 0 0 -8 8 -8 8 -8 14 -16 16 -24 24 -32 33 -40 48 -56 64 -72 81 -96 105 -121 137
35 137 -153 174 -193 217 -241 271 -300 333 -368 408 -449 496 -547 603 -665 732 -806 890 -981
54 -981 1084 -1201 1333 -1486 1661 -1870 2120 -2426 2814 -3319 4011 -5018 6637 -9679 17438
69 17438 -84811 -156818 -102521 -91808 -6767 2065 35304 72632 67956 92148 121198 85712
81 85712 87434 50654 2146 7636 -19358 -47491 -30196 -68969 -85400 -74872 -87168 -40877 11095
94 11095 18163 61978 66034 43015 58643 36248 20645 37455 -2494 -24088 -25578 -54767 -35546
107 -35546 -21247 -36999 -11881 -23181 -47699 -20743 -17985 4843 54059 46430 54108 64636 31630
120 31630 36412 34090 9935 21521 -5766 -38903 -26025 -43518 -42170 -17953 -39543 -35711 -30711
133c0711k5730K6733K7073J1501M2431m41r477J7232k5941q270J2110k8546n526
146B438j0898l5031J4664N876o378K7042q947r687J4936j7221J4568L4280n886
159A9756J3957P13k8066N862j2496j7835J7567j5888j2184J0891j5719J6899K7865
172A1322q032J8165L423k3566J0081n876k704K7844j1141q543N580k7483o4N911
186e083j8363J4944j453k1174J4823p68M131K8202r050k61Q635k5003M549J1954
200F083o813K2925M16j7704J2236j1829p553J5477j3753K27L618k5800O443R473
214f554q453J9116l072j4143J1629j3367j789K4028l252R931P449k0665P745J218
228I821j4823J5307n203j3714P804j6547K72K1200p473Q896P415j8461Q217j164
$$ plain form
133 -30711 -56441 -29708 -2635 8866 51297 50856 41379 58611 32670 24400 36510 7964 2438
146 2438 -8460 -43491 -28827 -22951 -29329 -2287 -11234 -20921 -5985 -23206 -8638 25642 19756
159 19756 33713 34426 6360 12222 -274 -18109 -542 -16430 -28614 -17723 -33442 -16543 11322
172 11322 3290 21455 24878 1312 11393 5517 2813 30657 19516 10973 16553 -10930 -10994 -5083
186 -5083 -23446 -8502 -9955 -31129 -16306 -17074 -12943 15259 6209 5948 14583 -10420 -5871 6083
200 6083 -730 22195 22611 4907 17143 5314 -2239 13238 -515 -288 3330 -22470 -16027 -6554
214 -6554 -15007 4109 1037 -13106 -1477 -14844 -16633 7395 4143 14074 21523 858 8603 9821
228 9821 -5002 10305 5102 -8612 -808 -17355 -17083 4117 -3356 5540 12955 -5506 2711 1547
242A547r479K2358j862r521Q419j7839k751J1177j4462Q603N326j8688Q476j801
256a0497n008K4095k371m441J2876j5347o44J0702r720J4300M958j7868P305o265
270B075r546J5383q705m257R193j9948k584Q341q900J4644M413j1911J3608l427
284a621m775J9877k263L927J1220j8343jM578j4636Q229k654j5548O572j3742
298a9180r594J6734l892N816J4652j0044R986R394q485J6537K887j0881O267j6399
312C798j0863R499j4134n87P143j6103L756J799q882J9494O313j896J6729m965
326A1101L27J3757j0681M009N579k0069k036o378j5048J0766m146o892J2690r609
340a6630k223J1761o672J2811J2591q592J1936L305p565J2556n267o683O877j8901
$$ plain form
242 1547 -7932 14426 12564 3043 11462 -6377 -9128 2049 -12413 -3810 1516 -17172 -8696 -10497
256 -10497 -15505 8590 6219 1778 14654 -693 -1337 9365 -355 13945 18903 1035 8340 2075
270 2075 -7471 7912 -793 -5050 4143 -15805 -18389 -10048 -18948 -4304 109 -11802 1806 -1621
284 -1621 -6396 13481 11218 15145 26365 8022 8021 12599 -2037 6192 3538 -12010 -5438 -19180
298 -19180 -28774 -12040 -15932 -10116 4536 -5508 4478 13872 5387 21924 24811 13930 20197 3798
312 3798 -7065 2434 -11700 -12287 -5144 -21247 -17491 -15692 -24574 -5080 1233 -663 16066 11101
326 11101 11428 25185 14504 18513 24092 4023 1987 -4391 -19439 -8673 -12819 -19711 -7021 -16630
340 -16630 -18853 -7092 -13764 -953 11638 3046 14982 18287 10722 23278 18011 11328 18205 -696
354f96q954L336j3842O280N067j1159J0663q29q314J5277K85L653J6091p560M619
369A3917J0556j1625O020M00j6337K625j2747j5385Q736o518J95J2953p454O735
383g929R149r389J3044P428n491J2260l545n914J0732j0626m818M374j6928l735
397a1388j473j3701J1397N013m217J5801m74k061J1503p827K491J0058j0984M181
411H319K985j0608R230l273j0595Q102j0531q858O831q494N657J1386p433R506
425B224M513r550R158k712n123J2242o930k063J1070q243K938L718j3926L377
439F93m811j4782P911k519k169J4408m277K631J1954q565M442O228q303R018m82
454A1377q463J0678n958p510N355j3638m680K797j2974O089Q778l397J4201M557
$$ plain form
354 -696 -9650 -6314 -20156 -13876 -8809 -19968 -9305 -10134 -18448 -3171 -2886 767 16858 9298 13917
369 13917 24473 12848 18868 19268 2931 5556 -7191 -22576 -13840 -20358 -20163 -7210 -14664 -7929
383 -7929 1220 -8169 4875 12303 6812 19072 15527 9613 20345 9719 4901 9275 -7653 -11388
397 -11388 -12861 -26562 -15165 -10152 -14369 1432 958 -1103 10400 2573 5064 15122 4138 8319
411 8319 11304 696 9926 6653 -3942 4160 -6371 -15229 -8398 -16892 -11235 151 -7282 2224
425 2224 6737 -2813 6345 3633 -1490 10752 3822 1759 12829 4586 7524 11242 -2684 693
439 693 -4118 -18900 -10989 -13508 -15677 -1269 -5546 -2915 9039 474 4916 11144 2841 11859 11377
454 11377 2914 13592 7634 124 5479 -8159 -12839 -10042 -23016 -16927 -8149 -11546 2655 7212
468G212k514J2737o350m808Q341j1017j391M030j1546N376J316j1802O677l912
482g651p493R314n088K503J4919m791N989Q358r432M686k732j2313O804n156o523
497h606J0203n520J428Q383j0785K746L124j2153N655K32n267J2406j423j090
511f67J2317o483J07N616j0507M940K847r393P707p98q678N187r650o339N910
526g884j0250J670R692m002J2096Q679l077J2974j029q145N254r882n731L839
540D204j2339L09L424j1823M369J093o536J1480r7l91J5198q16L714J0322p565
555A4546K221q02j6406P01m945j0499P112l840k464J0750o396J558Q970n961O311
570H56M328o495J0472J422m917J0143m814n266L654j2373k294M075r982M604K538
$$ plain form
468 7212 4698 17435 11085 6277 14618 3601 2210 6240 -5306 70 1386 -10416 -3739 -7651
482 -7651 -15144 -5830 -10918 -8415 6504 1713 7702 16060 6628 11314 8582 -3731 3073 -2083 -8606
497 -8606 1597 -3923 -2495 5888 -4897 -2151 973 -11180 -5525 -5293 -10560 1846 423 -667
511 -667 11650 5167 5274 10890 383 5323 8170 -1223 6484 5686 -2992 2195 -7455 -13794 -7884
526 -7884 -18134 -16464 -6772 -10774 1322 10001 6924 19898 18869 10724 15978 6096 365 4204
540 4204 -8135 -7826 -4402 -16225 -11856 -10763 -17299 -5819 -5916 -6307 8891 8075 11789 22111 14546
555 14546 16767 15965 -441 260 -4685 -15184 -8072 -11912 -14376 -3626 -10022 -8464 506 -5455 856
570 856 5184 -1311 9161 10583 5666 15809 10995 5729 9383 -2990 -5284 -1209 -11191 -6587 -4049
585d049p367P672k492n148J0436l264Q8R525m659O002Q217n915P106J13j1168
600E097J873r187q687N656q184j587P607o978M621O221m365J1410L898m387J0289
615A3297j563k276Q329q149k199J912j4996k353j128r540P635P71l196J1736j346
630c066J4J1294l939L987N462r977L538Q07q884O210l109o772N241q888l730P745
646d067n484M721O907o038O839J439o353Q526j545m288O295p632j243P135p107
661a895L791M204q744L754k584p736Q081k464k794P955o060J62O481o548O295
676A898N120o780N848j465n185Q404l932k451N947r372k208K384q359N564L162
691a425o549P656r24m053Q712k927Q29P897q402M71L111p753N378J332o221O401
$$ plain form
585 -4049 -11416 -3744 -6236 -11384 -948 -4212 -4124 5401 742 6744 14961 9046 16152 16265 5097
600 5097 6970 -2217 -10904 -5248 -13432 -15019 -7412 -14390 -9769 -3548 -7913 3497 7395 3008 13297
615 13297 11734 9458 17787 9638 7439 9351 -5645 -7998 -9126 -18666 -11031 -10260 -13456 -1720 -3066
630 -3066 -3052 8242 4303 8290 13752 3775 7313 8120 -764 5446 2337 -4435 806 -8082 -11812 -4067
646 -4067 -9551 -4830 2077 -3961 2878 4317 -2036 6490 4945 657 6952 -680 -1923 5212 -1895
661 -1895 1896 6100 -2644 1110 -1474 -9210 -1129 -3593 -6387 1568 -4492 -4330 2151 -4397 1898
676 1898 7018 238 6086 4621 -564 7840 3908 1457 7404 -1968 -4176 -1792 -10151 -4587 -1425
691 -1425 -7974 -318 -1242 -5295 3417 490 1319 9216 814 1285 4396 -3357 2021 3353 -2868 3533
707C533l931n463P136l683J333O629p533K243K636q215N790J367m868O634m788
722a180m494P397m568J876O645o776L314J306q393O843N0n111O501n511l579O264
738E84n888L197P196n433M495J076o895O991n49m386O632o370l931L566q289K136
754e868M610p285M272K94n669Q571M73k53J0641l372p66M972p081K668K672q571
770C08L520k870q976M324l693k205P753n465R9N917m999O129O092l502Q413j500
786I345o974M854n492l408M639q330r01K931p964M824M158k745Q929q48l307Q511
802H222l121J53P471o292J93K26j0906J394r90p345M927l307l764P388l513K649
818f615J0016k987M511L942o138O161J109m487O984l983n559K647r423k083L399
$$ plain form
707 3533 -398 -5861 1275 -2408 -1075 5554 -1979 264 2900 -5315 475 1842 -3026 3608 -1180
722 -1180 -5674 1723 -2845 -969 5676 -1100 2214 3520 -4873 1970 2020 -3091 3410 -2101 -5680 584
738 584 -5304 -2107 5089 -344 4151 5227 -1668 5323 4774 388 7020 650 -3281 285 -8004 -5868
754 -5868 -1258 -8543 -4271 -3977 -9646 -1075 -602 -855 9786 6414 5648 10620 3539 6207 8879 308
770 308 3828 958 -8018 -3694 -7387 -9592 -1839 -7304 -7205 -1288 -6287 -158 5934 2432 10845 9345
786 9345 2371 7225 1733 -1675 2964 -5366 -6267 -3336 -11300 -6476 -2318 -5063 3866 3018 -289 8222
802 8222 5101 5254 12725 6433 6626 6852 -4054 -2660 -3650 -10995 -6068 -9375 -13139 -5751 -9264 -6615
818 -6615 3401 414 4925 8867 2729 8890 9999 5512 12496 8513 2954 5601 -3822 -5905 -2506
833b506q190J924J598o011O563J836o41J0734j070j071O512n504J587M825p220
848C366K873q41j0020K059m214n158O770l807k82Q091l449N280P762k750O920
863A2600P59p850L413m888n811M305o995k610K919q771J785M277m167P654K649
878g31k678Q771m96m82Q086m198n62K175r637R75N89o679N197p50m946N351m348
895d363k039O581m865J284L773o277M412K370m447P650n3l948N710m475r01O130
911F542n473J800K969p695K279j322o363N942k379l657O652l602J306P237l909
926C27M897L197o949L214j486o077N554l817l671N023o411p46M666m759M786L368
942A116m476O595R56k691P634k720j732M103p925j359K422o988K891O29n741N200
$$ plain form
833 -2506 -10696 -8772 -7174 -13185 -6622 -4786 -5427 5307 4237 3166 9678 4174 5761 10586 3366
848 3366 6239 5398 -4622 -2563 -6777 -11935 -5165 -8972 -9254 -1163 -4612 668 8430 5680 12600
863 12600 13359 5509 8922 4034 -1777 2528 -4467 -7077 -4158 -12929 -11144 -6867 -11034 -3380 -731
878 -731 -3409 5362 4866 4384 12470 8272 7710 9885 248 1223 1812 -4867 330 -420 -5366 -15 -4363
895 -4363 -6402 179 -4686 -3402 371 -5906 -1494 876 -3571 4079 4026 78 5788 1313 412 6542
911 6542 1069 2869 5838 -1857 422 -900 -7263 -1321 -3700 -7357 -705 -4307 -3001 4236 327
926 327 5224 8421 1472 4686 3200 -2877 2677 -1140 -4811 212 -6199 -6945 -2279 -7038 -2252 1116
942 1116 -3360 3235 4191 1500 9134 6414 4682 8785 860 -499 1923 -5065 -2174 -1545 -7286 -2086
958b086j659l921P033k682K09O084m995K494M499m948N038J187n144M435l830
973A714m077N496m521p28M472o163J577K152n702M876O81m379O335k590j312O642
989D473m005J004M771o573J705R72o450M829q49m344N764l162j688N417m618K116
1005f38M682n715L439J633m950N468j491l738N231m692k326M413n168K131L288
1020A567n590M493R79m877N343j473k508N327m523m70M784n287K706K965n174
1035a738M658m01m939N635k587k502N260n478k60L499o358K759K274m850N315
1050B87j02k876P060k230n45N304m593L83K146o949K316L93o564L780j867l078
1066g135N607k821N95O574l467K915M133m278M047N36n531L858l474m466L154
$$ plain form
958 -2086 -3745 -7666 -633 -3315 -3106 2978 -2017 477 4976 28 5066 6253 1109 5544 1714
973 1714 -2363 3133 -1388 -2116 2356 -3807 -2230 -78 -5780 -904 -223 -4602 1733 -857 -2169 4473
989 4473 468 1472 6243 -330 1375 2347 -4103 726 -123 -4467 1297 -1865 -3553 1864 -2754 -638
1005 -638 4044 -1671 1768 3401 -1549 3919 2428 -1310 3921 -771 -3097 1316 -3852 -1721 1567
1020 1567 -4023 470 1449 -3428 1915 442 -2066 3261 -1262 -1732 3052 -2235 471 3436 -1738
1035 -1738 2920 2519 -2420 3215 628 -1874 3386 -2092 -2352 1147 -5211 -2452 -178 -5028 287
1050 287 185 -2691 4369 2139 1594 6898 2305 2688 4834 -2115 201 594 -5970 -2190 -4057 -7135
1066 -7135 -1528 -4349 -3754 2820 -647 2268 6401 2123 6170 6706 1175 5033 1559 -2907 247
1081B47n526r52M110n177K728L804l828N871J499k435O563j962k144M508n304
1096B002p21K061o925J486L23n984M119m07k803O269j655j30O772l093J680L962
1112F956m703L469K85n707L638k643m471L619m502j848L898n023J675L496m040
1127e901N046J604k743O524o18j796N527l444o51L287o165P55P65o846K378q57
1143c135m503M714k042j149O226k725K034N212l297L404J941m873L722j552n020
1158a043L547m455k722L604n156P13M112m087M414K190k833O006l21k387N409
1173F991l374j471L124o127N17J694n929K410K90m097M342j484j521N909l030
1188a756M00M389m167K634K398m304M174r8l999M268k833k027M060m283k17L216
$$ plain form
1081 247 -5279 -6231 -2121 -7298 -4570 -766 -4594 1277 2776 341 6904 4942 2798 7306 2002
1096 2002 1281 3342 -3583 -2097 -1774 -7758 -3639 -4046 -6849 -580 -2235 -2365 4407 1314 2994 6956
1112 6956 2253 5722 6007 300 3938 1295 -3176 443 -4059 -5907 -2009 -7032 -5357 -1861 -5901
1127 -5901 -855 749 -1994 4530 3912 2116 7643 4199 3548 6835 670 1425 2190 -4656 -2278 -3135
1143 -3135 -7638 -2924 -4966 -6115 111 -2614 -580 4632 1335 4739 6680 1807 5529 3977 -1043
1158 -1043 2504 -1951 -4673 -1069 -6225 -5512 -1400 -5487 -1073 1117 -1716 4290 3969 1582 6991
1173 6991 3617 2146 5270 -857 -340 1354 -4575 -2165 -1875 -5972 -1630 -3114 -4635 1274 -1756
1188 -1756 -1356 3033 -1134 1500 3898 -406 3768 3670 -329 3939 1106 -921 3139 -1144 -1361 1855
1204A855n314K072J249m411M113o79l015M990k146n90M924l562J396L271n126
1219i73K466J134m404L919j479k912M654l272p34M046m043J628K076m785L214
1234E35O25l849M461j407k486M418l665m68L801m192K023K013m380L705j32l739
1250b737M565j955k059M127l697N64L857l837K731J863l777L398r49l312M209
1265B991l229j586L615m271N37K262m409K907O01m239M196p09j997N333k157K76
1281A21M580l696J501K112m262K820L2m089L526k029l079L401l941p98K780m643
1297e664K027K559l089M730J334j785M844j647j808L707m509m97J792n157J571
1312a592Q46m312L529l26k152M967j487R8N146k322J430K712m303J537r81n521
$$ plain form
1204 1855 -3459 -1387 -138 -4549 -436 -1115 -4130 860 -1286 -1876 3048 -514 882 4153 -973
1219 -973 1493 2627 -1777 2142 663 -2249 2405 -867 -1601 2445 -1598 30 2106 -2679 535
1234 535 1160 -2689 1772 365 -2121 2297 -1368 -1836 1965 -2227 -204 1809 -2571 1134 1002 -2737
1250 -2737 1828 -127 -2186 1941 -1756 -1192 2665 -1172 1559 3422 -355 3043 2094 -1218 2991
1265 2991 -238 -1824 1791 -2480 -1943 319 -4090 -1183 -582 -4821 -625 -1334 -3331 2002 -155 121
1281 121 4701 1005 2506 4618 356 3176 3208 -881 2645 616 -2463 938 -3003 -3801 -1021 -5664
1297 -5664 -3637 -1078 -4167 563 1897 112 4956 3309 1501 5208 699 202 1994 -3163 -1592
1312 -1592 -746 -5058 -1529 -1855 -4007 960 -527 -429 4717 2395 3825 6537 2234 3771 2790 -2731
1328b731J827k402l376L371k506J76M666k570K754L454k638L507R26k692M220
1343E986j709k435L316m322j427J593n090R44J141l909L715N76j744M728j221
1358A42q52M106l239M08K842l867K225J164l923L203j241l432K655k835j557L627
1374e74l066J480L688k728L340J583k937L720j280k615L733l193j501K386m554
1389b518J62J044m985J924J92k482M607K48K12N770j178J045L369l672R80N63
1405E281m839J590j451l985K636k486j855L010l401P74L197k489L424K832j590
1420F48M093Kk538L053k826k362K275m368k48J849l925K437Q61k567L346q57j569
1437b696M048j428M97M195k618J440J144m181J785r17l931K606k230k180L236
$$ plain form
1328 -2731 -904 -3306 -6682 -3311 -5817 -5641 -975 -3545 -791 2663 25 3532 4458 1766 5986
1343 5986 4277 1842 5158 836 -591 1002 -4088 -3144 -2003 -5912 -2197 -1621 -3365 1363 142
1358 142 -710 3396 157 565 3407 -460 1765 2929 -994 2209 968 -2464 191 -2644 -4201 -574
1374 -574 -3640 -2160 1528 -1200 2140 3723 786 4506 3226 611 4344 1151 -350 2036 -2518
1389 -2518 -2356 -1312 -6297 -4373 -4181 -6663 -2056 -1808 -1596 4174 2996 4041 7410 3738 4718 5281
1405 5281 442 2032 581 -3404 -768 -3254 -5109 -2099 -5500 -4726 -1529 -4018 -594 2238 648
1420 648 4741 4743 2205 5258 2432 70 2345 -2023 -2271 -422 -4347 -1910 -1049 -3616 -270 -1127 -2696
1437 -2696 1352 -76 421 4616 1998 3438 4582 401 2186 1269 -2662 -56 -2286 -4466 -1230
1452a230k400M13L285k817J648J830k812L788O05j552M413j363j427K439l999
1467H21p03J342m266O43L50l229K997j22j254M249j517m35L285k584J225K600
1483C402k527K325J87l685J903j761k581K870k473m62K908k707J721K893k555
1498e42K955j42l139K665j647j541L141k268j71K088l851J298J316k620K950J54
1514F46k326L335j390p38L597k676j23J460l874J282P46k484L470k48k016L140
1530A801k131o91L306k641O86J556l667J938M84k448L346j051k310K520k567k43
1546b112L165k149J382J918l213J965J46k205L356j270j650K476k874k40K506
1561A201k653J579J041l688J904j12j954L681o25n67K596k387J43K229k549J964
$$ plain form
1452 -1230 -3630 -3217 68 -2749 -1101 729 -2083 1705 2310 758 5171 3808 2381 4820 821
1467 821 118 1460 -2806 -2163 -1813 -5042 -2045 -2167 -3421 828 -689 -1124 2161 -423 802 3402
1483 3402 875 3200 3387 -298 1605 -156 -2737 133 -2340 -2802 106 -2601 -880 2013 -542
1498 -542 2413 2271 -868 1797 150 -1391 1750 -518 -689 1399 -2452 -1154 162 -2458 492 646
1514 646 -1680 1655 265 -473 3124 448 325 1785 -2089 -807 -61 -2545 925 677 -1339 1801
1530 1801 -330 -1021 2285 -356 330 1886 -1781 157 641 -1807 1539 488 -1822 698 -1869 -2112
1546 -2112 1053 -1096 286 2204 -1009 956 1102 -1103 2253 983 -667 1809 -1065 -1305 1201
1561 1201 -1452 127 1168 -2520 -616 -728 -2682 999 374 -193 2403 16 159 2388 -161 1803
1577A803M57l469J529j135k194L419j483l79K405l167P18K281j935K802Q38k781
1593b91K288j481j547K895j523m46J447l263K63J336k695L108Q82k286K775j480
1609a8j185L512j836K07J984l708K17Q23k313K939M9k083K277k003j129L055j736
1626i48J388K213k916J056M56k141K762m70k027K146k662j368K380j665J446K101
1642A751l095J210J0k489L267j94q06K803k455n96K461k177J514J374l365R13
1658A26q10k561L061j57m29K634k659o05J826k338J824K057k246K144o64k226
1674a023L034r00r43J770l356q17J148k498K560J777j798K432j063j970K833j168
1690A8L40K896k591P9J289k693J859M07k870J505k198k351K499r85J376L323j993
$$ plain form
1577 1803 2260 -1209 320 -815 -3009 410 -1073 -1452 953 -2214 -1496 785 -1150 1652 2490 -291
1593 -291 1997 516 -1031 1864 341 -105 1342 -1921 -1658 -322 -3017 91 973 -1313 1462 -18
1609 -18 -1203 2309 473 680 2664 -1044 -827 -4 -2317 622 671 -1412 865 -1138 -2267 788 -948
1626 -948 440 2653 -263 793 1249 -892 1870 1400 -627 1519 -1143 -2511 -131 -1796 -350 1751
1642 1751 -1344 -134 -124 -2613 654 460 -346 2457 2 -594 1867 -310 1204 2578 -787 126
1658 126 -684 -3245 -184 -341 -770 1864 -795 -1400 426 -1912 -88 1969 -277 1867 1203 -1023
1674 -1023 2011 1111 168 1938 -1418 -2235 -1087 -3585 -1025 752 -1046 1386 323 -1647 1186 18
1690 18 358 3254 663 742 2031 -662 1197 1604 -1266 239 -1959 -4310 -1811 -2796 -1420 1903 -90
1707i0Q46R43k709K341O10j712K486j747j654K106j841K89J714l355J75j23k733
1724d454K830J291j72L282j204j340K036k498P34J735k568J051Rk919K410q5j021
1741h83K140k277j541J786j872J813L095j549J839l04l208J597q02j258K575j853
1757g02o72J706k057J884K110j868J299j125k808J735m07k14L165j614n92R66
1773H06k982Q21J511j793K549j29j855K681n01J67K585k601j108J59l710J186
1789b214J112j078L005m74k014J985j357J6L141j755Q41J082k539J682P94j670
1805E57J790j920l107Q80k291L22L257p91J602J478k513J556O19j105K595q95
1821B034j470J629k224K44J675k237M29n75l763J093J67m45L901Q7j74K248k183
$$ plain form
1707 -90 756 1699 -1010 1331 1941 229 2715 968 -686 1420 -421 -132 1582 -1773 -1598 -1721 -4454
1724 -4454 -1624 -333 -505 2777 1573 233 2269 -229 505 2240 -328 723 732 -2187 223 138 -883
1741 -883 1257 -1020 -2561 -775 -2647 -834 2261 712 2551 2247 -961 636 -166 -1424 1151 -702
1757 -702 -1374 332 -1725 159 2269 401 1700 575 -2233 -498 -905 -1119 2046 432 -160 806
1773 806 -2176 -1355 156 -1637 912 783 -1072 1609 1108 1275 3860 1259 151 310 -3400 -2214
1789 -2214 -1102 -2180 825 351 -1663 322 -1035 -1019 2122 367 1208 2290 -249 1433 2227 557
1805 557 2347 427 -2680 -1800 -4091 -3769 -512 -1303 299 1777 -736 820 1439 334 2929 2034
1821 2034 564 2193 -31 213 1888 -349 80 -495 -4258 -3165 -2998 -3443 458 545 371 2619 436
1838D36M50J892k135J275j35k978J483o91j143K630j684r93P39k774R04K430m96
1855g90L202J009k057J617j455j321K083k315j052P29k915O03J548j427K487L35
1871B81k177J761n56k09L671o03O84J646l205j39k17k399J376q65k576J677j239
1888c089M7L377m72J187J393k855J095M94j436K742j61j763J081k599j201J710
1904d50j872O85J203k404J691J001m64L222M67j179J134k591r59J749k034J269
1920D68P09k816P59p20j536K243l47p39K124j670N58K342q05J973J184k351N95
1937A971r06k241K367j046m58J570k905j74R28j831J764Q60j805J820o9o77K885
1954B053m54K11J452k884m45L67k348J732N11j938J862j253j139K607o65M37K233
$$ plain form
1838 436 886 2778 643 1918 1783 -1195 288 -403 -1546 1084 -600 -1593 -854 -3628 -2724 -294 -790
1855 -790 2412 3421 1364 2981 1526 205 2288 -27 -1079 -350 -3265 -2662 -1114 -2541 -54 281
1871 281 -1896 -135 -691 -900 2771 2168 2852 4498 1293 1154 937 -1462 -86 -951 -3527 -1850 -3089
1888 -3089 -3042 335 -137 1050 2443 -412 683 1177 -259 2483 2322 559 1640 -959 -2160 -450
1904 -450 -2322 -1637 -434 -2838 -1147 -146 -610 2612 3079 1900 3034 443 -516 1233 -801 468
1920 468 1177 -1639 -880 -1600 -3136 -893 -1240 -1979 145 -1525 -967 1375 570 2543 3727 1376 1971
1937 1971 1065 -1176 1191 145 -313 1257 -1648 -1822 -894 -2725 -961 -101 -1906 -86 -155 -832 2053
1954 2053 1599 1810 3262 378 -67 300 -2048 -316 195 -1743 119 -1134 -2273 334 -331 106 2339
1971B339k157N34R18j837J981K28j838J102k359j581J782j499Q95J864j844Q83
1987e89Q44j732K393N72j269J861j685q36J990j720P90J457k418M10j49k012J889
2004b04k0p34K054j598o54J607j553J212J502k003R67k66j723J759k07p87J966
2021A318j814p45J421j746J479J533j752J562N2j708K146m38n22J715k355q60
2037g14P88k467Q07P41j685J542j15j400K480k90M02K568j554J23J133k290J181
2054A250M38j912J214j325k010J548j244k35K243j270O53J397j467J889O58j165
2070F62J655j188j814J646j751j58J647k149N69N14k186J598J59p01K465o18k61
2087H9K064r12M93J579k271M03j96k621J000m38j335J899j196q65J524j393N91
$$ plain form
1971 2339 182 716 1634 -203 1778 2006 168 1270 -1089 -2670 -888 -2387 -1492 372 -1472 -589
1987 -589 255 -1477 916 1488 219 2080 395 -441 1549 -171 619 2076 -342 68 -81 -2093 -204
2004 -204 -224 -958 1096 -502 -1156 451 -1102 110 1612 -391 576 310 -1413 346 139 -648 1318
2021 1318 -496 -1241 180 -1566 -87 1446 -306 1256 1308 -400 1746 1308 786 2501 146 -714
2037 -714 74 -2393 -1586 -845 -2530 -988 -1103 -2503 -23 -313 89 2657 1103 1226 2359 69 1250
2054 1250 1688 -224 990 -335 -2345 -797 -2041 -2276 -33 -1303 -650 747 -720 1169 1827 662
2070 662 2317 1129 -685 961 -790 -948 699 -1450 -881 -367 -2553 -955 -796 -1497 968 350 89
2087 89 2153 1241 1734 3313 1042 1445 1249 -1372 -372 -810 -2145 -246 -1442 -2307 -783 -2176 -1585
2104a585J969j512J842Q42j098K029j52r99J461j809j316P96k236K15J116j536
2120a973J423L32j430J820k96q29K263j210K05J685j974Q14P72k083Q76o97j951
2137b253J301q06j78K258j017Q84J440j622R26P27j722J364j98j421J646j145
2153A84n60J351j762l37O14j938Q54Q13j138K368O4m43J815j200m84J360j801
2170b40K75R18j759J429M9j566J581q44j239J422j572K91J675j004J262J048j457
2187B69J179l44j748J181j024j148J793j542M26J377j588R42P60j894J508L9r61
2204g75K481o95P8J718j867q7M06k443M13k2j706J684o5n64J808q91j72J524j673
2223h48P65J081j105J283M61j040J320q81j508J002j768n67J211j254J264R57
$$ plain form
2104 -1585 384 -1128 714 1556 458 2487 2335 1336 2797 988 -328 468 -1768 -1553 -437 -1973
2120 -1973 -550 -218 -1648 172 -124 -953 1310 100 305 1990 16 830 1602 -481 395 -302 -2253
2137 -2253 -952 -1758 -1936 322 -695 189 1629 7 933 1660 -62 1302 1104 -317 1329 184
2153 184 -376 975 -787 -1124 -510 -2448 -1594 -781 -1919 449 513 70 1885 685 201 1561 -240
2170 -240 35 953 -806 623 672 -894 687 -157 -1396 26 -1546 -1255 420 -584 678 1726 269
2187 269 1448 1104 -644 537 -487 -1635 158 -1384 -958 419 -1169 -227 533 -1361 147 186 -775
2204 -775 1706 1011 1089 2807 940 853 1259 -1184 -771 -793 -2499 -815 -880 -1444 364 -527 -699 825 -848
2223 -848 -83 998 -107 1176 1637 597 1917 1036 -472 530 -1238 -1805 -594 -1848 -584 373
2239C73j385J993K3j375J509p66p85J419j274K89J428j675N49K02j900Q88n72
2256a059j152J935l85L48J496q19L95J011j919R43m3j499J346n24q64J872j096
2273a4m82J189j954K01P85j550J769M86q42J794l76j105J482j431m94J219j685
2290a008N39P85j221J479J88j227J245j139n17J396j092N69J536j668Q22K13j695
2307g95R75m81j343J739j164l94K069q61Q73J052j624P62j32j606J495l10p48
2324d93J566j153n77J089j590N66O22j512J180K00q29K110j41o25J754j774l87
2341FO85j657P29P41j484J286l50j193J428p64k55J286j294M20J139j324J435
2358H34P44j362J018p53j466J202q50j87J503j520M34O12j368J101L84j144J329
$$ plain form
2239 373 -1012 981 1004 -371 1138 372 -413 1006 -268 21 1449 -226 323 525 -1375 -487 -1059
2256 -1059 -2211 -276 -661 -313 1183 364 759 1770 -149 794 751 -748 598 74 -790 1082 -14
2273 -14 -496 693 -1261 -1060 -275 -1825 -56 430 -412 1382 1006 -99 1383 -48 -542 677 -1008
2290 -1008 -469 316 -905 574 762 -465 780 -359 -876 520 -572 -3 1533 -135 687 900 -795
2307 -795 180 -301 -1644 95 -1069 -1463 606 -255 618 1670 46 808 676 -930 565 255 -493
2324 -493 1073 -80 -657 432 -1158 -592 30 -1482 -302 -102 -931 1179 1038 413 2167 393 6
2341 6 691 -966 -237 504 -980 306 -44 -1237 191 -573 -828 458 -836 -416 723 -601 834
2358 834 1578 216 1234 481 -985 217 -633 -820 683 -837 -403 209 -1159 -58 326 -818 511
2375E11o02o50J546q80N49J302j501j81N90j757Q08L31j026J410q73p61J480r75
2393f79K43J469j321N26M52j481J388L58q82J227j054r61J076j435K62J238j205
2410g79P58K87j341J322j26l09J357j176m47J043j346O08J186j329P58j13j172
2427h19R43j36n04J576j052k96P65j170N18P10j087J014k22j275J118l44m73J630
2445H96r24j81R12j524N30R93j057R67j25j263J376p74j82J508j288J09N82j629
2463a074Q95M13r52J272l61j084J185p63o4J572q60K41M02j351N44L92r60J330
2481G77n13j071J105j249L5J341p47O40N58j392R20K29p00J521p55j116Q30j171
2499g58p8J015r34P39L41j392P98K34n11J516n48n12R06j078j6J188j086O15M9
$$ plain form
2375 511 -91 -741 805 -75 474 1776 275 94 684 -1073 -265 66 -960 450 -423 -1184 296 -679
2393 -679 -436 1033 -288 238 690 -791 597 955 73 1300 246 -715 361 -1074 -812 426 -779
2410 -779 -21 266 -1075 247 121 -188 1169 -7 -454 589 -757 -149 1037 -292 466 353 -819
2427 -819 124 -12 -516 1060 8 -288 477 -693 -175 535 -552 462 240 -1035 83 -261 -734 896
2445 896 -28 -209 703 -821 -291 702 -355 612 487 -776 600 -174 -356 1152 -136 -27 555 -1074
2463 -1074 -179 234 -718 554 193 -891 294 -469 -533 1039 179 420 822 -529 15 407 -553 777
2481 777 264 -807 298 -951 -916 425 -322 318 876 -516 404 633 -67 1454 699 -417 413 -758
2499 -758 -836 179 -755 -16 325 -1067 -269 -35 -546 970 422 -90 816 -262 -278 910 -176 439 488
2518D88j539Q67k02p41J662l36j20Q04j275N6Q07r29R68J7j300Q94l48n44J444
2537F73o18o7N59j253J05P83o15J184J40j004R60r49o00J175o69j24P72j386M60
2556d74M22p87J320k2r04R63p57n90J584n93N10O71j198J42j24j029R22j89j087
2575a220J008q38P2J197k88O39O78j124L17M3p21J222j87p96Q48j145n89P17r96
2594a163J74Q65q87N97L80m91J482j6m50J040j217m25P26j006N44M64j313O42
2612e4m54q82R44j64k01J179q10J90J027o77J110K09j031N58r87r21R63l54p2
2631d27R10j198q0Q25q63Q82L35r20J048n13n17J297m97K92N80j084k4O7j138
2650a025Q40P3k55P92m31o15J133q77R8J050j256M00L25p10R50J86p43Q08q61
$$ plain form
2518 488 -1051 -184 -386 -1127 535 199 79 883 -392 -336 471 -458 510 527 -773 121 -227 -771 673
2537 673 55 -12 547 -706 -601 182 -433 751 891 -113 847 -102 -702 473 -196 -320 452 -934 -474
2556 -474 -52 -839 481 459 -445 518 -239 -829 755 162 672 1343 145 287 163 -866 56 -133 -1220
2575 -1220 -212 -1050 -978 219 -69 570 1248 124 441 484 -237 985 798 2 850 -295 -884 -167 -1163
2594 -1163 -989 -124 -1011 -414 -34 -525 957 941 491 1531 314 -111 615 -391 153 617 -696 -54
2612 -54 -508 -1390 -446 -610 -811 368 -442 -252 775 98 1208 1417 386 944 -43 -964 -1 -355 -427
2631 -427 483 -715 -795 30 -833 49 384 -536 512 -1 -518 779 282 574 1154 70 46 113 -1025
2650 -1025 -185 -112 -367 425 -6 -621 512 -365 -267 783 -473 -73 252 -458 492 678 -65 743 -118
2669a18o19N75o35M36Q81n55K35L14r00P85j29o16R15q09l52Q89q32O15P72j109
2689b57K52n4j045J026j27j93J248p58p2O13r09L89M74j094O72j35r40J012j13
2708a1k38R53p47k05M60r25P22M50r07J127j05r70Q16m13l50R16p22k8M38r57
2728f96P35M07o80P42l81j036R14n08J01J004o91L14M04q42P48J00o71O05m98
2747G1o42Q08p79K40O04q95K76L25j000O25M05m34J073j8o08Q44o78l2P07j147
2767b55L11j15q76P27P6m82J021l83l82O14p33M25O65o05L93M35r39O28k43o25
2787c43P84q83k81Q34j047N07O50r12R06K80q65O18j20k95J106q12m9P34j020
2806b08J25M06q16O78l41q11Q05k75l95J528p78N2Q04j208N21L63o52Q25j46r16
$$ plain form
2669 -118 -737 -162 -797 -361 520 -35 200 514 -386 399 270 -346 569 -240 -592 297 -535 80 852 -257
2689 -257 -5 -59 -1104 -78 -205 -398 850 92 20 633 -276 113 587 -507 165 30 -910 102 -11
2708 -11 -249 704 -43 -248 212 -713 9 459 -448 679 574 -396 420 7 -343 573 -149 -177 261 -696
2728 -696 39 446 -234 508 127 -909 5 -503 -402 602 -89 225 629 -213 535 635 -36 569 71
2747 71 -571 237 -542 -302 302 -593 -317 8 -992 -367 38 -396 677 659 51 895 217 185 892 -255
2767 -255 56 -59 -935 -208 -132 -614 407 24 -358 256 -477 -52 613 8 401 836 -103 525 282 -343
2787 -343 441 -442 -723 111 -936 -429 221 -691 215 495 -370 248 128 -167 939 127 78 812 -208
2806 -208 -83 323 -493 185 -156 -967 -162 -437 -832 696 -82 -30 774 -434 87 450 -202 623 477 -439
2826d39O94m24m11R57n66J84K38r34P34K20n55P97l5n85M11m79jL46o65M7N71
2847A05r86O94K66n50J089r7n12P32p08J01O50r00L66J29q88L71l4o34Q71n10
2867d45j4Q57q04K73O60o00O04P1p33N26j41p91R79p17k37Q04r40J12P19q33O85
2888C5L61p31O90k0l80P01l54k48Q22q93K8K42p75L96M43r14O69m37l51P10k78
2909b84M7P48q27M14N93r40O73J44o02M28l89l39O78p14J07K83n95K67N37q58
2929f29Q17jn63Q64m36j35P08o41j9N79q72M33l7n53P37k54m67O08k84o1O46n43
2951a03K91J70n59L66k6n06O06m43k70P97o59p3O54n83J41N55q31P78Qo76Q31
2972D68l66m60P17n45r2O11p06L06K04p78P87J1o61Q26l29k2O25o38K15M61q71
$$ plain form
2826 -439 255 -169 -580 377 -189 -5 233 -701 33 253 -302 495 460 -125 286 -193 -194 152 -513 -466 105
2847 105 -881 -187 79 -471 618 521 9 741 33 134 784 -116 250 379 -509 -138 -172 -806 65 -445
2867 -445 -459 398 -406 -133 527 -73 531 602 -131 395 254 -537 442 -275 -512 292 -648 -536 183 -650 35
2888 35 396 -335 355 335 -45 656 302 54 876 -17 11 253 -522 -126 317 -597 72 -365 -716 -6 -284
2909 -284 -237 511 -316 98 691 -249 424 568 -34 394 5 -334 344 -370 -263 20 -575 -308 229 -629
2929 -629 188 187 -376 488 52 -83 625 -16 -35 544 -328 105 68 -485 252 -2 -469 139 -145 -206 440 -103
2951 -103 188 358 -201 165 139 -367 239 -204 -474 323 -336 -409 245 -338 -197 358 -473 305 313 -363 468
2972 468 102 -358 359 -186 -278 333 -373 -67 137 -641 146 157 -504 322 -7 -29 596 -42 173 634 -237
2993b37L37R2n12L49j01o01P18m78R4O23m74J19M37n41N92Q1m84O20m13l90O50
3014D81n77q8L41n75J93K74o59O08Mm11P95k68l7M79l06p2K64n41K20J25o36N56
3036A70k05o53Q24m63k25Q70o41J41N53m60L16J65m45N22k28l56N58o72n2O60
3056C79q39L29L57o23N30j5n12O58n2m29Q12l66k00N47p56J30M02o12J42K92p20
3077e46P38k01m03Q38n99J22N59p36K89K73n20M23k9m57N11m11j91N85o55K91
3097a19L26o94O45K09n34M11r9m26P92m83k26N31o75J94M49o18L73k4n25O59k28
3118f2k13N71k89p7N66p05L30J16o51M92o2m68O06k64k67N03n60L48M58o45O01
3139C28J62p29P74k14l92M60l79j83M92p08Q9L90n82J76L89n71Q12k67k64O50
$$ plain form
2993 -237 100 192 -320 29 -72 -673 45 -433 -339 284 -190 -71 366 -175 417 498 14 634 221 -169 481
3014 481 -96 -184 157 -418 -225 49 -610 -2 2 -409 386 118 81 560 254 182 446 -95 125 250 -386 170
3036 170 -35 -688 136 -327 -552 318 -323 -182 371 -89 227 392 -53 469 241 -115 443 -229 -281 379
3056 379 -460 -131 226 -397 133 118 -394 264 212 -217 595 229 29 576 -180 -50 352 -260 -118 174 -546
3077 -546 192 -9 -412 426 -173 -51 508 -228 61 334 -186 237 208 -249 262 -149 -340 245 -410 -119
3097 -119 207 -487 158 367 -167 244 145 -281 511 28 -198 333 -342 -148 301 -317 56 32 -493 166 -62
3118 -62 -275 296 7 -70 496 -209 121 237 -414 78 16 -452 154 -110 -377 126 -434 -86 372 -273 328
3139 328 490 -239 535 321 -71 389 10 -173 319 -389 -300 90 -492 -316 73 -498 314 47 -217 433
3159D33k90p8M70o06L8M86o77L59Q7n59N32l34l03O07m60K5N01o51L54L72n19
3180b13L09N5l09N45k52k41M81n01n0N06p69L91J76n69N63q1l81O25m30j24P92
3201E23n29J52K99n72M10n5p17N96k45l24P16n57k4M93m45J91M30n58L98P5m33
3222a76M70j04l35N56o19n2M63n86K75L13o31N48p0l54N54j23l27P22n97N3K30
3243B10p31L90K05o31M74m0l02Q28n59j5P09p34K92L97m00K85N2n75M82l36m57
3264d56P33n32j01L75n22J72N31n27M42O8k76N72m05L8M37k41l16L66o57RK91
3285An75L73J96n26O38k66j76P98n41K39O08o66L11j11k93K27k0o91N99n64jL44
3307i6l81J59M57m20M51P5m99P42n3l52L92l41k45N47p39N7L19m67K72J40o51
$$ plain form
3159 433 143 65 535 -71 -33 453 -224 135 222 -337 195 -139 -442 165 -295 -270 231 -420 -66 306 -213
3180 -213 96 151 -158 387 135 -106 375 -126 -176 330 -439 -48 128 -441 122 41 -340 285 -145 -269 523
3201 523 -6 146 445 -127 283 228 -489 107 -138 -462 254 -303 -327 166 -279 -88 342 -216 182 257 -176
3222 -176 294 190 -145 411 -208 -260 203 -383 -108 205 -426 122 52 -302 252 129 -198 524 -73 -20 210
3243 210 -521 -131 74 -557 -83 -123 -425 403 -156 -171 538 -196 96 493 93 378 430 -145 337 1 -456
3264 -456 277 -255 -356 19 -503 -331 200 -327 115 183 -93 479 74 112 549 308 -8 358 -299 -290 1
3285 1 -574 -201 -5 -531 107 -159 -335 463 -78 161 769 103 414 303 10 237 217 -474 125 -439 -440 -96
3307 -96 -477 -318 139 -281 170 245 -254 488 435 83 475 134 -111 436 -303 -246 73 -394 -122 18 -633
3328f33P90k71o7N99l39k6L72k42j19K82n81M53r4m84N12l07j36N05m30j42N80
3349B22m72L28J93l71M29k27l60M36n0k15M96n71q1M34o71K64K83m24N36o3m02
3370b86N15k50J38M93o16P9K77n00L13Q4o27O47l00m52N38k80J2N81n20K71J90
3391C07m95L90Q8k38L23l24l47M34m34Q9M36p06M29K69n27L11O9l81P65l93k02
3412a37M19k79r8N70p52L84K5o24L67j34j70N52l79j52N12k61J83L11k64J66J26
3433C65m94M98j65l39N31n08j25M48o59K82K09m98M94Kl52P37k62l46P82o03Q0
3454G7M06o89L58R9m26L00j32m87L74j40j20N08k37P5L75n52K08L74m64N07j73
3475B41n51M61l62M2M31n36q7L71n67M84j76l3P98k53k21M00l59j05K96m29R6
$$ plain form
3328 -633 157 -114 -181 418 79 53 425 183 64 346 -235 218 124 -360 152 -155 -291 214 -216 -358 222
3349 222 -250 78 271 -100 329 102 -258 178 128 -87 409 -162 -243 191 -480 -216 67 -357 179 116 -286
3370 -286 229 -21 117 610 -6 73 350 -150 163 247 -380 267 -33 -485 53 -227 -215 366 -154 117 307
3391 307 -188 202 290 52 375 51 -296 138 -296 -207 229 -477 -48 221 -306 5 74 -307 458 65 -137
3412 -137 282 3 -95 475 -277 107 132 -492 -125 -259 -429 123 -256 -408 104 -157 26 337 73 239 365
3433 365 -129 369 204 -135 396 -112 -237 211 -448 -166 43 -455 39 41 -311 426 164 -182 600 -3 77
3454 77 483 -206 152 251 -175 125 -7 -494 -120 -260 -380 128 -109 -34 341 -211 -3 371 -93 414 241
3475 241 -310 151 -211 -169 262 -274 -361 10 -557 -73 -249 -282 516 263 42 442 83 -22 274 -155 -59
3496e9K27n36K71l1l00P19k94j48L84o32J17M87l75M30M6l87L27k04k72L77k22
3517g5k62L83l32rN93l87J98J91o23M42j61j82P09l54m2R4m61P1K26l34K07p0
3539a78k54N72p7l47O42j24j75L89n56K24J76o26M11jm30M77l48j42J67k3J0L99
3561A86m25L96J1k68N79q6m41L09m34j92M16l39K52K05m84J89R9m66O06j20m4
3582e1L50l13L8L74m06J93K17n96J65l0m16L53J0j50N70l82o0L09l76L06J39m80
3604b36L92j82r6L46r7L2Q4l83K6J50m62L96K98m81N72l15l93O27k10k93N44l48
3626b9k16M36m53L89M2m94O13k73m02N73l22J9L22k43J34Q0k29M3J9m08M67k59
3648a91j71N25l06rN34m74K2K18m92N08K52m54L96k62m29O87p16K10J64k11q1
$$ plain form
3496 -59 168 -368 -97 -128 -428 291 -3 -151 233 -399 -282 205 -170 260 306 -81 246 42 -230 147 -75
3517 -75 -337 46 -286 -295 298 -89 109 300 -323 119 -42 -224 485 131 89 183 -278 -207 19 -315 -108 -178
3539 -178 -432 140 63 -284 358 234 59 448 -108 116 292 -334 77 76 -354 123 -225 -367 -200 -223 -213 186
3561 186 -239 157 168 -100 479 393 -48 261 -173 -365 51 -288 -36 169 -315 -126 -27 -493 113 -7 -51
3582 -51 299 -14 24 398 -8 185 402 -194 -29 -59 -475 -122 -112 -262 308 -74 -134 175 -201 105 244 -236
3604 -236 156 -26 -122 224 127 159 243 -140 -114 36 -426 -30 268 -213 359 44 -349 278 68 -225 319 -29
3626 -29 -245 191 -262 127 169 -325 288 15 -387 186 -136 -117 205 -38 96 176 -53 -10 9 -399 68 -191
3648 -191 -362 163 -143 -152 382 -92 -70 148 -344 164 416 -38 358 96 -333 354 -362 -152 12 -199 -280
3669b80J22p0K66R0k83L00j02k61N40l96K22K13m78J02J03k43K17r1k80M40j49
3690a8k91M66n00M11J29l79L37K03n15K09J09m46N69j64k77M48m57M8K78m78K98
3711b0l2l35L75KqL98n25RL75l51J96P8o9J00j57k87K40m0k84N30k22M4P7l60
3735b66J73K39k42L22j10k20K38j62r3L79m41J27J19k11J59J0j52K16J6k66L04
3756A39l70J08M67m90O2K15l96K76J10l41L39j45P0J72n24J76L25l64J52J44m00
3777b75L12j26k07L48j95j71L40n5q3L23r9J29j10k58K15k3l32L30L7k38J98k51
3799a91jJ92l63L54Q1l38L56l2j01K90j6k97K63l10J83J15k53K29Nl42J31j5j55
3822b15K88k18J06J11k52K80J86m71M76m9l92M33l31O1J90l66R7K01l22J6K58
$$ plain form
3669 -280 -158 -228 38 128 -155 145 43 -218 322 -74 148 361 -117 -15 88 -155 62 -29 -309 131 -18
3690 -18 -309 157 -343 68 197 -182 155 358 -157 52 161 -285 284 120 -157 291 -166 -118 160 -318 -20
3711 -20 -52 -387 -12 -10 -18 380 -145 -136 239 -112 84 162 93 193 36 -251 -11 -51 -335 195 -27 17 94 -266
3735 -266 -93 146 -96 226 116 -104 134 -28 -121 258 -183 -56 63 -148 11 21 -131 85 101 -165 139
3756 139 -231 -123 344 -146 -84 131 -265 11 121 -220 119 -26 44 216 -308 -132 193 -171 -19 125 -275
3777 -275 37 -89 -296 52 -143 -314 26 -29 -112 211 112 241 131 -127 88 65 -267 63 100 -138 60 -191
3799 -191 -192 0 -363 -9 72 -266 90 58 -43 247 231 -66 197 -113 70 185 -68 161 166 -176 -45 -60 -215
3822 -215 73 -145 -39 72 -180 100 286 -185 291 242 -150 283 -48 13 203 -163 -66 135 -187 -171 87
3843H7l29K15J17k40L89j98o1M84m58Q0N5n72L32K30l83K40nk04L25j74l1K61
3865A60j09jJ79k99J79m2j79J55M1j60J62l13j06K81k32K99K05k91L05p0n70N09
3887A03n5j08L20l22j31L37m69L72j1l58L37j53l9K09%l6L61l23j07K78k61J3
3909d3K78m52J19j4j84M28j59m8K07l81J86K13l54M87q3j31K60j85k57L19k16
3930a0j33K92l37k7L02l51R6M52o35M33j15k43L61Kj36M68k33L2J06m01L6jk18
3953b60J28lj56L39k02J15J55k38J44K04k67L42j2k99K29J2j25R6l66J03j6k63
3975c40J68K45l53K50N1j21L47l08M8J79j75j0K32m43M64O9m22K68l45q1L54l41
3997b64Q7L87j76Q9J6j39L17ll82j4J31j58L73k51PK1l85K93j07l69K79J89j82
$$ plain form
3843 87 -242 -27 90 -150 239 41 -20 464 6 86 141 -431 -99 131 -252 -12 -17 -221 104 -70 -101 160
3865 160 51 50 229 -70 109 67 -112 43 84 -76 86 -227 -333 -52 -284 15 220 -71 234 164 -406 103
3887 103 48 -60 260 -62 -193 144 -325 47 36 -322 15 -138 -177 32 32 -4 357 34 -73 205 -56 -43
3909 -43 235 -217 -98 -112 -296 132 -27 -75 132 -249 -63 150 -204 283 200 69 329 144 -113 206 -10
3930 -10 -143 149 -188 -215 87 -264 -168 284 -351 82 -33 -276 85 87 -49 419 186 218 324 -77 -41 -42 -260
3953 -260 -132 -135 -291 48 -154 -39 116 -122 22 226 -41 301 289 -10 219 231 106 202 -164 -61 -77 -340
3975 -340 -172 73 -280 -30 21 -100 247 -61 -13 166 -9 -19 213 -230 234 303 -119 149 -196 -277 77 -264
3997 -264 -177 210 34 123 139 0 317 314 -68 -82 49 -109 264 13 20 41 -344 -51 -158 -527 -248 -59 -241
4020b41M70l2j82M56l89N3J85n02K00j65j56M29k26J2J30Ok93K77k00J07J65j94
4042i0L60j57j88K53k55poj50J83j8k32K22L38l55K73o2l63M59k25L6K70l22m8
4065h4L22n18J85P0j56J45o9j64K46n9j03M88l39k0M46m72J52J86l06K19k27k52
4087c10M06k86k1L60m71K27Q0j23K36nn0J81Op9O7j72p6J04k42N3J8k56L27Rk50
4112b67K86j96n8M27l00J17J79j67L47j45j65o0M0k84K92j24k01L76l88L11N4
4133G4m07L58J21m95L69J03k45M00j69R8k42j32J00P1l24N89k01l38L18j00K6
4154b6J65l5j34J41k52J81P0j79J63J23j76J6j50j55K64k49J13L08l33RO0q6K57
4177I5ok11L41j71j52K44k31L26j43k86Q8J67k98K39J00q7Jj12J46J21l91L07
$$ plain form
4020 -241 229 197 15 471 82 135 320 -182 18 -147 -303 126 -100 -88 42 48 -245 32 -168 -61 104 -90
4042 -90 270 113 -75 178 -77 -84 -90 -240 -57 -75 -307 -85 253 -102 171 109 -254 205 -20 16 286 -36 -84
4065 -84 238 -280 -95 -25 -181 -36 -105 -269 -23 -82 -185 303 -36 -56 390 -82 70 256 -50 169 -58 -310
4087 -310 96 -190 -211 149 -322 -95 -15 -138 98 93 43 224 230 151 218 46 -30 74 -168 -115 -97 -353 -26 -17 -267
4112 -267 19 -177 -235 192 -108 9 188 21 368 223 58 -2 38 -246 46 -78 -279 97 -291 20 74
4133 74 -333 25 146 -349 20 123 -122 278 109 207 -35 -167 -67 4 -320 269 68 -270 48 -52 -26
4154 -26 139 104 -30 111 -141 40 110 -69 94 217 41 57 -93 -248 16 -233 -120 188 -145 -136 -76 -162 95
4177 95 89 -122 219 48 -104 140 -91 235 92 -194 -106 61 -237 2 102 15 16 -96 50 171 -220 87
4199H7Q0k80J14J56l30L98j61k69K01j39O6J65j52J52K71l82J60q3k46L15q0j12
4221f9K69m60L9L69m26J52J80l23L61p6p2L19m1j56L26k81k02K22l53L07l3k89
4243b37L5O6n7J78r6L5J54l82L93o4k13M79j23k53L68l45j86J45M5QJ34k45J67
4266FJ64n78N50l6k57L38k43k9K91q8N2J20n12L41r6k77K52n9j15L77k87lK10
4289A21k21J39R0j91K88k66k22M86p3l17L30k62k3K39l30P5K37k26K28n4l11M63
4311B00p0j75K07k75j3O6p2J30J10k72J39np9J70p1K01R7j55m9j8j08n8P0p8J57
4336D9j17nJ91j91O7K35r9n3m2j69J94O9k26L84r9l75L66j75j63K62k33L7J22
4359B9k48L58pj43J37p4j49J61j23J84k4r4J32j35k19L46m0l64K68k78M8K60j31
$$ plain form
4199 87 167 -113 1 157 -173 225 64 -205 -4 -143 -77 88 -64 88 359 -23 137 54 -192 123 43 -69
4221 -69 200 -260 -221 148 -278 -126 54 -269 92 16 -56 263 222 66 392 111 -91 131 -222 85 52 -237
4243 -237 -202 -136 -193 -15 -111 -76 78 -304 89 25 -188 291 168 -85 283 -62 -248 -103 -58 -50 84 -161 6
4266 6 170 -408 142 106 -151 187 -56 -85 206 118 170 290 -222 119 23 -254 -2 -61 -176 201 -86 -89 121
4289 121 -100 39 129 -62 226 -40 -262 224 151 -166 164 -98 -121 118 -212 -137 100 -126 102 48 -263 200
4311 200 130 -45 162 -113 -126 -60 -132 -2 108 -164 -25 -30 -109 61 -10 191 288 133 84 66 -42 -100 -30 -108 49
4336 49 -68 -73 118 -73 -6 229 130 77 35 -134 60 129 -97 287 188 -187 179 4 -159 103 -130 -93 29
4359 29 -219 139 132 -11 126 52 -97 64 -59 125 101 7 139 4 -215 131 91 -273 -5 -283 -235 25 -106
4382a06j2L72k40J07J9l29K60j03P2K43j90j43K6n5J34J40l57L30k65j86K70Q9
4404G6j22K34k52J18j48n7K89j41j99L54J16n09L63l16M0J93j6p3P3k27J52J69
4426A17k16J91j54j53L49k97J77K11r2j10J39j73P0P4k66K81o6l30OK75n1J76
4448A58j68L8J64l60QJ97j96M02q5l06K85j37j80L56k01q3L39n96L90L1k36L27
4470A47j92O7R4k03o5K09j68J54J86k34P4L8k65L36l44pK61m07L49J92k66R3l4
4493A5k03K10j79r9M69j87j85K83j71J2K40l71K1Q5j12L04j44j72L84q3j17J92
4515A92l55o3L77j64Jm1p0K45k25K5J34m3Ol2n3n3J32j44J28Q7j47J91j0l51K44
4540A1j5j21M51m06J65n6k28M39k46k29L79m01J5J73p6K96q0o5J38j72m6J93q5
$$ plain form
4382 -106 -118 254 14 121 140 -189 71 -32 40 283 93 -50 -24 -79 55 195 -162 168 -97 -283 -13 76
4404 76 -46 188 -64 54 -94 -151 138 -3 -202 152 268 -241 122 -194 -154 39 23 -50 23 -204 -52 117
4426 117 -99 92 -62 -215 134 -163 14 225 133 23 162 -11 59 133 -133 148 82 -248 -242 33 -18 158
4448 158 -10 28 192 -168 -160 37 -159 243 158 -148 137 0 -180 176 -25 -108 231 -365 25 56 -180 147
4470 147 -45 22 116 -87 -152 57 -111 43 229 -5 69 107 -158 178 -166 -173 88 -319 30 222 -44 49 15
4493 15 -188 22 -157 -256 213 26 -159 124 -47 -35 205 -166 -145 -60 -172 132 -12 -184 200 117 0 192
4515 192 -163 -226 151 -13 -12 -53 -123 122 -103 -78 56 13 19 -13 -66 -119 13 -131 -3 84 -63 128 118 -233 11
4540 11 -4 -125 326 -80 85 29 -199 240 -6 -235 144 -257 -242 -69 -145 151 71 6 144 -28 -74 119 34
4563C4q0J60k50N1K01m09L68J2j40K06l1l65L81j5j10K00l64J59O0j52j21K43
4585C8k80J78j65J21L23m8k04K19l29J57R2j48J38K68n04O3R4m41N08j16p9N7
4607e8j06P2J07j45J02R5q6K10j29j14L26k52r2J69j94N8l6j39J85K18l82J78
4629a3k5k60N48m20Q7K93p2m9J06j17oj11m3K74j61j83J00Pl1K56j13j85K28j02
4653HM6J59k33K69k10k34M54l60K5K18k63K58j58q5J76Jk20L41l6l12K12K0j04
4676b8J87j16J39r8l53M35j71k50M31j37j96L24k84J04J12r2J6l9j61K34o4j8
4698b5J92j54l4J96n26J14L90m31J50P1n6J44q0k1K83k42p1J40k24K86p6j16L24
4721B34j67k39J84p1o5J69j15J23M6k77K19R5k1j08O9q8K15k97j19L69j31O9N5
$$ plain form
4563 34 -46 114 -136 -85 116 -293 75 87 -53 153 122 -243 138 123 13 213 -151 8 68 -84 -205 38
4585 38 -242 -64 -229 -108 215 167 -37 182 -147 10 102 -46 92 360 -144 -81 13 -428 80 -36 -115 -58
4607 -58 -164 -92 15 -130 -28 67 -19 191 62 -52 274 22 -70 99 -95 -37 -73 -212 -27 191 -191 -13
4629 -13 -38 -298 250 -170 -83 210 138 89 195 78 72 -39 -82 192 31 -152 -52 -45 -76 180 67 -118 110 8
4653 8 54 213 -20 249 39 -195 259 -101 -76 142 -121 137 -21 -106 70 71 -149 192 156 -156 56 76 -28
4676 -28 159 43 182 84 -269 166 -5 -255 176 39 -157 167 -117 -13 99 7 23 -16 -177 57 -7 -25
4698 -25 167 13 -21 175 -351 -237 153 -278 -128 -57 -113 31 -49 -70 213 -29 -100 40 -184 102 26 -90 234
4721 234 67 -172 12 -59 -124 45 -70 53 99 -178 41 136 115 7 76 -12 203 -94 -213 156 25 94 149
4744A49k29J38J44l28K96j06oJ97j37k24J44r1o3PJ4J27r3j4J79j53P0J48j88
4767a9lJ49j27J65k8k21J74J38m04L28l46Q0J01k16L58j1k49O1J98j82K75j43
4789G8j69K34j28RM7j63J69o2k1r6J05j79J49m4j73N81m54J21J70j86MK21k52
4812c9J68j63Q1J67l71P4K89l97J56J21j75N8n1k8K8P0R0K8p3j10J25j45J51N7
4836A11k20J27O4j94K03j14j6J56j13p5K4j02J74K14l99L21j25k53K11j24N7L33
4858B60k51j08K99j20j37K07l62M05p0j87K11j32j73J28L3k64K18LJ06k3j98K83
4880A28n1j16M0L9J3O2j24j20J82l02K05L3j3J22Q0k32J75j51J2J51j61J57kj50
4904b3J75o0j96K29j65p0R3j16j50L06k58K01k8j65L46m6j34M1N4p4POJ38J13
$$ plain form
4744 149 -80 58 202 -126 170 64 58 255 118 -106 38 -53 -116 -109 -95 32 -61 -75 104 -49 21 169 -19
4767 -19 -22 127 0 165 137 -84 90 228 -176 152 -194 -114 -13 -229 129 118 -131 -70 128 -54 221 78
4789 78 -91 143 15 24 71 -92 77 15 -6 -102 3 -176 -27 -71 -244 337 -117 4 174 -12 -8 213 -39
4812 -39 129 -34 47 214 -157 -83 206 -191 -35 86 -89 -31 -82 -110 -82 -12 78 106 33 -77 48 -97 54 111
4836 111 -109 18 82 -112 91 -23 -39 117 4 -71 -47 -149 25 239 -160 161 36 -217 -6 -130 -73 260
4858 260 9 -99 200 80 -57 150 -212 193 123 -64 147 15 -158 -30 3 -261 -43 -40 66 43 -155 128
4880 128 77 -39 1 40 53 115 -9 -129 53 -249 -44 -11 -24 98 178 -54 121 -30 -18 133 -28 129 127 -23
4904 -23 152 92 -104 125 -40 -110 -17 -133 -283 23 -235 -34 -62 -227 119 73 -61 -20 34 -40 -33 -27 111 224
4928B24m98L19k6j6M6q3o1J75N2k37J42o8j07K06m4J26l8k10J69p8P3o5j9r7J92
4953G7j16o8J56j75M8m4J03K3J51j8j61J25l41J13J56j06K53m34K94k0k55K96
4975E7j66m0K62j04J6M8q5O7K7k20J77j7l32L00J71k35J95r3j66K21j95J88j10
4998c4l39M02O0j29P2O6j42K56k77J53m4j59j8K02k38K69r9r8K84k16O0J27k85
5021a27K65j42NJ00o9r9J54j57pK53j75q7R5J5j60J04M1k0m6L2O9j52J63J1j94
5046a28J05J3j7l07M25m5m7N3r3K22j73l1L91n10K18l6k7O0j58j70L41j73j4J33
5070C2j92R8J18q7O1J29j41J12o9J9k5M0j56K19k45j1K39l11M2K28k74J35J00
5093F1k13J59r4R0J73j87R5K4l9m1K3m5J04J7k32J57j31j18J83k37L72k7j66J97
$$ plain form
4928 224 -274 45 19 3 49 -34 -95 80 132 -105 37 -31 -138 68 24 150 112 -98 71 -7 66 1 -18 -115 77
4953 77 -39 -107 49 -126 -78 -122 -19 4 155 137 -24 101 -240 -127 29 -77 176 -258 36 16 -239 57
4975 57 -109 -149 113 9 25 73 -12 55 82 -138 39 22 -310 -10 161 -74 121 28 -138 83 -112 76 -34
4998 -34 -373 29 89 -40 32 98 -44 212 -65 88 44 -115 -133 69 -169 100 1 -97 187 -29 31 158 -127
5021 -127 138 -4 1 101 32 -67 87 -70 -77 176 1 -86 9 24 -136 -32 9 -11 -57 -25 44 -108 55 66 -128
5046 -128 -23 -10 -27 -334 91 46 -1 52 -41 181 8 -23 368 -142 76 40 13 73 -85 -255 86 -87 -101 32
5070 32 -160 -62 56 -31 30 159 18 130 61 80 55 95 -61 158 -87 -98 141 -170 -128 100 -174 -39 61
5093 61 -152 7 -87 3 176 -11 84 108 69 28 51 6 110 127 -105 52 -79 -197 -14 -251 121 94 -72 125
5117A25n3l37M17K4l65K61k29K78m4r4K3J07k31R2J79o0j54K6j6Pnj48L88k72
5141h1R1o8J05k5Np2J17o0q9K09j80J29O0j84L0J32l15K55j43k87M00p6j23K96
5165A26r8OQ1k34K49m7q8K20j70j34J64q7p7J23j23Q9P9k35J65N9j48J39l9k70
5189b50K80l2j57M07l75J45M7k74L45j60j06R1l6P8Kp2O9L8j39J34Kp6K13j79
5213ej71R4J32o1P9j69J95j71J70r0L8j00K6J79k48J08k11K45K9o7P1Ko3o2K7
5238b3j31K39l5r7J21N1j43Q6k15N3pO0J74q5o3k4J44k29J60k97K91K8j48P4l4
5263e0r5J97m7nP4r1r0Q5q0oP7jp7J89j28J25n7j08R6m8R5rR7l21J82q1k4J28
5291B7r9J08o4m6R6k12M5L82l78J99N9k36J14j7M7K06j97oKj05K4j5%K3qk31K40
$$ plain form
5117 125 72 -265 152 176 -189 72 -157 121 77 -17 6 113 -118 -26 153 93 -61 -35 -51 -44 -49 -197 191 -81
5141 -81 10 -58 47 22 27 -45 72 12 -77 132 -48 81 141 -43 -13 119 -196 59 -84 -371 29 -47 -170 126
5165 126 28 34 115 -119 130 83 -5 215 45 -89 75 -12 -89 34 -89 0 79 -156 9 68 -80 59 20 -250
5189 -250 30 -2 -159 248 -127 18 65 -209 136 -24 -130 -39 -75 3 5 -67 2 40 -99 35 37 -39 174 -5
5213 -5 -176 -82 50 -11 68 -101 94 -77 93 3 41 -59 -33 146 -102 6 -205 40 69 2 73 75 12 -50 -23
5238 -23 -154 85 50 -47 74 125 -18 68 -147 -94 -101 -41 133 48 -15 -39 105 -124 36 -261 30 58 -90 -16 -50
5263 -50 -145 52 5 0 74 -17 -107 -22 -102 -108 -31 -32 -109 80 -48 77 20 -88 8 -40 55 46 143 -178 4 -77 -101 27
5291 27 -72 36 -28 -74 22 -190 -145 237 -141 58 117 -119 -5 -22 25 231 34 28 30 -75 -51 -66 -66 -43 -51 -282 -42
5318d2J15l08L32m7j57M11k42j38J65j42J32N2j95Q0r7Q1Q1j95P6oq3n4L64k10
5342b7K5J09j67L3L22k86jj75o3K73j8L5p0j6N2r8J17J9j26KJ28j15M7L1j62J67
5368C6K50k75mk5j29J06M4L3L3j66J94p4k05L09j18N5R5q6j72J03k18K40j1K2
5392C7K1j13m6J37L9j58K05n9j69K03j98K00L3k14QJ51j91K08p5j2L4KmM1j33
$$ plain form
5318 -42 73 -235 97 50 -107 304 62 -76 89 -53 79 131 -64 16 -81 0 81 -114 -38 -44 -127 -181 183 -27
5342 -27 -2 107 -60 -27 295 9 8 -167 -230 43 25 60 -10 -26 26 -72 45 64 -62 -60 68 -47 0 31 -131 36
5368 36 286 11 7 -18 -147 -41 3 36 69 -97 97 23 -182 127 9 64 159 73 -99 4 -214 26 15 37
5392 37 58 -55 -101 36 75 -83 122 63 -106 97 -101 99 132 -82 -74 77 -114 94 19 7 41 43 39 80 -53
$$ [...]
8191H6
##END NTUPLES=NMR FID
##END=
