##TITLE=1H_2-2025-Bay
 CDCl3
 8 sc, 
 10.1.2025
##JCAMPDX= 6.0         $$ Bruker NMR JCAMP-DX V2.0
##DATA TYPE= NMR FID
##DATA CLASS= NTUPLES
##ORIGIN= UXNMR, Bruker Analytische Messtechnik GmbH
##OWNER= root
$$ XWIN-NMR		Version 3.5
$$ Fri Jan 10 14:04:19 2025 Russian Standard Time (UT+4h)  she@DPX200
##.OBSERVE FREQUENCY= 200.1315
##.OBSERVE NUCLEUS= ^1H
##.DELAY= (6, 6)
##.ACQUISITION MODE= SIMULTANEOUS
##.ACQUISITION SCHEME= undefined
##.AVERAGES= 8
##.DIGITISER RES= 18
##SPECTROMETER/DATA SYSTEM= spect
##.PULSE SEQUENCE= zg30
##.SOLVENT NAME= CDCl3
##.SHIFT REFERENCE= (INTERNAL, CDCl3, 0, 15.7039)
##AUDIT TRAIL= $$ (NUMBER, WHEN, WHO, WHERE, WHAT)
$$ ##TITLE= Audit trail, XWIN-NMR		Version 3.5
$$ ##JCAMPDX= 5.01
$$ ##ORIGIN= Bruker BioSpin GmbH
$$ ##OWNER= she
$$ F:/spectra/data/she/nmr/H-F/1/audita.txt
$$ ##AUDIT TRAIL=  $$ (NUMBER, WHEN, WHO, WHERE, WHAT)
(   1,<2025-01-10 14:02:54.78 +0400>,<she>,<DPX200>,
      <created by zg, POWCHK disabled, PULCHK disabled
       configuration hash MD5:
       00 E9 B6 7A A2 85 ED C7 34 08 36 98 17 FE 4E 26
       data hash MD5: 16K
       0E 7A DB D7 6A ED DB 3E F7 FE B5 7E 44 CC 0A 95>)
$$ ##END=
$$ 
$$ hash MD5
$$ 2C 07 1F 13 F7 4C 55 A3 EC 37 00 0A 75 15 0F 31
##$RELAX= 
##$RELAX= 
##$RELAX= 
##$RELAX= 
##$RELAX= 
##$RELAX= 
$$ Bruker specific parameters
$$ --------------------------
##$DU= <F:/spectra>
##$EXPNO= 1
##$NAME= <H-F>
##$PROCNO= 1
##$TYPE= <nmr>
##$USER= <she>
##$AMP= (0..31)
100 100 100 100 100 100 100 100 100 100 100 100 100 100 100 100 100 100 
100 100 100 100 100 100 100 100 100 100 100 100 100 100 
##$AQSEQ= 0
##$AQ_mod= 1
##$AUNM= <au_zg>
##$AUTOPOS= <>
##$BF1= 200.13
##$BF2= 200.13
##$BF3= 200.13
##$BF4= 200.13
##$BF5= 200.13
##$BF6= 200.13
##$BF7= 200.13
##$BF8= 200.13
##$BYTORDA= 1
##$CFDGTYP= 0
##$CFRGTYP= 5
##$CHEMSTR= <none>
##$CNST= (0..31)
1 1 145 1 1 1 1 1 1 1 1 1 1 1 1 1 1 1 1 1 1 1 1 1 1 1 1 1 1 1 1 1 
##$CPDPRG= <>
##$CPDPRG1= <>
##$CPDPRG2= <>
##$CPDPRG3= <>
##$CPDPRG4= <mlev>
##$CPDPRG5= <mlev>
##$CPDPRG6= <mlev>
##$CPDPRG7= <mlev>
##$CPDPRG8= <mlev>
##$CPDPRGB= <>
##$CPDPRGT= <>
##$D= (0..31)
0 1.2 0 0 0 0 0 0 0 0.06 0 0.03 0 0 0 0 0.0002 0 0 0 0 0 0 0 0 0 0 0 0 
0 0 0 
##$DATE= 1736503374
##$DBL= (0..7)
120 120 120 120 120 120 120 120 
##$DBP= (0..7)
150 150 150 150 150 150 150 150 
##$DBP07= 0
##$DBPNAM0= <>
##$DBPNAM1= <>
##$DBPNAM2= <>
##$DBPNAM3= <>
##$DBPNAM4= <>
##$DBPNAM5= <>
##$DBPNAM6= <>
##$DBPNAM7= <>
##$DBPOAL= (0..7)
0.5 0.5 0.5 0.5 0.5 0.5 0.5 0.5 
##$DBPOFFS= (0..7)
0 0 0 0 0 0 0 0 
##$DE= 6
##$DECBNUC= <off>
##$DECIM= 24
##$DECNUC= <off>
##$DECSTAT= 4
##$DIGMOD= 1
##$DIGTYP= 9
##$DL= (0..7)
0 120 120 120 120 120 120 120 
##$DP= (0..7)
150 150 150 150 150 150 150 150 
##$DP07= 0
##$DPNAME0= <>
##$DPNAME1= <>
##$DPNAME2= <>
##$DPNAME3= <>
##$DPNAME4= <>
##$DPNAME5= <>
##$DPNAME6= <>
##$DPNAME7= <>
##$DPOAL= (0..7)
0.5 0.5 0.5 0.5 0.5 0.5 0.5 0.5 
##$DPOFFS= (0..7)
0 0 0 0 0 0 0 0 
##$DQDMODE= 0
##$DR= 18
##$DS= 0
##$DSLIST= <SSSSSSSSSSSSSSS>
$$ [...]
##$SUBNAM2= <"">
##$SUBNAM3= <"">
##$SUBNAM4= <"">
##$SUBNAM5= <"">
##$SUBNAM6= <"">
##$SUBNAM7= <"">
##$SUBNAM8= <"">
##$SUBNAM9= <"">
##$SW= 24.0689530833862
##$SWIBOX= (0..15)
0 0 2 0 0 0 0 0 0 0 0 0 0 0 0 0 
##$SW_h= 4816.95568400771
##$TD= 16384
##$TD0= 1
##$TE= 0
##$TE2= 300
##$TE3= 300
##$TEG= 300
##$TL= (0..7)
0 120 120 120 120 120 120 120 
##$TP= (0..7)
150 150 150 150 150 150 150 150 
##$TP07= 0
##$TPNAME0= <>
##$TPNAME1= <>
##$TPNAME2= <>
##$TPNAME3= <>
##$TPNAME4= <>
##$TPNAME5= <>
##$TPNAME6= <>
##$TPNAME7= <>
##$TPOAL= (0..7)
0.5 0.5 0.5 0.5 0.5 0.5 0.5 0.5 
##$TPOFFS= (0..7)
0 0 0 0 0 0 0 0 
##$TUNHIN= 0
##$TUNHOUT= 0
##$TUNXOUT= 0
##$USERA1= <user>
##$USERA2= <user>
##$USERA3= <user>
##$USERA4= <user>
##$USERA5= <user>
##$V9= 5
##$VALIST= <valist>
##$VCLIST= <CCCCCCCCCCCCCCC>
##$VD= 0
##$VDLIST= <DDDDDDDDDDDDDDD>
##$VPLIST= <PPPPPPPPPPPPPPP>
##$VTLIST= <TTTTTTTTTTTTTTT>
##$WBST= 1024
##$WBSW= 4
##$XGAIN= (0..3)
0 0 0 0 
##$XL= 0
##$YL= 0
##$YMAX_a= 21688
##$YMIN_a= -42108
##$ZGOPTNS= <>
##$ZL1= 120
##$ZL2= 120
##$ZL3= 120
##$ZL4= 120
##$ABSF1= 10
##$ABSF2= 0
##$ABSG= 5
##$ABSL= 3
##$ALPHA= 0
##$AQORDER= 0
##$ASSFAC= 0
##$ASSFACI= 0
##$ASSFACX= 0
##$ASSWID= 0
##$AUNMP= <proc_1d>
##$AZFE= 0.1
##$AZFW= 0.1
##$BCFW= 1
##$BC_mod= 2
##$BYTORDP= 1
##$COROFFS= 0
##$CY= 11.3945322036743
##$DATMOD= 1
##$DC= 2
##$DFILT= <>
##$DTYPP= 0
##$F1P= 15.6554695791079
##$F2P= 12.8336369535428
##$FCOR= 0.5
##$FTSIZE= 0
##$FT_mod= 4
##$GAMMA= 1
##$GB= 0.15
##$INTBC= 1
##$INTSCL= 1
##$ISEN= 128
##$LB= 0.24
##$LEV0= 0
##$LPBIN= 0
##$MAXI= 10000
##$MC2= 0
##$MEAN= 0
##$ME_mod= 0
##$MI= 1.114404
##$NCOEF= 0
##$NC_proc= 0
##$NLEV= 6
##$NOISF1= 3.799351
##$NOISF2= 2.8
##$NSP= 1
##$NTH_PI= 0
##$NZP= 0
##$OFFSET= 15.70392
##$PC= 1
##$PHC0= -26571.88
##$PHC1= 12.18744
##$PH_mod= 1
##$PKNL= yes
##$PPARMOD= 0
##$PSCAL= 0
##$PSIGN= 0
##$REVERSE= no
##$SF= 200.130013532006
##$SI= 16384
##$SIGF1= 3
##$SIGF2= 2
##$SINO= 400
##$SIOLD= 16384
##$SREGLST= <1H.CDCl3>
##$SSB= 0
##$STSI= 0
##$STSR= 0
##$SW_p= 3612.71676300578
##$SYMM= 0
##$S_DEV= 0
##$TDeff= 0
##$TDoff= 0
##$TI= <>
##$TILT= no
##$TM1= 0
##$TM2= 0
##$TOPLEV= 0
##$USERP1= <user>
##$USERP2= <user>
##$USERP3= <user>
##$USERP4= <user>
##$USERP5= <user>
##$WDW= 1
##$XDIM= 8192
##$YMAX_p= 0
##$YMIN_p= 0
$$ End of Bruker specific parameters
$$ ---------------------------------
##NTUPLES= NMR FID
##VAR_NAME=  TIME,          FID/REAL,        FID/IMAG
##SYMBOL=    X,             R,               I
##VAR_TYPE=  INDEPENDENT,   DEPENDENT,       DEPENDENT
##VAR_FORM=  AFFN,          ASDF,            ASDF
##VAR_DIM=   8192,          8192,            8192
##UNITS=     SECONDS,       ARBITRARY UNITS, ARBITRARY UNITS
##FACTOR=    0.0002076,     1,               1
##FIRST=     0,             0,               0
##LAST=      1.7004516,     0,               0
##MIN=       0,             -42108,          0
##MAX=       1.7004516,     21688,           0
$$ Real data points
##PAGE= N=1
##DATA TABLE= (X++(R..R)), XYDATA
0 0 0 0 0 0 0 0 0 0 0 0 0 0 0 0 0 0 0 0 -6 6 -7 7 -7 8 -8 11 -14 14 -15 17 -21 21 -25 29 -30 34 -38 41 -47 51 -57
41 -57 63 -70 78 -86 95 -106 119 -134 149 -171 197 -227 266 -322 395 -513 706 -1102 2181 -12332
61 -12332 -27911 7087 4815 -21197 -3668 6908 -14448 -3469 7489 -14186 -6062 15203 -9787
74 -9787 -16349 15274 4230 -19783 4485 10146 -13820 -1357 9882 -11102 -3606 12480 -9180
87 -9180 -8820 17011 -406 -16280 12479 12064 -13228 3267 15072 -6076 468 13801 -5039
100 -5039 -1735 17479 -2186 -10417 16478 7773 -14022 7766 15213 -8412 1228 15000 -3316
113 -3316 314 16161 -1429 -3106 19598 4649 -10741 15113 15875 -9500 3781 17180 -2703
126 -2703 569 14693 -946 -632 16351 672 -7365 16941 9766 -11752 8365 16283 -7521
139 -7521 -290 15805 -1131 -2307 12995 117 -3831 15956 4669 -9515 13031 14525 -8574
152 -8574 4622 18869 -1095 -310 15386 2308 -818 15305 3610 -5412 14006 8565 -10339
165 -10339 7416 15088 -7718 -2468 13423 -1665 -4743 10247 -33 -5861 10438 2146 -11252
178 -11252 7670 9932 -11448 -1166 11894 -6159 -6750 8948 -2111 -7167 6760 -1219 -9877
191 -9877 7123 3668 -13549 1809 9905 -11310 -7129 10087 -3868 -9590 5426 -2021 -9424
204 -9424 4979 -260 -12755 3396 5034 -13908 -3837 9731 -8067 -9964 6768 -2932 -10467
217 -10467 3730 -1243 -10728 3440 1356 -14377 -583 7644 -12013 -8507 8091 -5010 -11040
230 -11040 4737 -724 -9603 3503 861 -10830 3032 6473 -10613 -2199 10637 -5874 -7975
243 -7975 8887 709 -7894 5191 2428 -7477 4708 4906 -9186 2226 9956 -7627 -4186 11609
257 11609 -817 -7732 7436 3542 -6074 4966 4845 -6027 4813 8241 -7090 227 12719
270 12719 -2805 -5313 11298 3651 -6035 6830 6315 -4105 5988 6994 -5280 3733 11227 -4732
284 -4732 -2215 12388 612 -6781 8670 5375 -5751 4624 6036 -5453 3094 7749 -6305
297 -6305 -392 10667 -4019 -6879 9300 2182 -8504 4386 4533 -7103 1317 4829 -7172 -358
311 -358 7559 -7159 -5349 8972 -2107 -9568 5336 3197 -8856 719 3648 -7129 -583 4582
325 4582 -7844 -3590 7391 -5589 -9022 6592 322 -10956 1709 3425 -8329 -1669 3242
338 3242 -7611 -2724 5204 -7291 -6028 6906 -2861 -10697 4047 2474 -9680 -797 3943 -7251
352 -7251 -2207 4054 -6272 -3452 6381 -4571 -7982 6933 1048 -9607 2595 5225 -7164 -1020
366 -1020 5353 -4782 -1574 6502 -3877 -4048 8669 120 -7395 6603 5443 -7032 1793 7588
380 7588 -3858 50 7446 -2737 -1487 8620 -1265 -4584 8763 3673 -7314 4558 7927 -4637
394 -4637 474 7926 -2296 -931 7564 -1312 -2546 9096 1407 -6394 6798 6018 -6194 1743
408 1743 8184 -3263 -1350 7132 -1233 -2073 7286 -431 -4862 7330 3156 -7098 3679 7224
422 7224 -5736 -1269 7332 -2188 -2724 6201 -1355 -3954 6135 368 -6706 5000 4718 -7750 -342
437 -342 6618 -4863 -3924 5068 -2561 -5032 4296 -2001 -6931 4443 1114 -9287 829 4933 -7721
452 -7721 -4038 5283 -4314 -5819 3725 -2465 -5837 3755 -642 -7966 2606 3101 -8808 -1246 6071
467 6071 -5516 -5268 4584 -2335 -5601 3822 -1045 -6544 3593 1220 -8206 1286 5552 -6974 -3197
482 -3197 6183 -2665 -5293 4521 -501 -5206 3468 581 -5985 3358 4127 -6644 -267 6970 -3993
497 -3993 -3845 6445 43 -4227 4915 1733 -4116 4874 3553 -5186 2954 7160 -3968 -642 8969
512 8969 169 -2933 7015 2863 -2378 5969 4190 -3011 5006 6672 -3804 1896 9157 -1575 -2306
527 -2306 8035 1769 -3559 5304 3067 -3285 4019 3944 -4717 2557 6841 -3933 -1647 7983 -579
542 -579 -4415 5920 2269 -4599 3136 2754 -4417 2408 4412 -5365 -308 6290 -4028 -4880 5881
557 5881 -75 -6335 2564 1702 -5807 871 2079 -6189 -838 3550 -6450 -4131 4881 -3362 -7458
572 -7458 2670 -238 -7422 89 834 -6814 -1037 1870 -7120 -3229 3868 -5249 -6707 3569 -1687
587 -1687 -8106 899 1211 -6793 -1020 1654 -6285 -1447 3484 -5658 -4007 5113 -2576 -6517 3820
602 3820 1744 -6398 841 2869 -4829 96 3709 -4633 -1654 5227 -3338 -4800 5470 676 -6574
617 -6574 2640 3357 -4913 617 4231 -3157 418 5303 -2880 -1920 7215 -186 -4549 5381 4050 -4478
633 -4478 2532 5868 -2448 1197 5886 -1636 100 6853 -503 -2426 6882 2653 -4462 4367 5677
648 5677 -3368 1004 5468 -1890 99 5886 -1307 -1652 6467 540 -4114 5513 3898 -4413 2133
663 2133 5370 -2921 -261 4998 -1659 -1227 5138 -1246 -3734 5169 1518 -5686 2394 3813 -5170
678 -5170 -1072 4212 -3259 -2412 3589 -2858 -3985 3696 -1182 -5967 2800 1673 -7215 -1003 3429
693 3429 -5268 -3213 2786 -3775 -4217 2620 -2613 -5723 2315 -589 -7772 327 2291 -6726 -3026
708 -3026 2794 -4510 -4615 2171 -2885 -5200 2161 -1811 -6743 1761 1377 -7076 -1102 3417 -4909 -3715
724 -3715 2955 -2447 -3842 2993 -1353 -4343 2981 987 -5629 1695 3906 -4743 -1275 5129 -1862
739 -1862 -2837 4296 -27 -2837 4040 1144 -3745 3856 3961 -4264 1228 6100 -2292 -1606 5935 334
755 334 -2217 4773 1836 -2356 4728 3561 -3226 3305 6106 -2597 484 7223 476 -1355 5941
770 5941 2435 -1193 5328 3073 -2222 4342 5122 -2768 1854 6698 -1278 -686 6258 1216 -2348 4472
786 4472 2319 -2699 3573 2863 -3420 1975 4866 -3414 -961 5665 -1141 -3453 4187 803 -3535
801 -3535 2544 1691 -3926 1761 2637 -4914 -367 4611 -3261 -3267 3838 -1050 -4767 2053 315 -4769
817 -4769 652 819 -5207 -475 2541 -5060 -3324 3449 -3037 -5527 1915 -789 -5233 168 506 -5370
833 -5370 -124 1348 -5383 -1887 3063 -4168 -4680 3128 -1365 -5603 1384 538 -4998 20 1346 -4645
849 -4645 -569 2815 -4245 -2664 4051 -1896 -4565 3276 904 -4527 1446 2091 -3368 751 3244
864 3244 -3395 -775 4594 -2221 -2542 4560 489 -4012 2721 2799 -3227 1386 3351 -2669 515 4369
880 4369 -2215 -1101 5410 -146 -3083 4244 2385 -3106 2502 3800 -2335 986 4215 -2105 -159
895 -159 5163 -746 -1809 5116 1393 -3504 3521 3606 -2889 1368 3995 -2167 282 4457 -1533 -1202
911 -1202 4858 -506 -3446 3884 2361 -3892 1443 3343 -2785 -59 3594 -2129 -978 3937 -1636
926 -1636 -3069 3978 772 -4606 2075 2821 -3917 -85 3301 -2930 -1502 2733 -2911 -2594 3229 -1377
942 -1377 -4761 2395 844 -5330 179 2242 -4400 -1616 2177 -3188 -2662 2574 -2343 -4385 2677
957 2677 -426 -5638 1234 1937 -4930 -1286 2594 -3533 -2554 2038 -2497 -3280 2512 -1306 -4680 2095
973 2095 1446 -4875 304 2749 -3546 -1747 3000 -1736 -2120 2952 -1015 -2692 3279 884 -4112 1695
989 1695 3221 -3432 -516 4030 -1722 -1457 3740 -429 -2091 3801 895 -2837 3495 2764 -3117 1579
1005 1579 4560 -1909 -400 4455 -567 -1295 4196 1108 -1784 3502 2022 -3060 2725 4039 -2592
1020 -2592 198 4959 -1040 -1483 4430 539 -1773 3647 1062 -2584 3107 2878 -3052 1155 4120
1035 4120 -2110 -1298 4302 -169 -2065 3372 472 -2780 2834 1624 -3371 1512 3171 -3254 -747
1050 -747 4019 -1529 -2554 2869 -282 -3139 2068 468 -3471 1309 1577 -4185 -238 3107 -3332
1065 -3332 -2922 3233 -1700 -4051 1671 -408 -4073 836 479 -4474 -166 1915 -4284 -2214 2779
1080 2779 -2752 -3726 2166 -585 -4374 915 -48 -4125 5 1336 -4143 -946 2769 -3292 -2882 2791
1096 2791 -1135 -3819 1762 278 -3593 1341 1553 -3319 360 2700 -3031 -1184 3598 -1384 -2780
1111 -2780 3376 425 -3290 2100 2089 -2849 1260 2818 -2668 252 4004 -1705 -1446 4277 266 -2637
1127 -2637 3200 2155 -2589 2042 3008 -1993 1185 3876 -1572 -313 4749 -294 -1955 4023 1809
1142 1809 -2358 2644 2869 -1660 1242 3544 -1772 383 4264 -928 -1396 4161 766 -2411 3097
1157 3097 2509 -2259 1671 3125 -1772 660 3488 -1740 -856 3645 -699 -2579 3197 1066 -3512
1172 -3512 1529 2195 -2825 222 2479 -2522 -1054 2928 -1874 -2635 2690 -362 -3925 1523 1606 -3740
1188 -3740 2 1920 -3020 -1387 2135 -2703 -2374 2442 -1564 -3913 2057 372 -4558 261 1639
1203 1639 -3653 -1396 1815 -2827 -1663 2082 -1999 -3118 2167 -856 -4292 1185 1358 -4225 -679
1218 -679 2115 -2709 -1492 2359 -2084 -2030 2661 -884 -3245 2415 1003 -3870 734 2501 -3013 -757
1234 -757 2649 -1452 -942 3045 -523 -2108 3192 701 -3055 2226 2481 -2631 607 3619 -1385 -693
1250 -693 3716 -346 -1217 3534 690 -2132 3332 2061 -2731 1676 3735 -1894 178 3865 -364
1265 -364 -668 3988 622 -1618 3221 1508 -2523 2414 2928 -2589 461 3704 -1126 -565 3291 -190
1281 -190 -1424 3344 831 -2358 2858 2022 -2871 864 3128 -2448 -635 3331 -957 -1944 2829 -33
1297 -33 -2345 2155 878 -3055 1163 2213 -3041 -236 3044 -1974 -1891 2274 -896 -2812 1897 38
1313 38 -3276 1089 861 -3756 123 2557 -3395 -1985 2447 -1810 -3026 1594 -839 -3592 1125 92
1329 92 -3510 394 1452 -3716 -1278 2023 -2546 -2587 2162 -1009 -3199 1295 -34 -3323 925 1099
1345 1099 -3447 -143 2574 -2817 -1799 2667 -1388 -2955 2250 -225 -3076 1390 1008 -2918 822
1360 822 2382 -2579 -497 3435 -1063 -1925 2921 328 -2223 2317 1537 -2175 1523 2161 -2162 528
1376 528 3540 -1632 -1009 3699 -13 -1831 3042 1446 -1872 1926 2373 -1693 1500 3291 -1597 74
1392 74 3684 -263 -1169 3387 885 -2164 2352 1983 -1912 1467 2638 -1506 626 3255 -1276 -1195
1408 -1195 3414 230 -2249 2304 1679 -2272 1440 2051 -2114 409 2658 -2060 -603 2997 -1223
1423 -1223 -2226 2674 215 -3061 1277 1204 -2890 36 1926 -2691 -607 2176 -2048 -2072 2481 -1012
1439 -1012 -3369 1490 410 -3352 187 1280 -2900 -807 1722 -2636 -1882 1972 -1813 -3233 1687
1454 1687 -103 -3452 616 1219 -2929 -618 1303 -2494 -1394 1996 -1826 -2326 1977 -724 -3113
1469 -3113 1422 869 -3220 255 1734 -2413 -1049 1883 -2032 -1483 2308 -1082 -2543 2188 656
1484 656 -2835 1075 2168 -2404 16 2521 -1627 -698 2692 -871 -1048 2876 601 -2227 2225 2147
1500 2147 -2099 1068 2810 -1363 176 3046 -505 -738 3240 323 -1560 3021 1623 -1815 1815
1515 1815 2844 -1622 405 3216 -668 -268 3134 5 -1291 2978 664 -2122 2094 2064 -2179 740
1531 740 2808 -1377 -532 2748 -343 -1453 2427 10 -2058 1984 1121 -2458 1139 2275 -2095 -800
1547 -800 2121 -1225 -1536 2060 -786 -2103 1961 450 -2599 1428 1282 -2983 -379 1971 -1917 -1908
1563 -1908 1907 -1242 -2408 1307 -357 -2898 959 445 -3203 111 1642 -2990 -1309 1883 -1752
1578 -1752 -2298 1591 -933 -2560 1310 -117 -2833 577 1125 -2921 -657 2039 -1885 -1558 2016 -1073
1594 -1073 -2184 1836 -63 -2619 1315 932 -2816 108 1990 -1940 -894 2386 -1139 -2071 2179
1609 2179 120 -2085 1650 998 -2155 1080 1876 -2008 -7 2711 -932 -805 3020 167 -1607 2336
1625 2336 775 -1573 1586 1854 -1792 1037 2770 -1369 -230 3060 -180 -1079 2562 912 -1446
1640 -1446 2000 1580 -1628 1599 2333 -1457 120 3071 -667 -856 2630 599 -1637 1867 1100 -1844
1656 -1844 1303 1814 -1847 398 2082 -1351 -771 2518 -586 -1596 1916 444 -2145 1237 1290 -2212
1672 -2212 323 1806 -1964 -534 2071 -1517 -1680 2131 -273 -2627 959 702 -2159 -78 872 -2273
1688 -2273 -534 1426 -2011 -1794 1850 -1151 -2912 1204 -53 -2497 550 567 -2389 -419 1341 -2315
1704 -2315 -1138 1679 -1682 -1917 1490 -269 -2638 682 595 -2553 -174 1260 -2157 -447 1687 -1666
1720 -1666 -1476 1929 -590 -2084 1407 633 -2128 589 1389 -1903 -74 1863 -1572 -774 2078 -609
1736 -609 -1695 2168 704 -2113 1240 1466 -1762 841 2175 -1182 14 2443 -626 -812 2406 9
1752 9 -1278 2216 1404 -1364 1203 2094 -896 534 2461 -573 -179 2639 -126 -1270 2604 1146
1768 1146 -1510 1898 1990 -1352 725 2194 -1179 -317 2369 -436 -992 2327 242 -1851 1799 1110
1784 1110 -1821 685 1692 -1377 -554 1644 -911 -911 2042 -510 -1652 1695 448 -2435 808 1317
1800 1317 -1956 -402 1598 -1553 -1005 1644 -977 -2024 1186 -320 -2377 1113 827 -2442 -153
1815 -153 918 -1865 -1353 1310 -1466 -1909 1088 -852 -2190 821 -71 -2521 236 942 -2344 -601
1831 -601 1311 -1671 -1597 1289 -926 -1916 1031 -293 -2305 929 944 -2337 177 1543 -1362 -935 1627
1848 1627 -817 -1372 1495 -61 -1636 1358 774 -1840 816 1758 -1306 -256 2044 -620 -902 1884
1864 1884 163 -1215 1765 709 -1369 1272 1705 -1547 306 2129 -665 -309 2254 -34 -891 2055
1880 2055 734 -942 1563 1320 -1411 899 2343 -874 73 2265 -439 -585 2112 810 -1052 1756
1896 1756 1278 -1098 1133 1513 -1094 254 2278 -911 -460 1972 -66 -1124 1480 602 -1344 1223
1912 1223 815 -1327 269 1661 -1381 -553 1902 -836 -1432 1408 -61 -1682 1028 446 -1629 117
1928 117 1182 -1841 -500 1441 -1345 -1417 1699 -560 -2095 971 245 -2030 450 633 -2051 0
1944 0 1068 -1751 -1093 1226 -1110 -1803 1146 -313 -1924 420 498 -2015 7 1030 -1901 -653 1366
1961 1366 -1324 -1708 1231 -353 -2079 673 373 -1703 -36 878 -1581 56 1366 -1422 -722 1655
1977 1655 -598 -1521 1319 740 -1725 847 1231 -1537 355 1288 -1100 -361 1961 -644 -905 2035
1993 2035 430 -1378 1326 1144 -1345 765 1605 -877 401 1916 -777 -281 2148 62 -1132 1859
2009 1859 1056 -1288 813 1645 -1024 668 1919 -720 -198 2165 -418 -855 1893 633 -1271 1231
2025 1231 1292 -1077 591 1609 -915 -59 1955 -436 -757 1552 -134 -1414 1200 808 -1743 621
2041 621 1194 -1472 -106 1454 -1117 -681 1508 -721 -1391 1115 -17 -1816 463 637 -2064 -360
2057 -360 868 -1557 -731 907 -904 -1368 949 -349 -1646 668 412 -1829 -86 1078 -1844 -895
2073 -895 896 -1551 -1283 863 -658 -1797 769 -126 -1750 199 602 -1901 -556 900 -1431 -901
2089 -901 1133 -768 -1109 1093 -550 -1782 1034 806 -1755 -4 1321 -1148 -542 1557 -600 -1147
2105 -1147 1286 -52 -1152 1371 720 -1468 677 1151 -1364 32 1668 -771 -480 1760 -73 -947
2121 -947 1761 391 -990 1355 1164 -1250 755 1783 -831 28 1752 -37 -790 1537 543 -896
2137 -896 1434 988 -1101 970 1679 -529 89 1798 -503 -738 1771 214 -727 1353 449 -733 1244
2154 1244 945 -1209 490 1608 -1096 -377 1515 -341 -768 1346 387 -1328 1035 602 -1327 326
2170 326 1025 -1475 -642 1344 -993 -885 1028 -454 -1504 590 -69 -1592 101 669 -1560 -92
2186 -92 927 -1271 -929 1011 -651 -1635 775 -94 -1377 320 100 -1617 -538 886 -1453 -812 1243
2203 1243 -1196 -1142 904 -213 -1619 663 275 -1539 123 801 -1322 -434 1348 -1105 -901 1239
2219 1239 -512 -1185 1020 505 -1462 625 792 -1257 127 1433 -987 -488 1311 -364 -968 1473
2235 1473 394 -1150 792 978 -1027 553 1528 -670 191 1558 -478 -436 1650 320 -862 1424
2251 1424 971 -763 993 1187 -812 311 1428 -713 205 1799 -83 -714 1636 704 -735 879
2267 879 1132 -868 559 1433 -927 -4 1361 -162 -500 1403 196 -1089 1098 863 -1262 414
2283 414 936 -1164 176 1323 -864 -393 1219 -363 -1046 998 205 -1476 607 374 -1333 -346 920
2300 920 -1037 -545 874 -821 -1011 779 -593 -1653 340 328 -1649 -189 621 -1271 -652 589 -1272
2317 -1272 -994 809 -897 -1821 574 -39 -1583 -10 346 -1676 -627 834 -1605 -538 968 -638
2333 -638 -1234 896 -200 -1478 470 213 -1386 -42 866 -1346 -608 1195 -688 -1038 1018 -302
2349 -302 -1205 1203 681 -1378 424 1074 -1027 -147 1284 -781 -640 1141 -181 -578 1334 432 -910
2366 -910 1034 920 -985 333 1131 -642 29 1611 -201 -312 1343 357 -701 1242 703 -1020 852
2383 852 1553 -399 228 1716 -325 -192 1650 148 -598 1422 596 -1011 801 1116 -920 195 1570
2400 1570 -683 -279 1455 -326 -733 1164 262 -1119 758 799 -961 310 1007 -979 -167 1117 -582
2417 -582 -862 954 -277 -1129 762 471 -1301 248 704 -1178 -296 1070 -1068 -788 800 -623 -1021
2434 -1021 676 28 -1495 250 471 -1566 -38 750 -1465 -615 1012 -884 -937 550 -261 -1301 650
2451 650 45 -1417 146 472 -1599 -172 1002 -984 -880 886 -352 -1287 768 47 -1106 517
2467 517 818 -1204 132 1231 -945 -448 893 -480 -819 1088 411 -977 1060 622 -968 324
2483 324 1120 -811 -41 1374 -417 -620 1413 143 -869 1050 528 -699 748 1222 -829 153 1256
2500 1256 -489 37 1473 -44 -582 1240 728 -881 884 1000 -724 544 992 -809 -246 1529
2516 1529 -116 -572 1172 364 -768 1063 600 -800 537 880 -734 203 1154 -812 -715 1245 -229
2533 -229 -1021 809 225 -1102 478 788 -1070 -13 654 -857 -401 800 -504 -1065 827 -68 -1163
2550 -1163 172 14 -1483 -298 480 -1382 -697 794 -1012 -919 638 -633 -1318 628 -214 -1529 98
2567 98 210 -1299 -354 798 -1294 -768 856 -585 -1332 724 -35 -1310 461 354 -1237 -83 444
2584 444 -1013 -552 1007 -720 -886 1076 -192 -956 800 284 -1202 233 855 -1023 -85 978 -470
2601 -470 -358 1109 -410 -699 1157 150 -1048 796 891 -786 340 1090 -639 90 1270 -281 -445
2618 -445 1092 370 -512 789 799 -800 460 1166 -593 218 1210 -382 -371 1332 97 -761 1190 822
2636 822 -895 818 1189 -923 297 1463 -189 -355 1056 -87 -699 1137 265 -674 781 629 -799
2653 -799 148 906 -781 -313 1226 -259 -702 840 -1 -1086 901 146 -1006 49 523 -1092 -412
2670 -412 834 -952 -642 736 -405 -882 614 -139 -1228 313 461 -1078 -68 776 -1152 -582 772
2687 772 -762 -1188 702 -169 -1481 412 263 -1237 121 489 -1347 -504 755 -984 -1094 626 -205
2704 -205 -767 597 267 -1350 348 651 -1018 -289 1003 -600 -513 912 -302 -672 832 -114 -1161
2721 -1161 738 741 -900 133 1186 -729 -67 1078 -371 -558 1295 289 -693 1133 524 -779 735
2738 735 971 -781 114 1509 -350 -244 1262 351 -268 1306 756 -428 995 845 -533 668 1346
2755 1346 -624 -269 1249 -44 -135 1386 220 -622 792 609 -698 570 800 -638 19 1185 -295
2772 -295 -616 1049 -352 -956 543 234 -948 450 865 -751 147 957 -718 -526 891 -252 -918
2789 -918 848 215 -1057 297 255 -1113 -106 583 -1116 -535 661 -838 -844 770 -343 -1089 363
2806 363 -18 -1125 -128 111 -1453 -337 673 -1161 -725 760 -673 -1069 463 25 -1218 330 402
2823 402 -1012 -47 654 -942 -643 790 -802 -889 634 -100 -906 352 397 -1096 231 535 -858 34
2841 34 976 -599 -518 1167 -45 -515 807 283 -962 497 723 -759 116 1008 -575 -163 960 -352
2859 -352 -484 1055 197 -623 785 1060 -473 440 1043 -115 332 1315 -25 -54 1117 380 -797 805
2877 805 486 -922 702 714 -654 298 1127 -280 -438 1212 -200 -707 1028 331 -654 659 420 -959
2895 -959 501 666 -737 -154 857 -443 -512 884 174 -820 676 561 -800 342 744 -647 -165
2912 -165 722 -404 -560 881 -420 -961 703 -5 -1264 461 454 -1007 16 761 -885 -362 703
2929 703 -484 -1070 520 -122 -975 184 186 -1322 -104 391 -875 -405 497 -710 -715 693 -627 -1066
2947 -1066 516 184 -1219 286 420 -1107 -386 458 -743 -616 852 -304 -858 548 227 -1123 279
2964 279 415 -871 245 947 -743 -252 879 -289 -670 794 72 -410 761 116 -933 616 728
2981 728 -823 74 1203 -586 -188 983 24 -531 877 291 -504 963 923 -424 335 1013 -433 -289
2999 -289 1159 5 -363 886 251 -480 842 694 -663 301 843 -708 -24 1191 -303 -149 1057
3016 1057 223 -435 746 487 -816 403 859 -713 190 897 -639 -418 926 -495 -351 698 -40
3033 -40 -759 429 290 -1032 -187 979 -1084 -274 590 -620 -870 564 -66 -838 391 253 -1093 57
3051 57 399 -1020 -314 420 -568 -775 679 -484 -827 506 -170 -779 72 127 -1076 288 396 -758
3069 -758 -439 627 -454 -485 468 163 -984 347 189 -1251 21 450 -820 -218 833 -366 -364 708
3087 708 -188 -792 626 231 -665 309 984 -784 143 966 -556 -200 910 -131 -510 900 441 -474
3105 -474 770 659 -556 311 965 -388 20 965 -225 -209 940 -194 -449 1036 628 -601 398 562
3123 562 -477 319 1081 -281 -235 1049 -4 -673 1109 104 -954 345 733 -507 237 730 -450
3140 -450 -122 872 -344 -369 905 75 -677 768 467 -781 405 732 -689 -132 562 -341 -509 985
3158 985 -16 -676 630 -23 -713 33 225 -1050 -121 444 -717 -436 420 -467 -684 516 -195 -821
3176 -821 123 341 -1000 -19 536 -723 -314 464 -405 -768 784 -75 -558 373 150 -837 187 499 -848
3195 -848 -22 324 -716 -430 486 -405 -657 537 64 -839 403 351 -1010 -206 273 -475 -273 531 -516
3214 -516 -645 539 -281 -768 326 339 -724 256 578 -710 -151 820 -450 -416 968 -117 -206 892
3232 892 299 -696 508 940 -578 330 799 -589 -98 809 -516 -606 874 139 -593 674 673 -533 236
3251 236 906 -473 277 1139 -79 -362 685 54 -224 746 169 -612 398 733 -451 18 727 -318
3269 -318 -331 953 -151 -314 592 227 -603 564 464 -756 140 447 -391 -162 608 -337 -370 553 -399
3288 -399 -664 385 10 -800 81 456 -718 -92 475 -568 -702 398 -444 -686 356 89 -865 -35
3306 -35 -17 -861 -83 463 -771 -495 594 -372 -550 287 8 -828 365 165 -679 38 374 -834 -236
3325 -236 534 -451 -341 668 -72 -408 352 7 -953 345 472 -664 170 464 -396 -306 645 -228 -295 509
3345 509 466 -581 355 693 -416 311 699 -368 -188 786 -355 -153 663 17 -482 683 527 -628
3363 -628 749 787 -273 115 759 -171 84 691 -124 -394 886 435 -263 588 463 -550 105 610 -297
3382 -297 -116 883 -18 -212 908 337 -648 621 296 -664 523 560 -350 74 676 49 -26 895 -301
3401 -301 -712 272 -20 -566 225 299 -531 162 534 -328 -459 435 -291 -590 645 2 -586 77 105 -768
3421 -768 127 346 -660 -120 436 -613 -597 422 -283 -970 396 -56 -957 -324 192 -800 -175 258 -513
3440 -513 -434 529 -567 -736 584 -82 -756 109 171 -742 12 416 -789 -328 438 -413 -417 713 60 -739
3460 -739 404 106 -622 312 580 -541 30 443 -487 -284 515 -22 -465 240 156 -417 611 285 -642
3479 -642 185 689 -240 160 923 -109 -13 808 326 -544 682 596 -367 189 734 -105 113 487 -28 -58
3499 -58 815 56 -511 469 425 -473 428 689 -427 146 808 -159 -216 626 -109 -306 538 122 -563 399 613
3520 613 -636 265 306 -441 -313 640 -150 -372 647 -32 -545 141 299 -765 143 410 -646 -270 314
3539 314 -368 -476 463 -189 -617 674 34 -895 178 230 -885 -78 371 -523 -593 376 -402 -494 403 -94
3559 -94 -694 379 126 -696 -15 294 -453 -280 470 -684 -726 327 -97 -719 262 -100 -704 162 162 -624
3579 -624 -56 634 -556 -282 615 -143 -495 634 250 -323 395 425 -405 14 598 -347 -201 498 -236 -21
3599 -21 695 146 -233 477 288 -479 484 600 -533 20 590 -223 200 668 13 -374 489 241 -492 537
3619 537 548 -117 379 599 -410 84 586 -84 -345 856 70 -399 457 297 -528 251 478 -494 19 870
3639 870 -369 -330 700 12 -547 275 276 -649 165 372 -527 -118 419 -412 -411 631 -433 -469 200 -182 -675
3660 -675 120 290 -443 -15 390 -579 -374 236 -324 -629 156 -19 -747 203 170 -636 164 293 -610 -131
3680 -131 389 -207 -418 155 -307 -653 466 -199 -703 180 16 -730 -9 373 -473 -92 403 -597 -413
3699 -413 226 -86 -683 351 -134 -482 365 279 -319 -267 285 -306 -345 675 -230 -533 637 205 -379 200
3719 200 472 -200 79 567 -170 -252 471 -15 -250 720 216 -324 581 322 -229 252 593 -186 333 792
3739 792 -83 51 514 248 -365 589 365 -601 231 579 -444 244 523 59 -22 548 -118 -83 396 255
3759 255 -470 462 256 -526 310 430 -167 -273 500 -305 -282 492 114 -501 208 139 -436 88 269 -402 -127
3780 -127 455 -105 -342 470 -130 -522 514 172 -574 184 82 -508 -228 155 -377 -534 158 -230 -458 325
3800 325 -190 -648 206 26 -527 139 105 -539 -127 370 -384 -231 492 -191 -222 115 -165 -648 265 162 -644
3821 -644 -205 321 -601 -216 518 -39 -449 136 27 -365 298 277 -464 55 430 -352 -153 608 -55 -393
3841 -393 515 300 -453 340 107 -287 276 468 -258 67 572 -73 -481 576 132 -308 629 448 -347 238
3861 238 572 -491 371 593 -54 45 352 -235 -112 651 289 -416 449 359 -444 239 762 -197 125 605
3881 605 -118 61 449 17 -305 339 168 -290 498 309 -240 -5 531 -435 -57 498 -144 -287 198 -109
3901 -109 -550 129 229 -525 54 -32 -589 -109 465 -278 -419 371 -145 -470 445 41 -513 -127 205 -429
3921 -429 -61 380 -441 -326 271 -48 -524 421 -201 -668 271 -85 -742 -9 353 -374 -386 271 -364 -293 373
3942 373 -90 -386 96 89 -371 101 151 -313 -22 263 -429 -468 477 -127 -668 481 180 -492 60 234 -18
3963 -18 -122 350 -292 13 575 -135 -275 624 292 -178 480 498 -468 9 498 -440 -13 437 -83 -56 774
3984 774 230 -119 610 269 -272 103 638 -118 55 604 -53 -151 376 -205 -217 454 7 -353 486 440 -458
4005 -458 290 431 -382 32 183 -85 -135 403 80 -209 215 445 -242 130 398 -448 -80 265 -385 -145
4025 -145 470 86 -216 522 -266 -510 216 167 -200 -105 354 -454 -239 313 -462 -462 188 -128 -476 274 128
4046 128 -397 -129 149 -487 -126 622 -336 -523 427 -138 -556 401 18 -478 280 191 -647 -26 426 -214
4066 -214 -88 152 -308 -426 455 -163 -428 126 134 -417 -118 498 -416 93 417 -258 -403 110 -116 -360 450
4087 450 171 -352 227 506 -295 4 533 -264 -51 340 8 -78 415 197 -166 381 209 -185 80 442
4107 442 -161 64 493 21 91 482 235 6 612 352 -304 154 646 -172 -24 511 -178 -299 359 241
4127 241 -302 291 197 -401 146 81 -426 67 187 -278 -198 461 -42 -345 425 -25 -381 339 178 -307 -108
4148 -108 320 -341 -106 485 -248 -249 357 -101 -560 362 59 -541 -15 165 -538 -273 322 -163 -371 167 -43
4169 -43 -426 559 69 -375 -75 69 -568 -177 401 -358 -84 52 -735 -284 -37 -20 -466 302 343 -455 -2
4190 -2 333 -506 -140 70 -416 -416 522 -76 -726 91 63 -410 42 368 -402 -33 400 -394 -38 546 152 -343
4212 -343 441 182 -136 204 484 -154 357 623 -397 -111 379 -24 92 615 8 -216 181 -133 -276 80
4232 80 324 -239 130 509 -221 310 627 13 -342 668 73 -171 504 158 -252 62 385 -176 425 564
4252 564 -95 -191 383 253 -410 186 111 -200 -41 195 -136 0 197 -96 -220 430 11 -365 115 -7 -744
4273 -744 122 323 -351 127 245 -241 -337 620 -377 -334 231 2 -696 141 153 -466 -110 105 -391 -192 377
4294 377 -238 -239 338 -145 -373 332 119 -438 247 190 -387 -43 42 -590 -314 355 -83 -225 300 71 -559
4315 -559 96 209 -564 -23 144 -304 23 354 -346 80 323 97 -384 295 229 -213 -16 195 -370 -89
4335 -89 294 -151 61 420 -30 -258 313 261 -153 397 468 30 -80 492 -144 -127 242 -150 -147 354 105 -306
4357 -306 336 131 -243 201 316 -277 -9 635 40 -93 368 -17 -218 460 182 -469 223 318 -179 4
4377 4 119 -223 -80 465 -226 -56 61 142 -449 128 146 -312 144 115 -329 -222 387 -271 -158 248 -241 -445
4399 -445 83 214 -441 112 268 -456 1 341 -301 -351 101 8 -779 102 28 -291 105 132 -504 -102 205
4420 205 -286 -369 130 -59 -398 251 -222 -316 144 162 -517 -111 135 -310 -253 509 -462 -153 88 -202 -334
4441 -334 47 -138 -451 79 137 -162 -47 251 -159 -181 305 -43 -435 379 190 -338 383 227 -323 79 59
4462 59 -561 -25 362 -206 10 616 -162 -151 355 292 -45 333 413 -458 158 473 44 21 499 -204 -182 406
4484 406 135 -374 561 560 -200 119 356 -37 -73 202 -95 40 142 -42 -322 387 364 -50 268 266 -197 38
4506 38 510 -16 45 123 -55 -77 -67 195 -15 447 125 -314 -124 311 -580 -93 203 -176 -356 265 -17 -409
4528 -409 399 177 -197 -14 255 -212 -33 538 -32 -233 427 -196 -323 135 -80 -480 -169 -143 -184 -297 411
4549 411 -475 -321 164 -349 -540 291 257 -372 63 251 -439 18 245 -438 -208 98 5 -265 53 20 -413
4570 -413 166 -35 -244 386 214 -289 48 313 -358 -126 68 -217 -76 438 431 -196 306 413 -160 227 388
4591 388 -96 -7 346 -27 -158 338 107 -207 530 224 -416 329 450 -198 -51 326 196 111 405 -96 -116
4612 -116 212 -114 -94 152 187 -223 117 463 -109 -81 265 -165 14 296 33 -274 452 238 -320 222 31
4633 31 -430 -216 232 -253 -90 113 -22 -214 248 105 -335 167 357 -425 -76 145 -118 -212 186 -40 -326
4654 -326 119 115 -363 175 -258 -313 89 64 -578 -127 343 -344 -275 105 -88 -436 140 127 -524 91 236 -293
4676 -293 66 307 -266 -267 314 -221 -225 -68 -83 -331 284 320 -316 144 -99 -81 -50 157 -140 19 309 22 -353
4699 -353 209 -32 -349 348 373 -105 -144 240 -180 -167 286 437 -171 129 288 -47 130 286 -202 232 223 -107
4721 -107 -46 412 188 -144 615 -72 -279 -51 180 -71 109 279 -19 -41 515 -89 -104 340 73 -295 297
4742 297 2 -173 133 414 -158 290 193 48 217 291 44 -76 253 -42 -406 372 -185 -365 -28 159 -277
4763 -277 152 176 -103 -369 199 -2 -300 355 -61 -322 40 281 -21 -54 109 -227 -247 193 -154 -99 339
4784 339 105 -400 143 75 -637 -415 -3 -385 -139 198 -124 -156 -33 -118 -463 136 246 -423 -7 227 -187
4805 -187 -38 17 42 -221 365 69 -225 67 98 -342 205 126 -379 142 459 -36 -79 202 37 -333 350 2
4827 2 -159 144 78 83 -113 500 -11 131 164 -48 -98 104 197 -126 173 476 -204 42 128 -315 19 264 -11
4850 -11 -47 297 98 -222 48 102 -16 417 47 -228 8 572 -150 157 112 -167 136 295 168 -315 162
4871 162 492 -96 280 152 100 -20 322 -168 -117 126 -111 -134 160 -182 -175 -35 188 -305 328 -4 -192 39
4893 39 299 -171 -411 85 -123 -138 -85 -19 -68 69 194 -253 -248 62 -87 -441 123 -1 -249 192 -40 -414
4915 -414 -63 98 -293 -117 249 -238 -158 311 -234 -215 -160 85 -404 130 -92 23 -217 240 -245 182 229
4936 229 -430 42 308 62 -201 -136 72 -239 201 161 -96 301 281 -55 -146 235 190 -76 419 208 -180 233
4958 233 -15 -78 192 195 -302 40 334 66 -207 283 19 -69 247 290 -333 49 319 -214 81 322 79 -172
4980 -172 398 53 189 250 21 -170 114 183 -83 184 549 -290 -358 171 72 -197 178 81 -462 290 277 -254
5002 -254 -60 156 -124 -242 255 245 -80 163 36 -212 211 -57 -207 109 137 -147 85 26 -105 -335 371
5023 371 -139 -176 14 1 -138 -64 238 -468 -54 359 -322 -118 129 -242 -40 225 79 -444 -71 -68 -135 305
5045 305 -26 -339 39 64 -217 -123 -76 7 -108 184 -98 -159 15 111 -84 133 109 -394 -121 264 107 -220
5067 -220 380 117 -242 250 -7 -168 30 189 11 -70 404 -44 -12 462 -192 -213 -5 164 -158 275 -9
5088 -9 -283 174 94 -491 -5 384 -7 -300 276 138 -82 427 259 -118 243 341 -48 -69 491 90 -60 131
5110 131 -79 -172 174 219 -176 242 105 -162 66 124 -99 -107 177 -239 -170 60 -200 -484 322 20 -353 36
5132 36 51 -333 -218 211 -257 -47 403 -302 -193 108 -46 8 79 90 -197 -178 -126 -459 -61 29 -157 -277 61
5155 61 145 -108 243 2 -168 48 58 -99 -292 52 -53 -34 276 -55 -238 331 216 -227 211 82 -114
5176 -114 -58 56 -163 -357 123 -141 -70 238 259 -180 213 16 -196 -64 39 -407 -242 150 -366 122 377
5197 377 69 -158 202 187 -61 -37 122 -236 84 356 -82 14 182 -13 -27 206 139 -35 119 350 57 -5
5219 -5 210 -11 -56 122 -95 -76 313 231 -27 23 33 -137 21 211 -102 -61 319 15 -352 194 -224 -245 190
5242 190 192 -137 294 -36 -58 -65 79 -58 113 187 3 -74 192 181 -54 11 112 -105 109 38 -92 -164 252 -57
5266 -57 -252 29 20 -254 -136 111 -353 177 138 -237 -32 155 -72 -87 139 20 -330 4 -144 -223 -30 -42
5288 -42 -370 86 280 -301 141 37 -103 4 197 -115 -242 -49 209 17 44 238 -261 5 46 -194 -127
5309 -127 -1 66 -202 12 170 -177 104 286 -165 -34 379 -247 -54 287 -137 -345 9 -27 -161 -92 -32
5330 -32 8 228 309 -139 87 116 82 49 146 159 -149 203 92 -132 384 258 -28 -106 331 -257 5 194 190 110
5354 110 89 -40 -207 -201 186 -215 -124 99 -43 -2 365 62 -65 313 -89 -104 -39 -18 -447 21 281 -194 -10
5377 -10 92 -199 121 -24 165 -113 236 -9 -242 112 -64 -77 -7 277 -245 -264 136 -21 -131 67 55 -107
5399 -107 114 47 -182 -152 359 -322 -407 377 -83 -397 147 -115 -308 118 -72 -215 -142 221 -394 177 213 -73
5421 -73 106 2 133 -29 208 230 -287 -35 215 -369 -173 170 -121 -231 419 49 -317 194 -123 -371 250
5442 250 -46 -129 1 -44 -183 110 88 -11 235 92 248 -137 103 -1 52 101 229 -129 -15 76 -14 2 174
5465 174 47 -33 278 38 -21 242 75 -146 253 562 -112 -16 363 -149 171 65 195 -188 294 225 -331
5486 -331 43 64 -88 44 155 -147 -46 253 -152 -207 -31 28 -302 -222 237 -203 167 197 -367 -108 126 -138
5508 -138 -137 -36 119 -242 -20 80 -145 23 -113 -161 -41 77 -169 -320 115 -120 -220 -18 164 -57 -143
5529 -143 121 -234 191 88 -266 2 -39 -185 -194 99 49 1 -52 92 -53 17 382 -167 -76 241 -59 -171 169
5552 169 -50 -144 99 -22 -207 83 297 -22 143 67 -145 -183 182 35 44 395 159 -117 192 122 -174 136
5574 136 402 -49 -134 279 -209 174 267 151 -289 175 221 -150 45 149 69 164 237 -284 107 202 -192 -52
5596 -52 194 12 -117 286 429 -102 -61 384 -126 -3 110 -246 114 489 -88 -77 193 255 -168 -80 262 -121
5618 -121 67 164 -170 75 -103 -39 -410 -6 12 48 -169 79 -185 -196 281 -164 -100 385 -149 -275 -101 135
5640 135 -46 -9 50 -195 -198 279 -328 -147 159 -351 -233 404 18 -189 -11 169 -101 82 36 -84 -187 179
5662 179 152 -254 169 -295 -55 192 16 -299 -62 175 -255 115 8 -190 -31 176 -227 7 188 48
5682 48 -132 12 111 -7 184 168 -200 44 367 33 -157 344 47 -181 211 -43 -194 -60 239 -135 337
5703 337 322 -166 -70 148 -310 -43 179 50 -315 130 131 -40 50 248 -2 6 306 82 16 377 12 -23 314
5726 314 -62 -136 88 146 -65 144 23 -291 -102 292 -28 25 65 -71 -189 13 43 -216 15 68 -180 -34
5748 -34 126 -130 -153 61 71 -403 37 -127 -249 47 19 -90 -47 212 18 -138 -48 -69 37 277 -10 -372
5770 -372 132 233 -110 -301 19 -174 46 95 26 -358 82 115 -339 6 -130 -231 -101 60 -135 -75 239
5791 239 -243 75 85 76 103 -42 18 -193 40 -20 -362 164 323 -201 -43 203 -33 -23 307 130 35 199 36
5814 36 -140 202 -222 -164 306 -69 58 109 215 -76 36 98 287 -15 -63 -79 22 -224 224 39 -11 339
5836 339 90 -174 265 5 -65 -49 311 -189 39 335 -153 134 180 42 -79 -1 -47 -92 49 -25 210 75
5858 75 275 -280 99 148 -397 -212 43 187 -298 222 -15 16 -365 78 -83 -91 183 -20 27 243 -45 -165
5880 -165 106 67 -203 5 79 -369 -130 192 -403 -127 251 -207 -169 196 -6 -505 -33 113 -78 -85 43 -380
5902 -380 67 65 -269 -200 -1 -88 -381 83 -204 -356 26 52 -282 121 101 -232 -148 250 165 -154 199 48 -297
5925 -297 72 6 -141 232 224 -255 0 384 -93 1 271 138 -165 42 -32 -167 22 62 -111 75 296 9
5947 9 -156 153 99 11 177 81 -213 490 236 -242 292 305 90 -94 372 -27 -93 53 227 -336 309 319 -219
5970 -219 162 219 38 -117 405 -105 -94 155 -176 -115 126 273 -245 -42 123 -208 -218 -10 -334 48 173
5991 173 -164 -100 168 -69 -190 111 243 -229 -146 122 -258 -138 41 -316 43 203 -58 -206 335 -154 -49
6012 -49 -126 -215 -151 -193 168 -150 -101 126 -107 -298 108 112 -563 388 -35 -296 243 41 -74 21 293 38 -182
6035 -182 128 -33 -141 113 99 -205 19 58 -71 39 328 24 -156 292 -296 -29 78 -100 -164 41 255
6056 255 -178 9 314 -154 99 42 -35 -219 169 -89 -139 108 178 -351 95 189 -135 16 142 -71 -15 259
6078 259 -37 -228 167 105 -252 -61 105 -154 -175 356 -234 -18 208 -25 -27 246 -204 1 219 157 142 -89
6100 -89 148 -93 53 45 -201 -196 215 -210 -15 252 85 -301 100 -24 -384 70 139 -329 -369 284 -228 -145 42
6123 42 -267 -209 -139 66 -116 55 206 -412 -83 34 124 -51 -8 45 -142 60 -109 -97 49 -124 -82 10 220
6146 220 -236 129 192 -146 -235 201 63 -193 6 30 -284 49 120 -91 -184 276 -192 -105 301 89 72 60 105
6169 105 -99 -82 259 -17 -296 -54 37 -217 -57 64 -47 157 -5 -180 57 118 -324 65 111 103 27 15 -73
6192 -73 -173 215 212 154 88 296 -177 54 -49 -4 -34 490 -89 127 234 208 -142 302 73 -89 3 69 -152
6215 -152 -10 279 -96 9 506 160 -129 335 -132 77 187 264 -305 -96 281 -305 53 242 22 89 77
6236 77 -43 -362 225 54 9 126 37 -308 -82 -197 -386 -286 172 -184 -199 -67 39 -192 39 100 -408 -140
6258 -140 -21 -90 -151 62 -109 81 42 71 -45 -34 54 223 39 369 -322 42 90 -210 -256 418 180 42 89
6281 89 -219 -269 41 34 -187 -41 182 -176 -10 218 60 -393 108 173 -248 100 98 8 -19 119 -128 193 259
6304 259 -185 -206 161 2 -211 -74 146 46 178 70 91 104 213 -260 -68 293 -175 131 160 -132 128
6325 128 402 187 -233 240 500 97 -20 199 55 -364 261 28 -139 -181 280 -68 113 377 -38 212
6345 212 206 152 -235 106 30 -168 -84 192 -89 -4 416 70 41 154 -26 -151 -22 -212 -89 131 -275 -300 106
6368 106 -229 -76 316 36 -311 -66 89 -45 -78 125 -250 -166 38 57 47 60 6 -152 182 112 -256 -189 312
6391 312 -103 -358 256 151 -183 -107 129 -152 -72 35 -109 -81 187 -253 -478 -28 189 -38 88 -201 -21
6412 -21 -40 111 -132 -26 207 -75 -176 186 52 -93 204 110 -274 -96 27 -71 -133 -6 -152 156 307 -96
6434 -96 -130 99 -125 -268 447 -194 60 59 128 -99 252 -79 109 72 100 -60 -58 332 291 -239 136 274 36
6457 36 93 54 -30 -169 354 -37 41 194 2 -209 169 -24 51 56 258 -192 106 116 -277 -80 61 -81 -302
6480 -302 262 87 -213 -87 192 -140 -57 145 -87 19 124 -354 -180 23 -23 -278 24 127 -305 -62 105
6501 105 -49 -228 -238 -35 -156 8 -106 -310 -120 58 -227 -61 -50 -370 158 246 -185 -139 -80 28 -31 -44
6523 -44 33 -201 30 208 -1 34 123 -90 51 -44 -187 -106 84 155 77 27 -116 -255 24 368 -59 -178 132
6546 132 -102 -64 336 -21 -13 194 -153 -181 -193 138 -87 28 62 0 -163 56 -132 -111 -22 17 -192 225 204 -98
6570 -98 -134 323 84 -127 83 -88 74 211 44 132 142 31 33 -30 202 -189 -40 217 -32 -115 -60 25 17 71
6594 71 135 67 293 210 -35 134 179 -79 -87 328 -37 -199 218 -33 -209 -80 95 -216 180 -72 -235 -28
6616 -28 222 19 -46 257 -345 -123 38 -46 -105 51 -61 -184 -56 191 -293 -95 215 -146 -272 151 160 -209
6638 -209 12 80 -219 -124 -187 -126 -31 72 -248 -68 -115 -58 -411 -192 204 -72 -72 115 -232 -25 39 -343 -83
6661 -83 277 -188 135 82 -68 -162 153 183 -11 130 -8 -35 173 -32 -3 -61 167 -135 -150 28 331 -14 -107
6684 -107 242 137 -9 88 44 -214 195 139 -78 43 12 -274 4 186 -183 25 249 99 -66 401 155
6705 155 -44 157 42 4 355 217 86 232 244 -41 40 68 -66 -152 167 51 -112 164 36 90 -5 216
6727 216 -109 -3 98 -74 -175 -1 -156 -130 -131 31 -218 75 167 -128 -8 292 -148 -151 187 10 -159 228
6749 228 86 -283 -354 176 -310 163 168 -39 209 -33 -170 180 260 -40 -432 93 245 -181 15 148 -166
6770 -166 -159 371 -367 -83 -40 -164 -193 281 -84 -21 108 40 -126 -87 -2 -215 -262 227 83 -227 144 59 -96
6793 -96 -85 298 -257 30 171 -168 -35 314 -275 23 467 46 81 177 52 -132 31 251 -71 134 172 36
6815 36 136 172 101 -107 124 -155 -59 212 102 -57 -17 206 -360 -135 233 -201 -367 89 49 137 -82 197
6837 197 -116 -148 281 -139 105 341 28 46 277 -142 -164 296 -13 -163 -32 22 -241 7 143 -218 64
6858 64 311 -19 -289 311 24 -286 -71 140 11 -156 212 -339 292 46 19 6 5 -140 -272 -161 -51 -419
6880 -419 235 -1 -250 -116 195 -38 -261 224 -226 -291 50 20 -84 -131 205 -193 -2 34 -197 165 106 -291
6902 -291 29 33 -176 -236 203 -49 -356 165 252 -280 -37 182 -56 -196 192 -247 107 218 -66 16 70 -147
6924 -147 -1 18 243 -73 162 149 9 -277 170 91 46 181 139 -85 -1 204 -385 108 4 22 -17 138 21
6947 21 -151 190 106 -180 132 -77 -20 -79 249 -79 -139 84 84 -116 198 -20 -127 87 144 -341 106 -50 -263
6970 -263 58 226 -27 -88 20 -68 -390 83 -69 -88 -110 26 -150 -121 266 -83 -253 -123 -93 33 254 -173
6992 -173 -256 141 69 -293 -182 115 -95 -56 318 -206 -206 353 -68 -216 -163 130 -66 -47 -167 -90 49 85 37
7015 37 8 -26 -99 -354 267 110 -192 -116 -63 -396 84 360 -200 147 199 -100 -60 283 -123 -160 177 63 -50
7038 -50 213 -144 -261 -162 171 -101 -236 214 102 -258 188 152 -107 277 177 -301 -97 122 -64 168 311
7059 311 -121 -142 245 213 50 -26 -103 -117 -39 349 -208 -178 277 -47 102 480 16 -305 169 177 -139 141 248
7082 248 -212 30 179 -24 61 -114 -187 50 143 -8 -451 153 103 -260 79 -74 186 -157 -38 81 -216
7103 -216 -50 72 -173 335 204 -94 348 -47 -20 -202 75 -258 -114 66 -149 -11 145 74 -201 131 59
7124 59 -159 65 188 -184 270 -46 -299 -112 68 7 -103 187 118 -142 19 -141 40 42 172 -1 15 14 -142
7147 -142 92 -91 289 -211 -98 294 -16 -78 150 -114 87 379 18 -233 -98 26 -323 23 157 -288
7167 -288 -173 327 -263 -58 167 -14 106 91 -63 -89 -51 28 -409 182 285 -239 3 184 82 116 239 207
7189 207 -90 -109 -41 289 9 -17 -33 -250 228 -197 -210 328 -147 -58 108 -200 -97 11 292 -165 -222 207
7211 207 -88 -102 266 -61 163 462 135 -225 -60 -187 -108 221 52 65 40 -36 -84 73 146 124 -99 260 16
7234 16 -204 68 83 -55 30 97 -169 -156 180 -155 -157 -16 109 -104 249 -95 -9 96 82 -238 -65 59 -184
7257 -184 5 -144 -14 -210 186 94 -109 40 71 -113 -45 -38 -184 -252 -29 -127 -94 -2 123 -82 -132 155 -133
7280 -133 -152 95 -133 -100 65 -177 -194 65 118 -148 -67 44 -68 403 -100 -121 150 63 -10 115 269 314 12
7303 12 12 -48 -263 294 280 -17 -92 87 -154 -4 272 57 25 192 241 -81 -41 33 -196 -87 21 -209 -32
7326 -32 228 -110 -130 91 -48 -215 245 177 -165 200 74 -82 4 69 -111 -238 196 -301 63 273 65 -18
7348 -18 140 79 -139 -134 -107 -84 23 52 -232 23 71 -191 -154 80 78 -262 114 202 -207 91 210 -77 -17 -55 -193
7373 -193 -98 -277 -104 -210 118 24 -286 -98 72 -38 -162 153 -234 -112 202 -46 -7 -10 -33 -345 361 -1
7395 -1 -59 5 -40 103 -98 138 -66 -238 -42 -114 -252 259 135 -34 228 -69 -241 -116 233 -64 45 203
7417 203 -269 -125 124 388 19 224 119 -365 -50 279 -163 -231 251 263 -124 339 -89 -189 134 68 -113
7438 -113 50 194 15 -26 35 -86 -133 79 26 93 218 124 -331 10 -103 68 148 224 -60 20 392 -129 -104
7461 -104 -121 214 -212 -2 2 -103 -113 -32 -280 -187 -157 -210 -123 -17 2 -259 -159 42 -129 50 125 -213 15 51
7485 51 -301 -16 299 -55 43 233 34 -368 -279 106 120 43 -57 -189 -278 308 -284 -9 -87 -154 -148 -132 260 -519
7509 -519 77 66 -182 -1 38 47 -284 -12 -11 -314 394 91 87 184 253 -345 -96 114 109 -121 44 4 -244 131
7533 131 -49 -61 80 202 -349 -23 257 -15 174 -12 -150 38 -41 261 -260 48 81 -177 142 -54 -116
7554 -116 -132 46 109 -80 95 35 -137 -67 242 -44 6 102 26 166 337 92 -146 218 237 -163 390 121 -260
7577 -260 238 184 -43 -86 203 -81 -125 335 -64 -55 80 121 -171 192 199 -167 104 72 -352 -223 13 -14 -55 119
7601 119 -14 -129 203 152 -194 -1 -28 -175 -144 204 -49 -56 110 -7 -35 156 -92 -214 -68 30 -177 -280
7623 -280 217 -26 49 -9 -199 -259 84 -210 -400 -70 175 -79 -260 203 -109 36 -85 -134 -381 254 48
7644 48 -343 319 146 -302 -7 46 -147 225 226 -49 -119 -207 79 3 -7 59 55 109 -43 -195 88 304 -24 158
7668 158 88 126 92 78 74 -93 358 70 -60 138 -41 22 -163 -25 -235 0 178 183 -127 102 69 -176 203
7691 203 184 98 73 167 51 -93 283 -26 4 340 138 -201 23 -89 -94 130 149 -233 275 144 169 -115 126
7714 126 138 -128 327 293 -213 138 137 10 80 68 -158 8 98 -15 -161 116 96 -220 244 -209 -58 -45 140
7737 140 -181 55 -129 -128 -71 -21 -197 -293 -51 221 38 -116 218 45 33 202 -73 -5 55 -118 -105 191 215
7760 215 -184 -24 -117 -235 150 29 -335 59 49 -189 85 112 -281 -219 -34 236 -163 143 86 -126 -121 42
7782 42 -229 45 51 -35 -25 57 125 -122 174 37 -68 56 214 -37 -13 198 -19 -143 209 125 -114 160 206
7805 206 -160 80 32 1 -80 109 -76 -13 176 106 20 40 217 -244 80 162 -179 148 -6 -15 157 197 94 54
7829 54 82 -19 -211 -69 11 -337 46 251 36 -96 111 186 -237 155 -76 36 178 -189 -111 -27 150 -113
7851 -113 -473 127 63 -143 -66 131 -120 95 -67 -96 41 95 -280 216 121 -60 47 -106 -144 -136 -156 99 -83
7874 -83 -60 151 -277 -13 153 54 -119 188 -67 -4 165 -110 -140 223 -69 -252 34 -35 -82 76 159 -33 -22
7897 -22 -140 -216 -140 139 114 -236 133 15 -209 21 57 24 237 210 8 -29 229 5 -132 95 138 -72 278
7920 278 182 -64 -110 144 78 26 72 -17 86 -51 198 -350 -63 194 -128 145 232 251 157 10 159 55 288
7943 288 -70 -151 4 -16 -149 6 116 -168 69 -139 31 59 175 37 -155 152 150 -98 325 -2 -285 -59
7965 -59 -71 -439 86 121 -206 88 -120 -7 -271 63 106 -170 63 73 -137 -146 -73 -234 6 279 16 -172 110
7988 110 9 -152 89 118 -136 -166 -51 -382 -249 60 -214 -232 -11 -160 -222 103 -81 25 110 99 -378 17
8010 17 -49 137 -49 -13 56 -196 127 110 -419 165 -2 -214 97 -78 -130 -148 92 -141 -261 226 -119 57
8032 57 288 -296 -116 325 36 449 193 -49 95 71 58 210 21 92 -53 -34 -63 122 -61 -55 317 155 -99
8055 -99 31 20 -129 254 -20 172 149 71 34 -27 19 37 -24 42 71 -66 189 230 -106 134 56 -147 291 280 -61
8080 -61 85 130 37 52 115 210 -91 152 83 -198 271 134 -194 -187 16 -329 -62 -150 -136 -222 170 55 -318 35
8104 35 164 -81 23 164 182 41 -2 -16 17 -32 -226 -370 128 -30 -15 -75 -19 -106 -196 80 -161 -111 -1 -168
8128 -168 -64 -75 149 -110 1 275 -125 68 98 -213 10 297 -56 36 84 38 -59 82 78 70 289 178 -1
8151 -1 44 90 -212 11 41 136 -393 90 14 40 -42 182 -100 -75 51 38 271 267 68 -37 -225 87 -44 97
8175 97 102 261 -77 150 -202 24 319 169 83 18 108 -108 9 85 -168 6
8191F
$$ Imaginary data points
##PAGE= N=2
##DATA TABLE= (X++(I..I)), XYDATA
0 0 0 0 0 0 0 0 0 0 0 0 0 7 -8 8 -8 8 -10 16 -16 17 -24 24 -32 34 -40 48 -53 59 -67 77 -86 98 -109 123
34 123 -136 153 -169 186 -209 231 -255 283 -314 347 -384 426 -472 528 -589 661 -745 845 -970
53 -970 1126 -1327 1604 -2005 2641 -3821 6763 -33132 -29933 -5137 -42108 -26730 -11762 -29412
67 -29412 -29343 -7453 -26075 -25442 -2390 -17554 -32685 -915 -3083 -29733 -10062 5804 -20721
80 -20721 -15736 4689 -11269 -13433 6692 -9558 -16535 10487 1734 -20882 3938 12692 -15110
93 -15110 -5350 14453 -5597 -7290 12135 -1568 -7511 13931 3134 -10752 14251 13938 -11732
106 -11732 5808 21688 -2545 -1395 19029 4653 -796 16837 4845 -4466 17669 11067 -10651
119 -10651 10180 18913 -7462 -195 19753 1256 -4236 14507 4707 -3421 14308 6092 -8094
132 -8094 12697 12787 -11474 3331 18689 -5669 -6990 13690 708 -7836 9340 1562 -9657
145 -9657 8163 4999 -13320 4359 12492 -11954 -5801 13705 -4019 -10386 8995 1044 -9784
158 -9784 5848 1710 -11342 5604 7028 -13925 -1950 12772 -8174 -9310 11017 -307 -10345
171 -10345 5745 1530 -9761 4854 3799 -12775 1276 9527 -11619 -6732 11970 -3957 -11580
184 -11580 7039 1708 -9415 4470 2605 -9660 3812 6944 -11408 -1389 12115 -7319 -9348
197 -9348 10217 150 -11094 4773 3278 -9172 2516 4072 -10060 1440 9480 -9485 -5184
210 -5184 12246 -2048 -9964 8607 4427 -8877 4094 5186 -7366 3425 7823 -8410 -657
223 -657 11833 -5110 -7026 11794 2885 -9248 6239 6585 -6586 4001 7250 -5899 2590 10356
237 10356 -5888 -2474 13766 385 -7733 9943 6523 -6759 5443 8328 -4453 3616 9060
250 9060 -4588 1103 12787 -2240 -5025 12398 4120 -8176 6597 8005 -5453 2648 6966
263 6966 -4574 1542 9285 -5189 -3272 11445 -971 -8346 8360 5647 -8673 2173 7020
276 7020 -5968 -172 6478 -5721 -2578 8104 -5178 -7874 8548 948 -11368 2870 5077
289 5077 -9131 -1826 4516 -7187 -3203 4987 -7379 -6469 7231 -3358 -11341 4636 2158 -11813
303 -11813 -585 4795 -8342 -3938 3989 -6956 -5260 5488 -5755 -9205 5888 -656 -12416
316 -12416 1526 4627 -9764 -3444 4551 -6813 -4538 4568 -5419 -6303 6249 -2360 -9878 5533
330 5533 4044 -10202 326 7002 -5779 -2886 6523 -3066 -2955 7036 -2057 -5569 8605 2842
344 2842 -8442 4713 7820 -6225 -58 9306 -1989 -1944 7820 -658 -2618 8617 1590 -5801
358 -5801 8146 6595 -6703 2700 10232 -3077 -1156 9111 52 -1977 8280 1112 -3432 8607
372 8607 4054 -6736 5628 9155 -5251 296 9744 -1713 -2424 7911 554 -3060 7451 1592
386 1592 -6097 6444 5874 -7337 1432 8664 -4519 -3592 7286 -949 -4359 5281 -530 -5721 5384
401 5384 2015 -7997 2523 5703 -7993 -3014 7141 -3748 -6367 4446 -1680 -6632 3160 -678
415 -678 -8094 2244 2171 -10195 -2078 5467 -7220 -6839 4417 -3148 -7854 1843 -1547 -7883 1782
430 1782 -24 -9606 158 4253 -8596 -4449 5847 -4425 -7580 3680 -888 -7121 2214 104
444 104 -7677 1140 2764 -8310 -1378 6070 -6014 -5885 5794 -1272 -6847 3404 844 -5944 2704
459 2704 2343 -6819 1860 6189 -6259 -2387 8075 -1391 -4901 6387 2361 -4608 4271 4071 -4046
474 -4046 3949 5712 -4626 1423 9089 -2656 -2766 9202 2138 -4393 5780 4644 -2671 4555
488 4555 5448 -3319 3414 7949 -3217 110 9592 284 -3673 7624 4161 -3663 4454 5140 -3444
503 -3444 3005 5659 -3784 1080 7685 -2991 -3294 7756 1538 -5511 4543 3869 -4481 2012 4459
518 4459 -4059 1143 5894 -4218 -2119 7156 -1321 -5643 5399 2559 -6286 1645 3334 -4913 377
533 377 3840 -5311 -1637 5134 -4309 -5332 5435 -746 -8123 2343 2282 -7106 -608 2564 -5909
548 -5909 -1846 3407 -5596 -3879 5009 -3084 -7386 3881 941 -7547 537 2879 -5873 -1803 3068
563 3068 -4999 -2698 4048 -4270 -5535 4749 -794 -7843 2064 3000 -6522 -709 3616 -4635 -1783
578 -1783 4159 -3554 -3255 5469 -1586 -5821 4563 2474 -6291 1246 4861 -4377 -873 4651 -2684
593 -2684 -1629 5189 -1724 -3501 6185 1378 -5735 3668 5173 -4471 562 6076 -2029 -475 5706
608 5706 -868 -1289 6885 591 -3651 6179 4467 -4646 2954 6820 -2541 84 6384 -828 -816 6111
624 6111 -169 -2988 5977 2043 -5079 4072 5408 -4495 233 5825 -2198 -1578 5223 -867 -2539
639 -2539 5471 271 -4717 4685 3110 -5856 1145 5551 -3992 -2109 4906 -1625 -3234 3792 -1040
654 -1040 -3971 3898 975 -5904 1884 3772 -5895 -1727 4866 -3066 -3819 3198 -2015 -4702 2792
669 2792 -921 -6051 2181 1313 -7183 -860 3650 -5230 -4429 3434 -2906 -5123 2181 -1617 -5639 2119
685 2119 64 -6785 820 2927 -6328 -2379 4354 -3517 -4498 3529 -939 -4609 2360 66 -5234
700 -5234 2194 2238 -6069 -175 4554 -4708 -3567 4410 -1331 -4979 2624 -548 -4840 2368 1013 -5641
716 -5641 944 3840 -5037 -1723 5406 -2322 -3778 4284 752 -3469 3385 1930 -3737 2773 3501
731 3501 -4155 1212 5997 -2591 -1858 5878 130 -3226 4116 2457 -3107 3016 2953 -3409 2068 5013
747 5013 -3306 -850 6128 -1093 -3493 5105 1637 -3713 2901 2529 -3298 1842 3592 -3692 489
762 489 5386 -3046 -2665 5441 -103 -4277 3377 1918 -3982 1687 2667 -3593 581 3843 -4097 -1773
778 -1773 5175 -1606 -4161 4100 883 -4977 1464 2216 -4395 248 2406 -4541 -1087 4121 -3706
793 -3706 -3829 4337 -988 -5625 1985 1567 -5308 -78 1721 -4411 -629 2930 -4137 -2355 4073 -2323
809 -2323 -5052 3252 737 -5251 993 2119 -4267 -154 2652 -3751 -1163 3770 -2844 -3477 4499
824 4499 -34 -4911 2507 2360 -4408 583 3151 -2828 -130 3708 -2630 -1437 4801 -654 -3542
839 -3542 4254 2073 -4185 2178 3732 -2701 747 4211 -1843 -470 4969 -1028 -2050 5532 1222
854 1222 -3690 3741 3823 -3000 1540 4801 -1676 242 4900 -1146 -608 5388 173 -2785 4978 2928
870 2928 -3404 2746 4854 -2700 378 4731 -1035 -337 4775 -546 -2157 4633 1558 -3593 3279
885 3279 3502 -3866 344 4075 -2248 -1050 3557 -1379 -1990 3781 -375 -3998 3192 1603 -5002 705
901 705 3135 -4209 -1799 3011 -2515 -2920 2448 -1902 -3905 2567 -578 -5534 1176 1605 -5339 -1536
917 -1536 2647 -3623 -3010 2215 -2440 -3805 1747 -1325 -4979 1563 437 -5951 -525 2506 -4792
932 -4792 -2853 2510 -2705 -3676 1908 -1775 -4359 2011 -336 -5206 1114 1957 -4993 -1468 3070 -3100
948 -3100 -2978 3132 -1368 -3220 2599 -104 -3850 2522 2126 -4457 812 4119 -2868 -1289 4639 -792
964 -792 -2540 3475 479 -2565 3196 2013 -2967 2401 3912 -3135 424 5328 -1115 -1511 4511 787
980 787 -1905 3844 2018 -2260 3226 3166 -2535 1917 5083 -1728 -672 4985 316 -1930 3777 1521
996 1521 -1992 3117 2433 -2675 2232 3980 -2797 -108 4627 -1055 -1929 4269 626 -2703 2529 1631
1012 1631 -2851 2202 2430 -3106 164 3695 -2826 -1869 4246 -777 -3346 2620 566 -3493 1444
1027 1444 1422 -3960 431 2313 -4036 -1751 3248 -2392 -3611 2740 -595 -4117 1117 512 -4213 253
1043 253 1284 -4343 -999 2766 -3729 -3013 2740 -1435 -4684 1688 452 -4340 255 1086 -3894 -481
1059 -481 2009 -3843 -1948 2807 -2578 -3903 2728 157 -4349 981 1433 -3581 150 2142 -3205
1074 -3205 -808 3165 -2855 -2621 3416 -409 -3458 2562 1705 -3342 1240 2657 -2388 343 3208
1089 3208 -2055 -508 4292 -665 -2273 3898 1550 -2741 2630 3296 -2244 1004 3427 -1765 337
1104 337 4294 -922 -1153 4578 942 -2390 3528 2859 -2503 1608 3771 -1848 528 3747 -1231 -495
1120 -495 4190 -321 -2427 4089 1617 -3187 1846 3048 -2509 519 3523 -1798 -437 3476 -1312
1135 -1312 -1968 3511 326 -3105 2624 2041 -3351 438 2768 -2385 -672 2852 -1957 -1731 2885 -1130
1151 -1130 -3384 2424 547 -4395 509 2035 -3559 -1102 2239 -2677 -2238 2219 -2157 -3162 2207
1166 2207 -793 -4334 1075 1219 -4570 -560 2046 -3119 -2148 1948 -2230 -2964 1988 -1432 -4070 1866
1182 1866 331 -4715 327 1777 -3819 -1512 2243 -2382 -2307 2124 -1384 -2861 2534 17 -3635
1197 -3635 1552 1863 -3973 -92 3090 -2311 -1493 2864 -972 -1751 2853 -55 -2899 2590 1654 -3372
1213 -3372 1427 3163 -2352 -210 3780 -779 -1267 3233 187 -1794 3362 1447 -2646 2554 3111
1228 3111 -2427 814 4065 -1439 -513 3723 417 -1313 3186 1246 -2010 2532 2494 -2531 1674 3861
1244 3861 -1759 -419 4120 -576 -1348 3504 669 -1977 2689 1712 -2362 1930 2871 -2362 68 3734
1260 3734 -1319 -1396 3281 -466 -2369 2487 568 -2838 1530 1505 -3287 202 2777 -2553 -1521 3197
1276 3197 -1217 -2983 2025 -220 -3223 1336 634 -3625 355 1375 -3552 -1234 2726 -2488 -2655
1291 -2655 2150 -1075 -3383 1198 246 -3543 275 1041 -3731 -516 1868 -3439 -2283 2303 -1406
1306 -1406 -3463 1700 -121 -3736 643 805 -3337 64 1862 -3303 -1304 2625 -2010 -2346 2284
1321 2284 -330 -3190 1568 1067 -2944 745 1822 -2623 2 3065 -1821 -1344 3470 -248 -2389
1336 -2389 3053 1336 -2239 1889 2145 -1802 1062 3066 -1657 81 3864 -751 -1237 3889 994
1351 994 -1992 2615 2427 -1831 1508 3091 -1676 467 3606 -983 -1048 3836 158 -1914 3407 1783
1367 1783 -2187 1716 2618 -1753 760 3170 -1513 -70 3486 -324 -1676 3621 1047 -2511 1798
1382 1798 2182 -2444 610 2680 -1986 -283 2776 -1605 -1686 2846 -319 -2706 1952 1062 -3072 434
1398 434 1913 -2654 -608 2146 -2235 -1410 2382 -1348 -3088 2095 62 -3681 603 1359 -3258 -664
1414 -664 1779 -2736 -1675 2099 -1955 -2399 1940 -704 -3383 1188 492 -3550 -136 1575 -2854 -1295
1430 -1295 1603 -2144 -2311 1893 -1223 -2970 1836 334 -3592 729 1431 -3108 -587 2142 -1881
1445 -1881 -1459 2227 -1329 -2130 2154 57 -2788 1818 1617 -2720 349 2679 -2057 -557 2804 -1156
1461 -1156 -1092 2787 -6 -1975 2574 1156 -2360 1627 2706 -1766 50 3300 -929 -508 3141 144
1477 144 -1178 2924 1085 -1628 2366 2442 -1779 1093 3176 -1364 -140 3193 -183 -1129 2854 490
1493 490 -1540 2449 1786 -2072 1233 2584 -2017 90 3057 -737 -977 2666 170 -1855 2216 948
1509 948 -2250 1510 1880 -2516 292 2524 -1891 -1440 2596 -583 -1788 1823 18 -2553 1268 704
1525 704 -3097 246 1751 -2613 -1211 2327 -1590 -2244 1789 -735 -2723 1021 -24 -3047 441
1540 441 1156 -3356 -980 1679 -2661 -2151 1642 -1069 -2755 1094 -437 -2929 430 577 -3095 -190
1556 -190 1669 -2600 -1317 2140 -1895 -2209 1766 -446 -2528 1239 702 -2534 577 1351 -2510 -295
1572 -295 2538 -1464 -1739 2358 -337 -2408 1679 760 -2323 1040 1520 -2041 575 2356 -1845 -896
1588 -896 2970 -526 -1466 2658 818 -1613 1974 1590 -1820 1473 2313 -1482 52 3044 -702 -798
1604 -798 3009 629 -1664 2622 1582 -1408 1463 2142 -1335 865 3054 -955 -356 3410 -92 -1597
1620 -1597 2555 1124 -1825 1644 1617 -1655 642 2310 -1531 -306 2639 -1124 -1385 2450 403 -2250
1636 -2250 1638 1256 -2178 689 1498 -2146 -440 1836 -1700 -1503 2081 -652 -2125 1520 260 -2545
1652 -2545 410 1161 -2155 -265 1126 -2110 -1330 1612 -1546 -2354 1415 -537 -3035 681 610 -2939
1668 -2939 -224 1171 -2441 -1300 1510 -2076 -1895 1528 -847 -2767 1157 534 -2726 207 1013 -2448
1684 -2448 -522 1322 -1993 -1380 1771 -1054 -1874 1927 118 -2569 810 1113 -2542 19 1692 -1559
1700 -1559 -939 2021 -896 -1109 2440 -184 -1981 1820 1238 -1810 1010 1899 -1578 199 2684 -998
1716 -998 -558 2408 -68 -1276 2391 640 -1841 1790 2056 -1478 474 2534 -1031 -339 2527 -61
1732 -61 -684 2417 633 -1365 2035 1521 -1762 981 2419 -1032 183 2362 -540 -575 2355 158
1748 158 -1327 2014 1030 -2115 1125 1834 -1801 -74 2294 -1058 -999 1971 -564 -1532 1643 346
1764 346 -2236 1342 1089 -2209 97 1707 -1862 -895 1892 -1107 -1653 1508 -562 -2376 1297 173
1780 173 -2523 353 1122 -2278 -731 1393 -1665 -1912 1289 -1341 -2303 735 -228 -2839 308 651
1796 651 -2694 -573 1464 -2214 -1364 1400 -1304 -1852 1109 -431 -2453 831 422 -2224 290 1280
1812 1280 -2189 -757 1527 -1390 -1365 1809 -331 -1706 1313 506 -1729 820 1236 -1947 132 2159
1828 2159 -1232 -1019 2483 -375 -1359 1603 547 -1403 1373 1245 -1665 850 1834 -1255 -192 2496
1844 2496 -516 -1070 2146 432 -1365 1939 1360 -1277 1332 2085 -1214 518 2402 -889 -407 2448
1860 2448 393 -1251 2273 1053 -1008 1472 1666 -1483 464 2092 -859 -329 2291 -431 -1159 1915
1876 1915 424 -1491 1263 1121 -1359 358 1388 -1611 -92 1980 -1072 -1101 1440 -422 -1956 1272
1892 1272 332 -1950 556 804 -1828 -198 1122 -1755 -1242 1392 -1089 -1971 1048 -175 -1886 452
1908 452 559 -2470 -42 801 -2036 -939 1147 -1420 -1747 1206 -666 -2237 610 26 -2256 91
1924 91 633 -2077 -563 1085 -1562 -1320 1481 -1000 -1791 1083 -65 -2170 224 692 -1812 -541
1940 -541 1165 -1390 -497 1583 -941 -1397 1345 236 -1639 1328 1077 -1499 516 1415 -1231 -168
1956 -168 2063 -607 -551 2319 -49 -987 1664 1186 -1244 1128 1664 -1243 441 2173 -479 -102 2353
1973 2353 280 -715 2329 784 -909 1551 1509 -1227 692 2121 -756 385 2156 -212 -575 2141
1989 2141 372 -786 1699 1272 -1351 908 1748 -1044 247 1858 -807 -368 2133 -239 -1181 1816
2005 1816 373 -1652 943 1241 -1596 -3 1287 -1126 -421 1518 -707 -1217 1123 -161 -1758 997
2021 997 387 -2071 336 1012 -1682 -740 1376 -1174 -1293 818 -729 -2053 800 -330 -2105 339
2037 339 684 -2109 -647 1102 -1686 -1194 1030 -886 -1494 750 -110 -1700 436 194 -2130 -173
2053 -173 977 -1682 -1102 1289 -1193 -1091 1092 -283 -1349 849 344 -1708 529 1107 -1583 -71
2069 -71 1477 -966 -854 1721 -320 -1270 1318 348 -1155 1318 1186 -1233 446 1810 -740 -139 1910
2086 1910 -355 -694 1594 600 -925 1375 860 -1250 964 1787 -1033 238 1961 -620 -360 1916
2102 1916 135 -541 1827 804 -1171 1184 1477 -948 508 1671 -876 -142 1849 -200 -660 1458
2118 1458 388 -962 984 1086 -1210 625 1450 -1435 -188 1599 -675 -847 1392 -83 -1251 837
2134 837 265 -1537 499 914 -1232 -233 1262 -1285 -1024 1176 -458 -1599 686 167 -1543 155
2150 155 446 -1746 -82 554 -1661 -845 905 -1260 -1531 958 -386 -1917 359 290 -1764 39 735
2167 735 -1636 -743 1074 -1016 -1235 912 -907 -1745 506 -96 -1632 99 458 -1516 -104 782 -1526
2184 -1526 -521 1253 -843 -1304 1215 68 -1583 573 777 -1426 151 1126 -1113 -307 1330 -799
2200 -799 -573 1163 -167 -1082 1245 916 -1280 601 1336 -1011 489 1189 -605 -199 1630 -8 -902
2217 -902 1635 883 -1132 1177 1225 -838 747 1585 -452 227 1788 -143 -443 1771 469 -1173 1334
2234 1334 986 -825 753 1280 -625 105 1681 -520 -366 1702 94 -835 1450 737 -1007 882
2250 882 1045 -1014 141 1332 -833 -394 1402 -523 -1086 1073 84 -1527 871 361 -1577 -105
2266 -105 594 -1167 -338 1033 -951 -1087 1248 -511 -1537 670 147 -1619 241 514 -1487 -625 1090
2283 1090 -1321 -1218 707 -818 -1448 763 -345 -1651 295 229 -1855 -71 806 -1453 -734 642
2299 642 -942 -1180 769 -360 -1343 560 306 -1414 113 983 -1192 -372 1113 -679 -543 1101 -231
2316 -231 -1135 1201 207 -1233 768 798 -1027 34 1187 -797 -379 1328 -264 -754 1287 195 -880
2333 -880 1274 556 -1168 686 1540 -849 291 1513 -409 -415 1668 57 -492 1404 825 -910 743
2350 743 1439 -878 234 1443 -511 -228 1502 48 -420 1455 525 -867 967 1009 -1011 475 1332
2367 1332 -801 -283 1424 -336 -650 1055 64 -1013 1045 320 -1109 565 887 -1171 -252 972
2383 972 -952 -594 1085 -213 -942 816 22 -1318 578 678 -1352 -110 848 -1160 -761 931 -635
2400 -635 -1176 753 -247 -1329 457 67 -1441 -161 456 -1636 -620 427 -1122 -1173 563 -518
2416 -518 -1380 451 -181 -1520 332 276 -1461 -169 680 -1325 -586 1042 -644 -1202 676 59 -1018
2433 -1018 673 360 -1054 -154 869 -909 -203 872 -626 -877 1070 73 -1021 752 798 -982 602
2450 602 950 -941 -61 1348 -748 -303 1475 -44 -593 1201 589 -836 1128 741 -800 669 1295
2467 1295 -527 -34 1434 -134 -436 1372 503 -653 1025 624 -528 742 1317 -671 126 1434
2483 1434 -317 -163 1724 155 -630 1241 812 -777 805 944 -934 398 943 -608 -248 1288
2499 1288 -531 -946 1224 169 -1102 779 910 -1040 174 960 -849 -321 1015 -580 -686 1009
2515 1009 -350 -1025 535 397 -1286 216 769 -1275 -348 752 -1145 -383 887 -579 -1301 868
2531 868 -260 -1565 66 385 -1377 -62 649 -1243 -847 483 -970 -848 933 -718 -1368 305
2547 305 210 -1397 82 617 -1436 -180 845 -844 -674 710 -527 -1150 542 163 -1164 650 661
2564 661 -1066 154 925 -746 -297 1058 -255 -839 1182 130 -926 871 423 -996 563 1135
2580 1135 -555 -37 1321 -292 -559 1141 -12 -640 1495 328 -873 856 1040 -710 370 1582
2596 1582 -694 -165 1109 -195 -481 1399 286 -755 780 996 -704 453 1201 -650 -175 1436
2612 1436 -60 -411 986 150 -696 998 543 -1001 506 992 -939 19 1074 -551 -420 1193 79
2629 79 -717 916 96 -1005 389 489 -1197 -31 843 -841 -439 766 -518 -974 637 -276 -1171
2646 -1171 409 358 -1477 -16 688 -1331 -800 746 -676 -1049 567 -482 -1119 441 1 -1111 177
2663 177 348 -1396 -428 684 -1117 -968 480 -540 -1010 514 -313 -923 480 291 -1310 309 695
2680 695 -935 -564 693 -722 -735 1023 -191 -1085 584 390 -1073 549 682 -963 -146 1090 -493
2697 -493 -561 1044 43 -910 916 256 -768 593 1023 -861 137 1103 -822 -247 943 -250 -472
2714 -472 983 327 -519 873 975 -525 825 1101 -571 212 1266 -425 -84 1459 245 -599 1235
2731 1235 375 -809 737 916 -889 375 941 -559 -313 1473 -293 -565 1160 294 -739 805
2747 805 495 -822 205 694 -798 -130 1005 -502 -697 997 20 -788 716 659 -1023 166 700
2764 700 -1063 -402 686 -754 -586 787 -624 -1082 649 -32 -1509 156 222 -1334 -282 421 -1121
2781 -1121 -596 852 -903 -744 751 -165 -1137 367 108 -1358 148 435 -1113 -276 467 -920 -661
2798 -661 1017 -450 -1102 911 49 -1068 331 600 -1039 -114 591 -579 -578 968 -781 -808 770 221
2816 221 -930 794 373 -837 275 840 -763 -230 1097 -400 -326 1159 67 -623 921 422 -507
2833 -507 429 931 -618 146 1236 -362 -347 1110 199 -640 1298 370 -604 862 1051 -679 319 1269
2851 1269 -242 -289 1156 -151 -311 1082 564 -655 799 550 -983 507 1083 -585 -256 1055 -240
2868 -240 -250 1123 -61 -850 951 393 -1032 491 779 -843 -71 698 -579 -440 861 -239 -786
2885 -786 516 99 -1055 493 344 -1266 56 561 -1008 -479 989 -615 -841 687 -223 -1112 438
2902 438 175 -1096 28 576 -1153 -378 562 -907 -813 536 -269 -829 535 -62 -1259 20 183 -1255
2920 -1255 51 714 -1107 -301 728 -424 -820 672 -198 -1110 499 46 -1036 69 581 -903 -70
2937 -70 851 -836 -750 1073 23 -708 777 247 -775 468 653 -790 260 1009 -428 -465 978 -79
2955 -79 -506 1004 306 -729 823 389 -376 583 835 -294 83 1228 -153 -398 1103 299 -262 805
2973 805 630 -462 606 776 -417 368 1208 -337 -289 1084 0 -675 661 277 -817 504 344
2990 344 -494 247 688 -645 -37 1123 -319 -525 868 -143 -644 686 432 -1060 74 455 -821
3007 -821 -147 790 -761 -675 817 -498 -902 507 171 -934 89 372 -1101 -243 692 -720 -909 556
3025 556 -461 -847 536 -68 -1036 209 133 -1116 -211 539 -1081 -426 674 -675 -648 794 -281 -897
3043 -897 479 67 -1025 262 173 -845 -27 579 -680 -502 828 -353 -695 837 78 -910 140
3060 140 359 -924 77 600 -777 -36 687 -440 -452 830 -64 -831 791 661 -778 620 797 -703
3078 -703 43 976 -412 -305 972 -15 -464 1005 206 -512 480 821 -690 283 1014 -204 -233 871
3096 871 -102 -322 803 270 -373 702 604 -672 404 1240 -508 183 855 -336 -180 831 -100 -472
3114 -472 597 451 -726 514 623 -951 6 832 -375 -240 1075 -356 -711 746 181 -1046 390
3131 390 475 -747 170 565 -782 -371 663 -551 -666 495 -127 -868 363 170 -1024 11 574 -996
3149 -996 -177 501 -781 -634 605 -388 -978 455 -162 -924 190 315 -1055 -68 627 -714 -288 713
3167 713 -389 -649 684 81 -1037 377 120 -987 149 376 -546 -19 580 -481 -428 734 -120 -1002
3185 -1002 689 200 -777 661 731 -632 288 690 -375 -162 907 -69 -444 710 265 -518 460 515
3203 515 -701 495 930 -270 -44 638 -60 -103 983 427 -232 729 678 -562 576 825 -476 368
3221 368 1056 -219 -117 1104 145 -523 563 400 -747 369 769 -703 337 787 -357 -50 919
3238 919 -236 -604 685 -135 -784 444 120 -738 216 528 -475 11 713 -535 -348 609 -310 -725
3256 -725 514 -12 -875 151 463 -891 -207 270 -734 -214 356 -416 -735 355 -231 -605 263 144
3274 144 -993 30 550 -786 -223 534 -626 -418 432 -186 -1007 442 198 -683 -141 224 -910 -257
3292 -257 264 -843 -492 630 -279 -855 371 -7 -704 171 256 -990 218 401 -572 -163 520 -459 -505
3311 -505 569 125 -484 562 281 -595 468 782 -566 129 601 -201 -421 903 174 -570 602 237
3329 237 -649 588 400 -389 99 898 -153 -14 933 -166 -305 802 -1 -531 549 498 -324 462 632
3348 632 -312 -71 918 -106 -118 989 -11 -419 521 494 -489 328 398 -469 103 637 -338 -310 882 -236
3368 -236 -542 742 -58 -572 584 386 -610 107 378 -638 -441 538 -580 -588 569 -181 -705 466 291
3387 291 -856 341 327 -756 -309 491 -502 -608 520 -286 -663 357 -228 -697 15 222 -748 49 693
3406 693 -624 -421 437 -571 -672 358 -233 -759 557 0 -755 151 732 -691 -66 608 -359 -220
3424 -220 488 -548 -564 642 15 -675 181 475 -683 52 580 -348 -86 510 -91 -390 467 196 -575
3443 -575 532 575 -626 235 598 -447 -33 748 35 -287 827 133 -227 678 289 -511 393 829 -159
3462 -159 -8 668 -114 82 930 70 -208 870 152 -283 706 257 -434 126 847 -255 11 614 107
3481 107 -270 699 16 -620 456 526 -486 -30 467 -252 114 423 -310 -241 247 -16 -345 438 139 -741
3501 -741 318 449 -489 264 452 -463 32 451 -112 -579 157 -123 -565 300 13 -978 -189 454 -555
3520 -555 -229 453 -430 -571 301 -333 -592 219 -76 -884 235 242 -781 59 463 -538 -446 533 -279 -831
3540 -831 351 -202 -625 211 300 -533 -101 662 -511 -194 529 -298 -426 434 -30 -363 383 452 -280 41
3560 41 407 -509 166 563 -232 -335 572 61 -653 534 315 -196 175 392 -350 166 751 -83 59 578
3580 578 -83 -82 689 148 -371 418 500 -276 191 697 -176 16 725 -229 -196 680 250 -398 621 446 -356
3601 -356 139 548 -367 15 402 103 -42 481 -47 -426 376 61 -518 434 497 -927 -80 441 -491 -75
3621 -75 520 -94 -301 431 -116 -714 293 203 -466 7 400 -757 -397 258 -547 -337 540 -271 -739 166
3641 166 98 -516 62 262 -513 -206 263 -495 -432 461 -210 -501 220 -165 -760 243 102 -627 -8 213
3661 213 -556 -406 349 -487 -377 567 -351 -475 514 85 -569 78 418 -583 -24 283 -441 -89 322 -196
3681 -196 -236 355 -98 -401 464 39 -501 195 119 -463 -107 609 -313 -83 747 106 -507 477 153 -446 334
3702 334 682 -388 77 809 -413 -136 688 41 -123 603 166 -255 399 204 -453 302 586 -498 -192
3721 -192 609 -307 18 641 171 -194 540 112 -555 97 418 -534 10 462 -140 -116 568 -93 -419 545
3741 545 -25 -539 374 455 -371 36 459 -489 -81 377 -255 -340 298 99 -600 -36 156 -578 108 19 -603
3762 -603 -222 369 -355 -420 -39 -191 -678 324 -156 -651 -5 -25 -670 -97 301 -492 -228 175 -114 -371
3782 -371 415 43 -456 37 336 -547 -207 444 -470 -253 409 -484 -620 156 93 -345 127 176 -380 302 349
3803 349 -489 -132 411 -304 -129 517 -22 -393 62 183 -477 228 507 -501 -22 676 -14 -119 607 94
3823 94 -275 438 172 -448 465 375 -332 108 742 -75 -165 526 22 -114 834 150 -290 446 88 -242 225
3844 225 228 -453 281 448 -67 -448 669 43 -263 444 22 -183 358 102 -434 254 541 -272 -407 503
3864 503 -77 -270 447 86 -423 521 -15 -385 -45 125 -579 -88 404 -405 -409 419 -44 -381 368 -249 -647
3885 -647 204 241 -669 41 376 -536 -291 253 -282 -699 207 -129 -527 251 121 -559 -238 452 -520 -225
3905 -225 356 -418 -346 583 -278 -495 155 -161 -302 156 415 -424 -38 363 -182 -603 591 1 -293 264
3925 264 113 -231 25 435 -419 244 365 -327 -12 470 -259 -48 638 -118 -438 727 508 -265 241 538
3945 538 -250 -92 402 -53 -89 527 -107 -282 373 189 -307 295 462 -353 -129 395 -334 136 695 130
3965 130 -68 394 13 -368 485 138 -421 282 186 -135 74 711 -241 -254 405 -502 -511 457 141 -199 357
3986 357 54 -461 -151 597 -278 22 91 -126 -258 197 245 -524 159 237 -589 -8 208 -374 14 161 -220
4007 -220 -283 359 12 -517 267 57 -544 -37 281 -434 -317 167 -400 -262 379 -116 -411 184 137 -485 119
4028 119 94 -405 63 252 -497 -175 294 -448 -412 239 -102 -407 356 240 -365 131 331 -526 -222 254 -263
4049 -263 -173 498 149 -295 255 304 -336 224 414 -372 83 564 -245 -43 697 128 -264 447 127 -393 540
4070 540 539 5 210 299 -432 117 287 183 -300 488 59 -241 416 82 -271 236 329 -252 44 505 -158
4091 -158 30 304 28 -163 586 430 -348 116 181 -312 244 372 -245 -89 41 -221 -504 410 39 -313
4111 -313 238 241 -373 53 90 -583 -110 174 -58 -270 172 -229 -335 372 -123 -334 191 253 -442 -31 203
4132 203 -255 -95 200 -275 -360 251 -14 -450 -91 274 -334 -21 228 -599 -266 136 -324 -400 249 -197 -466
4153 -466 298 168 -582 60 99 -426 62 448 -321 -201 365 -374 -356 129 -189 -463 295 -10 -160 -124 325
4174 325 -319 -178 435 -161 -231 569 135 -427 232 181 -217 -215 399 -203 -235 493 -190 52 229 -88 -386 359
4196 359 141 -187 361 396 -424 -148 189 -311 61 463 -185 -271 378 81 -191 395 223 -58 146 569 -14
4217 -14 162 609 -224 -145 582 -91 -166 413 255 -274 317 134 -551 183 350 -40 -234 258 -28 -305 569
4238 569 6 -424 92 -66 -560 -58 270 -574 160 457 23 -379 201 -14 -595 303 55 -430 102 179
4258 179 -271 -206 183 13 -466 177 -382 -292 161 50 -633 36 70 -452 -151 111 -377 -26 362 -199 -182
4279 -182 289 -146 -358 217 92 -794 192 584 -211 -168 50 -289 -161 48 -68 -430 300 -28 -355 167
4299 167 315 -429 -130 406 -216 -193 303 -259 -124 137 -56 -455 325 415 -197 225 250 -212 -21 683 -45
4320 -45 -57 395 295 -262 477 355 -205 152 454 -226 266 418 -95 4 361 -15 -292 52 77 -258 256
4341 256 88 -439 -60 413 -205 224 453 40 -55 241 29 132 383 100 -475 308 183 -263 -200 196 -243
4362 -243 -157 195 -132 -471 233 91 -429 36 357 -288 -193 296 -467 78 362 -351 -407 223 2 -274 21
4383 21 112 -374 106 117 -370 -122 358 -389 -267 346 -318 -236 317 -4 -386 -60 109 -495 -203 242 -268
4404 -268 -257 342 170 -422 360 104 -422 156 131 -445 46 233 -194 -47 311 -219 -138 485 150 -506 93
4425 93 14 -320 399 193 -218 88 363 -162 125 609 -65 -57 436 -109 -220 40 76 -440 276 481 -232 -28
4447 -28 495 -74 -191 499 -13 -185 213 253 -387 70 307 -246 47 295 15 -73 594 -50 -288 249 147
4468 147 -134 25 136 -428 195 372 -194 -79 141 -86 -161 209 -11 -424 195 364 -227 246 109 -383
4488 -383 70 273 -265 -86 199 -160 -406 248 22 -419 54 46 -393 -79 119 -295 -76 418 -116 -143 376
4509 376 -130 -484 98 93 -523 -12 177 -246 -332 259 -261 -392 166 34 -453 154 -5 -406 -48 46 -261
4530 -261 -69 516 -124 -207 471 -103 -376 35 141 -148 56 177 -209 -53 310 -214 -116 620 108 -264 396
4551 396 286 -199 158 140 -343 103 310 -125 32 399 -217 19 214 32 -321 265 159 -218 134 291
4571 291 -154 98 390 -228 55 342 -130 -206 500 176 -157 21 36 -168 316 401 -236 -204 181 24 -49 322
4593 322 108 -322 487 43 -188 266 64 -338 59 250 -116 -248 293 -57 -215 315 129 -191 234 177
4613 177 -373 193 44 -32 -222 88 -138 -178 160 -81 -492 182 -25 -225 155 121 -304 -315 267 -275 -187 304
4635 304 -253 -28 191 -116 -378 -169 -81 -234 -56 237 -239 -40 259 -228 -45 1 18 -268 56 9 -261
4656 -261 -4 341 -305 -115 204 -80 -346 334 16 -312 -17 -129 -346 200 98 -193 -76 254 -128 -138
4676 -138 341 153 -375 114 -27 -244 225 83 -114 -107 276 -225 94 247 -91 11 381 99 -9 270 66
4697 66 -7 166 384 -367 -100 195 -132 -111 516 -39 -75 220 288 -292 81 234 -121 50 432 -381 2 530
4719 530 61 -72 52 111 -226 82 21 -362 25 311 -403 -111 200 -15 -257 187 -230 -320 275 -3 -270
4740 -270 85 173 -351 -217 19 -187 -328 -142 -92 -32 319 -220 -406 86 140 -665 -89 248 30 7 323 -354
4762 -354 -76 47 -268 -127 200 -40 -389 9 182 -137 -154 156 -315 -277 376 -92 -284 70 -109 -290 209
4783 209 191 -6 100 324 -144 -147 167 -140 -167 16 -197 -181 305 242 -326 172 181 -278 192 198 77 -58 461
4806 461 71 -187 374 84 -104 85 115 -105 91 139 22 -203 347 -110 -2 351 175 -309 -78 109 -31
4827 -31 276 182 -13 156 187 -117 48 308 93 -278 227 136 -252 186 43 -184 40 178 -191 -191 286 -68
4849 -68 19 418 -91 -362 41 241 -307 -60 91 -248 -44 205 -190 -208 32 153 -205 190 215 -371 282
4870 282 37 -250 -191 -49 -246 -321 124 -76 -583 235 -13 -125 -56 70 -168 -150 4 -111 -316 225 -206
4891 -206 -123 97 -374 -242 27 -12 -91 -64 -24 -363 -45 167 -147 -111 92 208 -156 279 112 -254 44 86
4913 86 -213 -186 480 -143 -259 205 -140 -87 225 20 -224 250 56 -419 -235 136 -193 28 176 90 -173
4934 -173 127 248 -84 376 229 -281 353 232 -26 88 193 -101 -11 190 -2 -192 296 235 -240 162 313
4955 313 -110 71 250 -6 -57 220 -134 -8 382 142 -353 135 112 -280 25 414 -236 107 150 -114 -262
4976 -262 274 -142 -260 137 41 -295 187 -9 -304 -68 -113 -130 -152 291 -347 -157 24 21 -388 13 -41 -355
4998 -355 -19 -61 -363 -215 86 -293 -130 129 -215 -387 278 78 -321 221 52 -398 -48 -71 -52 -62 411
5019 411 -80 -69 131 -178 -101 180 135 -392 -290 128 -248 206 129 33 -270 123 -37 -277 -51 290 -397 -138
5041 -138 183 -79 80 244 -53 234 207 78 -159 408 243 -173 239 353 -64 239 255 -196 296 69 35
5062 35 -116 33 53 -131 211 167 -164 29 94 -36 130 170 -49 133 93 35 -73 265 126 18 44 185 -335
5085 -335 100 212 2 97 188 -157 -108 294 -78 -382 256 312 -384 174 231 -40 41 302 -89 -213 54 -91
5107 -91 -356 19 56 -328 -85 66 -244 -85 193 -362 -191 244 -81 -208 363 -72 -322 162 275 -170 12
5128 12 490 -302 -66 285 -257 -319 194 -59 -424 -42 -71 -165 48 75 -211 -34 78 -36 -97 96 -38 -156
5150 -156 -17 -67 -358 -5 -145 -182 42 137 -163 46 219 -28 -200 229 47 -207 83 248 -267 -1 233
5171 233 -189 -2 166 -9 -265 189 68 -136 218 401 -194 62 122 -213 -12 381 -45 192 189 122 -81
5192 -81 13 43 -69 237 75 -35 435 59 -176 -58 374 123 119 277 90 -142 41 264 -115 255 145 -39
5214 -39 93 162 110 -251 155 39 -201 229 -21 -238 144 -15 -271 -39 20 -103 -62 199 -60 -353 -26 -60
5236 -60 -234 -139 10 -29 41 203 -66 -239 126 -212 -398 181 -225 -86 -157 204 -170 216 18 -330 -15 189
5258 189 -209 -78 104 24 -186 159 -36 -407 196 27 -408 28 220 -86 -42 204 -40 49 283 5 44
5279 44 75 33 -212 96 209 -227 32 49 -164 216 472 290 -60 359 149 -84 322 150 -313 92 190 -88
5301 -88 -182 25 -9 -284 -49 176 -153 353 188 -207 200 62 -42 43 161 23 223 311 -84 -389 70 220
5323 220 -13 249 294 -427 -4 194 -261 -134 275 59 -366 397 256 -266 133 37 -213 64 54 -13 -26 206
5345 206 -109 -236 151 -97 12 -112 214 5 99 149 -31 31 106 -33 -200 150 -152 -275 27 -8 -421 128
5367 128 183 -38 -55 221 -179 13 228 -288 -176 -34 -13 -203 67 55 57 -14 82 -502 56 44 -299 -210 289
5390 289 -120 -149 102 -135 -260 207 61 -110 53 53 -50 -71 496 -68 -59 51 -110 -193 114 30 -77 181 132
5413 132 166 -127 275 -113 77 192 229 14 470 154 -185 74 170 -167 262 306 -129 98 292 3 -101
5434 -101 405 83 -89 73 51 -69 96 62 -24 -53 32 -118 -101 385 -138 -208 122 -130 -150 237 103 -33 -20
5457 -20 -49 -30 -149 298 -158 -81 -152 114 -179 242 -46 -332 45 105 -246 -140 251 96 -254 368 -119 -224
5479 -224 67 280 -125 98 50 -309 23 232 -148 -132 -5 -41 -160 189 -70 -365 43 -47 -55 21 -94 -141 -50
5502 -50 115 -352 -65 84 -45 -469 66 150 -227 59 171 -421 131 257 -233 44 183 -92 18 -18 60
5523 60 -314 65 315 -304 43 209 -150 55 412 -278 90 238 67 -178 139 194 -232 122 292 -278 -1
5544 -1 351 -120 88 328 67 -39 208 154 -196 170 140 -395 142 307 -44 -14 120 -113 -133 292 14 -46
5566 -46 180 217 -408 -88 125 -163 -169 263 92 -227 265 148 -161 365 103 -236 129 -103 -208 -56 273
5587 273 -331 54 152 -90 -94 291 -35 -225 36 87 -284 99 251 -30 43 121 63 -235 -123 30 -284 135
5609 135 213 -311 50 -129 -253 29 87 -154 -175 -73 73 -238 49 177 -136 -137 243 -275 -117 507 -183 13
5631 13 11 -25 -471 -28 62 -212 45 151 -23 46 102 -151 -31 162 -134 -135 222 1 -235 104 233 -87 89
5654 89 164 -200 99 170 -29 -184 157 -79 -71 -5 65 101 150 47 -70 66 85 -175 114 21 53 34 338 94
5678 94 -77 12 157 -173 -40 114 -144 -231 213 -152 -97 78 -234 -11 320 256 -284 119 145 116 -162 295
5700 295 -23 -68 304 -21 220 200 -180 62 167 -102 -357 -37 -34 -102 -194 280 -97 127 273 -37 -59 255
5722 255 -113 -176 -153 319 -158 -26 50 -67 -58 111 -184 -273 127 146 -368 215 138 -272 95 204 -11 -202 330
5745 330 -181 -264 286 148 -28 215 -159 -354 -7 263 -380 111 240 19 10 283 92 -176 -111 -50 -68 324
5767 324 285 -98 286 180 -242 -28 -50 9 -146 344 186 -34 -71 210 -29 43 307 61 6 389 156 94
5789 94 397 -130 87 389 308 -223 175 393 -246 135 268 21 1 229 148 -154 -47 12 -496 66 397 -1
5811 -1 522 133 42 132 370 -158 -207 174 -97 72 242 26 -364 93 39 -17 12 187 -170 73 98 -196 -177
5834 -177 244 42 -130 110 156 -261 35 142 -299 -92 292 6 -202 20 131 -140 17 153 -218 -139 309
5855 309 -118 1 165 -155 235 109 -200 -201 -36 -125 -271 107 159 -376 -53 61 -141 9 205 -158 -170 215
5877 215 -117 -283 -146 236 -365 143 184 54 -224 62 -144 -120 170 41 -166 83 4 -87 -4 190 -230 -176
5899 -176 175 -140 8 206 155 -50 271 0 -192 -44 74 -25 194 272 -86 49 404 -64 -4 377 -156
5920 -156 -108 85 298 -126 150 253 -292 281 246 -153 -227 199 -52 99 115 81 -148 85 165 95 110 279 -87
5943 -87 -84 186 4 -106 282 205 -107 107 -209 -166 -16 176 80 -170 159 -381 57 -13 -49 -213 93 22 -348
5966 -348 57 311 -257 -23 156 64 -112 -6 -213 -86 273 -51 -210 3 19 -306 -202 191 -363 -124 81
5987 81 -321 -187 0 3 -241 146 118 -337 -54 69 -130 -208 -101 33 -5 -111 -207 -267 139 -186 -372 -32 155
6010 155 -196 13 255 -144 -36 220 43 -136 182 -60 -20 382 -157 -286 -67 41 -352 -246 35 17 -65
6031 -65 166 80 -5 123 308 -71 -182 49 -249 -168 223 -318 126 81 76 -114 209 259 -93 -55 359 -147 1
6054 1 417 -194 53 162 -68 -133 85 -2 -116 122 4 -275 26 270 -2 43 147 -173 -1 -151 -75 -248
6076 -248 254 20 -203 267 6 -130 181 308 -129 -32 265 -54 93 17 -127 -142 316 -225 -39 20 233
6097 233 -415 10 82 -298 -286 136 -96 -136 263 138 -30 -145 196 -419 -154 331 -426 -94 189 -149 -62
6118 -62 -53 68 -427 105 185 -250 112 -37 -142 64 169 -1 -69 181 69 -219 328 53 -314 108 209 -112
6140 -112 103 315 -316 -215 114 -314 -213 293 187 -93 287 102 -296 11 343 -46 58 200 -283 84
6160 84 312 163 0 272 36 -8 39 -5 -35 137 91 -113 -80 195 74 -192 73 61 -122 197 90 -102 14
6183 14 195 -44 -14 225 14 -132 205 121 -188 227 162 -79 51 0 -286 68 143 -58 -153 101 -241 -111
6205 -111 133 -9 -215 40 128 -43 -4 299 -32 -122 72 -50 -168 -64 37 -100 -92 4 23 -92 278 -260
6227 -260 -192 303 -127 154 201 -95 -173 34 -337 -158 -179 182 21 -80 -9 -1 48 226 49 -127 47 -23 -166
6250 -166 -58 261 -240 -129 232 -87 -36 84 -134 129 345 14 -86 338 153 -31 210 68 -3 -196 190
6271 190 -100 -194 136 -78 -114 265 87 -337 306 57 -260 154 139 -215 121 275 -14 61 42 -9 25 235
6293 235 415 -338 -2 179 -41 47 273 -100 -81 98 56 -66 151 233 -268 151 27 -216 85 259 110
6314 110 -260 202 88 -280 270 136 -129 162 62 -93 184 34 -14 291 58 -370 -166 62 17 -149 -156
6335 -156 -260 -329 10 -2 -285 -297 128 -229 -431 85 -68 141 146 120 -242 -15 -32 -78 82 122 -405 -72 59
6358 59 -72 -125 97 162 -321 -185 -41 -78 16 77 -212 -333 -37 51 85 240 117 -81 -9 -184 -194 84 75 -166
6382 -166 82 387 -266 182 404 -59 108 148 -63 -375 139 -148 -149 17 170 150 176 109 124 -168 305 114
6404 114 -21 210 -13 -207 104 -102 -337 80 538 -118 192 172 -87 -157 145 239 -372 26 182 -286 160
6425 160 203 -15 58 186 71 -20 43 153 -268 100 10 -228 -31 188 -30 34 115 99 191 218 -215 -300 146 22
6449 22 -189 101 138 -401 152 185 -263 43 301 95 -111 -10 98 -397 143 -119 -89 -67 199 -359 -107 263
6471 263 -138 -67 -124 -66 -259 186 120 -331 186 110 -124 80 74 16 22 -46 -131 -192 267 340 -150 123 177 -393 -35
6496 -35 38 94 23 -112 -60 -170 96 78 -85 214 -73 -184 -282 231 -230 171 93 -125 -271 -4 -8 24 244 94
6520 94 -79 26 278 -145 -41 -54 -128 -144 143 65 -161 -34 70 1 -39 -183 -326 -78 83 -499 -78 170
6542 170 -40 10 404 253 63 254 79 -403 68 98 -108 -53 531 16 -27 206 -64 -111 189 119 4 110
6564 110 61 -220 -140 86 -165 -73 52 -50 -62 88 166 -168 83 383 -172 171 294 -87 -24 72 -169 -212 240
6587 240 -32 -190 135 -188 -293 86 -43 -188 -149 290 -219 -61 172 -15 -132 229 -106 -278 77 226
6607 226 -326 117 1 -170 8 17 -275 -208 49 167 -11 -20 -173 -233 -62 45 -21 -29 144 -279 -172 -89 -183 -29
6631 -29 23 -151 -271 -111 289 -212 -31 -69 -234 -158 425 32 -51 152 103 -335 62 133 -249 38 175 30
6653 30 93 45 -130 -40 156 165 -146 93 -244 -102 12 155 -76 156 376 -249 54 45 -9 56 216 164 -90 279
6677 279 228 -213 -71 -37 7 82 298 24 4 -27 11 -80 -30 61 -16 40 327 -30 -28 370 -103 -138 315 236 -194
6702 -194 116 237 -261 41 89 -111 -59 68 -558 -63 -33 -177 -59 -1 -147 -163 106 -17 29 -185 263 -151
6724 -151 82 255 -207 -274 72 88 -281 300 -24 -431 197 69 -171 29 85 -39 19 67 -299 -323 96 9
6746 9 -145 168 -89 27 -38 -104 -378 -40 288 -30 -97 -82 64 -61 14 22 -113 134 87 -97 85 207 -220
6769 -220 -134 207 -190 75 279 -15 -231 43 170 73 97 10 -270 -72 160 -143 78 336 52 -152 -20
6790 -20 -13 -261 103 211 -75 5 67 -136 -147 276 198 252 69 203 -86 172 422 -304 212 415 -3 104 174
6813 174 -147 43 -8 258 -117 172 -21 -183 11 174 -198 -220 302 -72 -146 160 102 -281 88 220 -84
6834 -84 29 -10 -181 113 44 -145 -146 229 -254 108 237 34 77 -4 152 -148 -122 173 -172 -53 321 29 -149
6857 -149 -88 -71 -255 -173 -12 -282 163 19 -39 -252 135 -379 4 164 -121 -244 97 261 -233 195 52
6878 52 -52 -34 150 153 -193 37 74 212 255 -42 -200 13 203 -188 122 225 -164 -181 171 -152 73 269
6900 269 -24 196 110 156 -11 200 39 57 184 123 -49 -6 181 -72 207 53 -107 6 -78 62 -270 197
6922 197 139 -19 -24 288 -29 166 166 98 -138 -66 166 -382 100 262 -252 -115 163 -66 -121 -125 -68 96 87 -259
6946 -259 -84 46 111 -123 45 191 -147 -36 115 -176 -251 -116 143 -339 21 97 -77 -30 70 -82 -116 179
6968 179 62 -11 70 -152 -329 40 -103 -327 -133 -105 -232 -124 228 -236 -307 197 -22 -172 -93 -141 -248 63
6990 63 27 -232 -29 -104 161 119 250 -125 -193 275 -183 -26 -96 76 -39 216 -22 -134 13 320 115 -212
7012 -212 32 -15 4 94 43 -137 220 -69 -291 136 326 -57 -104 138 -78 41 84 -40 -89 -51 74 -331 198
7035 198 146 -193 37 266 -38 -67 119 218 261 321 79 -256 252 245 -17 329 53 -267 -270 93 -115 -112 239 -42
7059 -42 -281 205 55 -188 -55 22 -256 -184 15 -176 40 288 -2 -143 -107 0 22 60 26 -267 -53 241
7081 241 1 -80 178 23 -314 173 -106 -183 37 -57 -142 -11 317 -286 -169 -99 -9 -313 200 -52 -194 112
7103 112 72 -322 80 113 -354 -37 101 -128 -373 35 -112 -300 128 -93 -170 121 180 -83 66 105 -116 57
7125 57 109 -184 -50 6 210 32 99 53 -207 -53 -82 -57 -4 70 -144 138 167 -56 -128 -236 107 -86 153 359
7149 359 -196 -189 182 -96 -129 296 -79 -99 65 177 -252 238 326 14 29 135 -50 17 444 -196 110 238
7171 238 -80 35 218 -166 -174 230 172 -150 -216 254 -47 -53 249 -105 -185 35 -42 -307 139 139 -127 193 119 -225
7195 -225 67 -7 -32 43 114 59 -97 76 -374 -43 81 -24 -118 87 169 -24 -244 201 -193 -503 79 -18 -260
7218 -260 19 -35 -59 3 437 -51 189 255 18 -14 204 -108 -119 -16 -11 -200 -161 138 -80 -233 50 -97 -66
7241 -66 182 130 -372 243 48 -464 -26 -25 -244 13 94 -304 -82 121 -86 -25 -94 32 -212 84 259 61
7263 61 -202 206 -342 -72 286 26 -295 -212 102 -157 171 107 -175 86 396 -354 -78 11 -96 -202 237
7284 237 49 -71 32 -80 -27 200 155 -179 -24 217 -140 171 100 65 -20 299 -163 -277 148 231 -126 122
7306 122 223 -34 70 266 50 -66 244 57 -48 51 38 -118 -17 58 -315 59 251 -15 -52 -109 49 -136
7328 -136 190 -68 52 -76 219 241 -104 44 -131 1 170 -332 24 -17 34 39 -127 106 -163 197 151 -111
7350 -111 -67 88 -208 -443 161 21 -37 31 -21 -123 166 -14 -43 -37 90 -144 -306 244 74 -104 77 245
7372 245 -307 1 -154 -225 36 225 -150 -126 233 1 -20 -13 -207 -11 -21 186 -309 122 43 -214 261 99
7394 99 -26 -129 44 110 12 359 15 -56 359 135 -107 -146 259 -148 71 93 -76 -148 219 -131 81 46 71
7417 71 -99 348 231 -295 129 132 -59 -167 13 -114 -285 -26 -75 -131 32 200 -185 87 159 -186 -121 224
7439 224 20 -190 118 -100 1 -52 -155 -283 125 -161 -28 -125 11 -2 -160 221 23 -176 139 -73 -332
7460 -332 -31 28 -177 -76 104 -120 -104 -37 115 -231 393 43 -154 175 122 -234 66 385 -43 -137 152 84
7482 84 70 99 -303 -439 155 139 -235 115 125 -17 -421 113 -145 -104 -114 67 -280 206 285 -1 126 211 -97
7505 -97 -102 163 50 -53 210 -26 -51 423 10 -93 295 -38 161 -4 170 -184 84 496 72 -270 154
7526 154 123 -371 180 2 -18 -34 185 -105 -81 251 -127 75 67 -313 -252 113 191 -44 215 81 -397 -3 252
7549 252 10 120 147 160 -102 102 -29 -77 241 186 161 13 37 129 50 74 -91 -172 373 35 -220 361 80
7572 80 -239 -142 -45 -158 203 294 -190 144 39 6 -372 -99 70 -262 -158 -38 -115 313 -8 -177 -49 86
7594 86 -120 -109 84 -159 -87 -17 126 -204 265 158 -194 -142 120 -193 -458 34 -316 -110 14 27 -208 -222
7616 -222 -20 -22 176 81 -153 -63 171 -160 -73 90 -108 -104 9 -174 -13 -102 54 -154 265 104 -81 -213 86
7639 86 -32 -1 112 247 -167 62 170 190 298 350 -3 -11 155 -92 -16 94 82 -205 -48 32 -40 58 10 211
7663 211 -16 -48 -123 4 263 257 -330 204 -17 -186 84 48 -185 -88 284 -271 143 148 69 -208 246 -86 -234
7686 -234 246 166 -324 -110 8 -96 120 203 11 -102 91 -187 -226 25 236 -107 11 112 -24 91 65
7707 65 -150 -245 -94 30 -300 333 -108 42 141 -30 -239 -313 167 -140 161 43 -152 -224 8 -86 -182 -39
7729 -39 -124 -27 18 238 -256 126 77 90 -56 191 -200 -53 -89 -190 -346 120 192 -239 6 132 -256 -315 181
7752 181 -177 -149 199 37 -337 153 142 -87 110 119 -102 155 27 72 157 244 17 145 80 247 -75 50 315
7775 315 -171 114 144 3 17 394 -20 -170 245 81 -50 184 388 59 48 -10 29 36 264 -52 14 213 64
7798 64 -165 53 168 -254 197 162 -227 -214 88 -74 -29 130 61 -347 146 134 -269 -118 41 -146 -145 215 -197
7821 -197 -138 -59 -244 -172 388 -78 -162 66 -87 -17 -22 190 -13 -68 188 104 -49 74 -365 -411 158 61 -416 32
7845 32 137 -85 27 19 -95 -97 86 -131 -257 137 104 -279 43 -19 -266 -72 152 -3 -195 -127 23 -152 -31
7868 -31 145 177 60 -51 77 -31 15 -202 95 168 55 -96 224 -80 -119 9 -39 -98 67 274 -84 191
7890 191 195 33 43 109 93 -28 -13 48 -166 -157 98 -139 92 182 -219 -33 21 40 45 98 163 -174 77 91 -351 284
7916 284 -21 67 -169 252 -266 40 283 157 -216 183 264 -18 -32 155 -302 -64 103 -150 2 -14 -99 -185
7938 -185 68 -38 -129 258 113 -125 -245 88 -53 -117 287 -177 50 -25 60 -49 -120 61 43 158 236 -147
7960 -147 118 197 -176 -84 -1 8 -190 2 77 60 -321 105 -219 -109 28 -231 15 -49 -232 -110 -47 -238 4
7983 4 276 20 113 77 -169 -58 -30 -39 -72 47 300 -261 -507 -76 75 -37 242 232 -259 -100 154 -77 -50
8006 -50 80 -358 51 -60 -54 -35 35 90 -60 -155 190 321 4 16 -164 -40 37 86 -184 186 40 18 145 360
8030 360 47 97 340 68 86 313 -73 123 83 101 90 273 93 -56 -15 130 -130 29 269 107 -89 200
8052 200 41 15 213 -73 -158 -191 228 -291 -134 -141 -107 -18 321 -220 -125 86 58 32 141 67 -94 61 -85 126
8076 126 -280 2 210 -170 -115 68 -69 -6 14 -206 -133 -71 -294 -30 156 51 -311 222 77 -171 147 22
8098 22 -193 -103 -96 -241 236 191 -101 33 199 -38 -207 -80 0 -123 234 33 -128 56 59 -97 -58 -99 -35 24
8122 24 -15 -98 -168 67 -40 -189 -41 102 -132 -60 279 330 -199 244 -154 -342 84 104 -97 -129 250 -347 120
8145 120 106 -240 -167 -110 31 -144 198 45 -59 192 -87 -39 15 32 -207 2 226 -19 28 241 -170 -11
8167 -11 118 155 -76 -88 131 -26 179 -43 -179 -86 253 56 -80 103 -77 -120 -51 123 -214 22 110 -113
8189 -113 -42 187
8191A87
##END NTUPLES=NMR FID
##END=
