##TITLE=1H_2-2022
 CDCl3
 8 sc, 
 13.1.2022
##JCAMPDX= 6.0         $$ Bruker NMR JCAMP-DX V2.0
##DATA TYPE= NMR FID
##DATA CLASS= NTUPLES
##ORIGIN= UXNMR, Bruker Analytische Messtechnik GmbH
##OWNER= root
$$ XWIN-NMR		Version 3.5
$$ Thu Jan 13 11:07:22 2022 Russian Standard Time (UT+4h)  she@DPX200
##.OBSERVE FREQUENCY= 200.131346
##.OBSERVE NUCLEUS= ^1H
##.DELAY= (6, 6)
##.ACQUISITION MODE= SIMULTANEOUS
##.ACQUISITION SCHEME= undefined
##.AVERAGES= 8
##.DIGITISER RES= 18
##SPECTROMETER/DATA SYSTEM= spect
##.PULSE SEQUENCE= zg30
##.SOLVENT NAME= D2O
##.SHIFT REFERENCE= (INTERNAL, D2O, 0, 15.7039)
##AUDIT TRAIL= $$ (NUMBER, WHEN, WHO, WHERE, WHAT)
$$ ##TITLE= Audit trail, XWIN-NMR		Version 3.5
$$ ##JCAMPDX= 5.01
$$ ##ORIGIN= Bruker BioSpin GmbH
$$ ##OWNER= she
$$ F:/spectra/data/she/nmr/H-F/1/audita.txt
$$ ##AUDIT TRAIL=  $$ (NUMBER, WHEN, WHO, WHERE, WHAT)
(   1,<2022-01-13 11:05:59.18 +0400>,<she>,<DPX200>,
      <created by zg, POWCHK disabled, PULCHK disabled
       configuration hash MD5:
       00 E9 B6 7A A2 85 ED C7 34 08 36 98 17 FE 4E 26
       data hash MD5: 16K
       97 DC 0D 18 80 51 67 6D 58 0F E1 8D 28 0C 05 6A>)
$$ ##END=
$$ 
$$ hash MD5
$$ 0F 7C 25 04 68 1B 28 60 BF 5E 4C C0 CC C9 23 A1
##$RELAX= 
##$RELAX= 
##$RELAX= 
##$RELAX= 
##$RELAX= 
##$RELAX= 
$$ Bruker specific parameters
$$ --------------------------
##$DU= <F:/spectra>
##$EXPNO= 1
##$NAME= <H-F>
##$PROCNO= 1
##$TYPE= <nmr>
##$USER= <she>
##$AMP= (0..31)
100 100 100 100 100 100 100 100 100 100 100 100 100 100 100 100 100 100 
100 100 100 100 100 100 100 100 100 100 100 100 100 100 
##$AQSEQ= 0
##$AQ_mod= 1
##$AUNM= <au_zg>
##$AUTOPOS= <>
##$BF1= 200.13
##$BF2= 200.13
##$BF3= 200.13
##$BF4= 200.13
##$BF5= 200.13
##$BF6= 200.13
##$BF7= 200.13
##$BF8= 200.13
##$BYTORDA= 1
##$CFDGTYP= 0
##$CFRGTYP= 5
##$CHEMSTR= <none>
##$CNST= (0..31)
1 1 145 1 1 1 1 1 1 1 1 1 1 1 1 1 1 1 1 1 1 1 1 1 1 1 1 1 1 1 1 1 
##$CPDPRG= <>
##$CPDPRG1= <>
##$CPDPRG2= <>
##$CPDPRG3= <>
##$CPDPRG4= <mlev>
##$CPDPRG5= <mlev>
##$CPDPRG6= <mlev>
##$CPDPRG7= <mlev>
##$CPDPRG8= <mlev>
##$CPDPRGB= <>
##$CPDPRGT= <>
##$D= (0..31)
0 1.2 0 0 0 0 0 0 0 0.06 0 0.03 0 0 0 0 0.0002 0 0 0 0 0 0 0 0 0 0 0 0 
0 0 0 
##$DATE= 1642057558
##$DBL= (0..7)
120 120 120 120 120 120 120 120 
##$DBP= (0..7)
150 150 150 150 150 150 150 150 
##$DBP07= 0
##$DBPNAM0= <>
##$DBPNAM1= <>
##$DBPNAM2= <>
##$DBPNAM3= <>
##$DBPNAM4= <>
##$DBPNAM5= <>
##$DBPNAM6= <>
##$DBPNAM7= <>
##$DBPOAL= (0..7)
0.5 0.5 0.5 0.5 0.5 0.5 0.5 0.5 
##$DBPOFFS= (0..7)
0 0 0 0 0 0 0 0 
##$DE= 6
##$DECBNUC= <off>
##$DECIM= 32
##$DECNUC= <off>
##$DECSTAT= 4
##$DIGMOD= 1
##$DIGTYP= 9
##$DL= (0..7)
0 120 120 120 120 120 120 120 
##$DP= (0..7)
150 150 150 150 150 150 150 150 
##$DP07= 0
##$DPNAME0= <>
##$DPNAME1= <>
##$DPNAME2= <>
##$DPNAME3= <>
##$DPNAME4= <>
##$DPNAME5= <>
##$DPNAME6= <>
##$DPNAME7= <>
##$DPOAL= (0..7)
0.5 0.5 0.5 0.5 0.5 0.5 0.5 0.5 
##$DPOFFS= (0..7)
0 0 0 0 0 0 0 0 
##$DQDMODE= 0
##$DR= 18
##$DS= 0
##$DSLIST= <SSSSSSSSSSSSSSS>
##$DSPFIRM= 0
$$ [...]
##$SUBNAM2= <"">
##$SUBNAM3= <"">
##$SUBNAM4= <"">
##$SUBNAM5= <"">
##$SUBNAM6= <"">
##$SUBNAM7= <"">
##$SUBNAM8= <"">
##$SUBNAM9= <"">
##$SW= 18.0517287032376
##$SWIBOX= (0..15)
0 0 2 0 0 0 0 0 0 0 0 0 0 0 0 0 
##$SW_h= 3612.71676300578
##$TD= 16384
##$TD0= 1
##$TE= 0
##$TE2= 300
##$TE3= 300
##$TEG= 300
##$TL= (0..7)
0 120 120 120 120 120 120 120 
##$TP= (0..7)
150 150 150 150 150 150 150 150 
##$TP07= 0
##$TPNAME0= <>
##$TPNAME1= <>
##$TPNAME2= <>
##$TPNAME3= <>
##$TPNAME4= <>
##$TPNAME5= <>
##$TPNAME6= <>
##$TPNAME7= <>
##$TPOAL= (0..7)
0.5 0.5 0.5 0.5 0.5 0.5 0.5 0.5 
##$TPOFFS= (0..7)
0 0 0 0 0 0 0 0 
##$TUNHIN= 0
##$TUNHOUT= 0
##$TUNXOUT= 0
##$USERA1= <user>
##$USERA2= <user>
##$USERA3= <user>
##$USERA4= <user>
##$USERA5= <user>
##$V9= 5
##$VALIST= <valist>
##$VCLIST= <CCCCCCCCCCCCCCC>
##$VD= 0
##$VDLIST= <DDDDDDDDDDDDDDD>
##$VPLIST= <PPPPPPPPPPPPPPP>
##$VTLIST= <TTTTTTTTTTTTTTT>
##$WBST= 1024
##$WBSW= 4
##$XGAIN= (0..3)
0 0 0 0 
##$XL= 0
##$YL= 0
##$YMAX_a= 466736
##$YMIN_a= -435224
##$ZGOPTNS= <>
##$ZL1= 120
##$ZL2= 120
##$ZL3= 120
##$ZL4= 120
##$ABSF1= 10
##$ABSF2= 0
##$ABSG= 5
##$ABSL= 3
##$ALPHA= 0
##$AQORDER= 0
##$ASSFAC= 0
##$ASSFACI= 0
##$ASSFACX= 0
##$ASSWID= 0
##$AUNMP= <proc_1d>
##$AZFE= 0.1
##$AZFW= 0.1
##$BCFW= 1
##$BC_mod= 2
##$BYTORDP= 1
##$COROFFS= 0
##$CY= 11.3945322036743
##$DATMOD= 1
##$DC= 2
##$DFILT= <>
##$DTYPP= 0
##$F1P= 2.36226072786647
##$F2P= -0.459571619588291
##$FCOR= 0.5
##$FTSIZE= 0
##$FT_mod= 4
##$GAMMA= 1
##$GB= 0.15
##$INTBC= 1
##$INTSCL= 1
##$ISEN= 128
##$LB= 0.24
##$LEV0= 0
##$LPBIN= 0
##$MAXI= 10000
##$MC2= 0
##$MEAN= 0
##$ME_mod= 0
##$MI= 1.114404
##$NCOEF= 0
##$NC_proc= 0
##$NLEV= 6
##$NOISF1= 3.799351
##$NOISF2= 2.8
##$NSP= 1
##$NTH_PI= 0
##$NZP= 0
##$OFFSET= 15.70392
##$PC= 1
##$PHC0= -15864.39
##$PHC1= 9.40079
##$PH_mod= 1
##$PKNL= yes
##$PPARMOD= 0
##$PSCAL= 0
##$PSIGN= 0
##$REVERSE= no
##$SF= 200.130013532006
##$SI= 16384
##$SIGF1= 3
##$SIGF2= 2
##$SINO= 400
##$SIOLD= 16384
##$SREGLST= <1H.CDCl3>
##$SSB= 0
##$STSI= 0
##$STSR= 0
##$SW_p= 3612.71676300578
##$SYMM= 0
##$S_DEV= 0
##$TDeff= 0
##$TDoff= 0
##$TI= <>
##$TILT= no
##$TM1= 0
##$TM2= 0
##$TOPLEV= 0
##$USERP1= <user>
##$USERP2= <user>
##$USERP3= <user>
##$USERP4= <user>
##$USERP5= <user>
##$WDW= 1
##$XDIM= 8192
##$YMAX_p= 0
##$YMIN_p= 0
$$ End of Bruker specific parameters
$$ ---------------------------------
##NTUPLES= NMR FID
##VAR_NAME=  TIME,          FID/REAL,        FID/IMAG
##SYMBOL=    X,             R,               I
##VAR_TYPE=  INDEPENDENT,   DEPENDENT,       DEPENDENT
##VAR_FORM=  AFFN,          ASDF,            ASDF
##VAR_DIM=   8192,          8192,            8192
##UNITS=     SECONDS,       ARBITRARY UNITS, ARBITRARY UNITS
##FACTOR=    0.0002768,     1,               1
##FIRST=     0,             0,               0
##LAST=      2.2672688,     0,               0
##MIN=       0,             -435224,         0
##MAX=       2.2672688,     466736,          0
$$ Real data points
##PAGE= N=1
##DATA TABLE= (X++(R..R)), XYDATA
$$ plain form
0 0 0 0 0 0 0 0 0 0 -8 8 -8 8 -16 16 -24 25 -33 43 -56 64 -78 90 -110 129 -152 177 -207 239 -274 315 -359
31 -359 411 -465 529 -595 673 -755 846 -946 1055 -1175 1307 -1449 1606 -1774 1962 -2165
47 -2165 2389 -2631 2897 -3191 3518 -3876 4276 -4724 5227 -5801 6457 -7220 8116 -9190
61 -9190 10501 -12146 14278 -17164 21308 -27788 39422 -66769 267488 1758 -268554 449368
73 449368 73221 -289552 212822 320548 -214655 -22632 246148 -155375 -248620 227544
83 227544 121048 -129745 105131 168545 -99582 -85885 57563 25844 -44491 86207 90555
94 90555 -140987 -68575 122374 -123008 -138246 229896 95092 -235152 10150 123452 -263718
105 -263718 -179944 206019 -90072 -263107 161743 -5302 -380412 35933 202467 -180330
$$ packed form
0@%%%%%%%%qJ6j6J6k4L2m0M9n8P6r9J20j42J68k00K39k81L29l84M46n13N89o74
31c59P70q76R94j124J268j428J601j792K001k230K482k756L055l380L736m127
47b165M554n020N528o088O709p394Q152r000R951j1028J2258j3677J5336j7306
61i190J9691k2647K6424l1442L8472m9096O7210j06191L34257k65730k70312P17922
73D49368l76147l62773N02374J07726n35203J92023K68780m01523r3245M76164
83B27544j06496k50793K34876O3414k68127J3697J43448l1719p0335J30698M348
94I0555k31542P2412J90949k45382j5238L68142j34804l30244K45302J13302l87170
105b63718Q3774L85963k96091j73035M24850j67045l75110M16345J66534l82797
$$ plain form
115 -180330 -31031 257376 -19578 -167050 63691 34272 -103663 53010 69843 -98749
125 -98749 -21109 7687 -126708 -41243 73108 30191 20817 27077 13462 -13333 -31352 28939
137 28939 33546 4438 76401 37485 -93955 -15915 98610 -13828 -51265 147091 109565
148 109565 -124924 -11853 87723 -117869 -44050 120627 -61550 -81779 73273 -56231
158 -56231 -132510 57459 82261 -36683 41842 94698 -43819 -23880 56579 -45470 -1411
169 -1411 108488 -30455 -79511 33433 -8933 -75257 -4560 65281 34419 -20156 7016 14553
181 14553 -35531 -3381 43517 9385 -4224 38103 21289 -69486 -21655 99345 7313 -38729
193 -38729 101808 41985 -69768 22210 19221 -48497 31774 42358 -60256 -31410 39242 -50126
$$ packed form
115a80330J49299K88407k76954j47472K30741k9419j37935J56673J6833j68592
125i8749P7640K8796j34395Q5465J14351m2917r374O260j3615k6795j8019O0291
137B8939M607k9108P1963l8916j31440P8040J14525j12438l7437J98356l7526
148A09565k34489J13071R9576k05592P3819J64677j82177k0229J55052j29504
158e6231p6279J89969K4802j18944P8525N2856j38517J9939Q0459j02049M4059
169a411J09899j38943m9056J12944m2366o6324P0697O9841l0862n4575K7172P537
181A4553n0084L2150M6898l4132j3609M2327j6814r0775M7831J21000r2032m6042
193c8729J40537n9823j11753R1978k989o7718Q0271J0584j02614K8846P0652q9368
$$ plain form
205 -50126 -76444 60756 38547 -48034 35405 21403 -63152 11273 22206 -49002 1418 40231
217 40231 -28190 -65975 -12928 13160 -35552 -20796 32479 5633 -16473 -10894 -17646 -7917 520
230 520 10427 -1996 -25372 19422 5628 -62691 8399 54808 -17517 -1834 38424 -5249 -13252
243 -13252 19278 -1799 -20482 37790 31665 -58325 -6898 54383 -36710 -26265 54301 8325
255 8325 -7833 27001 -3325 -16032 22179 23887 -19937 -6605 42056 -6909 -44879 12703
267 12703 15369 -12346 2624 3331 2585 -371 -7747 -2798 -13807 7475 23902 -29709 -18788 31191
281 31191 -9010 -32223 9184 21447 -4598 -9576 12960 -3121 -10164 27569 -6484 -26538
293 -26538 41228 15019 -41710 7334 26457 -9802 -10638 8219 6444 -7310 4609 -839 -23389
$$ packed form
205e0126k6318J37200k2209q6581Q3439j4002q4555P4425J0933p1208N0420L8813
217D0231o8421l7785N3047K6088m8712J4756N3275k6846k2106N579o752R729Q437
230E20R907j2423k3376M4794j3794o8319P1090M6409p2325J5683M0258m3673q003
243a3252L2530k1077j8683N8272o125q9990N1427O1281r1093J0445Q0566m5976
255H325j6158L4834l0326j2707L8211J708m3824J3332M8661m8965l7970N7582
267A2703K666k7715J4970P07p46k956p376M949j1009K1282J6427n3611J0921M9979
281C1191m0201k3213M1407J2263k6045m978K2536j6081p043L7733l4053k0054
293b6538O7766k6209n6729M9044J9123l6259q36J8857j775j3754J1919n448k2550
$$ plain form
306 -23389 15993 21178 -31160 -4640 25378 -5674 -15066 -5058 8300 4725 -15448 -2441 -859
319 -859 -8040 9916 -9761 -18029 18559 10214 -16118 -8808 12640 12562 -20334 -9728 16733 -11096
333 -11096 -7203 5729 -19819 4044 20635 -15588 -8644 21754 15726 -8947 -5254 23431 7159
346 7159 -10373 10781 -649 58 20534 -7187 -6464 25740 14222 -299 1700 15297 20480
359 20480 -8212 -7293 10717 -2255 -3843 -9943 -15824 4580 173 -11427 -6474 1266 17048 -3444
373 -3444 -21110 13913 8099 -17363 -4040 -8225 -9181 -1390 -18581 -18583 -2078 4775 -5746 -18900
387 -18900 6785 11961 -18881 -6161 2747 -7395 4161 -11050 -19077 6518 938 -9128 -254
400 -254 10793 21598 4822 -3601 13756 10064 4658 -1114 -6415 10067 -855 -19468 -6228
$$ packed form
306b3389L9382N185n2338K6520L0018l1052r392J0008J3358l575k0173J3007J582
319h59p181J7956j9677q268L6588q345k6332P310K1448p8l2896J0606K6461k7829
333a1096L893J2932k5548K3863J6591l6223O944L0398o028k4673L693K8685j6272
346G159j7532K1154j1430P07K0476k7721P23L2204j1518j4521J999J3597N183
359B0480k8692R19J8010j2972j588o100n881K0404m407j1600M953P740J5782k0492
373c444j7666L5023n814k5462J3323m185r56P791j7191kJ6505O853j0521j3154
387a8900K5685N176l0842J2720Q908j0142J1556j5211q027K5595n580j0066Q874
400b54J1047J0805j6776q423J7357l692n406n772n301J6482j0922j8613J3240
$$ plain form
413 -6228 -2182 7472 11016 -6096 14897 25590 -1409 1756 10356 9981 12663 -2182 -8461 -2085
427 -2085 -2377 -9006 -20735 2234 20894 -12782 -11234 7236 -11028 -5132 -1882 -14094 4369
440 4369 5507 -15753 -17661 -5445 9722 3595 145 22286 19556 8162 4073 -3040 15702 16892
454 16892 -6124 2412 633 -11566 -8183 -19769 -5064 24047 8231 2107 16125 13555 7632
467 7632 6709 16339 20595 17251 16992 -10957 -15986 16881 -4224 -18234 21231 17172 -6441 -7651
481 -7651 -14273 -7322 -1437 -9044 -7658 -7487 -9769 -24286 -35985 -14601 -3609 -510 7077 -9107
495 -9107 -3925 4022 -26643 -18435 8071 -2446 -9018 -21692 -32725 -20231 -26825 -31190 -6276
508 -6276 12151 4634 -13409 -4382 4791 -8113 12946 24592 4253 22227 16274 -24968 -7212
$$ packed form
413f228M046R654L544j7112K0993J0693k6999L165Q600l75K682j4845o279O376
427b085k92o629j1729K2969J8660l3676J548J8470j8264N896L250j2212J8463
440D369J138k1260j908J2216J5167o127l450K2141k730j1394m089p113J8742J190
454A6892k3016Q536j779j2199L383j1586J4705K9111j5816o124J4018k570n923
467G632r23R630M256l344k59k7949n029L2867k1105j4010L9465m059k3613j210
481g651o622O951N885p607J386J71k282j4517j1699K1384J0992L099P587j6184
495i107N182P947l0665Q208K6506j0517o572j2674j1033J2494o594m365K4914
508f276J8427p517j8043R027R173j2904K1059J1646k0339J7974n953m1242J7756
$$ plain form
521 -7212 17382 10523 15244 19219 19983 14676 -1989 -3724 11811 30057 20808 391 15990 9504
535 9504 -19451 1859 16288 15982 38192 26532 6397 15468 10802 8467 14489 14139 22377 10962
549 10962 -20276 -31087 -14846 -2236 -19102 -9082 24971 -4216 -29872 -6456 -12823 -9194
561 -9194 16537 2453 -4687 250 -19219 -29496 -20072 -3755 7492 6739 -537 -15738 -11611 -5814
575 -5814 -29032 -7666 28845 -3275 -21871 -10112 -22623 -20352 -8756 -2037 19647 19188 -638
588 -638 -5197 -3174 1780 7643 18017 17209 1373 5801 -10504 -40722 -5249 20140 -3769 5859
602 5859 14503 -3379 -7539 -12362 -2084 24037 21217 5036 -175 -911 -13147 -19902 5377 13495
616 13495 6200 22136 373 -26567 2390 4636 -11235 11395 18216 3620 -10799 -24199 -14132
$$ packed form
521g212K4594o859M721L975P64n307j6665j735J5535J8246r249k0417J5599o486
535I504k8955K1310J4429l06K2210j1660k0135R071m666k335O022l50Q238j1415
549A0962l1238j0811J6241J2610j6866J0020L4053k9187k5656K3416o367L629
561i194K5731j4084p140M937j9469j0277R424J6317J1247p53p276j5201M127N797
575e814k3218K1366L6511l2120j8596J1759j2511K271J1596O719K1684m59j9826
588f38m559K023M954N863J0374q08j5836M428j6305l0218L5473K5389k3909R628
602E859Q644j7882m160m823J0278K6121k820j6181n211p36j2236o755K5279Q118
616A3495p295J5936k1763k6940K8957K246j5871K2630O821j4596j4419j3400J0067
$$ plain form
629 -14132 2083 5632 6589 14000 20086 -2650 -16054 8117 9583 9723 27561 6849 -4899 5088
643 5088 -16294 -17911 6287 12132 13545 5475 -7968 -4969 -2099 -5217 -2417 18990 26248 -8807
657 -8807 -15085 1921 -15566 -8190 13864 2822 10065 11688 -17282 -17190 -902 2364 3983 4492
671 4492 4467 -4885 -14895 -18873 -20065 4449 15449 -8290 -1086 6308 -16841 -12197 -1806 713
685 713 17112 8157 -9559 -6068 -7790 -10565 -5923 4866 13601 6877 406 -9438 -12808 8984
699 8984 4817 -5118 20190 13274 -11787 -6028 -8499 -5095 12413 6715 1407 6999 2555 -10920
713 -10920 -13657 6235 12253 2867 8223 -1681 -9539 2144 -10728 -9335 17639 9804 -3333 -1627
727 -1627 -6358 -2567 -1540 -2509 7614 10381 4882 -7622 -11745 2256 235 -1324 8650 1819 4647
$$ packed form
629a4132J6215L549R57P411O086k2736j3404K4171J466J40J7838k0712j1748R987
643E088k1382j617K4198N845J413q070j3443K999K870l118K800K1407P258l5055
657h807o278J7006j7487P376K2054j1042P243J623k8970R2J6288L266J619N09
671D492k5r352j0010l978j192K4514J1000k3739P204P394k3149M644J0391K519
685G13J6399q955j7716L491j722k775M642J0789Q735o724o471r844l370K1792
699H984m167r935K5308o916k5061N759k471L404J7508n698n308N592m444j3475
713a0920k737J9892O018r386N356r904p858J1683j2872J393K6974p835j3137J706
727a627m731L791J027r69J0123K767n499j2504m123J4001k021j559R974o831K828
$$ plain form
742 4647 2681 -18041 -3432 13019 -466 2022 7076 342 -1641 -6098 -5277 2819 9773 8431
756 8431 -5984 -824 6898 -10379 -4471 9000 1994 8914 3364 -12669 357 3944 -6629 -1681
770 -1681 5598 6474 -4349 -11746 -3708 -3608 -1562 546 -6003 3930 3083 -12574 -4889 -121 530 7912
786 7912 -3645 -3587 7953 -4308 -8950 -24 5032 6028 -761 -722 1774 -633 3932 -2593 -1353 16543
802 16543 2141 -9977 5455 809 -2888 4147 -851 3333 7837 416 -3505 -793 9544 5791
816 5791 -5269 6075 6944 -3422 -679 -5065 -177 7850 -4852 -3755 3685 -2254 205 -3972
830 -3972 -5359 6111 650 -7783 -5400 -1923 -821 -9841 -7957 2612 -4362 -3305 -1755 -9540 3635
845 3635 5565 -10628 98 6886 -1794 -3458 -3815 763 2166 -2126 -317 -1644 4429 7241 -6497
$$ packed form
742D647j966k0722J4609J6451j3485K488N054o734j983m457Q21Q096O954j342
756H431j4415N160P722j7277N908J3471p006O920n550j6033J3026L587j0573M948
770a681P279Q76j0823p397Q038J00K046K108o549R933q47j5657P685M768O51P382
786G912j1557N8J1540j2261m642Q926N056R96o789L9K496k407M565o525J240J7896
802A6543j4402j2118J5432m646l697P035m998M184M504p421l921K712J0337l753
816E791j1060J1344Q69j0366K743m386M888Q027j2702J097P440n939K459m177
830c972j387J1470n461q433K383L477J102r020J884J0569o974J057J550p785J3175
845C635J930j6193J0726O788q680j664l57M578J403m292J809j327O073K812j3738
$$ plain form
860 -6497 1083 11585 621 1587 2442 283 7726 -574 -5180 5102 3473 1649 -144 -764 7536
875 7536 3810 -1228 2038 2117 6261 -996 -8424 4468 1116 -6975 33 -4238 -859 5348 -6845
890 -6845 -4265 5779 1644 -3396 -4260 1762 1518 -7108 -3157 -3738 -4564 3760 -7294 -8276 7611 -658
906 -658 -5668 1671 1150 4430 1472 -3648 3003 3381 2185 -49 -1177 9087 6028 -1364 5368 4910
922 4910 7303 7555 -2589 6834 10369 -3431 166 2077 -663 4562 -1071 -3563 3603 3241 -648
937 -648 -5027 3281 8913 -4363 -1944 3536 -5658 -424 -2487 -10771 2073 1244 -10426 -6235 -3558
952 -3558 -2797 -5224 -7719 -1259 -2115 -5392 -6887 -11747 -2400 -502 -10639 -2857 -196 -4371 -1020
967 -1020 -7982 -3873 8156 -1172 -3296 3096 75 -1018 -3169 -1851 3666 4190 5186 -1628 -1538 10959
$$ packed form
860f497P580J0502j0964R66Q55k159P443q300m606J0282j629j824j793o20Q300
875G536l726n038L266P9M144p257p428J2892l352q091P008m271L379O207j2193
890f845K580J0044m135n040q64O022k44q626L951n81q26Q324j1054r82J5887q269
906f58n010P339n21L280k958n120O651L78j196k234j128J0264l059p392O732m58
922D910K393K52j0144R423L535j3800L597J911k740N225n633k492P166l62l889
937f48m379Q308N632j3276K419N480r194N234k063q284J2844q29j1670M191K677
952c558P61k427k495O460q56l277j495m860R347J898j0137P782K661m175L351
967a020o962M109J2029r328k124O392l021j093k151J318N517N24R96o814R0J2497
$$ plain form
983 10959 1107 -2773 13320 8461 4266 7103 -1305 3107 8451 1438 3236 7710 7807 1294 -4750
998 -4750 3539 4863 2646 7536 1186 2877 6765 -7476 -4269 6446 2070 4084 962 -3734 3034
1013 3034 -2204 -7464 920 5833 3966 -3884 -4654 -1562 -7908 -3724 -171 -5222 4985 1331 -15002
1028 -15002 -4802 78 -5544 815 1366 925 1517 -6142 -8484 -3915 3849 3936 -4133 2965 3172 -9778
1044 -9778 -4213 -997 -1087 9701 2281 -4853 1490 -3986 -5582 -910 391 6897 5015 -4067 -5910
1059 -5910 -3260 1371 -3135 -1207 12115 3051 -6570 -372 -6625 -2786 7942 -740 2199 8486
1073 8486 -2984 -7673 -4353 723 5316 4660 4712 -310 -2171 -104 -9220 -2515 13857 3857 -714
1088 -714 2479 -5361 -2685 -1344 -2800 9267 9747 624 -2140 -4465 -2024 321 2834 7523 4728
$$ packed form
983A0959r852l880J6093m859m195K837q408M412N344p013J798M474R7o513o044
998d750Q289J324k217M890o350J691L888j4241L207J0715m376K014l122m696O768
1013C034n238n260Q384M913j867p850p70L092o346M184L553n051J0207l654j6333
1028a5002J0200M880n622O359N51m41N92p659k342M569P764Q7q069P098K07j2950
1044i778N565L216r0J0788p420p134O343n476j596M672J301O506j882r082j843
1059e910K650M631m506J928J3322r064r621O198o253L839J0728q682K939O287
1073H486j1470m689L320N076M593o56N2n022j861K067r116O705J6372j0000m571
1088g14L193p840K676J341j456J2067M80r123k764k325K441K345K513M689k795
$$ plain form
1103 4728 5842 -790 -13146 333 7412 -1962 6713 7607 -2315 -1343 -7209 -7535 5121 7241 2399
1118 2399 56 29 -3260 -11066 -3227 4110 2012 7910 240 -10804 -1276 -3461 -7649 4883 6813
1133 6813 4397 281 -9557 -6336 -554 -650 2055 4690 6520 -2161 -10595 -3749 -2510 399 9663
1148 9663 393 -907 4922 -9445 -10070 2660 3655 5504 4286 -1751 -2723 -4343 -3856 -2655 4784
1163 4784 12643 760 -4765 858 -6431 -3581 4673 784 7338 7196 -7357 -6416 -2454 -1552 2598
1178 2598 3102 5163 2987 -4346 -6960 -7454 2096 7181 -1132 3596 3563 -8166 -4177 -3149 -2909 10075
1194 10075 6862 -2745 -56 -1577 -4127 -3507 2366 8956 5050 2043 -2643 -7355 1046 611 -3184
1209 -3184 9470 7050 -3903 -2035 -6391 -4333 4652 2167 2496 4546 743 -4375 -8273 -1202 5104
$$ packed form
1103D728J114o632j2356J3479P079r374Q675Q94r922R72n866l26J2656K120m842
1118B399k343k7l289p806P839P337k098N898p670j1044R528k185m188J2532J930
1133F813k416m116r838L221N782r6K705K635J830q681q434O846J239K909R264
1148I663r270j300N829j4367o25J2730R95J849j218o037r72j620M87J201P439
1163D784P859j1883n525N623p289K850Q254l889O554j42j4553R41L962R02M150
1178B598N04K061k176p333k614m94R550N085q313M728l3j1729L989J028K40J2984
1194A0075l213r607K689j521k550O20N873O590l906l007m686m712Q401m35l795
1209c184J2654k420j0953J868m356K058Q985k485L29K050l803n118l898P071O306
$$ plain form
1224 5104 2591 4566 591 -2661 707 -7769 -4583 9003 3644 687 2097 -5347 -3885 -2072 -3583
1239 -3583 1932 4974 3300 -3762 -7338 -824 -2030 -1769 5379 1647 2865 2426 -9934 -3560 4925
1254 4925 -856 2165 4407 937 -271 -4499 -3439 1274 4345 5999 371 -101 2779 -4823 -2711
1269 -2711 2773 1237 6731 2008 -6464 744 290 -4590 1410 3751 4188 1246 -3853 -2663 -2281 -30
1285 -30 899 -1946 4111 1969 -7509 -2252 -1240 -1579 5596 430 -1394 4069 -2100 -5687 -2200 1261
1301 1261 3387 -1582 -1751 -49 -3760 -1697 -2498 -1713 6859 1588 -3291 1445 -2235 -1540 1767 -2259
1317 -2259 2576 4590 -1941 -2939 -1182 2361 2302 -426 4549 3782 364 1515 -3335 436 6199 -1940
1333 -1940 -1019 3275 -1987 -1317 -1714 -2286 3673 2556 -350 -580 -618 1790 -2704 -3027 3086 -162 -711
$$ packed form
1224E104k513J975l975l252L368q476L186J3586n359k957J410p444J462J813j511
1239c583N515L042j674p062l576O514j206K61P148l732J218m39j2360O374Q485
1254D925n781L021K242l470j208m228J060M713L071J654n628m72K880p602K112
1269b711N484j536N494m723q472P208m54m880O000K341M37k942n099J190L82K251
1285c0R29k845O057k142r478N257J012l39P175n166j824N463o169l587L487L461
1301A261K126m969j69J702l711K063q01P85Q572n271m879M736l680O95L307m026
1317b259M835K014o531r98J757L543n9k728M975p67l418J151m850L771N763q139
1333a940R21M294n262O70l97n72N959j117k906k30l8K408m494l23O113l248n49
$$ plain form
1350 -711 -786 -5404 1312 1817 -4417 2294 3896 -158 696 -2025 -727 1606 -1564 -1627 -2109 -165 -88
1367 -88 -6404 -1367 3143 -1581 1716 958 -1191 4650 -96 -3358 3133 1647 114 -555 -1670 2071
1383 2071 460 -797 1173 1126 4646 1610 -3166 3588 2152 -2242 1367 -1630 -383 2693 -3972
1398 -3972 -2298 2582 477 446 -150 1885 3029 -1143 -97 -648 -1008 1733 -4526 -4502 2116 -3290 -3911
1415 -3911 -95 -2074 1709 1414 -2680 1458 1980 49 -1269 -1802 1767 -435 -3581 -363 -1755 133
1431 133 1585 -3914 1281 4109 -2192 -123 538 -1149 1636 -2039 -2739 904 41 -632 -1681 1406
1447 1406 4982 723 1973 4420 1176 4076 1552 -2845 3951 1642 -3932 -517 -965 -943 -27 -2366
1463 -2366 551 1967 1289 469 -1824 2718 2375 -3104 672 816 -1575 1118 -3251 -1951 4085 -733
$$ packed form
1350g11p5m618O716N05o234O711J602m054Q54k721J298K333l170o3m82J944P7
1367h8o316N037M510m724L297p58k149N841m746l262O491j486j533o69j115L741
1383B071j611j257J970m7L520l036m776O754j436m394L609k997J247L076o665
1398c972J674M880k105l1n96K035J144m172J046n51l60K741o259K4O618n406o21
1415c911L816j979L783k95m094M138N22j931j318n33L569k202l146L218j392J888
1431A33J452n499N195K828o301K069O61j687K785l675p00L643q63o73j049L087
1447A406L576m259J250K447l244K900k524m397O796k309n574L415m48K2R16k339
1463b366K917J416o78q20k293M542l43n479L776J44k391K693m369J300O036m818
$$ plain form
1479 -733 -1180 2230 762 986 -1164 -2027 768 -334 -845 -3355 -3178 1554 -2483 -3833 2865 615
1495 615 1179 2920 -2122 1489 3258 -2221 -744 1049 225 -1415 -3774 -1164 -524 -869 1408 -1015
1511 -1015 1664 4168 -2847 -990 3041 -470 1433 614 -2383 1586 -773 -3603 87 1855 2565
1526 2565 217 -624 1719 -1022 -768 190 -2003 2923 861 -5857 -718 -364 -2801 1423 689 1567
1542 1567 4176 -431 -1671 360 2310 1887 -1114 1768 1503 -3629 -1820 -2228 -1746 4377 429 -1898
1558 -1898 2978 -745 -2333 -76 -410 2671 2250 -1789 -2066 -1639 -407 -1578 -1328 4855 2401 -765
1574 -765 1127 -2357 -473 3530 -1463 1181 4172 -1920 -3190 -2710 -1973 1412 870 783 471 -60 -164
1591 -164 -4505 -1566 4382 129 321 1466 -3237 -969 -981 -3496 3323 4597 864 220 -1110 -512
$$ packed form
1479g33m47L410j468K24k150q63K795j102n11k510J77M732m037j350O698k250
1495F15N64J741n042L611J769n479J477J793q24j640k359K610O40l45K277k423
1511a015K679K504p015J857M031l511J903q19k997L969k359k830L690J768P10
1526B565k348q41K343k741K54R58k193M926k062o718N139L54k437M224p34Q78
1542A567K609m607j240K031J950m23l001K882k65n132J809m08M82O123l948k327
1558a898M876l723j588K257l34L081m21m039k77M27J232j171K50O183k454l166
1574g65J892l484J884M003m993K644K991o092j270M80P37L385n42q7l12n31j04
1591a64m341K939N948m253J92J145m703K268j2k515O819J274l733o44j330N98
$$ plain form
1607 -512 -540 -494 2514 1978 2111 -443 -6188 -1543 774 -2441 2450 2882 -367 1268 -3287 -3564 2615
1624 2615 2462 1784 2103 815 -403 -3861 -2200 868 1510 4616 369 -3507 1019 -2594 -4498 2455
1640 2455 2221 2137 2183 -3285 -2909 -475 -594 932 2505 4247 1160 -3873 -1659 -1646 -428 3541 316
1657 316 680 2644 -5034 -5224 -619 -522 2552 2351 -731 45 -2040 -2919 -1573 2246 5983 2202 13
1674 13 1217 -3095 -1073 1685 -805 4279 4315 -3871 -3512 -2370 -3167 -127 645 2577 2321 -1303 -2755
1691 -2755 -3385 318 3870 1068 3205 3311 -2579 -1296 -2137 -2182 4863 3192 -418 1315 -983 -3053
1707 -3053 -2703 -1233 2858 2132 318 -1790 -4537 -1756 -2099 -2685 4391 3809 -119 1009 -2731 -2212
1723 -2212 2779 993 1719 3327 524 -2684 -5107 -2735 553 381 2547 1143 -541 530 -3922
$$ packed form
1607e12k8M6L008n36J33k554n745M645K317l215M891M32l249J635m555k77O179
1624B615j53o78L19j288j218l458J661L068O42L106m247l876M526l613j904O953
1640B455k34q4M6n468L76K434j19J526J573J742l087n033K214J3J218L969l225
1657C16L64J964p678j90M605R7L074k01l082P76k085q79J346L819L737l781k189
1674A3J204m312K022K758k490N084L6q186L59J142p97L040P72J932k56l624j452
1691b755o30L703L552k802K137J06n890J283q41m5P045j671l610J733k298k070
1707c053L50J470M091p26j814k108k747K781l43n86P076n82l928J128l740N19
1723b212M991j786P26J608k803l208k423K372L288j72K166j404j684J071m452
$$ plain form
1738 -3922 -2589 4353 2542 1861 2425 -2245 -1785 -1416 -2472 1325 3490 3062 441 -2084 -161 -978
1754 -978 -894 2425 1255 2195 967 -5679 -2965 297 -1866 1790 3281 1294 1533 -1170 -1874 691
1770 691 2609 3483 711 -65 78 -4696 -3824 -944 -1074 2882 1210 -3267 351 -516 -2561 852 1906
1787 1906 2749 1370 -2257 -2222 -2258 -1309 219 -270 3066 2641 -2180 49 -419 -119 3924 883 -140
1804 -140 2460 -2084 -4185 -2370 -936 1311 530 633 1005 -683 525 -386 -78 4761 1947 -1082
1820 -1082 614 -2447 -2456 -124 -1852 1348 2849 -171 -563 -489 899 1628 375 2231 1447 -1009 -1377
1837 -1377 -4325 -2531 859 -2368 -466 1720 -1396 -127 -407 -1052 2807 2498 299 -41 -749 -620
1853 -620 -2899 -2539 1230 -119 485 623 -2205 1300 1781 -1342 2249 2466 6 247 -2213 -1866 11
$$ packed form
1738c922J333O942j811o81N64m670M60L69j056L797K165m28k621k525J923q17
1754i78Q4L319j170R40j228o646K714L262k163L656J491j987K39k703p04K565
1770F91J918Q74k772p76J43m774Q72K880j30L956j672m477L618q67k045L413J054
1787A906Q43j379l627L5l6R49J528m89L336m25m821K229m68L00M043l041j023
1804a40K600m544k101J815J434K247p81J03L72j688J208r11L08M839k814l029
1820a082J696l061rK332j728L200J501l020l92P4J388P29j253J856p84k456l68
1837a377k948J794L390l227J902K186l116J269k80o45L859l09k199l40p08J29
1853f20k279L60L769j349O04J38k828L505M81l123L591K17k460K41k460L47J877
$$ plain form
1870 11 -931 -164 208 1129 1639 -1484 914 2926 927 2587 970 -940 1428 -1929 -3496 290 -644
1887 -644 -473 208 -792 952 1101 548 1555 1684 3232 899 -2201 798 -685 -2493 -101 -1797
1903 -1797 -675 1578 -2296 -884 1391 253 698 -18 210 611 -1780 -1444 -1722 -1449 1038 -1576 -1073
1920 -1073 2555 -109 231 2033 170 2540 1666 -1741 125 -438 -1874 -2009 -2326 -329 -744 -1959
1936 -1959 65 -630 933 1989 -1177 1462 2599 -1412 -55 -369 -1449 813 -1104 -1556 841 274
1952 274 286 6 694 2630 34 153 998 -1233 461 -1067 -2932 1134 64 -1827 936 306 1208
1969 1208 2068 -51 1663 2135 930 276 -1177 524 490 -2346 72 -31 -607 1823 -681 124 3446
1986 3446 348 369 1615 240 845 -637 -1676 -17 -551 -391 -736 -1059 1708 -356 -1125 1979 59
$$ packed form
1870A1r42P67L72R21N10l123K398K012j999J660j617j910K368l357j567L786r34
1887f44J71O81j000J744J49n53J007J29J548k333l100K999j483j808K392j696
1903a797J122K253l874J412K275j138M45p16K28M01k391L36k78K73K487k614N03
1920a073L628k664L40J802j863K370q74l407J866n63j436j35l17J997m15j215
1936a959K024o95J563J056l166K639J137m011J357l14j080K262j917m52K397n67
1952B74J2k80O88J936k596J19Q45k231J694j528j865M066j070j891K763o30R02
1969A208Q60k119J714M72j205o54j453J701l4k836K418j03n76K430k504Q05L322
1986C446l098K1J246j375O05j482j039J659n34J60l45l23K767k064p69L104j920
$$ plain form
2003 59 478 1148 -2161 -20 622 -2472 -1038 -548 -592 -148 -1433 -73 541 -1 1118 -557 500 1844
2021 1844 -2090 -985 563 -1641 17 -680 -1532 1402 -302 -1365 505 411 1062 115 -917 541
2037 541 -762 -862 -534 -1663 1119 698 -2164 1016 714 -418 1797 253 1152 2657 -293 -514 -91
2054 -91 136 409 -1365 29 631 -1695 -276 -1000 -1451 1901 -184 -1268 1553 -756 -951 -158 -901
2071 -901 1458 1234 -114 617 115 824 204 -411 2313 1249 -243 630 -1827 -593 973 -2130 -127
2088 -127 1725 -999 -607 -823 -1006 1194 609 921 1186 821 1109 -1150 -188 2508 156 809 1177 -1652
2106 -1652 -101 -775 -2766 644 742 -418 -327 -1668 -705 -681 -1191 828 863 1215 853 -1979 41 557
2124 557 -1194 1298 877 -535 965 -2373 -2693 222 -423 -132 241 -465 -135 -2076 -1603 165 461
$$ packed form
2003E9M19O70l309K141O42l094J434M90m4M44j285J360O14n42J119j675J057J344
2021A844l934J105J548k204J658o97q52K934j704j063J870r4O51r47j032J458
2037E41j303j00L28j129K782m21k862L180l02j132K215j544Q99J505k950k21M23
2054i1K27K73j774J394O02k326J419p24m51L352k085j084K821k309j95P93p43
2071i01K359k24j348P31n02P09o20o15K724j064j492Q73k457J234J566l103K003
2088a27J852k724L92k16j83K200n85L12K65l65K88k259R62K696k352O53L68k829
2106a652J551o74j991L410R8j160R1j341R63K4n10K019L5L52l62k832K020N16
2124E57j751K492m21j412J500l338l20K915o45K91L73p06L30j941M73J768K96
$$ plain form
2141 461 2644 1119 -657 2132 10 -1160 2572 1741 2144 2430 -980 -838 -748 -1537 -502 -460 943
2158 943 127 -2527 -1513 -1561 -730 2127 536 1347 2895 -1346 -1066 459 -399 1856 1387 -437 313
2175 313 -1384 -2293 -1589 -547 1506 110 -1039 -614 -3009 -2048 -769 -2285 1432 1868 -1677 -386
2191 -386 -472 -989 1350 1350 2670 2874 531 -319 -1844 -607 1151 -675 1152 1125 -1828 -536 -1292 -1234
2209 -1234 3163 2567 1500 2557 587 68 -244 -218 2120 2093 1318 327 -1505 -55 -798 -1335 2682 1826
2227 1826 259 921 -2545 -2322 397 -1062 -115 1170 -191 -916 -2564 -1390 514 393 2098 1282
2243 1282 -163 545 -2938 -2890 366 -1033 -245 -95 -2991 -1885 -2040 -2752 389 1441 1859 1102 -889
2260 -889 -134 -908 -955 1249 413 1573 1300 -2537 -958 369 -557 2237 2470 1054 1837 -700 -1785
$$ packed form
2141D61K183j525j776K789k122j170L732q31M03K86l410J42R0p89J035M2J403
2158I43q16k654J014m8Q31K857j591Q11J548m241K80J525q58K255m69j824P50
2175C13j697r09P04J042K053j396j149M25k395R61J279j516L717M36l545J291
2191c86q6n17K339%J320K04k343q50j525J237J758j826J827k7k953J292p56N8
2209a234M397n96j067J057j970n19l12K6K338k7p75r91j832J450p43n37M017q56
2227A826j567O62l466K23K719j459R47J285j361p25j648J174J904j21J705q16
2243A282j445P08l483M8L256j399P88J50k896J106j55p12L141J052M18p57j991
2260h89P55p74m7K204q36J160k73l837J579J327r26K794K33j416P83k537j085
$$ plain form
2277 -1785 -405 195 1545 24 77 441 -2084 -1101 495 334 3293 2383 -356 1401 -192 -1744 308
2294 308 85 963 739 -1381 -1581 -1819 -870 359 60 2282 1724 -1197 -242 -1526 -1467 1112 -696 -561
2312 -561 1074 -1891 -2410 -1063 -784 1470 1364 1092 1190 -410 -169 -1117 -893 2158 624 -859 693
2329 693 -1876 -957 662 -433 1863 2851 696 372 -494 -110 372 -220 1070 694 -414 -133 -2005
2346 -2005 -674 1604 53 1556 1994 -64 787 -650 -1525 1017 588 -388 -95 -961 -656 -1461 -1191
2363 -1191 1272 581 1674 1264 -1241 495 304 -1733 943 372 -664 171 -1901 -1573 -231 -551 401
2380 401 540 802 956 -1352 -442 482 -657 922 3 -1180 551 -1332 -1846 787 125 887 1267 -368
2398 -368 596 -61 -717 52 -268 518 -259 -1997 -320 -1071 -1475 633 -517 607 1834 -1008 -212 847
$$ packed form
2277a785J380O00J350j521N3L64k525R83J596j61K959r10k739J757j593j552K052
2294C08k23Q78k24k120k00k38R49J229k99K222n58k921R55j284N9K579j808J35
2312e61J635k965n19J347K79K254j06k72R8j600K41r48K24L051j534j483J552
2329F93k569R19J619j095K296R88k155l24q66L84M82n92J290l76j108K81j872
2346b005J331K278j551J503M38k058Q51j437q75K542m29r76K93q66L05q05K70
2363a191K463o91J093m10k505J736j91k037K676n71j036Q35k072L28J342l20R52
2380D01J39K62J54k308R10R24j139J579r19j183J731j883n14K633o62P62L80j635
2398c68R64o57o56P69l20P86p77j738J677p51m04K108j150J124J227k842P96J059
$$ plain form
2416 847 -417 499 172 16 500 -752 -528 -365 -286 1631 168 206 1841 -168 227 718 -681 1256
2434 1256 613 -1054 453 -196 -434 341 -137 1126 1158 194 1024 -41 614 1178 -742 953 1029 -982
2452 -982 415 -301 -822 1380 -139 -29 1155 241 276 -355 -450 702 -727 -533 -84 -1348 120 -720
2470 -720 -1630 784 287 -584 654 -592 192 539 -862 18 107 -591 -422 -1170 -160 61 -1234 513
2488 513 -79 -354 1072 -921 -343 1381 -746 -60 613 -488 469 -97 -622 283 84 345 -164 -668
2506 -668 914 -476 -693 704 -565 -80 434 -1563 125 365 -1128 320 293 218 870 -206 355 497
2524 497 -66 519 -519 -54 812 -1288 -319 202 -1146 403 -190 -1029 773 -58 -630 521 -10 723
2542 723 417 43 1273 384 755 789 -77 1404 922 -566 1072 232 -446 775 -692 -356 870 -824
$$ packed form
2416H47j264R16l27j56M84j252K24J63P9J917j463L8J635k009L95M91j399J937
2434A256o43j667J507o49k38P75m78J263L2r64Q30j065O55N64j920J695P6k011
2452i82J397p16n21K202j519J10J184r14L5o31r5J152j429J94M49j264J468q40
2470g20r10K414m97q71J238j246P84L47j401Q80Q9o98J69p48J010K21j295J747
2488E13n92k75J426j993N78J724k127O86O73j101R57n66n25R05j99K61n09n04
2506f68J582j390k17J397j269M85N14j997J688K40j493J448k7p5O52j076N61J42
2524D97n63N85j038M65Q66k100R69N21j348J549n93q39J802q31n72J151n31P33
2542G23l06l74J230q89L71L4q66J481m82j488J638q40o78J221j467L36J226j694
$$ plain form
2560 -824 -359 -180 -218 446 -484 219 613 -191 532 -144 -256 1590 -82 -328 987 -376 -146 -131 -1280
2579 -1280 162 -70 -1071 -408 -818 -461 -536 -1003 546 -54 -242 586 -699 283 1114 -993 543 993
2597 993 -550 222 -400 -815 190 -363 -40 230 -84 477 -790 -506 1162 -6 725 1020 -394 1060
2615 1060 263 -816 1101 964 311 984 -192 119 -121 -757 44 -456 -163 -416 -1989 -680 -593 -1602
2633 -1602 157 -223 -613 795 -846 -903 551 -166 212 402 -121 51 -956 -961 -399 -654 629 -235 -991
2652 -991 426 -823 -1169 502 -358 649 989 -608 93 276 -256 637 793 1659 1610 416 910 385
2670 385 556 1806 387 1138 1802 -660 -199 455 -298 1271 1120 176 1113 282 -115 109 264 1559
2688 1559 715 362 581 -1256 -746 -272 -1317 642 725 -947 -335 -1227 -1328 -196 -841 -14 113 -759
$$ packed form
2560h24M65J79l8O64r30P03L94q04P23o76j12J846j672k46J315j363K30J5j149
2579a280J442k32j001O63m10L57p5m67J549o00j88Q28j285R82Q31k107J536M50
2597I93j543P72o22m15J005n53L23K70l14N61j267K84J668j168P31K95j414J454
2615A060p97j079J917j37o53O73j176L11k40o36Q01n00K93k53j573J309Q7j009
2633a602J759l80l90J408j641n7J454p17L78J90n23J72j007nN62k55J283q64p56
2652i91J417j249l46J671q60J007L40j597P01J83n32Q93J56Q66m9j194M94n25
2670C85J71J250j419P51O64k462M61O54p53J569j51r44R37q31l97K24J55J295
2688A559q44l53K19j837N10M74j045J959Q3j672O12q92j01J132o45Q27J27q72
$$ plain form
2706 -759 -927 -1610 -1202 21 -605 309 414 -1147 -156 -1188 -1373 784 -113 -534 336 -958 -1287 -1080
2724 -1080 -1466 -177 366 406 244 -712 322 -139 -415 1536 1059 578 1227 -900 -567 518 -507 983
2742 983 1366 460 556 -417 -529 388 201 1164 619 3 570 -1255 -1151 528 -72 754 1286 -379 341
2761 341 -308 -929 625 758 972 698 -555 -320 -864 -924 319 -65 940 901 -1263 -253 6 -886 943
2780 943 911 433 780 -763 -1328 -599 -343 506 339 601 605 -948 -589 -146 -311 1679 1062 -264 614 -798
2800 -798 -1088 134 -201 801 1139 -338 -174 -397 -489 66 -130 945 849 -761 -396 -1236 -1117 581 -207
2819 -207 199 1183 -617 -687 -336 -489 766 780 593 422 -277 -357 -758 -833 970 511 80 737 -900 -387
2839 -387 245 -801 881 1143 -146 -62 -775 -617 -198 -332 541 436 99 237 -1018 -629 647 -252 785
$$ packed form
2706g59j68o83M08J223o26R14J05j561R91j032j85K157q97m21Q70j294l29K07
2724a080l86J289N43M0j62r56J034m61k76J951m77m81O49k127L33J085j025J490
2742I83L83r06R6r73j12R17j87R63n45o16N67j825J04J679o00Q26N32j665P20
2761C41o49o21J554J33K14k74j253K35n44o0J243l84J005l9k164J010K59q92J829
2780I43l2m78L47j543n65P29K56Q49j67K62Mj553L59M43j65J990o17j326Q78j412
2800g98k90J222l35J002L38j477J64k23r2N55j96J075r6j610L65q40J19J698p88
2819b07M06R84j800p0L51j53J255J4j87j71o99q0m01p5J803m59m31O57j637N13
2839c87O32j046J682K62j289Q4p13J58M19j34Q73j05l37J38j255L89J276q99J037
$$ plain form
2858 785 782 -619 122 -879 -1409 535 128 83 526 -239 -243 -864 -630 525 201 599 452 -883 -170 -563
2878 -563 -1323 677 338 33 854 -842 -577 265 -66 600 680 735 617 -658 -292 300 -41 1110 440
2897 440 10 1163 -314 -378 762 92 772 819 -175 357 -290 -527 -39 -30 664 354 -573 143 -389 -392 752
2918 752 -321 489 993 -681 -163 -54 -573 321 93 42 476 -359 -268 -524 -455 648 -197 -343 510 -927
2938 -927 -370 -204 -931 588 25 -621 309 -213 -337 24 -372 687 397 -95 375 -501 -108 369 -701
2957 -701 429 444 -558 448 -415 -557 732 -203 -87 599 -315 -98 -315 -330 244 -201 90 10 -561 316
2977 316 -354 -899 694 -246 -499 435 -639 -74 291 -613 234 352 -53 222 -519 -35 255 -340 468
2996 468 39 147 850 -496 -300 809 -483 222 453 -441 500 82 -266 356 201 262 244 -69 853 19
$$ packed form
2858G85lj401P41j001n30J944m07m5M43p65mo21K34J155l24L98j47j335P13l93
2878e63p60K000l39l05Q21j696K65Q42l31O66Q0N5j18j275L66N92l41J151o70
2897D40m30J153j477o4J140o70O80M7r94N32o47k37M88RO94l10r27P16n32lJ144
2918G52j073Q10N04j674N18J09n19Q94k28n1M34q35R1k56O9J103q45j46Q53j437
2938i27N57J66p27J519n63o46R30n22j24L61l96J059k90m92M70q76L93M77j070
2957g01J130J5j002J006q63j42J289r35J16O86r14K17k17j5N74m45K91q0n71Q77
2977C16o70n45J593r40k53R34j074N65L65r04Q47J18m05K75p41M84K90n95Q08
2996D68m29J08P03j346J96J109j292P05K31q94R41m18l48O22j55O1j8l13R22q34
$$ plain form
3016 19 -211 641 -111 693 558 -399 404 424 -680 334 -17 -216 207 -517 -261 113 -329 -77 -336 -21
3036 -21 333 -671 110 184 -688 424 -46 -597 632 -67 -462 232 -387 345 125 -316 272 -55 97 206
3056 206 -487 554 233 -484 599 -187 -374 813 -424 14 828 -357 352 127 -185 394 -192 -16
3074 -16 259 -250 409 -279 -231 749 -253 -189 696 -329 186 190 -808 235 69 -543 -18 -585 -308 -272 -713
3095 -713 -128 -364 -591 -44 -1068 -596 182 -1114 -197 89 -735 161 -438 -614 208 -344 -185 131 -239
3114 -239 269 -279 -150 608 -87 403 424 -296 716 204 -389 710 414 363 874 84 406 566 61 590
3134 590 260 724 851 -177 752 612 177 1072 530 132 945 -224 137 675 -155 509 392 -43 624
3153 624 -144 -384 64 -634 272 -112 -485 515 -626 -652 80 -704 -79 122 -842 -189 -407 -899 -314 -573
$$ packed form
3016A9k30Q52p52Q04j35r57Q03K0j104J014l51j99M23p24K56L74m42K52k59L15
3036b1L54j004P81P4q72J112m70n51J229o99l95O94o19P32k20m41N88l27J52J09
3056B06o93J041l21p17J083p86j87J187j237M38Q14j185P09k25l12N79n86J76
3074a6K75n09O59o88M8R80j002O4Q85j025N15Mr98J043j66o12N25n67K77L6m41
3095g13N85k36k27N47j024M72P78j296R17K86q24Q96n99j76Q22n52J59L16l70
3114b39N08n48J29P58o95M90K1p20J012n12n93J099k96n1N11p90L22J60n05N29
3134E90l30M64J27j028R29j40m35Q95n42l98Q13j169L61N38q30O64j17m35O67
3153F24p68k40M48o98R06l84l73J000j141k6P32p84O25K01r64O53k18m92N85k59
$$ plain form
3173 -573 -20 202 -780 -274 -692 -690 204 -592 -82 322 -669 -432 -324 -889 281 -212 -386 211 -463 -389 -226
3194 -226 -396 282 17 2 395 -623 87 50 -604 607 469 -154 578 -210 -379 418 -163 388 660 233
3214 233 494 -172 -257 477 -126 539 503 -57 398 -117 -486 721 49 206 775 -178 43 142 -435 505 447
3235 447 315 484 -326 317 -79 -354 751 279 349 711 -666 -195 272 -623 276 466 -65 174 -301 -473
3255 -473 -54 -279 369 132 -277 419 -663 -474 128 -382 305 410 -515 65 -505 -891 155 154 254 359
3275 359 -404 -223 -539 -633 164 -288 284 397 -828 -188 -365 -802 431 108 58 689 -282 -498 -209 -451
3295 -451 412 225 138 402 -410 -264 -67 -475 699 475 66 543 -405 -466 423 -435 481 763 -90 123
3315 123 -524 -339 125 -287 509 630 -98 172 -524 -493 421 -381 283 730 -413 -118 -327 -689 326 202
$$ packed form
3173e73N53K22r82N06m18KQ94p96N10M04r91K37J08n65J170m93j74N97o74P4J63
3194b26j70O78k65j5L93j018P10l7o54J211j38o23P32p88j69P97n81N51K72m27
3214B33K61o66q5P34o03O65l6n60M55n15l69J207o72J57N69r53K21R9n77R40n8
3235D47j32J69q10O43l96k75J105m72P0L62j377M71M67q95Q99J90n31K39m75j72
3255d73M19k25O48k37m09O96j082J89O02n10O87J05r25N80n70l86J046jJ00J05
3275C59p63J81l16r4P97m52N72J13j225O40j77m37J233l23n0O31r71k16K89k42
3295d51Q63j87q7K64q12J46J97m08J174k24m09M77r48o1Q89q58R16K82q53K13
3315A23o47J85M64m12P96J21p28K70o96L1R14q02O64M47j143K95k09l62J015j24
$$ plain form
3335 202 303 544 -142 -53 -313 -352 502 95 64 400 -616 -142 -218 -556 594 631 -25 401 -167 -193 188
3356 188 -273 404 452 374 549 -395 -331 243 -274 595 544 62 450 -249 -515 440 4 234 516 -347 -12
3377 -12 -498 -567 182 -23 480 138 -719 32 -137 -483 481 125 153 434 -615 -250 18 -369 224 331 90
3398 90 314 -547 -241 -152 -350 539 128 73 554 -512 -510 254 -429 261 572 -155 176 -398 -496 7 -287 355
3420 355 305 -313 214 -417 -488 172 -373 397 764 -261 230 -101 -483 378 125 -49 163 -228 -151 -361 -354
3441 -354 281 -203 -135 179 -659 -99 -189 -570 549 67 -215 317 -232 -311 147 -189 367 411 240 316 -329
3462 -329 51 138 -425 415 288 -222 402 -313 -397 383 -98 219 538 -81 266 -6 -395 220 193 315 260
3483 260 -152 176 -312 -482 560 -228 -54 320 -534 21 65 -458 250 267 -147 197 -286 -3 38 -73 318
$$ packed form
3335B02J01K41o86Q9k60l9Q54m07l1L36j016M74p6l38J150L7o56M26n68k6L81
3356A88m61O77M8p8J75r44O4N74n17Q69n1m82L88o99k66R55m36K30K82q63L35
3377a2m86o9P49k05N03l42q57P51j69l46R64l56K8K81j049L65K68l87N93J07k41
3398I0K24q61L06Q9j98Q89m11n5M81j066KP64o83O90L11p27L31n74r8N03k94O42
3420C55n0o18N27o31p1O60n45P70L67j025M91l31l82Q61k53j74K12l91P7k10P
3441c54O35m84O8L14q38N60r0l81J119m82k82N32n49p9M58l36N56M4j71P6o45
3462c29L80Q7n63Q40j27n10O24p15q4P80m81L17L19o19L47k72l89O15k7J22n5
3483B60m12L28m88j70J042p88J74L74q54N55M4n23P08J7m14L44m83K83M1j11L91
$$ plain form
3504 318 -31 -172 380 -307 -176 239 -525 255 230 -270 362 -29 -350 117 -30 325 290 -160 366 251 216
3525 216 433 -104 482 357 -266 362 107 -376 215 -142 -106 342 -528 -269 -65 -242 128 -320 -57 118
3545 118 -478 -44 48 -397 389 -133 -288 369 -242 -285 166 -490 -206 -97 -457 -207 -328 -290 -290 -686 -55 -262
3567 -262 -741 228 -580 -311 294 -325 -29 264 -229 122 -49 10 478 -204 -135 188 -335 322 26 -96 670
3588 670 -59 90 405 -115 593 425 -148 672 324 136 618 76 268 539 -7 452 241 261 389 -209
3608 -209 181 139 -309 230 186 -199 419 2 -106 391 -144 138 326 -178 299 52 -46 176 -242 149 73
3629 73 -599 197 -417 -522 18 -532 -270 -222 -512 -191 -33 -582 43 -343 -127 68 -363 -143 -189 -384 -26
3650 -26 -283 -196 175 -272 -268 31 -311 -15 -61 -319 17 -193 -142 -75 -399 275 -45 -220 464 -385 -41 195
$$ packed form
3504C18l49j41N52o87J31M15p64P80k5n00O32l91l21M67j47L55l5m50N26j15l5
3525B16K17n37N86j25o23O28k55m83N91l57L6M48q70K59K04j77L70m48K63J75
3545A18n96M34R2m45P86n22j55O57o11m3M51o56K84J09l60K50j21L8%l96O31k07
3567b62m79R69q08K69O05o19K96K93m93L51j71N9M68o82O9L23n23O57k96j22P66
3588F70p29J49L15n20P08j68n73Q20l48j88M82n42J92K71n46M59k11K0J28n98
3608b09L90m2m48N39m4l85O18m17j08M97n35K82J88n04M77k47r8K22m18L91p6
3629G3o72P96o14j05N40n50K62M8k90L21J58n49O25l86K16J95m31K20m6j95L58
3650b6k57Q7L71m47MK99l42K96m6k58L36k10N1O7l24O74l20j75O84q49L44K36
$$ plain form
3672 195 -316 53 340 -258 188 8 -41 175 -29 236 270 34 216 39 182 357 -109 151 368 -29 333
3693 333 187 -71 520 143 36 363 129 157 127 18 299 279 164 380 -124 27 -65 -315 445 147 83 286
3715 286 -192 -235 368 -187 99 284 -21 56 -344 -63 124 -242 48 -3 -383 -20 -314 -285 206 -341 -12
3736 -12 269 -402 -37 -33 -418 118 -53 -108 -7 -190 49 -163 -133 266 -149 229 267 -327 -217 -30 -491 215
3758 215 146 -68 276 -233 -320 242 31 230 250 86 281 -199 -62 124 -165 380 297 -95 258 -15 -241
3779 -241 199 78 119 409 -113 158 -254 -296 88 -9 167 254 -218 225 -10 -226 501 47 169 430 -113
3800 -113 -148 111 -66 357 -52 30 289 -163 -158 -90 -247 189 168 -109 359 -177 -349 109 -396 65 216 -97
3822 -97 95 -155 -273 62 -213 172 301 -51 98 -284 -359 305 -135 130 450 -236 101 -154 -241 106 315
$$ packed form
3672A95n11L69K87n98M46j80m9K16k04K65L4k36J82j77J43J75m66K60K17l97L62
3693C33j46k58N91l77j07L27k34K8l0j09K81k0j15K16n04J51r2k50P60k98o4K03
3715B86m78m3O03n55K86J85l05P7m00K81J87l66K90n1l80L63k94K9M91n47L29
3736a2K81o71L65Ml85N36j71n5J01j83K39k12L0L99m15L78L8n94J10J87m61P06
3758B15o9k14L44n09q7N62k11J99K0j64J95m80J37J86k89N45q3l92L53k73k26
3779b41M40j21M1K90n22K71m12m2L84r7J76Q7m72M43k35k16P27m54J22K61n43
3800a13l5K59j77M23m09Q2K59m52NO8j57M36k1k77M68n36j72M58n05M61J51l13
3822i7J92k50j18L35k75L85J29l52J49l82p5O64m40K65L20o86L37k55q7L47K09
$$ plain form
3843 315 155 81 -301 112 -231 -293 228 80 163 155 -396 18 -103 -353 193 199 -8 175 -297 -230 -122 -104 81
3866 81 113 103 44 -216 -243 45 -318 108 231 -136 312 -395 -232 320 -195 121 268 -20 -27 -160 -256 47 2
3889 2 233 170 -141 -157 -90 -427 166 38 -17 526 -285 21 -106 -177 90 161 176 135 -330 -149 -96 -130 318 69
3913 69 0 229 -343 -288 -30 -245 196 226 -116 211 -98 -87 31 43 335 189 35 163 -98 -162 268 -210
3935 -210 337 420 -309 -33 -78 -421 53 37 74 332 -160 -161 -306 -365 224 -81 160 294 -203 -5 -110 -152 370
3958 370 -1 34 266 -265 -66 -212 -261 118 219 62 26 -88 -125 49 -115 258 153 -42 326 -172 -66
3979 -66 390 -141 258 273 -167 33 -41 -243 -64 -59 -49 48 60 188 -166 4 235 -52 317 285 -227 23 69
4002 69 -289 174 -21 -136 168 -187 -128 -116 -165 51 -132 21 197 -380 -16 -55 -186 161 246 77 132 -65
$$ packed form
3843C15j60p4l82M13l43o2N21j48Q3qn51M14j21k50N46Ok07J83m72O7J08J8J85
3866H1L2j0n9k60k7K88l63M26J23l67M48p07J63N52n15L16J47k88pj33r6L03m5
3889BK31o3l11j6O7l37N93j28n5N43q11L06j27p1K67P1J5m1m65J81N3l4M48k49
3913F9o9K29n72N5K58k15M41L0l42L27l09J1J18J2K92j46j54J28k61o4M30m78
3935b10N47Q3p29K76m5l43M74j6L7K58m92jj45n9N89l05K41J34m97J98j05m2N22
3958C70l71L5K32n31J99j46m9L79J01j57l6j14l7J74j64L73j05j95L68m98J06
3979f6M56n31L99J5m40K00p4k02J79NJ0R7J2J28l54J70K31k87L69l2n12K50M6
4002F9l58M63j95j15L04l55N9J2m9K16j83J53J76n77L64l9j31L47Q5j69N5j97
$$ plain form
4024 -65 -51 155 0 181 49 -164 -32 -189 -264 51 -230 161 -38 -461 194 -109 -206 200 -274 29 123 -143
4046 -143 55 37 -69 180 -38 231 287 -240 18 -74 -160 403 -196 72 316 -79 63 132 -120 295 101 119
4068 119 220 -81 70 141 11 372 -52 -66 409 -150 107 215 -125 98 192 -150 85 -29 -105 66 14 157
4090 157 -14 -255 146 -27 104 179 -283 58 90 -343 210 -161 -486 47 -103 -163 123 -403 -132 -9 -301
4111 -301 75 -149 -90 109 -300 -114 -114 -130 79 -6 -303 201 -224 27 79 -241 122 -63 -113 139 -168 18
4133 18 64 -292 176 17 -119 164 -96 -66 261 -273 231 201 -149 126 94 86 248 -28 87 75 40 335 -14
4156 -14 -251 372 -30 -104 421 -259 184 279 -249 164 114 -118 420 -71 100 131 72 357 64 -162 24 -214
4178 -214 -82 259 -328 172 23 -340 292 37 -174 235 -289 -155 149 -182 -82 -96 -109 2 -312 229 198
$$ packed form
4024f5J4K06j55J81j32k13J32j57p5L15k81L91j99m23O55l03r7M06m74L03R4k66
4046a43J98j8j06K49k18K69N6n27K58r2q6N63n99K68K44l95J42O9k52M15j94J8
4068A19J01l01J51P1j30L61m24j4M75n59K57J08l40K23R4l42K35j14p6J71n2J43
4090A57j71k41M01j73J31P5m62L41L2m33N53l71l25N33j50o0K86n26K71J23k92
4111c01L76k24N9J99m09J86%j6K09q5k97N04m25K51N2l20L63j85n0K52l07J86
4133A8M6l56M68j59j36K83k60L0L27n34N04l0l50K75l2qJ62k76J15j2l5K95l49
4156a4k37O23m02p4N25o80M43R5n28M13n0k32N38m91J71L1n9K85k93k26J86k38
4178b14J32L41n87N00j49l63O32k55k11M09n24J34L04l31J00j4j3J11l14N41l1
$$ plain form
4199 198 -215 108 -239 -178 106 -109 -119 15 -232 -70 -63 -248 264 -21 -15 20 -101 36 -231 -182 199 -88 6
4222 6 303 -218 -22 -64 -278 127 -47 -237 169 -196 -36 -22 -195 68 -51 -104 329 -317 -62 189 -121 135
4244 135 160 -26 259 47 -159 27 14 153 158 -20 -169 -104 -129 274 -187 137 111 -140 175 -40 -317 404
4266 404 -4 -88 143 -71 -26 40 -62 112 90 84 210 -132 -6 126 -212 283 93 -70 176 -295 -90 9
4288 9 -48 -26 56 -136 142 -320 -184 8 -209 149 109 -182 228 -141 -139 147 -104 -24 158 -175 21 -90 -278
4311 -278 276 -72 115 183 3 -3 -53 -181 196 50 -48 248 -187 -91 -59 -237 77 77 -144 292 -349 -64 -25
4334 -25 -244 101 24 -87 219 -279 -180 171 -185 144 370 -181 236 -149 -269 109 47 41 -9 105 44 -231 -2
4357 -2 167 -68 279 112 -339 -2 -227 -148 140 82 191 254 -204 -167 39 -216 312 4 -34 287 -287 -22
$$ packed form
4199A98m13L23l47O1K84k15j0J34k47J62Pj85N12k85OL5j21J37k67M9L81k87R4
4222FK97n21J96m2k14M05j74j90M06l65J60J4j73K63j19n3M33o46K55K51l10K56
4244A35K5j86K85k12k06J86j3J39Nj78j49O5k5M03m61L24k6k51L15k15k77P21
4266D04m08q4K31k14M5O6j02J74k2oJ26l42J26J32l38M95j90j63K46m71K05R9
4288In7K2Q2j92K78m62J36J92k17L58m0k91M10l69KK86k51Q0J82l33J96j11j88
4311b78N54l48J87O8j80on0j28L77j46r8K96m35R6L2j78L14%k21M36o41K85L9
4334b5k19L45p7j11L06m98R9L51l56L29K26n51M17l85j20L78o2on0J14o1k75K29
4357bJ69k35L47j67m51L37k25P9K88n8J09O3m58L7K06k55N28l08l8L21n74K65
$$ plain form
4379 -22 15 -179 268 161 -50 115 -292 -222 71 -238 33 105 -143 -19 -150 -125 122 -13 210 100 -236 140
4401 140 -117 -217 291 -120 222 224 -298 -9 48 -152 62 70 -6 45 28 60 -228 -72 352 -164 147 278 -142
4424 -142 87 -137 -123 303 251 -144 193 -172 -36 -81 -113 136 167 -11 16 -30 -204 52 -157 275 40 -77
4446 -77 131 -236 -252 217 -64 272 101 -269 185 -87 -258 80 113 121 -121 -68 79 -159 -59 303 -21 173
4468 173 164 -62 14 22 -126 395 -71 10 162 -389 46 -14 -207 249 -57 -91 251 -397 -16 11 -155 146 141 -112
4492 -112 116 -365 -166 30 -78 144 -38 -29 59 -98 -46 81 -269 166 202 -148 -109 -192 -64 137 -59 71
4514 71 77 -245 -158 74 61 198 129 139 103 -324 203 -89 9 220 -10 -118 225 -103 129 205 -29 182 171 66
4538 66 208 -139 -39 162 -207 131 8 -135 69 -184 -88 201 -83 80 150 -143 41 -128 -211 7 17 92
$$ packed form
4379b2L7j94M47j07k11J65m07P0K93l09K71P2k48J24j31K5K47j35K23j10l36L76
4401A40k57j00N08m11L42Kn22K89N7k00K14Qp6N1j7L2k88J56M24n16L11J31m20
4424a42K29k24J4M26n2l95L37l65J36m5l2K49L1j78K7m6j74K56k09M32k35j17
4446g7K08l67j6M69k81L36j71l70M54k72j71L38L3Qk42N3J47k38J00L62l24J94
4468A73rk26P6Qj48N21m66Q1J52n51M35o0j93M56l06l4L42o48L81K7j66L01nk53
4492a12K28m81J99J96j08K22j82RQ8j57N2J27l50M35L6l50L9q3J28K01j96J30
4514G1Ol22Q7K32j3J37o9J0l6m27N27k92R8K11k30j08L43l28K32P6k34K11j1j05
4538F6J42l47J00K01l69L38j23j43K04k53R6K89k84J63P0k93J84j69q3K18J0P5
$$ plain form
4560 92 107 -192 14 -69 -6 182 -74 173 182 -344 43 -112 -220 37 -14 -71 54 -198 50 81 -148 147 -60
4583 -60 105 67 -303 -156 93 -164 222 0 -225 206 -85 -130 186 -129 105 222 -33 182 -75 -6 252
4604 252 -10 34 282 -140 92 -36 -122 268 -39 62 262 -131 27 -118 -162 262 -38 -220 146 -164 258
4625 258 -109 -32 208 23 -102 226 -172 -127 97 -319 26 -77 -64 184 -266 90 71 -103 298 -127 -77 -12
4647 -12 -336 -119 205 -95 216 257 -56 108 -12 42 174 -201 -5 215 -175 82 -153 -250 98 -310 2
4668 2 22 -278 269 -140 -95 156 -135 46 220 -75 54 -34 -147 99 13 162 118 -65 213 109 -162 247
4690 247 123 -136 93 -187 84 60 -166 0 -58 -255 176 -108 -70 142 -73 37 78 78 96 -118 -182 169 -179
4713 -179 -125 111 -208 61 78 -119 164 -36 37 46 -74 241 21 -16 167 -267 -62 65 -134 -15 187 -260
$$ packed form
4560I2J5k99K06q3O3J88k56K47Rn26L87j55j08K57n1n7J25k52K48L1k29K95k07
4583f0J65l8l70J47K49k57L86k22k25M31k91m5L16l15K34J17k55K15k57O9K58
4604B52k62M4K48m22K32j28q6L90l07J01K00l93J58j45m4M24l00j82L66l10M22
4625B58l67P7K40j85j25L28l98M5K24m16L45j03J3K48m50L56j9j74M01m25N0O5
4647a2l24K17L24l00L11M1l13J64j20N4J32l75J96K20l90K57k35r7L48m08L12
4668BK0l00N47m09M5K51k91J81J74k95J29q8j13K46q6J49m4j83K78j04k71M09
4690B47j24k59K29k80K71k4k26J66n8j97M31k84L8K12k15J10M1%J8k14o4L51l48
4713a79N4K36l19K69J7j97K83k00P3Rj20L15k20l7J83m34K05J27j99J19K02m47
$$ plain form
4735 -260 41 -112 -133 57 -146 34 -160 -48 155 -68 -66 258 -227 9 125 -152 243 80 -214 36 29 -194
4757 -194 38 -173 -11 -63 -155 -60 -85 -170 146 -46 56 -21 -326 234 -120 -94 52 37 -102 129 -115 108 99
4780 99 -109 56 39 69 104 -181 174 32 -151 205 -118 -125 42 -177 -34 81 -130 11 -34 -36 118 -94 -84
4803 -84 -19 -69 258 139 -180 37 -31 49 61 -198 50 345 -118 -130 -89 -134 146 -141 33 77 13 36 -94 -47
4827 -47 134 -198 57 208 -271 -109 -29 -164 183 84 -80 189 -40 -186 66 -116 49 92 72 77 -201 -154 96
4850 96 -90 123 70 -158 198 -47 -79 -66 -128 33 160 -206 167 -101 -227 109 -6 225 24 -63 211 -56
4872 -56 -19 177 -57 79 258 -161 -85 -230 -90 264 -108 -10 45 -309 152 10 -155 267 69 -96 106 -338
4894 -338 30 95 -210 96 140 -183 -6 65 -190 -39 -34 138 165 -4 132 -236 -133 149 -200 261 140 -232
$$ packed form
4735b60L01j53k1J90k03J80j94J12K03k23KL24m85K36J16k77L95j63k94K50pk23
4757a94K32k11J62n2r2R5k5q5L16j92J02p7l05N60l54K6J46j5j39K31k44K23r
4780I9k08J65j7L0L5k85L55j42j83L56l23pJ67k19J43J15k11J41m5kJ54k12J0
4803h4O5n0L27j19l19K17o8Q0J2k59K48K95m63j2M1m5K80k87J74M4o4K3j30M7
4827d7J81l32K55J51m79J62Q0j35L47r9j64K69k29j46K52j82J65M3k0Nk78M7K50
4850I6j86K13n3k28L56k45l2J3o2J61J27l66L73k68j26L36j15K31k01q7K74k67
4872e6L7J96k34J36J79m19P6j45J40L54l72R8N5l54M61j42j65M22j98j65K02m44
4894c38L68O5l05L06M4l23J77P1k55J51NJ72K7j69J36l68J03K82l49M61j21l72
$$ plain form
4916 -232 73 -104 -132 199 -86 -36 116 -230 -84 -245 -8 105 -96 100 99 -120 51 86 -315 281 150 -7
4938 -7 150 -244 -135 -35 19 183 129 -24 34 -36 34 -17 -177 -34 -13 -180 178 -295 -133 61 -81 225 291
4961 291 32 90 -62 -27 24 -7 228 49 -36 33 -69 93 143 -175 173 91 -301 -44 -109 9 267 -34 26
4984 26 12 -83 -202 65 -165 126 93 -95 6 -200 -49 -214 -239 227 237 33 -40 -70 -265 -26 -92 75 109
5007 109 -80 -87 -236 -81 -36 -145 -28 131 -173 76 -45 -171 115 -50 64 257 -95 249 63 -117 150
5028 150 -69 112 229 -104 215 -116 -14 352 124 -86 78 -81 -14 -54 -153 235 -11 96 154 -157 149
5049 149 -10 -104 171 -109 -60 70 -88 1 166 -62 139 135 -142 82 -23 -173 145 57 72 88 32 151 38
5072 38 10 206 -127 -77 -8 -111 63 -5 -150 79 6 -25 242 14 -13 -2 -72 136 140 102 203 -203 -75 10 -238
$$ packed form
4916b32L05j77k8L31k85N0J52l46J46j61K37J13k01J96jk19J71L5m01N96j31j57
4938gJ57l94J09J00N4J64n4j53N8p0P0n1j60J43K1j67L58m73J62J94j42L06O6
4961B91k59N8j52L5N1l1K35j79q5O9j02J62N0l18L48q2l92K57o5J18K58l01O0
4984B6j4r5j19K67k30K91l3j88J01k06J51j65k5M66J0k04p3l0j95K39o6J67L4
5007A09j89pj49J55M5j09J17J59l04K49j21j26K86j65J14J93l52L44j86j80K67
5028A50k19J81J17l33L19l31J02L66k28k10J64j59O7m0r9L88k46J07N8l11L06
5049A49j59r4K75k80M9J30j58Q9J65k28K01mk77K24j05j50L18q8J5J6n6J19j13
5072C8k8J96l33N0O9j03J74o8j45K29p3l1K67k28k7J1p0K08Ml8J01m06J28Q5k48
$$ plain form
5097 -238 130 -110 -119 27 -106 -7 0 -172 88 49 -206 98 -16 -121 -105 -299 -45 32 -194 162 -106 -53 390
5120 390 -156 199 329 -166 67 160 90 30 25 -124 67 70 73 -75 -50 130 -41 95 269 -126 145 75 -98 251
5144 251 37 68 81 -158 179 -100 69 22 32 3 224 -159 37 24 -293 63 160 -31 20 -58 -97 237 -113
5167 -113 129 50 19 60 -169 -112 138 -178 -27 157 -69 116 -11 -46 64 -184 -84 -41 -157 234 99 -238
5189 -238 161 70 -141 38 -135 179 0 -276 289 -63 -118 129 -118 119 22 -95 69 4 -167 21 -51 10
5211 10 108 -66 204 -118 74 157 -197 -106 -21 32 -61 120 -39 140 14 -124 79 -196 -206 -68 28 160 -129
5234 -129 -57 -54 -257 -154 153 -135 105 7 -208 249 57 -78 201 -131 -57 -77 57 143 -29 -51 144 -150 -14
5257 -14 62 -257 132 116 -90 316 -264 -117 274 -169 36 84 -20 49 73 -137 116 -137 44 -115 -103 165
$$ packed form
5097b38L68k40rJ46j33R9Pj72K60l9k55L04j14j05J6j94K54P7k26L56k68N3M43
5120C90n46L55J30m95K33R3p0o0nj49J91LLj48K5J80j71J36J74l95K71p0j73L49
5144B51k14L1J3k39L37k79J69m7J0k9K21l83J96j3l17L56R7j91N1p8l9L34l50
5167a13K42p9l1M1k29N7K50l16J51J84k26J85j27l5J10k48J00M3j16L91j35l37
5189b38L99r1k11J79j73L14j79k76N65l52n5K47k47K37r7j17J64o5j71J88p2O1
5211A0R8j74K70l22J92Q3l54R1Q5N3r3J81j59J79j26j38K03k75j0J38R6J32k89
5234a29P2Lk03J03L07k88K40r8k15M57j92j35K79l32P4k0J34Q6j72k2J95k94J36
5257a4P6l19L89j6k06M06n80J47L91m43K05M8j04O9K4k10K53k53J81j59J2K68
$$ plain form
5279 165 -143 -239 166 -93 -91 50 -94 45 40 -36 158 1 16 -11 -37 2 -58 -230 -4 -24 38 208 -51 77
5303 77 -9 -58 21 96 -111 199 -70 -47 125 39 190 -98 -108 186 -61 173 295 -34 337 194 40 253 -41
5326 -41 93 -30 -156 50 60 -67 -70 -16 -103 6 6 5 189 -138 140 -19 -3 215 23 -64 81 -184 95 40
5350 40 -248 176 -154 -130 261 -188 47 -115 -75 47 27 -126 118 -106 29 217 -87 120 -31 -75 -14 -99
5372 -99 147 131 -56 151 68 -78 109 -213 -152 100 -69 -96 128 -199 119 -62 -344 184 48 -182 105 -168
5394 -168 14 -139 -31 301 -117 -55 137 -142 -149 56 -145 161 -10 3 214 110 -52 35 -192 41 -74 17
5416 17 156 -65 117 26 -76 230 82 -199 185 -57 -161 92 15 250 2 -91 21 59 33 125 -143 137
5438 137 81 -58 124 11 -94 200 92 -59 221 -26 -49 3 -101 -51 -60 48 -22 -270 6 -44 -239 245 -86
$$ packed form
5279A65l08r6M05k59KJ41j44J39np6J94j57J5k7k6L9o0j72K26k0O2J70k59J28
5303G7q6m9P9P5k07L10k69K3J72q6J51k88j0K94k47K34J22l29L71j43j54K13k94
5326d1J34j23j26K06J0j27lN4q7J09%jJ84l27K78j59J6K18j92q7J45k65K79n5
5350D0k88M24l30K4L91m49K35j62M0J22k0j53K44k24J35J88l04K07j51m4O1q5
5372i9K46j6j87K07q3j46J87l22O1K52j69k7K24l27L18j81k82N28j36k30K87k73
5394a68J82j53J08L32m18O2J92k79pK05k01L06j71J3K11j04j62Q7k27K33j15R1
5416A7J39k21J82r1j02L06j48k81L84k42j04K53p7K35k48r3J12L8k6R2k68K80
5438A37n6j39J82j13j05K94j08j51K80k47k3N2j04N0rJ08p0k48K76n0j95M84l31
$$ plain form
5461 -86 55 113 -156 -149 -36 -201 136 124 -139 57 -129 -59 -15 -230 31 157 -69 41 -52 -148 33 -157 -17
5484 -17 32 -64 2 -114 -216 165 54 -8 -14 -81 -12 -69 -179 242 -120 134 268 -160 10 145 -79 24 82 98
5508 98 228 2 121 27 -141 16 65 81 -19 -199 9 74 -125 281 37 53 377 -141 -104 171 12 63 229
5531 229 -32 288 66 66 97 49 219 160 -93 5 53 -30 -20 -166 -43 175 -82 56 42 -242 102 35 100 -61
5555 -61 -167 -209 -131 -56 -126 -225 -278 29 -293 -112 79 -257 105 -108 -94 -6 -264 -80 -101 -233 45 -91 -151 117
5579 117 -78 -39 129 -44 166 107 -158 68 -89 35 60 -64 74 68 13 205 102 92 163 188 80 96 96 129
5603 129 63 -174 255 92 -112 333 8 212 236 -168 301 209 -51 143 -51 -166 -20 -197 276 -172 -157
5624 -157 205 -172 -103 138 -58 182 114 -84 30 8 -165 206 -174 -36 -39 -276 -10 -8 -248 130 -159 -11
$$ packed form
5461h6J41N8k69PJ13j65L37j2k63J96j86P0M4k15K61J26k26J10r3r6J81j90J40
5484a7M9r6O6j16j02L81j11o2oo7O9n7j10M21l62K54J34m28J70J35k24J03N8J6
5508I8J30k26J19r4j68J57M9J6j00j80K08O5j99M06k44J6L24n18L7K75j59N1J66
5531B29k61L20k22%L1m8J70n9k53R8M8q3J0j46J23K18k57J38j4k84L44o7O5j61
5555f1j06m2P8P5p0r9n3L07l22J81J91l36L62k13J4Q8k58J84k1j32K78j36o0K68
5579A17j95L9J68j73K10n9k65K26j57J24K5j24J38on5J92j03j0P1K5j08J6%L3
5603A29o6k37M29j63k04M45l25K04K4m04M69r2k60J94j94j15J46j77M73m48J5
5624a57L62l77O9K41j96K40o8j98J14k2j73L71l80J38lk37K66Kk40L78k89J48
$$ plain form
5646 -11 -14 -75 94 -87 36 -96 73 -42 268 -24 25 151 -71 138 -28 5 20 -161 -34 -1 -191 -28 5
5669 5 44 129 -9 82 60 -103 12 4 -73 39 25 -50 58 -124 111 -153 -231 -93 71 -97 -132 55 144 88 -152
5694 -152 38 6 -17 105 24 -36 133 -268 62 46 -181 307 -22 43 118 -150 -20 238 14 235 -124 -35 170
5717 170 -6 -117 -7 -119 161 117 -114 194 -45 3 59 19 120 25 -92 -15 -122 -98 177 -52 35 37 4 108
5741 108 -34 -69 132 33 63 152 -9 82 52 -178 40 -101 -115 37 -131 160 -6 -152 -17 37 -45 61 69 141
5765 141 -15 38 -32 -20 -254 2 42 9 49 -30 203 37 -87 254 8 -24 106 -159 73 -27 7 151 -73
5788 -73 -60 11 30 14 63 -77 -78 -24 -117 38 -137 48 23 -183 -73 10 60 95 72 -65 106 43 32 69 -233 121
5814 121 133 -131 231 -19 -163 267 -20 69 128 -133 108 -15 17 46 -66 -12 -21 -51 85 82 -136 135 -8 40
$$ packed form
5646a1lo1J69j81J23j32J69j15L10k92M9J26k22K09j66L3J5j81J27L3j90J63L3
5669EL9Q5j38R1k2j63J15qp7J12j4p5J08j82K35k64p8J38J64j68l5J87Q9n6k40
5694a52J90l2k3J22q1o0J69m01L30j6k27M88l29O5P5k68J30K58k24K21l59Q9K05
5717A70j76j11J10j12K80m4k31L08k39M8N6m0J01r5j17P7j07K4K75k29Q7Kl3J04
5741A08j42l5K01r9L0Q9j61R1l0k30K18j41j4J52j68K91j66j46J35N4q2J06QP2
5765A41j56N3p0J2k34K56M0l3M0p9K33j66j24L41k46l2J30k65K32j00L4J44k24
5788g3J3P1J9j6M9j40jN4r3J55j75J85k5k06J10Q3N0L5k3j37J71o3j1L7l02L54
5814A21J2k64L62k50j44M30k87Q9N9k61K41j23L2K9j12N4rl0J36lk18K71j43M8
$$ plain form
5838 40 -140 -31 128 -1 -70 -26 -150 25 21 -178 112 -142 116 167 117 47 161 -147 -14 -82 -30 177 -73
5861 -73 -151 83 73 4 10 61 73 122 15 199 -1 4 72 -150 -128 29 -159 80 148 -86 27 -99 195 -29 -145
5886 -145 -3 142 -142 93 -127 123 91 -203 120 87 12 51 127 71 120 -90 72 -120 -133 171 -100 116 -20
5909 -20 -262 187 -91 -123 25 6 -122 46 -80 51 -82 -264 21 -129 -148 -142 -191 -87 -96 -132 1 57 -39 -9
5933 -9 6 48 21 -51 -25 -1 -55 -138 -16 -69 81 -128 64 25 24 162 -95 -201 81 88 -148 40 -162 -59 13 -244
5959 -244 196 -146 -70 223 63 -96 23 -127 27 -215 -42 168 -93 75 131 48 268 73 -31 201 -76
5980 -76 36 173 -18 148 -30 -82 -13 61 92 237 10 163 259 209 101 110 3 116 160 -68 -156 -78 61 -81
6004 -81 89 106 -40 107 107 -41 19 102 0 25 -45 -147 -66 -206 -93 -122 -273 170 -42 61 78 -114 -79 -137
$$ packed form
5838D0j80J09J59j29o9M4j24J75mj99K90k54K58N1n0p0J14l08J33o8N2K07k50
5861g3p8K34j0o9ON1J2M9j07J84k00NO8k22K2J57j88K39O8k34J13j26K94k24j16
5886a45J42J45k84K35k20K50l2k94L23l3p5L9P6n6M9k10J62j92j3L04k71K16j36
5909b0k42M49k78l2J48j9j28J68j26J31j33j82K85j50j9Om9J04rl6J33N6r6L0
5933iJ5M2k7p2K6K4n4q3J22n3J50k09J92l9jJ38k57j06K82Pk36J88k02J03P2k57
5959b44M40l42P6K93j60j59J19j50J54k42J73K10k61J68N6q3K20j95j04K32k77
5980g6J12J37j91J66j78n2O9P4L1J45k27J53R6n0j08Rj07J13M4k28q8P8J39j42
6004h1J70J7j46J47%j48O0Q3j02K5p0j02Q1j40J13k9j51M43k12J03J7j92L5n8
$$ plain form
6028 -137 -128 -54 34 -282 -195 -249 -133 36 -183 -8 136 -128 85 -26 60 -8 -11 112 55 94 151 -107 -82 138 -128
6053 -128 79 204 -11 167 42 -58 175 124 22 50 -33 131 143 82 254 90 206 231 130 107 48 10 -99
6076 -99 57 56 34 -46 -33 169 -255 -87 -47 -4 -103 -122 -158 -96 1 0 88 -65 13 -29 -248 8 -208 66 102 -134
6102 -134 61 47 -10 15 -29 36 108 -116 -5 -119 -28 246 29 -85 -45 -109 -107 -44 -15 169 -63 -39 131 -26 27
6127 27 7 12 133 167 56 25 -170 -1 177 -54 38 -91 -149 -119 -121 -216 58 -33 164 -222 56 65 -141 -57 37 7
6153 7 -2 -14 -115 99 -157 9 118 -55 122 136 -52 158 -25 30 -109 -14 86 29 -103 48 93 66 279 33
6177 33 -52 62 91 70 153 -9 126 17 -175 139 -29 -23 56 -13 57 -43 -75 179 -21 -62 41 -180 107 87
6201 87 -16 103 -39 61 -90 -175 -79 147 -84 -4 -78 -206 103 -9 -57 -104 -105 8 -67 -7 47 17 -53 4 -181
$$ packed form
6028a37RP4Q8l16Q7n4J16J69k19J75J44k64K13j11Q6o8lJ23n7L9N7k58K5K20k66
6053a28K07J25k15J78j25j00K33n1j02K8q3J64J2o1J72j64J16K5j01k3n9l8j09
6076i9J56jk2q0J3K02m24J68M0M3r9j9l6O2R7jQ8j53P8m2k19K56k16K74L6k36
6102a34J95j4n7K5m4O5P2k24J11j14R1K74k17j14M0o4KO3K9J84k32K4J70j57N3
6127B7k0NJ21L4j11l1j95J69J78k31R2j29n8L0kr5K74r1J97l86K78Rk06Q4R4l0
6153Grj2j01K14k56J66J09j73J77J4j88K10j83N5j39R5J00n7j32J51M5k7K13k46
6177C3q5J14K9k1Q3j62J35j09j92L14j68OP9o9P0j00l2K54k00m1J03k21K87k0
6201H7j03J19j42J00j51q5R6K26k31Q0p4j28L09j12m8m7jJ13p5O0N4l0p0N7j85
$$ plain form
6226 -181 60 -67 -41 143 67 -12 -17 -88 78 66 -251 29 211 27 -154 -39 -35 -38 -189 127 -13 56 79 -222
6250 -222 44 250 -101 4 26 -239 -32 -225 -106 117 -4 7 22 -223 28 -98 -51 137 -214 33 20 22
6272 22 135 -66 -141 73 24 -79 41 56 -68 242 -66 202 58 117 129 83 -141 78 10 30 -33 13 76 59
6296 59 68 56 42 37 126 -11 -49 -114 -119 33 -127 -29 -3 -161 58 85 -35 145 -142 28 -5 -230 -159 -134 -130 -10 -96
6323 -96 26 5 29 -59 64 3 76 156 -78 80 64 -72 -93 -196 21 110 -134 94 -22 22 104 -8 13 -59 126
6348 126 101 -58 28 45 4 -75 -35 -71 12 -65 73 106 -47 -18 59 -153 67 -88 -101 -33 -79 -48 120 81 42 -8
6374 -8 -14 201 33 -104 -115 -7 57 74 -237 -44 -16 -15 253 -30 -124 20 -23 53 153 -87 110 -174 31 197
6398 197 -46 140 -86 154 -97 85 -16 90 30 69 41 -2 -35 51 24 -55 -231 -133 21 -240 -10 -69 -34 -100
$$ packed form
6226a81K41j27K6J84p6p9np1J66j2l17K80J82j84j81J15Mlj51L16j40O9K3l01
6250b22K66K06l51J05K2k65K07j93J19K23j21J1J5k45K51j26M7J88l51K47j3K
6272B2J13k01p5K14m9j03J20J5j24L10l08K68j44N9J2m6k24K19o8K0o3M6O3j7
6296E9Rj2j4nQ9j37l8o5nJ52j60R8K6j58K19K7j20J80k87J70l3k25P1K5MJ20q6
6323i6J22k1K4q8J23o1P3Q0k34J58j6j36k1j03K17Q9k44K28j16M4Q2j12K1p2J85
6348A26k5j59Q6J7m1p9M0l6Q3p7J38L3j53K9P7k12K20j55j3O8m6L1J68l9l9n0
6374hoK15j68j37j1J08O4J7l11J93K8JK68k83r4J44m3P6J00k40J97k84K05J66
6398A97k43J86k26K40k51J82j01J06o0L9k8m3l3Q6k7p9j76R8J54k61K30n9L5o6
$$ plain form
6422 -100 -66 -33 -162 -127 -36 -235 -150 85 -61 17 -74 116 25 -22 212 -30 -48 103 -62 24 -83 148 158 191
6446 191 14 -14 40 60 161 9 -73 149 187 14 263 -50 -16 125 4 47 -102 93 70 84 201 143 147 -55
6470 -55 -89 6 47 -25 -143 26 -73 -51 89 -142 56 -50 -65 -2 -224 -189 -31 -130 -79 -95 -293 65 -27 -244 -84
6495 -84 -114 -151 83 -164 79 25 -74 239 -106 -71 -50 -315 -191 -8 -6 174 56 27 229 46 172 103 37 41 13
6520 13 37 172 21 -280 79 27 17 49 -19 284 -13 -107 -56 52 76 60 -213 119 108 -20 2 -85 66 -96
6544 -96 -163 176 -10 -87 80 37 -45 -11 -19 19 -56 -146 64 83 69 150 -87 -90 -73 30 -12 -58 -109 56 -127 68 134
6571 134 -68 90 134 -153 136 -79 253 243 11 168 -74 -96 61 -77 -87 -22 -95 -124 276 64 2 149 20
6594 20 41 34 82 -24 -66 59 -83 -101 107 15 -129 56 4 56 119 -296 -2 28 -12 -18 -144 -39 163 -262 128
$$ packed form
6422a00L4L3j29L5R1j99Q5K35j46P8r1J90r1m7K34k42j8J51j65Q6j07K31J0L3
6446A91j77k8N4K0J01j52q2K22L8j73K49l13L4J41j21M3j49J95k3J4J17n8Mk02
6470e5l4R5M1p2j18J69r9K2J40k31J98j06j5O3k22L5J58r9N1j6j98L58r2k17J60
6495h4l0l7K34k47K43n4r9L13l45L5K1k65J24J83KJ80j18k9K02j83J26o9o6Mk8
6520A3K4J35j51l01L59n2j0L2o8L03k97r4N1J08K4j6k73L32j1j28K2q7J51j62
6544i6o7L39j86p7J67m3q2L4qL8p5r0K10J9j4Q1k37lJ7J03m2m6n1J65j83J95O6
6571A34k02J58M4k87K89k15L32j0k32J57k42k2J57j38j0O5p3k9M00k12o2J47j29
6594B0K1pM8j06m2J25j42j8K08r2j44J85n2N2O3m15K94L0m0oj26J05K02m25L90
$$ plain form
6619 128 -181 -1 154 138 146 275 -132 100 114 45 246 -20 4 57 -23 52 11 -127 94 51 -47 26 -129 160
6643 160 -100 -123 -26 -29 -52 59 114 -48 11 62 4 48 48 92 64 -11 68 -125 -86 1 -105 96 -211 -5 24 -110
6669 -110 -87 144 -111 -13 -115 -62 -79 -125 -54 146 -30 -106 -92 -97 85 -113 -18 67 -201 1 52 34 208 96 129
6694 129 -5 22 82 78 73 229 58 27 -15 -30 5 94 83 -72 23 -172 54 -160 -78 147 -140 -55 60 -70 39
6719 39 -21 6 26 -96 -60 39 -197 -92 204 -116 203 -149 -75 90 -95 -31 112 2 204 83 -101 -71 -100
6742 -100 294 152 -135 -16 -81 73 52 42 -38 15 -120 28 -39 -124 -70 -37 29 -18 -27 28 -67 -105 34 43 58 162
6768 162 -132 5 4 102 98 -81 -110 -35 30 13 -77 88 9 -6 20 59 -9 52 82 -22 102 35 -189 85 44 -67
6794 -67 -114 -73 159 112 130 -30 -51 100 98 95 -28 0 -126 -164 -171 -217 0 -53 -103 -30 -128 -54 25 -128 -14 23 -187
$$ packed form
6619A28l09J80J55j6QJ29m07K32J4o9K01k66K4N3q0P5m1j38K21m3r8P3j55K89
6643A60k60k3R7lk3J11N5j62N9N1n8M4%M4k8p5P9j93L9Q7j06K01l07K06K9j34
6669a10K3K31k55R8j02N3j7m6P1K00j76p6J4nJ82j98R5Q5k68K02N1j8J74j12L3
6694A29j34K7O0mnJ56j71l1m2j5L5Q9j1j55R5j95K26k14Q2K25k87Q5J15j30J09
6719C9o0K7K0j22L6R9k36J05K96l20L19l52P4J65j85O4J43j10K02j21j84L0k9
6742a00L94j42k87J19o5J54k1j0q0N3j35J48o7q5N4L3O6m7rN5r5l8J39RJ5J04
6768A62k94J37jR8mj79k9P5O5j7r0J65p9j5K6L9o8O1L0j04J24o7k24K74m1j11
6794f7m7M1K32m7J8j60k1J51klj23K8j26l8pm6K17n3n0P3r8P4P9j53J14L7k10
$$ plain form
6821 -187 152 -24 63 31 -118 -102 46 -53 12 86 -47 25 -25 58 27 -187 -111 -32 -25 66 -73 67 164 22 23 -22
6847 -22 18 47 -139 70 -38 96 -142 -103 18 12 -11 -138 27 -132 59 46 -34 117 64 206 313 76 -69
6870 -69 50 -36 113 -113 -123 11 76 -27 34 84 -75 -40 -194 -68 -25 -134 22 -93 23 -38 -36 -87 -25 55 81
6895 81 -119 -8 128 -89 56 -104 -66 99 10 -29 -12 -1 78 -1 -139 13 65 89 132 43 157 96 -29 65 -19
6920 -19 55 137 -69 181 208 38 64 67 -116 69 -9 -205 -38 -87 111 41 -136 17 56 -87 39 -42 -165 126
6944 126 -103 -12 108 -215 11 -330 -62 -121 155 37 61 61 -125 -53 -33 89 -45 -149 98 -112 120 39 11
6967 11 111 -19 -43 246 -126 -1 -76 24 -112 114 6 49 -101 34 164 -21 127 6 -48 -69 -79 39
6989 39 114 -42 40 -43 -60 37 36 -99 -8 -159 71 53 -5 135 -90 -35 -67 -40 -18 -90 -200 68 -35 -20 38 2
$$ packed form
6821a87L39j76Q7l2j49J6J48r9O5P4j33P2n0Q3l1k14P6P9PR1j39J40R7j42Jm5
6847b2M0K9j86K09j08J34k38L9J21ok3j27J65j59J91j3q0J51n3J42J07k37j45
6870f9J19q6J49k26j0J34O5j03O1N0j59L5j54J26M3j09J56j15J16o1Kn1O2Q0K6
6895H1k00J11J36k17J45j60L8J65q9l9J7J1P9p9j38J52N2K4M3q9J14o1j25R4q4
6920a9P4Q2k06K50K7j70K6Lj83J85p8j96J67m9J98p0j77J53L9j43J26q1j23K91
6944A26k29R1J20l23K26l41K68n9K76j18K4%j86P2K0J22j34j04K47k10K32q1k8
6967A1J00j30k4K89l72J25p5J00j36K26j08M3j50J35J30j85J48j21n4k1j0J18
6989C9P5j56Q2q3j7R7jj35R1j51K30j8n8J40k25N5l2K7K2p2j10K68j03J5N8l6
$$ plain form
7015 2 -22 19 -190 -62 -103 -18 29 -21 -25 -194 -93 -171 -99 -125 -31 -3 156 -131 92 52 -120 -58 227 24 134 119
7041 119 44 134 49 14 -25 49 9 69 -122 29 95 -231 212 -54 163 246 -101 -72 36 -22 -5 -101 -123 139 -141
7066 -141 -1 85 -29 156 -42 -51 -103 -25 71 -130 -47 -52 117 137 10 194 -24 82 -3 6 -51 -166 10 -59 49
7091 49 35 24 21 89 117 21 -87 -28 31 -60 16 71 -35 54 -72 -69 237 -70 -65 -79 -64 89 127 61 -38 71 -24 152
7119 152 30 20 252 -157 83 12 11 -14 81 -2 154 -1 43 41 13 -17 -124 -88 9 86 -50 -22 27 107 69 49 57
7146 57 -1 -27 -125 30 -127 -58 4 87 135 -7 -23 -79 -62 147 -38 -73 -15 46 23 133 23 227 -160 140 -15
7171 -15 -126 18 -158 -62 60 -109 -109 -1 -127 97 -6 77 -28 -119 -78 -30 -123 -69 49 -125 77 11 -101 126
7195 126 -198 -1 31 -10 -71 27 286 -1 71 32 -28 37 -15 -60 108 31 -74 -121 15 -132 255 44 102 5 -189
$$ packed form
7015Bk4M1k09J28m1Q5M7n0mj69J01p8P2k6R4K8J59k87K23m0j72O2K85k03J10j5
7041A19p5R0q5l5l9P4m0O0j91J51O6l26M43k66K17Q3l47K9J08n8J7r6k2K62k80
7066a41J40Q6j14J85j98rn2P8R6k01Q3nJ69K0j27J84k18J06q5Rn7j15J76o9J08
7091D9j4j1lO8K8r6j08N9N9r1P6N5j06Q9j26LL06l07Nj4J5J53L8o6r9J09r5J76
7119A52j22j0K32m09K40p1jk5R5q3J56j55M4kk8l0j07L6R7P7j36K8M9Q0l8k0Q
7146E7n8k6r8J55j57O9O2Q3M8j42j6n6J7K09j85l5N8O1k3J10j10K04l87L00j55
7171a5j11J44j76R6J22j69%J08j26K24j03Q3j05r1M1M8r3N4J18j74K02o6j12K27
7195A26l24J97L2m1o1R8K59k87P2l9o0O5n2m5J68p7j05m7J36j47L87k11N8r7j94
$$ plain form
7220 -189 100 -34 -11 122 -73 78 72 -28 20 21 -156 15 -27 10 66 -127 -125 -24 4 -36 10 -82 144 -46 -49 92
7246 92 -119 -22 -154 -191 -176 86 -146 123 -52 -27 86 -76 49 98 -13 26 68 -151 -69 -4 -2 59 -34 3 -6 -81
7272 -81 107 32 13 43 -70 -78 113 -101 -41 44 80 1 -190 66 -11 -29 -64 33 -162 63 -162 97 90 -60 -35 74
7298 74 -16 -44 -51 106 -4 3 45 -51 -4 46 -70 -3 318 -33 -92 -67 -65 40 -181 -98 171 33 -11 83 -75 124
7324 124 -33 -21 117 -113 220 -67 -21 5 204 -125 120 32 -139 65 -203 -107 112 -19 -208 -53 97 3
7346 3 23 2 -97 -151 -128 95 -91 102 -37 -23 -54 -59 -118 -36 -185 24 53 111 79 -192 34 -108 8 43 0 -14
7372 -14 147 -67 -28 118 -149 176 165 -82 103 -111 -106 6 -73 83 72 -136 -12 -57 -130 132 55 -142 88
7395 88 -7 -115 47 41 81 -12 40 114 -50 -96 155 50 75 -145 -13 -59 -15 162 12 -212 100 16 122 -51
$$ packed form
7220a89K89j34K3J33j95J51oj00M8Jj77J71m2L7N6j93KJ01K8m0M6r2K26j90lJ41
7246I2k11R7j32l7J5K62k32K69j75K5J13j62J25M9j11L9M2k19Q2O5KO1r3L7rp5
7272h1J88p5j9L0j13qJ91k14O0Q5L6p9j91K56p7j8l5R7j95K25k25K59pj50K5J09
7298G4r0k8pJ57j10PM2r6M7N0j16O7L21l51n9K5KJ05k21Q3K69j38m4R4j58J99
7324A24j57J2J38k30L33k87M6K6J99l29K45q8j71K04k68R6K19j31j89J55J50r4
7346CK0k1r9n4K3K23j86J93j39J4l1nn9Q2j49K09K9N8l2k71K26j42J16L5m3j4
7372a4J61k14L9J46k67L25j1k47J85k14NJ12p9J56j1k08J24m5p3K62p7j97K30
7395H8r5j08J62oM0r3N2P4j64m6K51j05K5k20J32m6M4J77j50k24L12q4J06j73
$$ plain form
7419 -51 -83 -28 -44 -129 -52 95 -113 46 62 -13 96 -35 -7 190 -79 -8 47 -40 -94 -137 33 -30 -103 52 -89
7444 -89 10 66 -103 32 -2 -160 49 97 42 47 60 30 -12 12 35 -30 -144 32 -103 -171 116 78 36 -44 -140 123
7470 123 -30 130 194 -144 -41 -105 -11 97 -68 -93 136 -15 -71 114 -69 -104 -156 13 -38 -172 -64 -59 -24 117
7494 117 3 58 -77 17 -43 269 28 82 -30 25 -19 -68 70 121 -37 -110 160 -290 -106 -126 26 4 -55 8
7518 8 -30 7 120 157 -133 203 44 57 -2 -125 70 -64 -96 -50 184 -82 -7 152 -98 75 19 -24 -148 153
7542 153 -63 -78 30 143 50 -34 128 -189 -53 -125 97 96 1 -113 -12 -232 18 173 -107 5 -80 19 -173
7565 -173 87 34 -1 -140 -171 -11 -8 47 82 53 -10 30 77 -17 93 -58 -17 50 91 -20 47 -69 -121 12 -89 -142
7591 -142 -13 -92 6 -115 -40 93 -198 -187 101 -4 -133 19 -107 -28 171 -59 55 -30 80 142 -140 -50 -66
$$ packed form
7419e1l2N5j6q5P7J47k08J59J6p5J09j31K8J97k69P1N5q7n4m3J70o3p3J55j41
7444h9R9N6j69J35l4j58K09M8n5NJ3l0m2K4K3o5j14J76j35o8K87l8m2q0r6K63
7470A23j53J60O4l38J03o4R4J08j65k5K29j51n6J85j83l5n2J69n1j34J08NL5J41
7494A17j14N5j35R4o0L12k41N4j12N5m4m9J38N1j58p3K70m50J84k0J52k2n9O3
7518Hl8L7J13L7k90L36j59J3n9j23J95j34l2M6K34k66P5J59k50J73n6m3j24L01
7542A53k16j5J08J13r3q4J62l17J36p2K22jr5j14J01k20K50J55k80J12q5R9j92
7565a73K60n3l5j39l1J60LN5L5k9o3M0M7r4J10j51M1O7M1j11O7j16n2J33j01n3
7591a42J29p9R8j21P5J33k91J1K88j05j29J52j26P9J99k30J14q5J10O2k82R0j6
$$ plain form
7614 -66 112 84 -112 64 -22 -205 118 -97 139 197 -11 -42 144 -168 92 78 78 200 39 -36 -43 18 76 10 -100
7639 -100 -137 -60 -191 -132 84 37 94 87 -137 30 8 -169 58 84 81 -106 42 77 -147 82 24 -1 -118 98 184
7664 184 42 -81 -175 -15 -15 152 159 -48 -86 -102 223 -47 -43 116 32 116 62 -160 83 115 -103 21 -82 -89 -144
7689 -144 -96 34 3 -168 34 195 -137 99 -64 -59 87 -56 2 17 -28 116 45 -39 27 -52 -105 47 -34 141
7713 141 163 -55 185 48 -100 -32 -229 -202 28 32 21 -105 187 -107 -162 -141 -32 9 84 227 -65 -1 -183 6
7737 6 129 -142 -31 94 77 30 92 15 42 11 -24 -100 -26 58 -143 -186 11 67 98 64 -113 106 94 94 93 -85 -41
7764 -41 8 -167 67 -8 54 114 56 -96 1 104 30 135 -117 -97 44 -88 -13 -119 279 -21 -8 30 6 36 108
7789 108 16 -96 157 -191 92 35 -56 8 164 49 118 -42 -7 37 23 133 97 -84 78 94 -149 -90 -51 47
$$ packed form
7614f6J78k8j96J76q6j83L23k15K36N8k08l1J86l12K60j4%J22j61p5pO1N8o6j10
7639a00l7P7j31N9K16m7N7pk24J67k2j77K27K6lj87J48L5k24K29n8k5j17K16Q6
7664A84j42j23r4J60%J67Pk07l8j6L25k70MJ59q4Q4n4k22K43L2k18J24j03pn5
7689a44M8J30l1j71K02J61l32K36j63NJ46j43N8J5m5J44p1q4O6p9n3J52q1J75
7713A41K2k18K40j37j48O8j97K7K30Mj1j26K92k94n5K1J09M1P5J43k92O4j82J89
7737FJ23k71J11J25j7m7O2p7K7l1l5p6P4Q4k01m3J97N6L1l4j77K19j2%jj78M4
7764d1M9j75K34p5O2O0n8j52R7J03p4J05k52K0J41j32P5j06L98l00J3L8k4L0P2
7789A08r2j12K53l48K83n7r1O4J56j15O9j60L5M4j4J10l6j81J62J6k43N9L9R8
$$ plain form
7813 47 16 -143 61 26 -107 231 -85 25 -136 -117 38 51 -45 -93 -35 -123 -39 -156 39 74 -10 36 -69 -4 62
7838 62 -74 156 -22 -269 107 -125 48 106 -128 119 59 41 142 -84 113 176 93 -89 86 -125 171 71
7860 71 8 96 2 -17 93 -3 -58 80 -53 17 1 -28 127 -49 115 62 -68 127 108 -85 153 105 26 -87 -103
7885 -103 27 -2 -151 -72 -154 -35 39 -34 83 44 -89 93 105 68 35 15 113 -97 90 31 36 -34 45 0 -92 -28
7911 -28 -86 105 149 70 127 25 59 178 -137 3 17 -41 20 39 -44 -15 69 12 94 -30 -1 47 -164 149 -187 64
7937 64 -4 -216 6 -55 41 52 -30 69 13 56 -77 179 -96 -63 60 126 179 -82 -107 9 -13 72 149 5 69 61
7963 61 -14 43 -90 -23 61 -209 -22 52 86 87 -18 52 -129 -23 168 67 -69 -84 61 -122 19 88 246 -42
7987 -42 118 66 74 -85 207 -171 211 -3 -126 40 89 34 33 -63 53 187 193 188 -25 18 -91 -162 -50 -59 -87 -47
$$ packed form
7813D7l1j59K04l5j33L38l16J10j61J9J55J3r6m8N8q8Q4j17J95L5q4M6j05O5O6
7838F2j36K30j78k47L76k32J73N8k34K47o0j8J01k26J97O3q3j82J75k11K96j00
7860G1o3Q8r4j9J10r6n5J38j33P0j6k9J55j76J64n3j30J95j9j93K38m8p9j13j6
7885a03J30k9j49P9q2J19P4p3J17l9j33J82J2l7l3k0R8k10J87n9Np0P9m5r2O4
7911b8n8J91M4p9N7j02L4J19l15J40J4n8O1J9q3K9Q4n7Q2j24K9M8k11L13l36K51
7937F4o8k12K22o1R6J1q2R9n6M3j33K56k75L3J23O6N3k61k5J16k2Q5P7j44O4q
7963F1p5N7j33O7Q4k70J87P4L4Jj05P0j81J06J91j01j36j5J45j83J41O9J58k88
7987d2J60n2Qj59K92l78L82k14j23J66M9n5jr6J16J34Onk13M3j09p1J12rk8M0
$$ plain form
8013 -47 -77 8 168 165 -14 -68 -122 36 82 -25 61 -41 46 88 -148 27 165 -84 159 61 -21 88 -129 -1
8037 -1 -39 -59 -115 180 -132 -50 -60 55 69 -239 -70 65 62 -9 20 40 -4 136 -38 75 -132 143 -62 -16 -16 -30
8063 -30 89 -97 -65 -77 -7 -35 51 75 125 118 73 140 135 24 -6 61 -30 -10 -8 -125 -28 103 45 -39 -62 65 92 -47
8091 -47 67 -94 -37 -77 -9 2 86 37 35 -94 -58 -103 -76 16 -174 -46 79 -67 78 35 -60 61 -88 -104 83
8116 83 -35 69 139 -105 36 -30 118 148 -220 44 -173 -116 -131 14 -51 45 -152 43 63 -92 36 28 -177 129
8140 129 89 -189 121 43 101 63 -182 54 -25 25 48 -30 30 30 47 -93 2 -101 35 -73 35 -11 -63 55 108
8165 108 71 91 -47 -19 40 -56 146 10 -101 -38 296 -46 -94 -80 -20 91 -133 -80 -127 -26 57 -49 -47 -146 50
8190 50 -4
$$ packed form
8013d7l0Q5J60lj79n4n4J58M6j07Q6j02Q7M2k36J75J38k49K43r8q2J09k17J28
8037al8k0n6K95l12Q2j0J15J4l08J69J35lp1K9K0m4J40j74J13k07K75k05M6%j4
8063c0J19j86L2j2P0k8Q6K4N0pm5O7nj11l0O7r1K0Kj17R7J31n8q4k3J27K7j39
8091d7J14j61N7m0O8J1Q4m9kj29L6m5K7R2j90J28J25j46J45m3r5J21j49j6J87
8116H3j18J04P0k44J41o6J48L0l68K64k17N7j5J45o5R6j97J95K0j55J28qk05L06
8140A29m0k78L10p8N8l8k45K36p9N0K3p8O0%J7j40R5j03J36j08J08m6n2J18N3
8165A08l7K0j38K8N9r6K02j36j11O3L34l42m8J4O0J11k24N3m7J01Q3j06Kr9J96
8190E0n4
8191d
$$ Imaginary data points
##PAGE= N=2
##DATA TABLE= (X++(I..I)), XYDATA
$$ plain form
0 0 0 0 0 0 0 0 0 0 0 0 0 -8 8 -8 8 -8 16 -16 16 -24 24 -32 37 -40 48 -56 67 -77 85 -100 115 -129 145 -163
34 -163 184 -208 232 -257 286 -319 354 -393 433 -479 527 -583 643 -705 778 -858 944 -1041
52 -1041 1150 -1268 1407 -1564 1743 -1951 2199 -2497 2864 -3326 3928 -4746 5918 -7722 10808
67 10808 -17037 34112 -168830 -435224 308028 159085 -345946 203329 466736 -167603 -160709
78 -160709 286913 9877 -236769 174215 193272 -124203 36698 127156 -126758 -56025 169493
89 169493 95171 -24850 102777 161374 -88796 -115513 156819 51510 -85733 185886 147230
100 147230 -158424 33048 207639 -117593 -76227 344544 79118 -281526 118818 143980
110 143980 -338719 -81037 230202 -136377 -144002 149773 -73315 -217987 80387 99729
$$ packed form
0@%%%%%%%%%%%qJ6j6J6j6K4l2L2m0M8n6O9p7Q8j04J23j44J62j85K15k44K74l08
34a63L47l92M40m89N43o05O73p47Q26r12J006j110J226j348J483j636J802j985
52a041K191k418K675k971L307l694M150m696N361o190P254q674J0664j3640J8530
67A0808k7845N1149k02942k66394P43252j48943n05031N49275K63407o34339O894
78a60709M47622k77036k46646M10984J9057l17475J60901R0458k53914P0733K25518
89A69493p4322j20021J27627N8597k50170k6717K72332j05309j37243K71619l8656
100A47230l05654J91472J74591l25232M1366M20771k65426l60644M00344K5162
110A43980m82699K57682L11239l66579p625K93775k23088j44672K98374J9342
$$ plain form
120 99729 -103516 51628 159276 -76619 -102032 22939 -53731 -39184 36638 -34737 -36129
131 -36129 -6536 -66551 -83105 -24565 60269 41875 -50656 10038 45522 -92220 -83408 60763
143 60763 26602 -44855 64776 62401 -111795 -7623 141281 -54512 -33310 200985 19071
154 19071 -139952 42693 12892 -118126 6190 53460 -59704 -15161 37730 -91484 -60616
165 -60616 103457 15374 -38561 101257 33399 -76046 8175 5014 -41301 26583 43185 -24625
177 -24625 -48230 2964 5784 -61354 -12685 82924 27313 -50163 -11466 26951 -37196 -52597
189 -52597 50739 27512 -41411 50011 17932 -84667 44535 87292 -34976 25765 102129
200 102129 -5741 -45993 29443 4648 -34890 47619 28895 -63098 25426 44136 -78787
$$ packed form
120I9729k03245J55144J07648k35895k5413J24971p6670J4547P5822p1375j392
131c6129K9593o0015j6554N8540Q4834j8394r2531O0694L5484j37742Q812J44171
143F0763l4161p1457J09631k375j74196J04172J48904j95793K1202K34295j81914
154A9071j59023J82645k9801j31018J24316M7270j13164M4543N2891j29214L0868
165f0616J64073q8083n3935J39818o7858j09445Q4221l161m6315O7884J6602o7810
177b4625k3605N1194K820o7138M8669R5609n5611p7476L8697L8417o4147j5401
189e2597J03336k3227o8923R1422l2079j02599J29202M2757j22268O0741P6364
200A02129j07870m0252P5436k4795l9538Q2509j8724r1993Q8524J8710j22923
$$ plain form
211 -78787 -3652 89795 3380 -10935 39120 7251 -25245 -6455 7808 -11885 3020 28726
223 28726 -26335 -45000 10222 4389 -23915 -7660 26650 20840 -39998 -27756 14811 -30231
235 -30231 -16129 23481 -30386 -13427 29822 -37030 -45623 34878 29473 -31909 -437 42817
247 42817 -23416 -31882 27449 -22781 -21611 51471 -16180 -52254 30944 16829 -39074 -2486
259 -2486 40621 13515 -15019 12556 7919 -16240 19192 10149 -21866 19965 22971 -19453 -16977
272 -16977 9778 23172 -8024 -15799 29453 6747 -24862 7268 -2954 -13253 17080 1722
284 1722 -24696 -1793 22406 -12744 -37170 24324 27899 -33891 1449 22301 -19739 5807
296 5807 14712 -19928 5596 28650 -4631 -25299 11134 29365 -19325 -15049 26930 -760 -7924
$$ packed form
211g8787P5135R3447q6415j4315N0055l1869l2496J8790J4263j9693J4905K5706
223B8726n5061j8665N5222n833k8304J6255L4310n810o0838J2242M2567m5042
235c0231J4102L9610n3867J6959M3249o6852q593Q0501n405o1382L1472M3254
247D2817o6233q466N9331n0230J170P3082o7651l6074Q3198j4115n5903L6588
259b486M3107k7106k8534K7575m637k4159L5432r043l2015M1831L006m2424K476
272a6977K6755J3394l1196p775M5252k2706l1609L2130j0222j0299L0333j5358
284A722k6418K2903K4199l5150k4426O1494L575o1790L5340K0852m2040K5546
296E807Q905l4640K5524K3054l3281k0668L6433J8231m8690M276M1979k7690p164
$$ plain form
309 -7924 9446 -10829 2156 17789 -4330 -8833 2170 17002 1135 -27604 7135 20503
321 20503 -17562 -9946 4691 -689 1245 -5154 -3346 -111 6632 11258 -21154 -9630 29101 -13866
335 -13866 -30589 10611 15 -15668 -6563 -7497 -3823 1293 2578 -9845 -9279 23278 1674 -29242
349 -29242 10115 13462 -14511 -3782 -1292 3865 10573 -2863 3228 11561 16928 18307 -4696 7044
363 7044 28667 1789 -8606 3145 8525 7652 -12432 -5049 12707 -115 6194 4707 -4462 25097
377 25097 14783 -16641 4521 14460 -1532 -10141 -7124 5223 -3966 -10535 -4301 -10797 7467
390 7467 11124 -20299 -1183 14384 -13790 -15399 -10155 -7535 -609 -16619 -16767 -3146 -3346 -1537
404 -1537 -8582 1886 22823 5383 -4821 1288 -220 5407 -11152 -17567 7888 -2898 -16255
$$ packed form
309g924J7370k0275J2985J5633k2119m503J1003J4832j5867k8739L4739J3368
321B0503l8065P616J4637n380J934o399J808L235O743M626l2412J1524L8731m2967
335a3866j6723M1200j0596j5683R105r34L674N116J285j2423N66L2557k1604l0916
349b9242L9357L347k7973J0729K490N157O708j3436O091Q333N367J379k3003J1740
363G044K1623k6878j0395J1751N380q73k0084P383J7756j2822O309j487r169K9559
377B5097j0314l1424K1162R939j5992q609L017J2347r189o569O234o496J8264
390G467L657l1423J9116J5567k8174j609N244K620O926j6010j48J3621k00J809
404a537p045J0468K0937j7440j0204O109j508N627j6559o415K5455j0786j3357
$$ plain form
417 -16255 -7452 -10668 7362 14896 -4454 10031 24011 9176 -3614 -1894 14298 8929 -2831
430 -2831 6038 -4193 -2242 9675 -18257 -7519 27415 4386 -10462 -931 -4657 -7179 -16853
443 -16853 -15467 -2110 -3684 -6559 -18310 -17703 6803 1563 -1646 16350 14827 15618 2922 -17031
457 -17031 5424 8134 -11473 -1402 -4271 -10412 -7147 -21615 -14968 12583 19318 7248 2847
470 2847 22990 14414 -12485 12545 24373 9039 25016 11350 -10554 14028 14381 588 16205
483 16205 29892 27929 6188 -7591 1921 2289 1389 -1878 -1338 14680 -6517 -28570 -3644 2028
497 2028 5794 21572 6408 7558 11118 -17297 -19144 -5459 -4644 -3648 -15355 -27999 -29980 -27125
511 -27125 -27468 -34584 -3777 20571 -20242 -25904 -232 -21522 -20905 -193 -4897 4097 1401 -22882
$$ packed form
417a6255Q803l216J8030P534j9350J4485J3980j4835j2790J720J6192n369j1760
430b831Q869j0231J951J1917k7932J0738L4934k3029j4848R531l726k522r674
443a6853J386J3357j574k875j1751O07K4506n240l209J7996j523P91j2696j9953
457a7031K2455K710j9607J0071k869o141L265j4468O647K7551O735j2070m401
470B847K0143q576k6899K5030J1828j5334J5977j3666k1904K4582L53j3793J5617
483A6205J3687j963k1741j3779R512L68r00l267N40J6018k1197k2053K4926N672
497B028L766J5778j5164J150L560k8415j847J3685Q15R96j1707j2644j981K855
511b7125l43p116L0807K4348m0813n662K5672k1290O17K0712m704Q994k696k4283
$$ plain form
525 -22882 -23504 -10715 -1326 1756 8118 16075 3323 -3015 -9898 -24376 6733 22165 -10397 -260
539 -260 12746 -10837 -12295 -1706 18126 41266 28948 19449 26483 17058 5100 8633 25225
552 25225 25263 14005 16957 -9639 -26315 10905 7309 -9979 27490 30167 -878 -7124 -9514 -345
566 -345 11540 5902 7020 12098 3340 -21959 -24367 6767 7440 3761 24092 2215 -16336 -1909
580 -1909 -20945 -23228 7979 7164 -6436 -16858 -24894 -16281 -15696 -15374 5852 26233 17058 -14699
594 -14699 -10074 8142 -13179 -4373 22560 3413 -1539 -2720 -31938 -22122 1713 2374 9336 10413
608 10413 3856 -1585 -12969 -15640 -1934 22690 16307 -12777 2772 5684 -30353 -12571 15666
621 15666 8630 18472 11462 -11491 -7117 -7446 -11692 -1423 8356 8812 -5351 -16916 -21260 -16534
$$ packed form
525b2882o22J2789R389L082O362P957j2752o338o883j4478L1109J5432l2562J0137
539b60J3006k3583j458J0589J9832K3140j2318r499P034r425j1958L533J6592
552B5225L8j1258K952k6596j6676L7220l596j7288L7469K677l1045o246k390R169
566c45J1885n638J118N078q758k5299k408L1134O73l679K0331k1877j8551J4427
580a909j9036k283L1207q15j3600j0422q036Q613N85L22K1226K0381r175l1757
594a4699M625J8216k1321Q806K6933j9147m952j181k9218R816K3835O61O962J077
608A0413o557n441j1384k671J3706K4624o383k9084J5549K912l6037J7782K8237
621A5666p036R842p010k2953M374l29m246J0269R779M56j4163j1565m344M726
$$ plain form
635 -16534 7302 6040 -1664 26334 14686 -19369 -5627 3011 4187 17050 8213 5011 7720
648 7720 -12401 -19829 -3931 11875 13589 10049 11354 -4066 -9528 5168 -8295 -522 33958
661 33958 10740 -12691 1116 -5872 -7781 3843 7098 18143 19192 878 -12669 -7584 5995
674 5995 255 1470 16596 1211 -9200 -7293 -23381 -6884 16517 710 1435 7828 -5971
687 -5971 -10521 -13125 -5956 11050 9946 -1804 -9296 -5777 -6777 -19520 -2235 15071 3040 6753
701 6753 -702 -19465 -140 3940 -9786 9026 16618 222 -9110 -11483 -6003 758 6497 6504 1217
716 1217 9738 -390 -21463 -1216 10255 109 9116 3151 -5929 1547 -9516 -12303 5918
729 5918 11063 6454 -2724 -4429 -338 -6170 -3974 1236 6165 13886 -4159 -13805 2884 -3841 -5423
$$ packed form
635a6534K3836j262p704K7998j1648l4055J3742Q638J176J2863q837l202K709
648G720k0121p428J5898J5806J714l540J305j5420n462J4696j3463P773L4480
661C3958k3218k3431J3807o988j909J1624L255J1045J049j8314j3547N085J3579
674E995n740J215J5126j5385j0411J907j6088J6497K3401j5807P25O393j3799
687e971m550k604P169J7006j104j1750p492L519j000j2743J7285J7306j2031L713
701F753p455j8763J9325M080j3726J8812P592j6396r332k373N480O761N739Pn287
716A217Q521j0128k1073K0247J1471j0146R007n965r080P476j1063k787J8221
729E918N145m609r178j705M091n832K196N210M929P721j8045r646J6689o725j582
$$ plain form
744 -5423 7944 932 4912 7660 -12019 -10611 3751 4747 503 771 8382 917 -8935 -2816 -4571
759 -4571 4371 15056 -4056 -2380 10920 -6171 -7590 4247 4509 10004 5874 -2681 -818 971
773 971 2091 -3590 -468 12927 1939 -8289 -3300 -6055 1035 817 -8702 5926 6020 -9485 -5199
788 -5199 -4361 -2143 5100 -2866 -3947 1742 -91 -6550 -11068 2376 7776 -5421 1238 1992 -6015
803 -6015 4796 -2589 -8980 10609 6528 -7289 -3104 961 1435 -3754 -1852 6643 3483 4244 1870
818 1870 -5384 8011 8298 -3667 4583 5516 3147 3451 -6799 1629 10716 -664 515 4939 3863
833 3863 4505 -1866 -723 4101 2959 1677 -7638 -3980 7146 -8582 -10006 4423 -2780 -2075 53
848 53 -8161 196 3444 -5397 -5725 -1197 3675 -4850 -11084 913 -1216 -4802 222 -6064 1120 7167
$$ packed form
744e423J3367p012L980K748j9679J408J4362R96m244K68P611p465r852O119j755
759d571Q942J0685j9112J676J3300j7091j419J1837K62N495m130q555J863J789
773I71J120n681L122J3395j0988j0228M989k755P090k18r519J4628R4j5505M286
788e199Q38K218P243p966j081N689j833o459m518J3444N400j3197O659P54q007
803f015J0811p385o391J9589m081j3817M185M065M74n189J902Q495l160P61k374
818A870p254J3395K87j1965Q250R33k369L04j0250Q428R087j1380J179M424j076
833C863O42o371J143M824j142j282r315L658J1126j5728j424J4429p203P05K128
848E3q214Q357L248q841l28M528M872q525o234J1997k129l586N024o286P184O047
$$ plain form
864 7167 -6672 -2428 5065 628 1485 -3499 -1771 5872 -1685 -3918 286 2889 5832 -1881 -58
879 -58 8377 2665 3408 1826 -2001 9840 2404 -9143 3614 3484 -2828 135 -2241 2236 5047
894 5047 -325 -1210 -296 6720 2364 -9517 2082 4212 -8068 -2603 -4329 -5865 3422 -5544 -8539
909 -8539 1529 -365 -3295 -6016 -3441 3473 -3505 -5687 -2103 -2820 1940 -3529 -5807 7212 3344
924 3344 -503 4391 -689 6779 8784 -4062 3670 9911 1295 -938 -85 4234 4429 753 4547
939 4547 2372 5430 9759 -3883 2202 15106 1750 958 6500 833 4030 991 -3867 3918 5124
954 5124 1824 -3022 -2595 5109 -2124 -6017 1414 -1538 -463 -3727 -13161 -2649 -1187 -9803 -2995
969 -2995 -3121 -4055 -623 -10096 -8936 308 -1341 -5347 -7087 -1105 -2585 -13207 -5830 -2073 -5243
$$ packed form
864G167j3839M244P493m437Q57m984J728P643p557k233M204K603K943p713J823
879e8Q435n712P43j582l827J1841p436j1547J2757j30o312K963k376M477K811
894E047n372q85R14P016m356j1881J1599K130j2280N465j726j536R287q966k995
909h539J0068j894k930k721K575O914o978k182L584p17M760n469k278J3019l868
924C344l847M894n080P468K005j2846P732O241q616k233Q53M319J95l676L794
939D547k175L058M329j3642O085J2904j3356p92N542n667L197l039m858P785J206
954E124l300m846M27P704p233l893P431k952J075l264r434J0512J462q616O808
969b995j26r34L432r473J160R244j649m006j740N982j480j0622P377L757l170
$$ plain form
984 -5243 4205 -3084 -8999 4685 -1047 -7637 2931 5081 4622 1945 -2838 171 659 1842 1170
999 1170 1034 11324 4667 -6235 2691 2841 2297 8146 1500 5218 9525 -3749 -3036 3644 3891 7764
1015 7764 4891 2672 4324 2271 134 -3155 5185 14204 -226 -2060 5164 -5530 -3422 1459
1029 1459 -3397 6472 6449 -6426 -5526 -1940 -1219 -1895 181 6005 1343 -2549 -3601 -10829 236 7177
1045 7177 -4430 2223 5833 -5046 -4610 -6407 -2891 8553 2765 -1778 1722 -2218 -5604 -6722
1059 -6722 -255 5271 2237 3792 -3420 -9709 2285 -2892 -8077 8995 7146 -2721 -1921 -7731 -5311
1074 -5311 1852 -690 1549 5272 4165 -5718 -11564 -26 1996 -1010 7915 1832 -3427 1435 -9402
1089 -9402 -8370 6170 4593 3601 1346 -4668 -1901 -4798 -6259 2449 8881 7487 -3046 -4990 1300
$$ packed form
984e243R448p289n915J3684n732o590J0568K150m59k677m783L009M88J183o72
999A170j36J0290o657j0902Q926J50n44N849o646L718M307j3274P13O680K47L873
1015G764k873k219J652k053k137l289Q340R019j4430j834P224j0694K108M881
1029A459m856R869k3j2875R00L586P21o76K076N824m662l892j052p228J1065O941
1045G177j1607O653L610j0879M36j797L516J1444n788m543L500l940l386j118
1059f722O467N526l034J555p212o289J1994n177n185J7072j849r867Q00n810K420
1074e311P163k542K239L723j107r883n846J1538K022l006Q925o083n259M862j0837
1089i402J032J4540j577r92k255o014K767k897j461Q708O432j394j0533j944O290
$$ plain form
1104 1300 -6006 -1994 8869 3026 7454 6186 -10679 -4623 3923 -467 4841 7870 5149 1495
1118 1495 -5096 -5867 -2511 6287 9384 -714 3010 5011 -10626 -6791 1965 1355 9496 4676 -4894
1133 -4894 -882 -4650 -6920 149 4811 8310 3670 -4086 -6211 -6072 634 602 -1002 11300 4418
1148 4418 -9839 -3648 -4904 -3770 7127 2341 1264 5405 -4081 -10177 -6184 2150 5488 2213
1162 2213 3925 -305 -6277 -1888 -6451 -2603 12779 4588 -2424 1606 -5181 -4804 -679 -1052 7092
1177 7092 8327 130 -5036 -5866 -928 -752 262 7915 3510 -163 -2258 -12298 -2617 6840 -1722
1192 -1722 2952 6156 -3632 -4788 -6304 -5076 3820 6134 3474 -1072 -1267 -844 -8550 -2399 7651
1207 7651 3434 5816 1462 -8440 -476 -1 -5514 5213 8235 2781 -1187 -6172 -3338 -660 999
$$ packed form
1104A300p306M012J0863n843M428j268j6865O056Q546m390N308L029k721l654
1118A495o591p71L356Q798L097j0098L724K001j5637L835Q756o10Q141m820r570
1133d894M012l768k270P069M662L499m640p756k125J39O706l2j604J2302o882
1148D418j4257O191j256J134J0897m786j077M141r486o096L993Q334L338l275
1162B213J712m230n972M389m563L848J5382q191p012M030o787L77M125l73Q144
1177G092J235q197n166q30M938J76J014P653m405l673k095j0040R681R457q562
1192a722M674L204r788j156j516J228Q896K314k660m546j95M23p706O151J0050
1207G651m217K382m354r902P964M75n513J0727L022n454l968m985K834K678J659
$$ plain form
1222 999 3862 2876 4840 245 -9460 -2153 1604 484 7707 2336 -1526 4041 -5480 -7660 3559
1237 3559 5479 4193 1447 -1172 -1219 -5283 -3404 -499 1703 8001 -673 -7036 423 -3992 -4518 3872
1253 3872 700 3116 4387 -6202 -6386 -1117 249 885 58 4280 2108 -5101 -3337 -2966 1763 7263
1269 7263 -531 977 4901 -4799 -3645 408 -761 5926 4363 -2102 -105 -127 -879 -1723 894 7425
1285 7425 2609 -1071 -626 -4798 483 1424 -4458 4830 5488 -4238 -2108 -1536 -997 3123 1223 1461
1301 1461 2293 182 -1835 -6146 -1121 4114 -1824 -117 476 -3528 448 -3852 -4788 5671 2339
1316 2339 -2349 -65 -2478 -1769 -2157 -3230 853 1416 1199 -1843 -4899 2623 1530 -2545 4463 2742
1332 2742 962 2987 -4161 -1901 4698 -113 -596 1463 1439 1065 -2867 -684 2897 2011 3565 -774
$$ packed form
1222I99K863r86J964m595r705P307L757j120P223n371l862N567r521k180J1219
1237C559J920j286k746k619m7m064J879K905K202O298q674o363P459m415n26Q390
1253C872l172K416J271j0589j84N269J366O36q27M222k172p209J764L71M729N500
1269G263p794J508L924r700J154M053j169O687j563o465J997k2p52q44K617O531
1285G425m816l680M45m172N281R41n882R288O58r726K130N72N39M120j900K38
1301A461Q32k111k017m311N025N235n938J707N93m004L976m300r36J0459l332
1316B339m688K284k413P09l88j073M083N63k17l042l056P522j093m075P008j721
1332B742j780K025p148K260O599m811m83K059k4l74l932K183L581q86J554m339
$$ plain form
1348 -774 -1059 3955 -3003 -3657 2407 -1006 843 881 -4657 1247 2561 -1918 637 2753 3828 425
1364 425 -2855 783 -790 -1790 41 -4431 -86 2017 -6068 -2085 1601 -1234 1573 -430 -1185
1379 -1185 3098 -641 -2686 -1185 255 1762 -2434 -1821 2523 -852 921 1051 -1090 5780 2572
1394 2572 -3560 2788 1429 -1182 601 -2221 517 2323 -1151 -568 750 3651 2978 -1597 3586
1409 3586 4127 -837 1720 -1049 -1801 3221 -3270 -4308 1650 -921 -1562 -1200 -1102 2729 830 -636
1425 -636 286 -423 2284 -1939 -4028 2345 -697 -2819 226 -2631 687 2639 -3792 177 2738 -1144
1441 -1144 -1408 -2577 -1313 -613 -3512 -2459 -2379 -621 1414 -3909 -99 5495 -100 1812 3507 183
1457 183 3850 1225 -2958 1615 1258 -1117 -1825 -1555 1805 -526 -1341 1696 530 2847 1697 -3417
$$ packed form
1348g74k85N014o958o54O064l413J849L8n538N904J314m479K555K116J075l403
1364D25l280L638j573j000J831m472M345K103q085L983L686k835K807k003p55
1379a185M283l739k045J501J440J507m196O13M344l375J773J30k141O870l208
1394B572o132O348j359k611J783k822K738J806l474N83J318K901o73m575N183
1409C586N41m964K557k769p52N022o491j038N958k571o41L62R8L831j899j466
1425f36R22p09K707m223k089O373l042k122L045k857L318J952o431L969K561l882
1441a144k64j169J264P00k899J053Q0J758K035n323L810N594n595J912J695l324
1457A83L667k625m183M573l57k375p08K70L360k331q15L037j166K317j150n114
$$ plain form
1473 -3417 2323 2231 -3038 456 180 -294 2331 -1923 -1167 3232 1910 1080 404 2397 2605 -2620 -1042
1490 -1042 -400 -2010 1442 -2856 -4177 2739 -1300 -3307 1925 1226 2574 2435 -1048 591 978 -609
1506 -609 -1660 -2065 2235 -459 -4579 -174 -1248 -998 2540 -1426 1411 4764 -2261 -1855 566 -612
1522 -612 1220 -475 -1116 1103 -436 -1156 -2222 698 5238 2 -86 2902 -2059 -766 -411 -3979
1538 -3979 2171 1841 -4159 -1579 -915 -1468 -228 -151 3003 2943 1340 268 -3045 1091 2507 -2765 1600
1555 1600 2567 -2387 -698 -2807 -2416 3891 1647 -190 2120 702 -1072 -2867 -1595 1788 746
1570 746 1147 -1067 -3418 1172 -1747 -3286 4264 3459 823 1974 -2182 -1102 1850 -1209 496 2896
1586 2896 1671 -1417 -4265 -847 228 -439 3194 693 304 2267 -4901 -3996 2521 33 994 1545
$$ packed form
1473c417N740r2n269L494k76m74K625m254P56M399j322q30o76J993K08n225J578
1490a042O42j610L452m298j321O916m039k007N232o99J348j39l483J639L87j587
1506f09j051m05M300k694m120M405j074K50L538l966K837L353p025M06K421j178
1522f12J832j695o41K219j539p20j066K920M540n236q8K988m961J293L55l568
1538c979O150l30o000K580O64n53J240P7L154o0j603j072l313M136J416n272M365
1555A600R67m954J689k109L91O307k244j837K310j418j774j795J272L383j042
1570G46M01k214k351M590k919j539P550q05k636J151m156J080K952l059J705K400
1586B896j225l088k848L418J075o67L633k501l89J963p168R05O517k488R61N51
$$ plain form
1602 1545 -1872 -512 -1843 -3475 408 3434 4263 692 -1244 1080 -2342 -2030 2035 173 3196
1617 3196 2056 -5326 -2622 -348 -2646 1215 2370 2063 1937 -2156 -3290 -1374 1653 2951 416
1632 416 2520 2283 -4412 -2333 -626 -808 5190 2421 -2356 1063 -1740 -4567 -1269 1101 3611 2359
1648 2359 -836 -1538 -2702 -509 188 -4 5827 3556 -2253 -585 -2831 -2235 2972 307 1389 3349
1664 3349 -1975 -4757 -3950 -1687 1518 867 1610 413 -2095 -1374 -4091 -1162 6502 2769 1177 3325
1680 3325 -2119 -1993 57 -1513 2893 4316 431 -2352 -3748 -2125 -1834 -1176 2840 2346 954 -340
1696 -340 -5287 -1420 2729 -730 2783 4269 -303 -394 -2681 -2666 2184 3291 2806 1789 517 -363 -4260
1713 -4260 -2705 1454 783 2709 64 -4882 -1064 -2171 -4484 2481 4400 2655 1792 -1737 -1732 -678
$$ packed form
1602A545l417J360j331j632L883L026Q29l571j936K324l422L12M065j862L023
1617C196j140p382K704K274k298L861J155l07j26m093j134J916L027J298k535
1632D16K104k37o695K079J707j82N998k769m777L419k803k827L298K370K510j252
1648B359l195p02j164K193O97j92N831k271n809J668k246N96N207k665J082J960
1664C349n324k782Q07K263L205o51P43j197k508P21k717K929P664l733j592K148
1680C325n444J26K050j570M406J423l885k783j396J623K91O58M016m94j392j294
1696c40m947L867M149l459L513J486m572r1k287J5M850J107m85j017j272q80l897
1713d260J555M159o71J926k645m946L818j107k313O965J919j745q63l529NJ054
$$ plain form
1729 -678 -327 1573 1524 2416 -149 -5597 -2748 -1388 -1233 3363 1497 152 2385 -2831 -4275 797
1745 797 1909 2389 1430 -439 -386 -2661 -2604 -513 1727 5227 1903 -1220 1274 -2230 -2190 1679 -284
1762 -284 1945 2618 -3682 -3894 -1421 -1088 611 1830 4048 3230 -459 -422 -1119 1026 3973 35 698
1779 698 2001 -4127 -3553 -1776 -1839 2672 2624 -312 495 -463 -1423 -1622 -802 2983 1119 -1094 -1380 -3864
1797 -3864 -1041 -269 -1949 3549 3930 -753 558 -846 -1158 1834 357 212 1139 -595 -2395 -4434
1813 -4434 -1625 1518 -326 2024 1948 -434 1535 -1336 -2249 3543 1783 -512 306 -1906 -1633 -1386
1829 -1386 -1828 1444 2500 2635 1291 -1042 1814 1232 -735 2305 759 -310 179 -4518 -2883 640
1845 640 -1695 -47 1587 872 1131 -865 -560 912 664 1546 -1076 -1499 641 -3216 -3279 654 -563
$$ packed form
1729f78L51J900m9Q92k565n448K849J360J55M596j866j345K233n216j444N072
1745G97J112M80r59j869N3k275N7K091K240L500l324l123K494l504M0L869j963
1762b84K229O73o300k12K473L33J699J219K218q18l689L7o97K145K947l938O63
1779F98J303o128N74J777o3M511m8k936Q07r58r60j99Q20L785j864k213k86k484
1797c864K823P72j680N498L81m683J311j404l12K992j477j45R27j734j800k039
1813d434K809L143j844K350p6k382J969k871r13N792j760k295Q18k212K73K47
1829a386m42L272J056J35j344k333K856n82j967L040j546j069M89m697J635L523
1845F40k335J648J634p15K59j996L05J472k48Q82k622m23K140l857o3L933j217
$$ plain form
1862 -563 1481 1684 -1622 1136 1188 -1357 281 845 993 -429 -2684 -1368 -1597 -1068 565 -933 1986
1879 1986 3011 -1271 721 2018 174 2183 192 -1258 1021 -1667 -2785 -1565 -534 1185 -279
1894 -279 300 2243 513 1650 1380 65 3382 1461 -2109 587 -729 -1607 194 -1085 659 2114
1910 2114 42 303 162 1431 982 -1543 521 147 -2135 -675 -2520 -1904 1673 -1076 -523 2621
1926 2621 928 1254 1276 329 2175 935 -687 -854 -1394 -520 -2273 -3037 641 -676 -825 1019 -1311
1943 -1311 1118 2206 -1674 621 1427 -735 -495 -1669 -1050 -17 -1264 -173 -198 621 2063 -1090
1959 -1090 196 2574 -932 26 -26 -2072 151 -1335 -3163 116 -117 -415 106 -180 1875 936 164
1976 164 1249 -24 1182 178 -2679 370 115 -2286 351 -351 -42 2405 -421 338 2358 924
$$ packed form
1862e63K044K03l306K758N2k545J638N64J48j422k255J316k29N29J633j498K919
1879A986J025m282J992J297j844K009j991j450K279k688j118J220J031J719j464
1894b79N79J943j730J137k70j315L317j921l570K696j316q78J801j279J744J455
1910B114k072K61j41J269m49k525K064l74k282J460j845O16L577k749N53L144
1926B621j693L26K2r47J846j240j622j67n40Q74j753p64L678j317j49J844k330
1943a311K429J088l880K295Q06k162K40j174O19J033j247J091k5Q19J442l153
1959a090J286K378l506R58n2k046K223j486j828L279k33k98N21k86K055r39p72
1976A64J085j273J206j004k857L049k55k401K637p02L09K447k826P59K020j434
$$ plain form
1992 924 834 40 475 1168 -1359 -596 -89 -795 1407 -408 -848 2852 656 -309 1862 82 1140 940
2010 940 -1700 -92 -205 -852 -975 -1176 1161 478 -1120 1011 10 289 1708 -1242 280 2026 -1825
2027 -1825 -975 -206 -1190 555 -557 -537 1076 208 224 -733 -40 1829 -706 -1013 613 -1805 -761 -909
2045 -909 -2850 1067 885 -1587 440 39 185 861 -212 1417 1475 588 300 -1680 237 945 -2054
2062 -2054 633 1073 -1197 293 -1419 -1862 1319 -517 -933 321 -542 -207 -1557 -1272 1072 349 992
2079 992 704 -567 1768 -5 -1392 2207 976 252 942 -1971 -989 399 -1995 -471 646 269
2095 269 -90 -1756 -371 398 -99 2098 614 736 2672 -1294 -916 2121 386 1508 1474 -542 495
2112 495 -788 -1947 -140 348 1144 -9 -1345 349 -1164 -1080 837 -47 2242 2240 -1659 181 396
$$ packed form
1992I24r0p94M35O93k527P63N07p06K202j815m40L700k196r65K171j780J058k00
2010I40k640J608j13o47j23k01K337o83j598K131j001K79J419k950J522J746l851
2027a825Q50P69r84J745j112K0J613q68J6r57O93J869k535l07J626k418J044j48
2045i09j941L917j82k472K027m01J46O76j073J629N8q87k88j980J917P08k999
2062b054K687M40k270J490j712m43L181j836m16J254q63L35j350K85K344p23O43
2079I92k88j271K335j773j387L599j231p24O90k913R82J388k394J524J117l77
2095B69l59j666J385P69m97K197j484J22J936l966L78L037j735J122l4k016J037
2112D95j283j159J807M88P96j153j336J694j513Q4J917q84K289kl899J840K15
$$ plain form
2129 396 -1220 961 650 734 1414 -1358 -2019 -1626 -756 298 -938 234 460 -2902 -1547 -1063 -1692 2507
2147 2507 1523 -362 2049 405 -673 745 844 2716 2162 160 160 -1463 -1007 -897 -1496 1678 650
2164 650 -1651 -317 -1867 -1203 1878 177 1578 3283 185 -375 -770 -365 1610 1005 1514 1288 -289
2181 -289 -220 -2353 -1603 2115 -90 -474 657 -2918 -2529 -1787 -3199 175 1354 -21 -259 -1496 -465
2198 -465 -380 -544 2142 1721 930 385 -3343 -1907 -182 -2129 281 1083 -1042 -331 -1928 -1901 1320 1325
2216 1325 1952 1818 845 759 -1323 -982 1217 1106 2994 1651 -1077 1132 -141 -1592 2274 2347 1573
2233 1573 1827 -1076 -1393 -1028 -1206 310 448 1816 1426 -1680 -9 502 284 3344 1765 1049 1786
2250 1786 -2016 -2975 -866 -1287 160 -49 -1415 -782 -2295 -2112 -1016 -212 2382 795 -899 127
$$ packed form
2129C96j616K181l11Q4O80k772o61L93Q70J054j236J172K26l362J355M84o29M199
2147B507r84j885K411j644j078J418R9J872n54k002%j623M56J10n99L174j028
2164F50k301J334j550O64L081j701J401J705l098n60l95M05J975o05N09k26j577
2181b89O9k133P50L718k205l84J131l575L89P42j412L374J179j375k38j237J031
2198d65Q5j64K686m21p91n45l728J436J725j947K410Q02k125P11j597K7L221N
2216A325O27j34r73q6k082L41K199j11J888j343k728K209j273j451L866P3p74
2233A573K54k903l17L65j78J516J38J368l90l106J671N11k18L060j579p16P37
2250A786l802r59K109m21J447k09j366O33j513J83J096Q04K594j587j694J026
$$ plain form
2266 127 -2393 -2153 -58 -1269 1224 2065 -1742 -995 -531 -708 1158 1284 1952 1691 -665 -1140 -2245
2283 -2245 -1231 1270 -731 263 1597 -1456 -502 -105 -484 2980 2591 967 1455 -262 -999 -1278 -899
2300 -899 1519 889 113 21 -1793 -264 423 -632 2554 2300 -204 465 -1859 -2021 89 -911 -352
2317 -352 799 -534 -1112 -2053 -559 1000 124 1541 975 -753 296 -1988 -2352 842 -55 -341 645
2334 645 -1220 -601 -242 -598 1281 1669 1843 688 -1214 -4 -560 -1467 679 191 260 940 -1808 -719
2352 -719 1190 -26 1564 1946 848 1077 -793 -1276 -218 -84 969 -367 -418 829 -1194 -750 1491
2369 1491 326 2154 1867 -760 609 96 -1468 107 115 566 394 -1319 -471 -873 -365 979 -203
2386 -203 1489 1650 -1443 -388 -443 -1174 779 -403 -787 856 -715 -1027 143 278 1512 725 612
$$ packed form
2266A27k520K40K095j211K493Q41l807P47M64j77J866J26O68k61k356m75j105
2283b245J014K501k001R94J334l053R54L97l79L464l89j624M88j717p37k79L79
2300h99K418o30p76r2j814J529O87j055L186k54k504O69k324j62K110j000N59
2317c52J151j333n78r41J494J559q76J417n66j728J049k284l64L194q97k86R86
2334F45j865O19L59l56J879L88J74j155j902J210n56r07K146m88O9O80k748J089
2352g19J909j216J590L82j098K29j870m83J058J34J053j336n1J247k023M44K241
2369A491j165J828k87k627J369n13j564J575QM51j72j713Q48m02N08J344j182
2386b03J692J61l093J055n5p31J953j182l84J643j571l12J170J35J234p87j13
$$ plain form
2403 612 925 -804 -249 -576 -1539 798 -183 -1761 153 -1193 -1223 319 -821 429 1373 -414 -462 -755
$$ packed form
2403F12L13j729N55l27r63K337r81j578J914j346l0J542j140J250R44j787m8k93
$$ [...]
8191a13
##END NTUPLES=NMR FID
##END=
