##TITLE=1H_19-2025
 200.13MHz, CDCl3,
 8 sc
 
 3.2.2025
##JCAMPDX= 6.0         $$ Bruker NMR JCAMP-DX V2.0
##DATA TYPE= NMR FID
##DATA CLASS= NTUPLES
##ORIGIN= UXNMR, Bruker Analytische Messtechnik GmbH
##OWNER= pz
$$ XWIN-NMR		Version 3.5
$$ Mon Feb  3 14:25:21 2025 Russian Standard Time (UT+4h)  she@DPX200
##.OBSERVE FREQUENCY= 200.1313
##.OBSERVE NUCLEUS= ^1H
##.DELAY= (6, 6)
##.ACQUISITION MODE= SIMULTANEOUS
##.ACQUISITION SCHEME= undefined
##.AVERAGES= 8
##.DIGITISER RES= 18
##SPECTROMETER/DATA SYSTEM= spect
##.PULSE SEQUENCE= zg30
##.SOLVENT NAME= CDCl3
##.SHIFT REFERENCE= (INTERNAL, CDCl3, 0, 14.3821)
##AUDIT TRAIL= $$ (NUMBER, WHEN, WHO, WHERE, WHAT)
$$ ##TITLE= Audit trail, XWIN-NMR		Version 3.5
$$ ##JCAMPDX= 5.01
$$ ##ORIGIN= Bruker BioSpin GmbH
$$ ##OWNER= she
$$ F:/spectra/data/she/nmr/H-C/1/audita.txt
$$ ##AUDIT TRAIL=  $$ (NUMBER, WHEN, WHO, WHERE, WHAT)
(   1,<2025-02-03 14:24:14.25 +0400>,<she>,<DPX200>,
      <created by zg, POWCHK disabled, PULCHK disabled
       configuration hash MD5:
       00 E9 B6 7A A2 85 ED C7 34 08 36 98 17 FE 4E 26
       data hash MD5: 16K
       0B D4 FA A3 2A FA 57 07 36 57 FF DE 9F C4 3D 72>)
$$ ##END=
$$ 
$$ hash MD5
$$ A2 D2 4D 6F 75 49 9A 33 90 E2 59 3B 50 D5 32 3E
##$RELAX= 
##$RELAX= 
##$RELAX= 
##$RELAX= 
##$RELAX= 
##$RELAX= 
$$ Bruker specific parameters
$$ --------------------------
##$DU= <F:/spectra>
##$EXPNO= 1
##$NAME= <H-C>
##$PROCNO= 1
##$TYPE= <nmr>
##$USER= <she>
##$AMP= (0..31)
100 100 100 100 100 100 100 100 100 100 100 100 100 100 100 100 100 100 
100 100 100 100 100 100 100 100 100 100 100 100 100 100 
##$AQSEQ= 0
##$AQ_mod= 1
##$AUNM= <au_zg>
##$AUTOPOS= <>
##$BF1= 200.13
##$BF2= 200.13
##$BF3= 200.13
##$BF4= 200.13
##$BF5= 200.13
##$BF6= 200.13
##$BF7= 200.13
##$BF8= 200.13
##$BYTORDA= 1
##$CFDGTYP= 0
##$CFRGTYP= 5
##$CHEMSTR= <none>
##$CNST= (0..31)
1 1 145 1 1 1 1 1 1 1 1 1 1 1 1 1 1 1 1 1 1 1 1 1 1 1 1 1 1 1 1 1 
##$CPDPRG= <>
##$CPDPRG1= <>
##$CPDPRG2= <>
##$CPDPRG3= <>
##$CPDPRG4= <mlev>
##$CPDPRG5= <mlev>
##$CPDPRG6= <mlev>
##$CPDPRG7= <mlev>
##$CPDPRG8= <mlev>
##$CPDPRGB= <>
##$CPDPRGT= <>
##$D= (0..31)
0 0.7 0 0 0 0 0 0 0 0 0 0.03 0 0 0 0 0 0 0 0 0 0 0 0 0 0 0 0 0 0 0 0 
##$DATE= 1738578253
##$DBL= (0..7)
120 120 120 120 120 120 120 120 
##$DBP= (0..7)
150 150 150 150 150 150 150 150 
##$DBP07= 0
##$DBPNAM0= <>
##$DBPNAM1= <>
##$DBPNAM2= <>
##$DBPNAM3= <>
##$DBPNAM4= <>
##$DBPNAM5= <>
##$DBPNAM6= <>
##$DBPNAM7= <>
##$DBPOAL= (0..7)
0.5 0.5 0.5 0.5 0.5 0.5 0.5 0.5 
##$DBPOFFS= (0..7)
0 0 0 0 0 0 0 0 
##$DE= 6
##$DECBNUC= <off>
##$DECIM= 32
##$DECNUC= <off>
##$DECSTAT= 4
##$DIGMOD= 1
##$DIGTYP= 9
##$DL= (0..7)
0 120 120 120 120 120 120 120 
##$DP= (0..7)
150 150 150 150 150 150 150 150 
##$DP07= 0
##$DPNAME0= <>
##$DPNAME1= <>
##$DPNAME2= <>
##$DPNAME3= <>
##$DPNAME4= <>
##$DPNAME5= <>
##$DPNAME6= <>
##$DPNAME7= <>
##$DPOAL= (0..7)
0.5 0.5 0.5 0.5 0.5 0.5 0.5 0.5 
##$DPOFFS= (0..7)
0 0 0 0 0 0 0 0 
##$DQDMODE= 0
##$DR= 18
##$DS= 0
##$DSLIST= <SSSSSSSSSSSSSSS>
$$ [...]
##$SUBNAM0= <"">
##$SUBNAM1= <"">
##$SUBNAM2= <"">
##$SUBNAM3= <"">
##$SUBNAM4= <"">
##$SUBNAM5= <"">
##$SUBNAM6= <"">
##$SUBNAM7= <"">
##$SUBNAM8= <"">
##$SUBNAM9= <"">
##$SW= 18.0517328524113
##$SWIBOX= (0..15)
0 0 2 0 0 0 0 0 0 0 0 0 0 0 0 0 
##$SW_h= 3612.71676300578
##$TD= 16384
##$TD0= 1
##$TE= 0
##$TE2= 300
##$TE3= 300
##$TEG= 300
##$TL= (0..7)
0 120 120 120 120 120 120 120 
##$TP= (0..7)
150 150 150 150 150 150 150 150 
##$TP07= 0
##$TPNAME0= <>
##$TPNAME1= <>
##$TPNAME2= <>
##$TPNAME3= <>
##$TPNAME4= <>
##$TPNAME5= <>
##$TPNAME6= <>
##$TPNAME7= <>
##$TPOAL= (0..7)
0.5 0.5 0.5 0.5 0.5 0.5 0.5 0.5 
##$TPOFFS= (0..7)
0 0 0 0 0 0 0 0 
##$TUNHIN= 0
##$TUNHOUT= 0
##$TUNXOUT= 0
##$USERA1= <user>
##$USERA2= <user>
##$USERA3= <user>
##$USERA4= <user>
##$USERA5= <user>
##$V9= 5
##$VALIST= <valist>
##$VCLIST= <CCCCCCCCCCCCCCC>
##$VD= 0
##$VDLIST= <DDDDDDDDDDDDDDD>
##$VPLIST= <PPPPPPPPPPPPPPP>
##$VTLIST= <TTTTTTTTTTTTTTT>
##$WBST= 1024
##$WBSW= 4
##$XGAIN= (0..3)
0 0 0 0 
##$XL= 0
##$YL= 0
##$YMAX_a= 639695
##$YMIN_a= -711621
##$ZGOPTNS= <>
##$ZL1= 120
##$ZL2= 120
##$ZL3= 120
##$ZL4= 120
##$ABSF1= 10
##$ABSF2= 0
##$ABSG= 5
##$ABSL= 3
##$ALPHA= 0
##$AQORDER= 0
##$ASSFAC= 0
##$ASSFACI= 0
##$ASSFACX= 0
##$ASSWID= 0
##$AUNMP= <proc_1d>
##$AZFE= 0.1
##$AZFW= 0.1
##$BCFW= 1
##$BC_mod= 2
##$BYTORDP= 1
##$COROFFS= 0
##$CY= -3
##$DATMOD= 1
##$DC= 2
##$DFILT= <>
##$DTYPP= 0
##$F1P= 0
##$F2P= 0
##$FCOR= 0.5
##$FTSIZE= 0
##$FT_mod= 4
##$GAMMA= 1
##$GB= 0.15
##$INTBC= 1
##$INTSCL= 1
##$ISEN= 128
##$LB= 0.25
##$LEV0= 0
##$LPBIN= 0
##$MAXI= 10000
##$MC2= 0
##$MEAN= 0
##$ME_mod= 0
##$MI= 1.114404
##$NCOEF= 0
##$NC_proc= 0
##$NLEV= 6
##$NOISF1= 3.799351
##$NOISF2= 2.8
##$NSP= 1
##$NTH_PI= 0
##$NZP= 0
##$OFFSET= 14.38212
##$PC= 1
##$PHC0= 249.565
##$PHC1= 15.19222
##$PH_mod= 1
##$PKNL= yes
##$PPARMOD= 0
##$PSCAL= 0
##$PSIGN= 0
##$REVERSE= no
##$SF= 200.129724274929
##$SI= 16384
##$SIGF1= 3
##$SIGF2= 2
##$SINO= 400
##$SIOLD= 16384
##$SREGLST= <1H.CDCl3>
##$SSB= 0
##$STSI= 0
##$STSR= 0
##$SW_p= 3205.1282051282
##$SYMM= 0
##$S_DEV= 0
##$TDeff= 0
##$TDoff= 0
##$TI= <>
##$TILT= no
##$TM1= 0
##$TM2= 0
##$TOPLEV= 0
##$USERP1= <user>
##$USERP2= <user>
##$USERP3= <user>
##$USERP4= <user>
##$USERP5= <user>
##$WDW= 1
##$XDIM= 8192
##$YMAX_p= 0
##$YMIN_p= 0
$$ End of Bruker specific parameters
$$ ---------------------------------
##NTUPLES= NMR FID
##VAR_NAME=  TIME,          FID/REAL,        FID/IMAG
##SYMBOL=    X,             R,               I
##VAR_TYPE=  INDEPENDENT,   DEPENDENT,       DEPENDENT
##VAR_FORM=  AFFN,          ASDF,            ASDF
##VAR_DIM=   8192,          8192,            8192
##UNITS=     SECONDS,       ARBITRARY UNITS, ARBITRARY UNITS
##FACTOR=    0.0002768,     1,               1
##FIRST=     0,             0,               0
##LAST=      2.2672688,     0,               0
##MIN=       0,             -711621,         0
##MAX=       2.2672688,     639695,          0
$$ Real data points
##PAGE= N=1
##DATA TABLE= (X++(R..R)), XYDATA
0 0 0 0 0 0 0 0 0 0 0 0 0 -8 4 0 8 -8 8 -8 12 -16 16 -23 24 -28 32 -37 44 -48 53 -61 70 -80 89 -100 113 -126
36 -126 138 -155 173 -190 211 -231 256 -283 311 -342 375 -412 455 -501 550 -606 671 -745 829
55 829 -923 1035 -1168 1333 -1531 1781 -2111 2555 -3183 4120 -5642 8407 -14380 32153 -182339
70 -182339 -711621 257757 420203 -458277 -49850 567098 -185923 -466764 379391 302970
80 302970 -463275 -122278 374689 -106178 -206888 323720 101448 -398210 -89809 273906
90 273906 1406 -174591 119379 142696 -202326 -62755 275648 -56701 -311749 146552
100 146552 257254 -163504 -46892 239063 -152030 -310629 245453 213437 -314594 4794
110 4794 325439 -229713 -215730 354317 -29791 -407519 220763 327318 -286064 -79187
120 -79187 343510 -158274 -344587 299866 221243 -344629 11689 343962 -185013 -251134
130 -251134 239031 62340 -283656 47764 276242 -86150 -200909 140995 93734 -236292
140 -236292 -23783 269754 -30538 -191042 154752 143412 -242206 -98779 259761 -19763
150 -19763 -245991 186691 200773 -295105 -79101 283571 -136003 -248278 261156 151535
160 151535 -261594 26774 229472 -191261 -175585 266120 60873 -236077 122072 185078
170 185078 -210721 -71682 191797 -84559 -166313 156022 124218 -142350 -42208 111864
180 111864 -77018 -130660 125739 104579 -121671 -12533 137926 -33474 -121636 55015
190 55015 74208 -102344 -16357 185390 -11019 -190068 61831 91362 -168208 -7978 202576
201 202576 -67923 -155904 144730 80926 -204532 -15247 187362 -82322 -104272 211564
211 211564 45479 -226957 35788 143776 -127615 -53270 171954 -4768 -144732 62450
221 62450 88800 -137120 -67877 133834 1868 -90334 92514 65903 -126473 -43560 98768
232 98768 662 -70712 63695 89791 -80484 -58037 96078 -23031 -125390 69285 99938
243 99938 -85103 -28213 98137 -46072 -124573 65879 86983 -94752 -2834 142115 -52148
254 -52148 -114284 96766 31575 -124737 43022 126605 -61033 -67410 85032 -2575 -127525
265 -127525 26001 101975 -65188 -38875 106626 -14465 -109245 33191 54264 -59287 -8104
276 -8104 93857 12173 -74369 20461 48132 -75612 -31188 95356 5093 -65137 43623
287 43623 35465 -85036 -40661 68088 2482 -61718 55545 67980 -82231 -35702 78502
298 78502 -31227 -64654 81099 55106 -65284 -1329 60716 -48660 -71842 60382 39643
309 39643 -68839 21298 73544 -67877 -60701 59430 -382 -58277 41977 65915 -36917
320 -36917 -35904 48309 -2506 -69849 30628 67407 -35971 -13897 55563 -22351 -66691 15403
332 15403 33890 -31632 -11447 58563 947 -65175 16231 32291 -57483 -4983 76557 -728
344 -728 -39359 33563 19676 -59008 -16437 60053 -3225 -41922 49508 26779 -73971 -11053
356 -11053 42228 -37013 -24886 58260 19297 -43962 2639 32048 -37037 -32389 55281 21885
368 21885 -36728 29652 34294 -50586 -27913 32651 -511 -25870 22653 35397 -30647 -34776
380 -34776 27378 -7007 -47155 28101 44978 -22847 -5200 32522 -16510 -42537 18301 38535
392 38535 -19892 -6174 48815 -12713 -52664 22674 12553 -48677 9335 49766 -12755 -28332
404 -28332 17972 -118 -44243 4289 49154 -8719 -17587 40623 2496 -41809 8011 17921
416 17921 -20757 -558 35344 9951 -31127 -10227 11800 -27599 -17261 40264 9678 -27720
428 -27720 14332 17512 -29391 -19237 24595 11791 -17164 22688 36594 -33010 -28303 29633
440 29633 -11225 -30139 34646 23254 -30710 -4724 18944 -23587 -32455 22376 22366 -21418 11578
453 11578 34815 -26510 -25712 23644 -341 -16135 22508 25525 -8590 -16836 2536 -3326 -25407
466 -25407 4113 28330 -8537 -11578 17255 -4993 -27552 -2714 15079 -1285 -1662 31286 13766
479 13766 -36128 -4936 23105 -21857 -4508 41184 -3393 -28330 16365 10244 -34668 -16304
491 -16304 23153 -531 -12985 31641 11379 -44722 -6375 24639 -11825 1383 29379 377
503 377 -14602 7218 10100 -15854 -20957 11320 16111 -4029 8330 5233 -28354 -21545 10168
516 10168 14320 -2326 -3184 15320 894 -18216 12884 7763 -31319 5963 39614 -1207 -9392
529 -9392 10321 -16501 -30047 11647 26488 -13962 -12621 23342 -5851 -26287 16078 1373
541 1373 -31944 14736 35290 -3095 -5718 4695 -11960 -14402 11582 21599 -4069 -9427 11613
554 11613 -1416 -16625 -1886 -3471 -9562 3681 14960 12539 -11285 -19771 5744 -60 -10421
567 -10421 22880 17988 -17839 1415 18350 -13106 -19825 10077 9793 -12682 9281 24092 -23501
580 -23501 -27447 16637 -4157 -18492 24493 14720 -18564 2663 12426 -13064 -11685 12001 11240
593 11240 -3722 9375 13681 -16026 -15095 5169 -4547 -3414 10324 4409 -1146 -7006 -8688 788
607 788 -6876 -4077 18712 7589 -6440 8824 3025 -15921 -4854 12627 4540 -5016 13889
620 13889 10165 -25344 -9992 14122 -16198 -9424 26083 805 -16837 10042 3560 -19752 -3962
633 -3962 16205 4058 -2568 16561 6856 -20866 -3037 9782 -9912 1340 14906 -1868 -5670
646 -5670 -1711 -5985 -6752 -7689 2928 12427 438 96 6036 -7542 -10440 3756 8735 2582 1802
661 1802 12147 1948 -17381 256 5792 -17652 2208 20949 -7782 -9002 9404 -8123 -17930
674 -17930 4511 12677 -2401 548 17008 -1810 -18125 6478 6206 -11998 8975 15987 -5859
687 -5859 -3560 1541 -8023 -9655 -2691 6371 4297 -2085 4573 -811 -12640 -2849 4871 2192 4335
702 4335 6545 7109 -2134 -8717 3674 -772 -11587 10597 13219 -9254 -1536 3860 -14187 -10551
716 -10551 7516 5857 -4358 3526 11336 -7851 -10695 9692 -1940 -9212 16138 11906 -7593
729 -7593 1463 1369 -10665 -6199 4917 6082 -2540 -940 5853 -7477 -11395 2484 -608 -2799 8763
744 8763 7602 1599 -3171 -4107 1849 -3054 -1529 13301 4014 -7043 4397 -1278 -13283 -2962
758 -2962 4960 -139 -1903 5975 4810 -11855 -6234 7859 -6003 -2732 17733 4355 -6558 4931
772 4931 -392 -9186 -736 7032 3219 -2825 3166 3653 -11428 -7197 3583 -5534 -1181 10827 2481
787 2481 -3218 -2471 -2854 -503 -1330 4899 9982 -1179 -690 6691 -5475 -8479 1141 402 31 3549
803 3549 4713 -2311 -11983 -2783 4050 -6289 2907 12111 -3907 -2332 7861 -2969 -7360 1781
817 1781 5583 3125 2145 6230 -1530 -13174 -1531 4216 -6161 1780 7450 -4163 -2848 898
831 898 -3568 -4277 -1922 6096 7929 148 3830 1656 -9596 -1588 5663 -90 1516 3637 830
846 830 -2961 -6437 -1123 -2098 -7342 6031 8702 -4678 -33 2196 -7652 -2428 5644 4684 2131
861 2131 2541 5549 -2188 -7859 2211 5 -6301 6889 6427 -5815 -2159 -1786 -6435 -3072 1550
876 1550 5447 2360 -826 5046 -1126 -7268 2728 2942 -837 6106 5098 -787 -2873 -4658 -1371
891 -1371 -2770 -2884 6819 2257 -5225 2025 -1838 -8489 232 3910 2184 3092 3798 3780 -3815 -4937
907 -4937 4017 -1308 -2468 9272 2253 -5591 635 -3017 -6803 -1838 1214 3147 404 355 3189
922 3189 -5379 -5721 4393 731 658 8317 2874 -1404 -812 -2666 -927 -2209 -14 6292 -365 -3188
938 -3188 1885 -5861 -7155 1770 1368 1051 3261 2093 975 -3819 -1972 3647 -2619 1310 9937 287
954 287 -2785 1588 -5100 -5734 988 1908 1488 -904 -39 891 -6463 -2741 2868 -2747 2535 8747 1021
971 1021 -826 -563 -2992 -288 920 3226 4649 -2400 -904 1445 -6706 -4341 1201 -2124 1652
986 1652 4318 897 -1570 -5104 -1519 2913 -882 4390 7067 -2702 311 3042 -4598 -2701 1102
1001 1102 714 2373 901 685 -2402 -8127 -1202 2516 -2428 3608 4777 -2733 380 1083 -2299 -394
1017 -394 531 3614 4919 -188 1180 -1269 -7247 -528 2276 -1428 1925 1375 -2079 -1340 -3248 -1374
1033 -1374 -111 -1755 5349 5429 -1637 1988 231 -5166 996 3107 1369 2408 292 159 -2204 -5511
1049 -5511 -132 -718 -3152 4721 2754 -3432 418 -1512 -3553 1143 2101 4170 3306 -42 2113 -1441
1065 -1441 -4955 1812 638 -1416 3940 1053 -2325 -2022 -4133 -1903 -827 -798 4701 1840 -2068 2109
1081 2109 -1824 -3733 3051 2121 1791 3698 670 271 -1912 -4258 556 -1221 -1444 4746 -160 -3572
1097 -3572 48 -3559 -3065 1084 1262 3350 2174 -20 2116 -2046 -2848 3009 96 538 5233 -137
1113 -137 -2176 -1120 -3655 -1775 -703 297 3407 -725 -1702 1428 -3394 -2357 2913 512 2253
1128 2253 4422 351 191 -1372 -2555 1254 -733 860 4053 -1639 -2283 -411 -4485 -2231 816
1143 816 159 2488 980 -227 1318 -3083 -1432 3191 -228 2232 5224 -807 -1241 -910 -3293 -823
1159 -823 -459 789 2218 -2166 -904 60 -5001 -1256 2046 -920 3161 3759 -794 218 -1459 -1161
1175 -1161 1748 205 2662 2839 -2089 -494 -616 -4450 -1079 -8 -340 2589 -53 -1041 -227 -4012
1191 -4012 -566 2697 -84 3201 3587 -1155 275 -75 -1822 -11 195 1732 2207 -1943 -362 -1462
1207 -1462 -5201 13 1189 -1491 2822 1552 -1804 251 -1157 -699 1361 1170 3499 2507 -1129 703
1223 703 -1418 -3569 1202 4 -191 2218 -1126 -1455 -1145 -3689 -144 1386 -613 2964 1973 -1341
1239 -1341 906 -683 -1346 1119 846 2760 1912 -1617 392 -2230 -3938 1420 141 -1702 2558 -165
1255 -165 -2126 -40 -1853 -740 688 1228 3557 1454 -316 1172 -2106 -1684 2804 -125 468 2110
1271 2110 -1586 -906 -1081 -3478 -549 -9 -168 2960 225 -1597 -35 -1778 11 2075 1088 2701
1287 2701 1153 -661 1471 -1777 -2649 1669 -591 -395 2844 -1265 -2676 -1141 -2391 -442 574
1302 574 892 2373 -196 26 1519 -2443 -344 2671 -266 2225 2755 -1472 -1166 -1366 -2730 462
1318 462 -177 107 1653 -1179 -944 -511 -2462 -7 1410 611 3250 872 -623 1041 -1932 -756
1334 -756 2244 -596 828 2327 -1761 -1427 -1006 -2638 -571 -325 754 1698 -1141 110 174 -2882 1081
1351 1081 2345 -227 2921 2256 -1462 117 -612 -1716 692 259 986 982 -2024 -561 -1487 -2810 766
1368 766 569 138 2690 14 -789 1043 -1693 169 2198 160 2080 1811 -1622 -621 -1050 -1819 154
1385 154 -116 985 802 -1828 -103 -897 -3062 1280 1421 -394 2956 1379 -1490 629 -507 -714
1401 -714 1208 632 1415 352 -1415 -159 -2295 -2574 800 -650 -98 2190 -1320 -848 381 -1846
1417 -1846 774 1811 492 2433 1135 -695 299 -1019 -1131 590 -274 1337 289 -2067 -488 -1928
1433 -1928 -2759 1705 420 -535 2532 -17 -1266 796 -549 -281 1274 1127 2332 377 -886 193
1449 193 -2441 -1091 1634 -1043 -32 1318 -1992 -777 -295 -2235 341 1087 757 2395 784 -574
1465 -574 53 -1019 516 1473 129 1655 8 -1703 278 -1966 -2259 1077 -701 -91 2311 -909
1481 -909 -1575 -91 -1118 663 1653 1462 1767 -165 169 580 -2121 -203 1609 -1193 1275 1340 -2533
1498 -2533 -1161 -932 -2087 553 971 160 1244 -321 -73 170 -1067 1231 1132 367 2417 119 -1121
1515 -1121 649 -2187 -1333 1446 -799 -192 1332 -1920 -1415 -314 -1354 314 581 1103 1520 -283
1531 -283 711 264 -1701 1312 1749 -734 2022 562 -2414 -494 -971 -1998 297 131 -243 492 -643
1548 -643 -277 -878 -996 1566 644 804 2718 -468 -713 1005 -1678 -368 1725 -932 136 857 -1713
1565 -1713 -1213 -820 -1371 136 239 1166 878 -1018 653 -41 -1550 2205 1399 -432 2553 347 -1769
1582 -1769 493 -939 -1502 624 222 -12 -316 -1084 -573 -1844 -809 1481 -323 937 2261 -892
1598 -892 -191 1369 -1371 590 1769 -259 1068 685 -1592 -724 -1194 -939 107 -314 901 -32 -1439
1615 -1439 638 -982 -1432 2284 635 -83 2894 140 -1351 939 -581 -543 1227 388 228 -649 -707
1632 -707 -628 -2217 -479 990 -895 941 1571 -1674 294 824 -1332 1142 1947 67 1405 491 -865
1649 -865 -382 -1020 -212 151 -294 1034 -464 -1532 316 -1663 -1272 1935 -255 -13 2328 -670 -679 926
1667 926 -177 335 1362 517 492 -433 -298 -398 -2045 -15 451 -1387 1132 870 -2054 63 316 -1319
1685 -1319 1214 1535 102 1312 203 -114 -192 -448 602 205 122 1185 -983 -1233 302 -2100 -763
1702 -763 1382 -674 151 1503 -927 -586 623 -295 711 1103 1021 829 -394 308 -273 -1455 453
1719 453 164 -1282 1399 61 -2242 188 -386 -1507 1212 798 40 936 6 88 -170 -84 1276 273
1737 273 791 1736 -943 -783 386 -2003 -451 1111 -1007 -124 523 -1448 -482 7 -617 458 1120
1754 1120 1121 760 -671 542 -383 -870 1555 260 -742 1371 -405 -1776 311 -954 -1361 784 105
1771 105 -42 441 -489 -62 -708 68 1474 -56 954 1494 -1070 -68 444 -1691 397 989 -860
1788 -860 243 -27 -1547 -613 -526 -456 228 0 1225 377 -624 722 -429 -601 1775 119 -241 1620
1806 1620 -610 -1194 461 -997 -787 861 -243 -239 -6 -570 -183 -989 527 1170 -455 1319 1318 -1211
1824 -1211 766 504 -1184 904 995 -708 300 -163 -1367 -775 -658 -246 -33 44 729 -463 -805 945
1842 945 -792 -144 1945 17 384 1649 -629 -457 791 -836 -201 610 -270 74 -553 -537 -631 -1102
1860 -1102 319 513 -625 1251 627 -1117 669 360 -923 1633 1058 -396 937 -199 -786 -387
1876 -387 -617 59 -246 -294 716 -998 -921 780 -1243 -155 1825 76 533 1437 -743 -196 640 -333
1894 -333 747 349 491 161 -872 -512 -649 -1339 293 11 -804 997 -89 -1517 691 -157 -602 1619
1912 1619 550 165 868 30 -30 -334 -411 663 -342 -85 790 -1511 -829 272 -1346 97 1325 -734
1930 -734 282 1010 -599 159 273 -167 740 590 919 321 -580 9 -543 -1209 923 141 -815 798 -710
1949 -710 -1134 523 -494 -499 1080 539 603 848 21 192 -220 215 1053 -214 345 837 -1506 -252 63
1968 63 -1716 205 726 -971 467 96 -925 -136 65 231 670 307 962 441 -575 571 -572 -757
1986 -757 1074 -250 -673 848 -1100 -982 572 -738 -325 796 103 432 137 -313 79 -63 641 1127
2004 1127 -140 725 500 -1180 72 -34 -1322 669 274 -1007 223 -313 -1132 -169 -238 -31 402 181
2022 181 877 138 -616 696 -483 -382 1600 -239 -270 892 -1404 -815 181 -990 -86 209 -436 133
2040 133 -392 -189 97 -341 524 801 -160 1330 530 -1105 683 127 -761 788 276 -574 395 -460 -792
2059 -792 -379 -665 162 22 -36 981 -711 -308 851 -773 130 1618 -186 198 914 -947 -81 240
2077 240 -743 300 94 -416 45 -913 -276 -274 -688 790 465 -447 1053 286 -998 720 29 -248 1444
2096 1444 135 -212 420 -572 -589 -446 -488 309 -284 62 459 -1099 -117 905 -771 422 1205 -547
2114 -547 653 722 -640 201 125 -380 512 228 -221 -135 -937 -152 -550 -907 769 77 -426 1081 -412
2133 -412 -602 931 -20 -226 1029 33 369 368 -712 -76 -361 -184 181 -633 -143 284 -1229 19 239
2152 239 -906 508 820 -388 688 380 -607 439 351 133 680 276 488 -67 -710 170 -676 -544 783
2171 783 -587 -450 842 -891 -520 886 -701 166 1100 116 325 378 -273 -6 -207 326 564 -456
2189 -456 212 -136 -1490 57 -104 -1367 545 215 -573 763 70 -730 306 274 86 773 392 342 -163
2208 -163 -139 261 -746 -295 784 -678 -192 463 -1153 -292 318 -729 284 488 -188 236 15 62 316
2227 316 -507 498 681 -355 660 52 -1173 439 -219 -969 672 -235 -805 489 -391 -690 80 -9
2245 -9 441 235 345 671 -363 107 651 -369 235 882 -823 16 403 -989 -262 -81 -743 445 372
2264 372 -270 78 -391 19 99 -44 973 482 -205 949 -86 -737 504 -445 -592 950 -232 -541
2282 -541 212 -659 -301 51 -222 521 -250 241 461 -543 161 434 -518 635 781 -673 402 282 -1160
2301 -1160 152 -196 -520 91 -238 -210 -174 -396 79 -149 -92 728 181 -6 1035 -286 -476 952 -441
2320 -441 49 872 -405 -70 240 -766 -363 -463 -156 246 -199 103 335 -617 402 446 -565 814 582
2339 582 -207 904 98 -588 685 -160 -208 445 -186 -94 -330 -594 -89 -456 -222 1053 -366 41 738
2358 738 -646 -138 950 -455 501 724 -303 76 78 -642 -202 -488 -17 358 -773 157 -160 -672 84
2377 84 -97 -743 854 162 -551 845 -65 -344 400 -72 227 339 92 128 -345 -444 232 -832 -202 684
2397 684 -603 -107 544 -751 -17 561 -364 776 543 54 264 -37 -213 223 -362 194 265 -337 165
2416 165 -334 -1018 457 -240 -453 1101 -88 -336 755 -478 -177 534 55 430 394 216 549 -317 -331
2435 -331 419 -701 132 457 -694 167 237 -1036 -22 92 -257 703 407 186 265 -147 448 178 -222
2454 -222 522 340 -171 458 -302 -840 550 -409 -539 674 -475 -389 232 -556 167 177 11 630 153 315
2474 315 477 -415 303 299 -504 428 505 -781 146 -198 -1054 21 -310 -206 487 -165 -6 479 -146 491
2494 491 153 116 866 145 -195 746 -436 -455 399 -553 -348 440 -618 -44 33 -803 -139 101 -31 388
2514 388 18 242 452 -448 377 569 -435 720 513 -614 615 -151 -772 196 -113 -454 188 -321 163
2533 163 -98 -544 298 125 95 828 -175 88 645 -523 -52 394 -333 169 445 -535 106 -144 -480 -59
2553 -59 -153 -81 452 -110 298 120 -244 533 302 -456 937 359 -172 618 -301 -528 202 -491 7 68 -431
2574 -431 -15 -330 -449 255 -380 7 737 -222 312 569 -532 151 619 -219 424 261 -260 378 -169 -358
2594 -358 -2 -395 60 160 -365 120 -65 -651 546 25 -135 717 -10 -9 711 -218 -304 345 -167 325 150
2615 150 -171 137 -533 -479 145 -514 103 398 -324 121 169 -577 415 198 -86 898 208 -317 104 -252 -17
2636 -17 205 -582 -18 -57 -616 388 -409 -383 120 -153 -9 610 -6 -9 662 -319 301 199 54 531 -97
2657 -97 -170 186 -385 -308 -4 -744 181 138 -514 263 -142 -580 365 115 -19 484 271 345 432 -515 157 247
2679 247 -309 589 33 -321 279 -599 -344 182 -472 -13 294 -215 -52 196 -435 219 333 240 501 175
2699 175 309 282 -235 287 233 -489 289 24 -714 338 -336 -448 449 -177 -67 248 -45 199 132 -433 328
2720 328 122 137 640 -300 136 418 -593 -46 105 -542 215 322 -384 117 -174 -446 239 3 79 348
2740 348 -150 278 227 -311 389 170 -125 467 -37 -163 442 -498 -375 6 -71 19 53 -324 113 -64 -367
2761 -367 246 -90 307 655 -217 8 286 -343 317 390 -338 14 -61 -523 193 -530 -464 206 -87 -76 101
2782 101 -195 334 76 90 444 -107 83 717 -132 -101 284 -534 10 -1 -449 -18 -150 -365 -158 -434 -316
2803 -316 276 -138 121 457 -469 132 368 -384 529 176 -218 362 -66 -154 -35 -175 -158 131 -283 276 -31
2824 -31 -397 197 -359 -163 617 -30 386 608 -164 209 565 -259 446 275 -459 415 -87 -256 -46 -561
2844 -561 -82 165 -292 142 124 -147 261 -30 -307 602 268 143 495 -62 114 256 -393 -69 -70 -239 123
2865 123 -342 -400 64 -460 -149 308 -180 213 241 -151 460 158 -4 494 -49 73 194 -172 -242 -27 -788
2886 -788 -102 -1 -326 283 -100 -238 221 -126 -181 432 -21 101 333 -249 304 191 -104 306 30 -277
2906 -277 533 -417 -295 104 -576 48 176 -382 266 20 -222 312 -141 6 264 -4 180 477 105 61
2926 61 75 -361 125 -195 -481 44 -473 -447 162 -320 -386 406 -218 394 240 -102 588 -136 -149 439 62 137
2948 137 275 -329 2 72 -720 -49 91 -563 195 -166 -295 109 -243 110 324 -177 270 332 -89 188 280
2969 280 -171 507 -90 -119 247 -335 103 -59 -654 -238 -107 -293 325 82 -434 397 -2 -37 284 -16 157
2990 157 377 -242 257 93 -341 48 -307 -325 -104 -337 -409 103 -406 -43 219 -287 193 285 -323 404 -40
3011 -40 -138 273 -48 66 307 -109 -44 6 -505 201 -27 -303 83 -40 -197 278 -353 -9 141 -129 372
3032 372 468 -325 374 239 -153 239 20 131 239 -169 -167 -59 -484 -138 -143 -94 367 -55 -99 179 -140 224
3054 224 494 -264 244 315 -254 227 41 -238 152 -228 -115 284 -303 -197 -98 -505 -97 253 -256 275 164
3075 164 -17 444 -170 -189 432 -121 133 180 -283 256 103 -635 215 -2 -286 215 -154 -272 111 -304 -45
3096 -45 222 -74 271 300 -75 347 -19 -15 392 41 32 174 -380 93 -53 -666 169 -28 -386 434 -99 -171
3118 -171 188 -259 221 397 -190 270 155 -397 163 -91 -196 341 78 -183 109 -247 -99 -145 -471 -139
3138 -139 24 -165 233 24 -94 426 -255 28 372 -158 32 211 -256 118 -157 -559 -10 -313 -259 411
3158 411 -411 -174 267 -362 -37 90 -375 494 146 -155 344 126 50 489 126 -218 239 -346 -30 9 -340
3179 -340 192 -217 -298 201 -196 27 212 -295 130 414 -176 336 193 71 316 -139 -159 388 -116 -84 17
3200 17 -332 -13 -160 -134 5 -74 -156 228 -112 42 429 -135 154 446 2 263 111 -297 140 -44 -279
3221 -279 247 -363 -325 208 -344 44 -143 -544 -68 30 -134 288 113 -97 199 81 100 270 40 -29 107
3242 107 -373 -4 -141 -364 214 -87 -140 205 -368 -6 262 -366 225 95 -45 277 159 -54 126 8
3262 8 44 143 -162 0 111 -204 98 -157 -478 99 -118 -297 377 -262 -238 312 -226 258 258 14 319 -68
3284 -68 -501 326 -100 -13 228 -207 -93 69 -746 -7 -7 -369 300 292 -86 349 108 27 429 -50 110 128 -2
3307 -2 221 -22 -355 126 49 -141 93 -97 -40 286 -298 -113 214 -306 81 150 3 572 -103 20 193 -91
3329 -91 28 320 -196 64 111 -446 14 -168 -294 -50 -125 -363 314 11 22 152 -125 355 119 64 329 -157
3351 -157 -125 356 -278 -7 -75 -666 -21 129 -409 -202 66 -214 154 -4 -195 319 85 77 230 -318 181
3372 181 273 -297 239 179 -139 151 -178 -294 72 -238 166 145 -180 1 -65 -187 317 209 112 250 -103 -179
3394 -179 282 -255 146 344 -264 -2 -163 -370 -214 -264 -285 -182 54 -142 50 -176 81 282 -364 436 36
3415 36 -233 226 -40 -474 298 -321 -197 349 -229 -257 -57 -141 57 -245 -354 196 -215 -43 333 -218 128
3436 128 375 -136 7 123 -263 328 107 -471 165 -117 -54 50 -266 127 65 -321 232 170 27 393 100
3457 100 -129 315 1 -83 235 -173 -7 -24 -166 23 -9 -207 -64 -138 -83 153 -85 -24 210 -168 84 178
3479 178 107 268 329 -3 390 -106 -81 247 -120 185 159 -500 166 -44 -476 163 -268 -202 131 153 -1 383
3501 383 -201 83 104 -270 393 250 -155 310 -282 -347 37 -88 -44 42 -184 53 39 -74 88 194 -159 226
3523 226 164 -134 172 6 -43 330 -207 129 -104 -172 232 -110 -479 432 -200 -352 -78 -207 69 57 -180
3544 -180 108 172 -19 467 72 24 243 192 126 72 -133 42 19 -320 166 -291 -452 135 95 -283 152 -78
3566 -78 -93 130 -269 -48 163 94 305 83 155 344 -235 -19 78 -311 -201 -40 -312 91 102 -268 -84 151
3588 151 129 196 91 66 391 12 84 17 -16 94 -27 -190 44 -90 -529 276 -3 -153 232 -63 13 179
3610 179 -33 -39 -125 1 156 -88 66 94 84 -45 261 -109 -227 361 -277 -43 -217 -211 204 138 -109 303 -124
3633 -124 70 135 162 204 -3 -15 98 129 -101 317 -111 -106 103 -116 -192 -36 -192 -135 -210 -204 -4 -116 -57 172
3657 172 -114 118 307 -114 17 293 -24 443 61 -184 245 -134 -305 -77 -323 -113 267 -207 227 -102
3677 -102 -214 76 -40 -136 314 -85 -178 171 8 -139 91 -259 126 136 16 77 -130 -117 177 -282 139 193
3699 193 -238 -86 113 -66 291 -21 -329 284 71 -89 301 -166 35 199 -94 -7 38 -176 138 -110 -158
3720 -158 -19 -152 4 400 -182 106 158 -16 46 99 126 -61 -98 34 -5 -55 -144 -58 -233 -136 -66 -221 118 -179
3744 -179 -76 121 -204 72 65 -156 56 239 178 58 392 -51 127 -67 -131 121 -267 -295 129 -259 65 -98
3766 -98 -95 107 234 -32 170 105 117 111 235 -56 111 33 -170 17 -45 61 60 -168 93 -13 -40 61 69 -1 119
3791 119 -101 142 120 -142 224 157 105 -12 -151 -100 305 -128 -125 -13 -402 124 156 -88 97 -150 -6 302
3813 302 -103 140 219 -24 29 29 50 72 -102 -198 34 -185 -100 61 -314 -86 -73 -236 -98 131 21 -43 18 -71
3837 -71 211 55 142 78 -31 270 97 -101 18 -14 -57 -35 -130 -53 -13 -207 -111 -5 19 76 110 -5 228 -82
3861 -82 98 -43 84 -67 153 -109 91 130 -141 -91 146 -326 61 88 24 -23 -109 148 142 -69 84 137 78 94
3885 94 195 -34 66 221 -173 17 22 -80 -71 -318 -177 -64 -54 226 -36 -21 237 -99 -128 68 55 -63 177
3908 177 -7 46 47 -107 261 124 -6 101 -19 -314 -192 -33 -120 69 -174 92 237 -52 598 134 67 115
3930 115 -189 -278 196 74 62 108 -237 24 -11 -184 10 -309 -185 206 -210 19 166 -72 212 33 -326
3951 -326 23 233 -3 -28 -17 17 -31 -111 -170 262 -243 22 -104 -189 -20 -91 -105 140 -118 -67 223 -256 303
3974 303 153 -7 67 115 -82 97 81 -90 245 -125 -219 0 -61 21 80 -192 -182 -32 -34 -20 96 -167 224 -116
3998 -116 93 158 -33 -111 -63 54 -121 91 -211 118 -119 -45 132 -187 -30 194 44 53 18 5 130 -62 -33
4021 -33 46 65 -137 -48 29 48 -33 -203 179 104 11 -63 140 -101 106 208 -10 65 -102 66 287 23 322 63
4045 63 74 -48 -153 -37 183 -288 -51 188 -100 -263 -39 -101 139 -69 -289 -65 150 -205 261 -119 8
4066 8 -93 -256 221 -9 -211 55 -71 -101 62 63 -21 47 5 8 143 -57 182 139 57 65 241 72 236 -158 38
4091 38 173 -1 -233 292 -167 -244 58 -19 87 -52 -54 62 -120 -23 221 -42 35 149 -6 65 -25 51 214
4114 214 15 27 100 -401 -95 -113 -11 0 -40 -184 47 -52 2 239 -292 72 67 -168 -117 178 69 216 56
4137 56 -2 43 171 -121 82 -11 52 35 -174 53 303 -117 151 80 -62 -31 81 -72 58 -180 68 250 44
4160 44 38 -3 -81 -52 -21 -64 0 -84 -96 162 -87 -2 170 -218 167 56 -129 28 -104 82 -2 -127 -91 -86 -252
4185 -252 -41 98 -103 299 82 -63 -26 -120 -240 -58 -40 39 72 -133 132 -13 -5 157 136 -211 -176 -123 73
4208 73 95 -132 -174 106 -57 43 22 -92 166 80 -154 140 26 -53 26 -98 235 27 62 137 -37 -26 308
4231 308 -255 90 168 -146 88 -48 42 -34 274 48 102 63 201 -35 -108 -41 304 36 -97 125 -46 53 -87
4254 -87 -126 72 -84 54 12 -4 -158 32 53 38 294 -177 160 33 -21 213 -97 161 -4 89 -2 -92 -32 -96
4278 -96 247 -212 175 212 -47 -11 39 -31 121 10 0 25 -1 81 35 120 -1 -107 -57 -214 -296 -196 169 -98
4302 -98 -4 7 -149 -196 227 39 -26 -112 -213 -47 -34 -58 84 43 71 142 -53 -37 -29 67 -80 -269 -257 173 -250
4327 -250 275 65 -127 85 -89 -50 4 -62 -24 -70 85 -37 71 -6 -8 87 -68 -18 -19 -79 56 211 -193 158
4351 158 54 45 -56 24 -7 42 -30 -111 -1 -179 173 204 131 21 -250 -65 142 -284 -22 -56 -63 97 34 18 -218
4376 -218 -44 -35 114 -5 -36 105 -8 193 135 -310 -32 -37 -117 42 45 0 222 72 23 56 -221 203 -128 -65
4400 -65 45 60 82 63 -41 -104 127 214 112 -7 -44 -53 -247 -96 30 24 177 -6 148 116 -13 20 -34 108 100
4425 100 1 229 -171 -115 203 -77 -107 -9 -20 -19 212 95 74 -46 56 -1 47 40 -151 127 88 -18 -24 24 -122
4450 -122 76 164 19 257 -23 -310 205 19 57 -32 71 71 -207 140 -2 217 87 47 -8 -82 2 72 -59
4473 -59 138 206 71 24 -6 139 36 -131 -34 54 -10 6 -139 39 167 -43 110 1 35 -306 -27 -103 -9 -175
4497 -175 -93 -44 -14 341 44 229 -119 44 -111 -44 235 4 -30 38 -159 168 -296 -68 14 -103 115 -165
4519 -165 81 -33 83 -95 -43 -11 -117 115 -38 17 61 -32 86 81 1 -1 -12 267 115 -92 -8 13 -35 23 -99
4544 -99 -17 -35 -164 -57 153 67 -60 -103 296 9 -116 -113 -8 87 -11 13 -51 -3 222 -152 -40 221 -92 77
4568 77 110 171 -42 -78 -40 10 100 -68 -12 45 -100 127 -34 45 -71 -18 -70 -195 -252 -10 163 -140 -313 -44
4592 -44 226 133 -9 40 150 -234 -205 5 19 -96 252 76 61 60 123 55 132 -84 -54 -28 30 -28 -105 1 -6 -9 64
4619 64 -59 -131 199 -100 94 -59 168 -38 -134 -43 61 -20 -230 83 156 97 219 -263 -39 48 74 -114 -10
4642 -10 175 179 93 82 112 -74 52 -176 -18 95 -110 -160 132 -188 -11 -128 -96 29 -125 194 94 3 2 -27
4666 -27 -52 16 166 -148 -17 12 1 37 2 -2 -38 -56 -199 -162 222 15 101 -41 -7 -71 195 35 -61 75 -42
4691 -42 85 -196 6 -41 -120 -102 139 -84 4 -25 -67 -46 2 77 58 114 41 -134 83 126 -58 74 78 70 -193 -118
4717 -118 -1 -75 -54 -72 -91 -212 -132 85 -317 -12 117 -86 -107 81 60 -106 52 -2 -29 -20 -42 67 -207 125
4741 125 83 168 18 101 178 -28 -21 -139 -62 58 38 84 176 -222 133 233 161 202 344 -109 -11 100 77 72 -34
4766 -34 -174 46 29 -92 52 -96 -27 86 129 138 12 52 60 114 103 -193 73 137 -26 -122 0 -6 -172 23 115
4791 115 -21 -21 -40 31 50 -168 0 -102 -22 -27 -173 26 21 -41 146 178 8 -28 30 148 109 38 -39 -72 57 119
4817 119 -2 -90 -162 -69 -32 -208 -88 -197 66 2 85 -152 -126 47 -185 110 -72 -75 -259 -73 -116 46 -93
4840 -93 59 17 -27 -147 313 23 11 257 -236 -197 -92 -186 23 104 74 -12 146 -15 191 149 -243 236 -121
4863 -121 150 -4 -128 66 -45 185 211 -16 139 211 10 185 -18 -117 -11 60 55 -153 -219 42 203 46
4885 46 -92 -71 94 4 -74 67 78 148 -93 -92 -104 7 -19 158 -2 64 -24 35 106 -50 147 -86 4 -11 -32 161
4911 161 307 132 16 -22 57 119 15 179 186 44 65 31 -91 -22 147 110 -19 12 -151 202 226 98 26 56
4935 56 -15 168 -25 2 116 -92 -105 -173 28 -72 115 45 -112 87 198 -37 -142 39 -108 -140 -108 -54 -28
4958 -28 -143 79 90 8 112 4 97 29 114 77 6 -149 37 -82 -1 -37 -155 -9 16 69 141 -54 -106 -2 -52
4983 -52 -35 -10 43 -164 -42 53 -35 -16 -130 -74 -5 117 49 99 89 -47 85 -265 -85 157 9 130 63 -14 22
5008 22 -73 -172 -11 -30 133 -260 129 1 272 169 125 112 146 72 -41 -80 -83 32 71 -214 -120 62 16 34 -169
5033 -169 -23 -149 -84 213 222 -81 -61 -140 33 16 61 36 221 135 12 -172 13 -185 -31 59 -89 -88 49 -3
5057 -3 125 -6 93 -215 54 -52 135 184 -10 119 17 167 -4 31 50 131 -167 43 -141 -39 208 132 131
5080 131 -125 -68 38 2 -42 57 -41 -246 -8 -97 -59 129 26 -66 110 46 -16 -65 -59 97 61 -202 135 72 -38
5105 -38 -5 -93 35 -64 -68 -27 59 86 153 32 54 -66 116 -23 83 -177 97 88 -48 -68 -93 -83 133 27 159
5130 159 -54 -52 42 -130 83 49 149 51 -120 227 13 -145 76 97 125 -102 46 -100 0 241 16 -27 -10
5153 -10 18 90 157 37 20 176 -62 48 -15 134 8 -47 -21 97 -102 -218 -167 -161 -88 145 56 -55 4 86 -73
5178 -73 -87 -123 -42 -10 -167 -176 61 121 -18 114 -59 65 110 -159 -81 -94 -59 136 -4 -187 102 -67 90 -49
5202 -49 -93 -141 -53 -244 -203 -127 -248 -58 281 23 54 -22 12 90 -50 165 198 95 -145 109 37 81 33 -164 230
5227 230 62 -21 -48 21 83 24 -53 88 226 -124 -104 14 110 -60 24 51 9 -17 -56 125 61 -108 91 -70 -54
5252 -54 154 -46 -38 136 40 83 146 0 21 -64 -12 51 -46 -82 58 -42 -99 115 253 -20 -32 90 33 -79 -160
5277 -160 -77 -166 -131 -145 -18 -64 -119 261 -134 41 70 1 126 138 11 -18 58 -117 96 270 -184 -264 30 -54
5301 -54 270 127 -84 -18 -91 54 -37 -6 -18 -169 46 -4 4 -52 44 66 -267 139 133 30 96 -71 19 122 107 -37
5327 -37 -75 25 -157 34 -77 -82 -151 225 109 -110 -185 -141 -14 143 238 105 -9 88 -13 28 -60 -105 72 -36
5351 -36 -103 -60 -188 57 -28 120 0 78 -83 -212 -100 5 103 16 63 -69 -45 -213 -87 82 29 -34 5 -24
5375 -24 146 45 33 -91 -12 -6 -3 160 16 -113 16 -8 84 -172 1 29 -168 -200 177 -333 -86 47 285 118
5399 118 -69 126 19 -214 -192 -221 12 2 -11 131 306 -21 60 -156 8 166 70 -106 -130 81 31 -76 223
5422 223 -49 -21 168 98 -68 20 158 160 20 -81 93 96 -25 -31 96 52 -8 6 54 -11 -173 -76 14 -29 -18 59
5448 59 72 50 22 33 -3 105 -142 -31 32 135 -86 71 152 -40 48 255 22 91 2 228 -172 -31 165 68
5472 68 123 4 -29 -112 -219 109 -13 57 -126 175 44 -170 -50 -115 148 -15 -124 129 -108 -77 155 -40
5494 -40 177 20 -6 -27 -8 -24 191 -141 63 164 78 -3 -105 -54 183 37 44 84 -19 67 74 -7 -20 89 -42
5519 -42 -114 -97 37 172 -138 13 -90 63 118 79 104 27 81 -189 -88 142 8 85 -130 -220 90 -91 -81 -15
5543 -15 255 -18 -71 -114 1 54 -71 -28 45 -12 -34 -115 -60 -114 -50 -56 46 -12 -49 -183 146 98 8 99 -88 -26 -163
5570 -163 -66 2 -58 26 -10 58 31 -74 -60 -48 119 -114 98 -27 93 -154 12 208 -86 128 -234 6 -129
5593 -129 -82 9 4 62 -45 -21 87 54 42 46 175 -29 -15 12 62 -206 -141 147 -87 83 35 4 -24 113 -125 -172
5619 -172 135 56 -163 69 -17 -126 146 58 -42 -9 52 -69 -129 67 -64 -30 -55 -19 -11 86 -44 112 12 -221
5643 -221 201 -254 170 30 -1 -176 67 145 -198 -217 40 80 73 24 -82 17 145 61 55 -58 25 -62 -166 -43
5667 -43 -114 64 116 71 102 40 141 -31 -12 5 -138 117 -28 -20 -33 16 -126 309 95 305 -9 14 79 86 40 88
5693 88 170 20 -126 44 -28 -38 -122 83 -107 -138 75 163 -115 -40 -133 -122 63 -12 -105 -161 225 -32 240 70
5717 70 -45 96 -102 -24 -64 -45 -41 -167 -236 10 112 -45 53 -86 173 79 -8 -37 -57 163 -154 -14 60 76 47
5742 47 15 -220 103 -54 -183 -66 -28 -20 -46 95 161 -23 159 -134 -87 -8 104 -38 -65 55 51 37 -20 7 171
5767 171 125 42 212 203 95 62 38 -47 -61 132 52 20 -55 -45 45 185 92 52 -7 7 242 -117 -64 71 129 -19
5793 -19 72 -9 -147 -12 206 -17 -57 -51 -87 -406 143 211 -17 147 -81 2 28 29 -83 63 164 91 -30 -179
5817 -179 6 -32 107 -31 35 206 -208 -45 109 1 -97 -62 9 -165 -62 61 96 -129 -197 -127 86 178 -94
5840 -94 -83 -70 -151 -111 146 -40 -83 40 211 186 162 -194 -90 -19 -17 -53 -121 -98 104 172 -128 -359 42 -165 -124
5865 -124 -167 1 175 -80 29 -17 177 99 57 -2 -23 115 -79 17 56 193 16 -6 -2 -37 182 4 -177 -87
5889 -87 -74 91 -68 -104 116 -126 -151 10 169 19 -96 -80 35 63 -153 16 -179 141 52 115 47 -82 -101
5912 -101 -52 64 27 -44 -164 0 79 -7 -93 -6 192 -139 -55 -222 254 187 -72 -123 97 75 -145 110 -196 -19
5936 -19 -25 -81 42 -46 -206 -65 102 -25 -57 25 -239 -50 243 125 129 8 -15 -162 -187 61 47 -15 125 -91
5960 -91 31 116 -60 21 295 97 57 0 5 143 -283 -84 -5 -160 -132 138 260 103 61 46 -129 -117 -161 113
5984 113 -62 -90 165 104 11 6 137 53 -13 -243 -13 -20 -132 81 -179 45 59 -110 74 8 57 59 79 -32 137
6009 137 -19 101 13 -7 36 -14 -52 35 197 46 9 89 -33 -119 74 74 61 -83 -61 -58 64 5 -163 185 -79
6034 -79 47 -119 63 6 117 -33 -31 25 -162 94 48 106 -3 146 112 -34 38 197 -18 -150 13 -88 -41
6057 -41 -90 56 103 -167 88 -151 -178 15 57 -12 111 -2 -42 -52 -24 -33 -159 -90 -80 -70 -139 -29 -65 102 252
6082 252 -5 27 -63 -56 -98 -46 24 -147 117 -32 -214 28 109 -118 -77 -147 43 141 117 -11 90 -13 -12 -9 220
6107 220 146 -5 180 -180 -70 32 37 8 0 -117 -129 -96 -32 96 -69 -24 -164 17 -71 -192 -267 -20 16 52 145
6132 145 -206 48 -60 96 -146 -229 -52 63 82 -175 38 -25 193 -116 -73 -169 85 -69 -48 74 234 9
6154 9 47 113 -129 -204 86 98 57 -65 103 -16 186 -44 99 -71 -173 -20 -176 -95 25 40 -134 -73 -28 -120
6178 -120 3 130 -168 -42 -31 96 104 -85 -25 88 189 -32 -4 -145 -114 -242 8 106 84 -34 -202 8 180
6201 180 -96 2 91 -70 -104 -290 -77 115 -102 76 87 -84 -88 133 131 218 134 -249 144 -23 -159 92 -64
6224 -64 -77 135 -113 -32 -54 43 -132 -48 -164 -92 83 -126 19 25 -196 93 15 104 -90 97 -61 107 132 -62
6248 -62 68 11 137 -41 167 180 124 72 64 54 105 -316 -190 -98 38 -82 238 -27 23 58 3 100 -6 218 234
6273 234 -141 35 42 62 -232 -76 25 -95 40 -98 -103 -151 149 -1 -20 -23 0 12 75 101 -88 -138 -4 17 187
6298 187 177 -18 -66 146 -152 -120 -26 -22 -122 -26 137 316 41 -2 17 -18 29 -118 116 -57 143 -75 -96 -113
6322 -113 -180 -100 -173 -49 4 -66 -171 110 43 -40 -41 42 236 216 -6 258 -84 38 -130 85 105 -185 118 138
6346 138 68 111 58 -130 2 -6 -27 -238 35 164 49 -139 30 60 94 -110 59 11 89 -6 21 101 -115 55
6370 55 -11 35 -37 -130 -13 -45 126 86 18 -122 80 93 62 82 159 107 122 -105 -32 29 -219 -124 15 14 -13 88 129
6397 129 95 64 -309 -57 -36 245 143 -27 54 31 73 -23 37 -144 9 60 -78 -67 -60 71 49 19 40 -58 -54 -191
6423 -191 -32 -255 -52 66 15 -10 -49 76 9 -41 -179 -54 94 -124 2 75 -159 152 95 -52 -97 -234 55
6446 55 -130 -98 60 103 60 63 125 222 -49 27 -33 80 -120 76 177 -91 -88 182 69 -203 118 -38 -215 19
6470 19 43 -112 -183 65 87 55 19 -233 -119 95 95 114 -101 -65 100 12 132 38 78 62 55 -62 25 75 -153 -70
6496 -70 118 59 98 -27 -215 -95 -6 -308 -204 -52 222 -35 114 14 243 36 228 113 144 120 42 -124
6518 -124 -84 25 165 -7 44 108 -151 31 -153 -115 -69 -33 -21 -78 69 -13 -59 64 -82 165 -78 14 -51 131
6542 131 -161 24 49 43 -106 100 39 45 -155 98 221 141 31 86 -75 146 -361 13 -12 -215 17 -69 120
6565 120 278 -11 16 131 64 -89 28 200 212 51 33 -113 60 20 3 73 -388 3 32 63 -10 -260 17
6588 17 -117 -94 6 17 131 -100 10 -17 121 -158 -182 -71 -10 -50 95 57 4 -70 23 71 131 60 -147 -16 -91
6613 -91 -74 -108 -79 99 -206 85 3 153 -87 24 -135 -69 92 30 -66 33 170 44 -20 164 26 -147 32
6636 32 -25 113 35 -62 -31 -17 76 21 -124 -21 -118 46 -241 -94 29 278 3 21 -50 -8 106 57 -99 -203
6660 -203 57 -113 124 116 -49 41 85 -95 -160 -84 -35 -40 -32 -101 -31 119 -116 -19 -28 5 93 -227 60 -125 -61 -92 -232
6687 -232 -95 168 -61 35 122 -17 -150 -13 -179 -25 17 25 -21 125 -125 27 -119 32 -23 -30 152 -161 -35
6710 -35 72 148 298 -98 -204 96 168 260 -11 233 -191 -18 -135 -37 43 20 64 -77 71 -9 -95 -234 109
6733 109 -81 163 -185 0 87 201 -56 -44 77 -125 9 59 -68 -67 -10 -67 -319 72 -152 -90 -11 -54 73
6756 73 -81 195 131 4 -46 127 17 70 -169 101 -3 -21 -83 67 -256 -126 105 159 144 5 -74 -52 60
6779 60 8 21 -125 -66 -131 194 30 198 104 -86 -6 -71 59 108 -196 68 14 -128 -76 69 65 -88 -83 -3 -135
6804 -135 -156 -12 78 23 -82 -84 -87 -24 -255 67 -194 -90 16 -111 2 -70 -133 48 226 193 -10 -14 140 -149
6828 -149 7 -100 -87 -30 -102 -26 28 49 96 -182 114 -44 -65 111 -272 -23 50 116 2 38 141 -23 171 67
6852 67 -21 -40 134 45 -182 -31 118 94 -41 -7 357 -248 176 -67 56 -110 96 -127 -69 30 27 -19 -102 -173
6876 -173 142 18 28 -133 86 -151 95 60 -81 57 -76 129 -337 57 -108 -124 -126 18 4 121 -332 -79
6898 -79 -151 141 83 92 80 73 -12 155 51 44 -99 -88 -64 66 -188 149 -187 -18 -55 49 -57 -4 41 73 92 98 -113
6925 -113 -142 -138 -122 122 -127 -47 -130 27 55 -41 -122 96 -70 50 -117 87 59 -24 187 -112 -81 -57 -77 99 57
6950 57 118 24 -122 -12 2 -42 100 6 -151 -50 12 99 94 40 -130 -59 -11 44 -127 -48 -95 144 77 -82 29 2
6976 2 -275 191 -184 107 -43 -32 -150 1 -83 217 131 18 45 152 163 -43 -115 -40 294 70 87 208 70
6999 70 49 174 -17 143 35 -2 156 227 264 72 -73 233 107 53 125 79 45 19 -40 -13 57 112 -84 -7 159
7024 159 -64 173 -84 39 -87 -104 -45 -67 -51 25 9 -137 -26 -10 313 13 -33 91 -72 -33 82 75 112 -67
7048 -67 -117 8 -263 -157 -51 18 33 134 -137 -418 -29 8 -75 -143 -171 -56 -14 -95 77 -277 109 -217 -49
7071 -49 19 116 -14 -52 -52 -31 100 40 220 -108 113 -136 150 -42 -163 -227 -218 -19 20 76 87 26 -134 221 148
7096 148 22 -156 -64 180 45 106 -12 52 126 -174 25 -190 -15 -11 -201 -7 129 79 -8 -222 116 118 98 -37
7120 -37 100 -97 169 14 -172 69 70 134 37 -93 -17 3 -137 27 88 -127 -159 -132 -86 241 -5 30 254 -13
7144 -13 -110 14 20 103 -144 113 -48 105 14 32 110 -186 -180 -172 -28 41 -139 128 74 -187 -161 -37 -211 218 124
7169 124 128 99 -80 7 115 -131 38 -10 -58 46 92 -66 -8 133 -55 -52 125 85 -49 -9 105 291 -29 -8
7193 -8 -62 54 -176 133 44 187 -38 -86 -144 128 -13 -119 113 6 -139 -142 -35 55 3 137 -78 37 -70
7216 -70 -242 69 -40 -237 -33 -99 142 -18 44 53 1 152 76 -5 55 -149 -37 3 -84 121 -27 -42 73 -116
7240 -116 52 15 -97 7 47 129 -208 -116 -134 -206 213 38 138 -90 -126 78 82 67 115 67 -169 -125 -47 0 137
7265 137 3 -194 -181 138 29 -18 102 -141 114 -25 -2 334 -191 110 -108 -153 -60 -68 -61 -106 -269 -44 68
7288 68 -159 -190 -53 -20 -131 -7 -263 -307 -49 -65 -96 -221 -28 46 31 62 -132 -111 19 300 44 96 -130 -32
7312 -32 41 -175 -5 49 -72 36 105 211 56 -44 185 56 -146 -26 -111 -170 191 191 0 -140 -276 -85 -17
7335 -17 -38 -189 11 82 40 -6 119 -216 -22 2 76 26 13 -97 -34 0 321 45 30 -77 12 69 111 33 226
7360 226 -136 -211 -188 6 -105 -171 3 85 91 58 178 39 -122 -77 155 -238 55 -130 -29 179 -60 57 -70
7383 -70 -36 58 52 154 15 250 -70 -140 -87 127 -39 -34 7 298 -121 113 96 12 61 194 16 -183 -9 86 290
7408 290 130 144 104 258 -96 229 -151 115 87 -62 -7 -243 196 -32 16 -14 -2 25 30 160 151 152 8 -94 -53
7433 -53 -3 1 117 43 -75 74 66 49 26 -193 128 123 -102 0 43 4 40 38 141 -1 -1 -149 86 -58 -209 69
7459 69 62 -100 46 -146 121 122 -150 -4 42 -26 -8 -2 1 69 4 -92 -162 -96 171 54 -188 167 -32 174 84 -22
7485 -22 106 42 55 -184 77 57 -22 228 85 84 -2 136 -27 62 -114 -194 1 -51 98 -143 4 -55 249 -281
7509 -281 -112 -24 65 45 -142 -195 68 -56 89 -34 -1 -104 -100 62 117 -13 -152 -174 128 232 34 101 82 29
7533 29 -64 -118 86 -274 118 62 -160 115 121 -148 -33 -25 -36 220 -31 19 59 64 -118 -76 123 -13 -62 55 -171
7558 -171 12 -59 218 73 -42 81 -32 126 -29 188 -31 -182 -35 142 -123 211 94 -1 95 87 -35 -42
7580 -42 -241 2 -70 -4 101 83 -27 -155 -54 -141 -39 97 16 -50 147 171 -46 -259 140 -56 301 66 53
7603 53 -75 -89 -245 -279 37 83 -34 -131 -26 41 31 -63 -47 111 98 146 -158 -31 -2 -208 26 -233 -117 -65
7627 -65 163 -246 -7 59 83 -148 -27 172 -65 42 -98 -10 -132 -119 371 139 -43 86 -98 -87 63 -29
7649 -29 63 -189 74 -48 -39 -255 -13 110 -68 -2 35 -200 122 -24 59 -101 -46 -28 64 180 84 -138 101 74
7673 74 -65 92 75 -246 -124 104 -49 26 99 126 14 83 138 70 176 27 82 5 -273 -130 -113 125 -95 -87
7697 -87 -32 241 219 134 50 -122 112 -76 75 -34 -93 125 42 68 158 29 -99 -100 78 -90 -103 19 -38 -98 29
7722 29 -81 -64 108 72 -27 -1 75 40 83 73 99 -60 -133 -28 -102 110 92 -60 -24 -51 -20 -192 14 -32 -98 -96 152
7749 152 -135 106 -178 -52 101 -10 50 -64 -159 50 -79 -52 -39 17 98 148 46 -1 -127 -289 100 -36 -108
7772 -108 195 72 -30 -81 98 -191 71 39 -77 105 -86 96 -29 -108 59 -106 -59 -159 -14 -95 -74 12
7794 12 184 -12 21 -42 -85 -93 130 79 137 150 -75 -36 78 -108 110 -29 -18 -22 -34 -155 -82 -100 138 4 -28 40
7820 40 -267 68 -106 261 141 -405 41 100 5 -91 -17 265 -47 22 -58 29 38 276 87 -34 3 -253 -108 -34
7844 -34 -20 54 -188 -59 150 -53 -43 25 21 -70 150 -103 -62 -32 -112 -214 31 76 238 212 -194 6 86 -132 146
7869 146 -168 82 184 -127 -86 -41 77 -85 -154 -51 -128 36 134 -6 68 40 -71 57 -95 -78 -128 -45 19 12
7893 12 -12 -114 37 -35 -42 -151 -108 -79 103 153 237 -55 24 3 -246 -97 142 -189 -32 117 59 33 -57 -74 274
7918 274 -165 -89 -92 -102 -50 122 -80 -67 149 -248 61 163 -23 -91 44 -149 -28 -75 103 7 -238 -88 -118
7941 -118 60 -158 -68 24 -51 -98 59 -130 48 58 69 -42 -148 181 237 34 19 27 148 -9 26 13 -95 -163
7965 -163 93 89 95 20 -119 27 -29 -85 -187 -229 -222 87 -6 92 20 -90 -16 -53 -189 -72 73 -103 71 -92 -231
7990 -231 -68 78 -15 -121 37 -122 151 -168 47 26 -178 143 15 -241 -41 -93 -96 116 26 -249 -180 -106 -185
8013 -185 254 -162 25 -127 97 117 82 201 74 11 -59 30 -59 50 -16 -32 -31 182 -184 158 55 -54 -203
8036 -203 -94 -76 15 -85 17 12 -107 31 218 76 -136 72 -22 -107 173 243 247 -31 -95 14 144 -69 177
8059 177 119 146 49 71 22 -160 -71 40 96 -48 -136 -198 58 -201 -121 69 -96 -123 129 -22 49 -18 43 -181 151
8084 151 -39 51 -237 62 -69 -116 117 2 -174 -73 122 13 -91 146 -148 62 -86 25 95 -180 19
8105 19 68 40 256 -221 92 22 -58 64 56 -104 71 107 4 -75 132 -53 -57 -154 62 126 -209 28 37 -31 -48 115
8131 115 -262 -7 -53 125 214 -64 -70 -120 -32 -55 -59 135 57 -39 16 115 65 195 -26 -89 23 -11 113 55 17 -49
8157 -49 22 15 149 26 -117 7 117 279 -114 -9 95 -256 -14 -32 39 -43 -60 -56 -12 -123 105 59 -198 16
8181 16 -52 -193 -46 -233 -7 -116 -33 138 -213 85
8191H5
$$ Imaginary data points
##PAGE= N=2
##DATA TABLE= (X++(I..I)), XYDATA
0 0 0 0 0 0 0 0 0 -8 8 -8 8 -16 16 -24 24 -32 48 -56 64 -80 96 -118 136 -160 190 -224 257 -297 344 -394
30 -394 453 -516 584 -663 750 -845 948 -1061 1187 -1323 1475 -1639 1816 -2011 2227 -2459
46 -2459 2714 -2991 3298 -3631 4003 -4409 4857 -5359 5922 -6555 7274 -8100 9060 -10191
60 -10191 11541 -13198 15275 -17978 21643 -26922 35205 -50134 85317 -340858 63236 639695
72 639695 -406958 -201146 509895 -62189 -550038 306932 381811 -421966 -215516 457428
82 457428 16186 -275555 224363 147347 -393094 -93275 340255 53998 -223876 54332
92 54332 144092 -172544 -122896 235821 -1158 -299863 112932 309998 -150243 -154989 199731
103 199731 -54915 -279362 216980 290993 -276930 -111648 330339 -129815 -297019 294948
113 294948 90970 -401042 134174 382571 -268448 -220018 312478 -49253 -352903 248845
123 248845 309516 -321380 -99798 359684 -107168 -307975 224126 160291 -262024 5438
133 5438 284888 -77027 -254741 97433 136917 -196507 -58800 263817 -112 -236161
143 -236161 90200 164685 -202475 -119239 266248 59077 -246689 110163 234156 -253256
153 -253256 -153998 297025 -30264 -273652 210564 203966 -279496 -76262 238721 -122632
163 -122632 -211046 242641 131905 -254432 36918 220454 -176465 -130518 215667 -2304
173 -2304 -172672 138057 150884 -157150 -93473 116992 -25859 -126194 105261 121924 -130911
184 -130911 -65462 124972 -20226 -135305 46078 105837 -66015 -35441 153417 7933
194 7933 -197139 32961 149728 -113136 -44986 196969 -33090 -191956 99185 110326 -188095
205 -188095 -55172 202197 -29678 -149608 151899 74296 -233939 -4300 198191 -76126
215 -76126 -87211 165675 26511 -162510 32299 114821 -105553 -80917 141791 37524 -117954
226 -117954 41269 68775 -125451 -61019 114542 25713 -78165 36815 83510 -71805 -77881
237 -77881 91495 24235 -107294 57036 124564 -77871 -68753 86288 -18135 -119233 54627
248 54627 109627 -81347 -50369 117547 -32082 -141152 75090 77968 -109348 16716 137862
259 137862 -50556 -97353 73694 32193 -106108 18904 124542 -43711 -74774 83925
269 83925 2652 -121723 19948 80360 -47658 -27838 78449 7752 -88861 -197 63628
280 63628 -44237 -33334 98710 26645 -79446 20549 47768 -69498 -39349 78595 24638
291 24638 -65352 22740 61075 -79706 -63113 79518 1726 -71629 63901 64717 -74582 -28369
303 -28369 63146 -22695 -62929 62543 66601 -61305 -9209 71738 -52582 -76136 63337
314 63337 28533 -60465 23311 59798 -45477 -57945 37118 15755 -58502 22179 78923 -29316
326 -29316 -39333 48669 -6037 -61835 23273 55074 -18336 -20436 43779 2260 -71373 -341
338 -341 46554 -40172 -18654 71173 513 -61980 14855 26982 -46270 -14336 67252 15504
350 15504 -46914 29595 36469 -66454 -21342 61326 -13092 -32321 50150 18458 -58379 -15783
362 -15783 31478 -23235 -33447 49892 32241 -45907 4780 36431 -42923 -29526 48096 19612
374 19612 -22012 16247 31332 -28888 -41009 25395 12788 -40186 18396 47498 -30074 -30541
386 -30541 22549 -11373 -38943 19861 46175 -13113 -19903 37429 -1987 -53156 19910 37286
398 37286 -33419 3118 53188 -13766 -44084 8915 8147 -34448 417 48514 -6003 -36752
410 -36752 23235 7514 -44978 5057 34464 -9780 -1720 33060 6809 -33460 -12448 21222
422 21222 -7090 -13477 36985 13671 -39220 -2458 16537 -28442 -21030 26982 17919 -18042 6156
435 6156 27806 -28994 -34934 35099 13714 -25608 30330 30855 -34047 -15749 21842 -12722 -27463
448 -27463 22411 28443 -23575 -9673 24852 -25453 -35788 25979 14454 -16701 17727 23726
460 23726 -14709 -20704 4917 8834 -10126 7532 31852 -5212 -22557 9584 -2162 -27663
472 -27663 -825 20135 1382 -8233 13932 5624 -38054 -12239 33139 -4600 -9677 38604 3766
485 3766 -34497 11130 18592 -26111 -12230 31146 10105 -19164 13239 7971 -46265 -14056 34886
498 34886 -3590 -10506 23246 -1607 -22794 4042 12196 -9391 -11801 18684 24861 -5073 -3812
511 -3812 3002 -22840 -15482 19752 17960 -6048 -10828 4440 -1431 -21872 2208 13657 -21842
524 -21842 2136 41419 -1545 -24358 6299 -3685 -18235 18642 33179 -9940 -20148 17429
536 17429 893 -30319 8151 12663 -27107 7235 35005 -12458 -23948 1176 -5429 -7490 16282
549 16282 23102 -3285 -13713 9302 5065 -15024 782 7806 -2897 5888 11986 920 -17250
562 -17250 -22657 4295 9783 -8552 12673 15719 -22279 -9326 18274 -7275 -16904 15633 20135
575 20135 -6834 1554 19299 -17835 -29742 19683 12058 -19004 15406 15458 -26700 -9611 11967
588 11967 -11466 -12363 14217 14324 -5127 462 10050 -12486 -14465 13893 8606 -1009 11429 3859
602 3859 -7983 -8201 -8434 1268 106 -4256 12657 5358 -15740 -1951 2530 -14053 -2348 17463
616 17463 8998 -4991 6375 9077 -19702 -10988 22084 -1297 -11454 23310 3991 -25813 1302
629 1302 5951 -18691 -4677 17922 4907 -9056 5403 4180 -20373 -4726 18913 -79 -84
642 -84 17187 -611 -10321 -230 -2381 -3178 -593 4230 10344 -2792 -10140 -657 -7685 -11047 5867
657 5867 10773 1850 -1642 5306 1426 -14570 -315 15135 -5956 993 22896 -5144 -17402
670 -17402 6686 -3041 -16037 5953 14664 -3853 -7818 7475 -3542 -20535 3594 14298 -7659
683 -7659 5128 17961 -6644 -8923 4710 -2437 -4123 4736 9401 4629 -5717 -2830 -2780 -12863
697 -12863 -3327 8106 1836 473 1875 116 -4499 -8926 3439 7218 -5032 9400 16432 -9238
711 -9238 -7493 6209 -7857 -7352 11461 8220 -6435 -3231 4846 -8793 -14921 7325 4859 -9625
725 -9625 11368 12603 -12478 -4611 4951 -5527 -800 11173 8849 -1450 -3652 3159 -5139 -11604
739 -11604 3952 4564 -3841 4773 3690 -6316 -7374 -5339 1900 2650 455 11361 5553 -9782
753 -9782 1458 3379 -8735 1143 11019 3081 -2471 1747 1188 -11860 -9175 8371 -335 -6124
767 -6124 12766 3306 -14153 -104 2716 -6822 2731 11049 5080 -2177 763 3309 -7832 -6300
781 -6300 8288 1202 -2495 8544 -300 -10179 -5506 -3029 -399 1036 2837 7144 -2140 -5679 4746
796 4746 -1949 -6789 6159 6895 1874 3639 1997 -4055 -9873 -2462 7897 -2235 -1661 8977 -5319
811 -5319 -9997 4347 -2330 -8273 4086 8138 3124 293 2396 -998 -9634 838 11377 -845
825 -845 207 7827 -4632 -7203 399 -3391 -4196 -61 4638 5017 -4050 -3574 233 -7552 -736 10235
841 10235 2955 623 4045 -102 -2557 -4017 338 3034 -2570 4213 8078 -7824 -7226 935 -6668
856 -6668 -3169 6894 3733 -948 -600 1484 -1806 -6532 3618 7025 -2396 6016 8262 -6986 -4849
871 -4849 846 -3886 -1028 3684 3585 -154 -5108 -1105 -1924 -7863 1656 6191 -591 4004 4644 -3145
887 -3145 -2932 -1533 1686 3289 612 6125 3258 -7710 -1885 90 -7882 -209 5582 191 -942
902 -942 -236 -1100 -4583 -5190 5230 4199 -1195 7835 4195 -7031 -450 1521 -4056 1754 4536 2418
918 2418 -573 -3568 -805 -5073 -6923 4441 2936 -2047 4500 1041 -5310 -1304 -388 1491 3054
933 3054 2420 6487 1466 -5169 810 -2455 -5756 3931 3904 -1070 279 -1618 -3260 -4810 -3165 3590
949 3590 480 -269 8259 607 -6110 1722 -564 -2547 5188 5269 1469 -1208 -2051 -592 -5041 -3811
965 -3811 4022 -1038 -1369 5635 -2095 -6199 -1713 -1735 1185 4362 3740 4032 -1646 -2511 2953 -2575 -2683
982 -2683 4837 1539 161 2707 -2429 -5152 -5167 -2267 3835 321 655 4795 -4307 -3948 3388 -1952
998 -1952 -1943 5054 3639 2804 1344 -1372 -2086 -5358 -99 5705 -1084 -110 2918 -5556 -4128 338 -2751
1015 -2751 -422 2195 2886 3821 -1185 -1917 261 -3819 1583 7176 763 1109 1746 -3501 -2596 -2252 -1894
1032 -1894 1049 -1188 1832 3307 -5197 -3121 602 -4252 1318 6028 1737 1742 718 -912 -643 -2648
1048 -2648 1651 3773 -1301 3094 2523 -6072 -2947 -870 -3761 991 2484 1371 1056 -2693 -698
1063 -698 -240 -3413 3138 5043 28 3537 2105 -3505 -1365 -1444 -514 1915 -74 2172 434 -5647
1079 -5647 -1667 -1080 -4563 2478 3683 -57 2186 -216 -1740 -496 -1814 2651 3806 152 4318
1094 4318 905 -5330 -852 -1551 -3111 2053 1523 315 -180 -3273 -952 -1739 -3086 3712 2940 13
1110 13 4417 576 -3351 169 -541 607 2792 1092 2172 -797 -4321 -409 -2844 -3470 3134 902
1126 902 -731 2322 -1601 -2009 -496 -1123 3239 2816 808 4343 -181 -3307 756 -1574 -1341 2908
1142 2908 518 260 -498 -3578 -1309 -2704 -2480 3410 1120 135 4230 -1211 -3021 1004 -396 1520
1158 1520 3016 1722 2465 -1590 -2455 686 -3417 -1716 3160 -535 -132 1597 -3356 -2854 -986 -842
1174 -842 2708 1982 1508 2782 -1534 -1248 1755 -1773 652 3242 448 1622 -380 -3601 -1443 -2916
1190 -2916 -1359 3251 -239 -379 1895 -3099 -1948 996 -805 1697 2793 2060 2489 -1297 -1317 360
1206 360 -3020 693 3693 -1385 341 575 -4234 -2132 -721 -1516 1506 1240 1367 1714 -2193 -440
1222 -440 616 -1625 2543 3372 330 2181 -466 -2804 -379 -2163 -201 2410 -1267 429 568 -3747
1238 -3747 -1376 -354 -1622 1640 2105 1930 1974 -1827 -393 555 -2162 2691 3220 -1537 1737 291
1254 291 -3788 -1047 -1188 -1862 1098 598 966 124 -2870 -439 -637 -936 3949 2071 -165 2513 -636
1271 -636 -1500 812 -1492 255 2032 -184 1298 -820 -3976 -1326 -1131 -1090 2422 579 460 649 -1937
1288 -1937 560 247 -1409 3195 2418 -100 2857 -522 -3434 -254 -582 -208 1508 -244 146 -1633
1304 -1633 -2471 53 -1901 -1244 3213 557 743 2669 -1870 -1310 912 -263 1786 2151 13 1002
1320 1002 -1366 -2417 -436 -1914 -561 1551 -343 590 74 -2949 -214 -304 -617 3622 1581 190
1336 190 2665 -902 -1620 733 -626 494 1517 373 372 -1906 -2366 -366 -2454 -106 2655 -801
1352 -801 282 1404 -2187 -715 1180 -71 2083 1993 753 1285 -1532 -1228 95 -1730 741 1414
1368 1414 -1078 618 -976 -3182 -83 -1162 -635 2655 414 721 1802 -1569 -570 924 69 1765
1384 1765 1450 589 682 -1943 -1439 -199 -2426 495 2240 -1621 350 448 -3177 -493 575 -225 2199
1401 2199 1574 722 693 -980 228 -128 -1046 2246 973 -1086 1176 -1851 -3030 -42 -1414 -370
1417 -370 2131 -470 120 768 -1562 -10 142 262 2278 1239 1078 1246 -1859 -579 137 -1699 1539
1434 1539 1384 -2160 576 -565 -3066 -24 -352 -589 1463 1014 1021 299 -1394 223 -69 130 3263
1451 3263 664 -382 1319 -1681 -1910 528 -1665 -233 1357 -594 223 -577 -2439 -380 -168 601
1467 601 2273 530 1094 805 -1450 664 606 -1269 2027 1086 -1041 1392 -1650 -3304 -88 -908 -194
1484 -194 1139 31 212 -757 -991 893 -520 344 3138 -6 690 2033 -2072 -1202 866 -1207 486
1501 486 1334 -935 -317 -1365 -1679 -345 -981 432 1548 -32 1364 371 -1887 988 221 -420 3087
1518 3087 983 -753 1351 -1377 -2018 469 -591 -28 469 -132 -70 -1554 -1019 60 -1279 943 2927
1535 2927 -348 958 1515 -2065 -86 1415 -754 1312 1223 -431 -126 -1461 -1435 -946 -1219 1014 621
1552 621 -557 1061 -732 -1951 1189 -39 40 3051 445 64 1305 -1247 -964 399 -557 403 595
1569 595 -48 -157 -2104 -1252 -141 -1732 1420 1826 -1229 1094 1172 -2429 802 1299 -367 1796 1533
1586 1533 -56 -97 -1252 -612 -747 -829 1381 -241 -949 1074 -1686 -2043 1268 -811 -44 2571 297
1603 297 155 1110 -1109 -82 578 362 1118 383 182 -94 -1966 -500 -312 -1827 1351 1025 -1391 918
1621 918 -59 -2402 800 859 -103 1892 1302 175 113 -753 -11 -645 -194 1645 -763 -789 831 -2278
1639 -2278 -1627 837 -1559 86 1965 -403 -24 581 -975 200 493 931 1175 395 678 -135 -1695
1656 -1695 262 -513 -1300 1708 142 -1675 724 -1001 -2028 949 -44 -199 1727 932 333 -14 -159
1673 -159 722 -853 758 1672 -761 63 933 -2353 -1067 734 -1556 213 1154 -965 -375 -1 -847
1690 -847 -119 548 1193 1089 391 1186 -216 -1161 1038 -287 -935 1707 -260 -986 770 -1485 -1952 833
1708 833 -491 115 1035 474 -1 -655 125 524 -491 1269 1705 -548 817 740 -2399 21 770 -1500
1726 -1500 829 589 -1382 -439 -535 -938 -73 -135 1091 693 290 1253 -412 -1056 1399 -240 -114 2512
1744 2512 -386 -806 705 -1311 -1196 269 -583 48 269 -148 -281 -901 -83 486 -587 1561 1453 -698
1762 -698 1241 609 -1872 735 566 -886 1159 514 -997 -446 -899 -821 -508 -293 1036 -146 -168 1181
1780 1181 -910 -705 1469 -412 393 2194 -241 -199 825 -1070 -652 116 66 440 -133 -347 -374 -1328
1798 -1328 -40 81 -1038 1424 1049 -744 1074 15 -1290 1286 690 -241 1291 390 -411 -343 -966
1815 -966 -532 -451 -317 906 -1014 -475 703 -1525 -567 1141 -728 854 1787 -394 381 592 -892
1832 -892 75 229 252 580 -164 -1 -529 -1677 -115 -393 -938 1456 67 -991 1221 -508 -902 1219
1850 1219 317 155 1309 245 200 -100 -813 30 -592 248 733 -1189 -9 505 -2031 -282 766 -1115
1868 -1115 939 1362 -491 173 205 -564 355 472 779 638 -168 609 -655 -1292 543 -720 -956 1482
1886 1482 -402 -801 572 -1038 -753 1021 340 528 1013 -87 609 -331 -217 767 -487 553 1081
1903 1081 -1090 101 -252 -2086 -20 312 -1139 801 168 -1155 254 -115 -340 469 503 1003 553
1920 553 -60 836 -804 -1051 861 -384 -427 1351 -991 -1047 276 -1197 -582 401 -124 495 759 191
1938 191 383 -465 60 791 -152 1284 889 -847 514 -195 -1329 77 -133 -923 731 -220 -959 -201
1956 -201 -522 -658 219 125 1147 113 -79 1007 -690 -81 1256 -471 335 1600 -689 -537 183 -1301
1974 -1301 -633 277 -490 428 32 59 83 -896 455 449 -93 1503 740 -438 1047 -151 -1264 705 -23
1993 -23 -516 762 -491 -676 -414 -862 -223 -322 -163 980 -229 -86 849 -882 262 1210 -454 734
2011 734 1115 -517 -16 -16 -1212 -104 112 -337 134 -416 -143 -326 -1044 506 176 -247 1628 408 -629
2030 -629 819 -173 -611 1069 -77 -155 552 -473 -426 -336 -880 -125 -462 -83 752 -717 96 450 -1118
2049 -1118 322 1018 -414 1070 1042 -558 743 249 -657 362 249 316 193 -603 -38 -910 -1242 394
2067 394 -180 -273 1479 65 -586 1022 -592 -326 1207 113 257 839 -244 115 -510 -453 257 -441
2085 -441 111 433 -1040 18 5 -1403 395 411 -428 963 880 -447 625 -45 -367 635 357 523
2103 523 249 -435 311 -677 -820 625 -628 -333 942 -764 -418 698 -865 -239 1096 -123 670
2120 670 855 -204 270 -403 206 189 -315 601 318 -1265 151 -275 -1480 272 46 -748 862 249
2138 249 -728 469 -102 111 381 334 681 240 -48 640 -853 -347 851 -793 -160 844 -1066 -261
2156 -261 432 -1060 -15 677 -87 629 463 204 192 -598 318 403 -500 832 257 -844 636 -544 -1068
2175 -1068 664 -206 -608 437 -316 -662 263 -144 389 145 324 855 -334 270 630 -776 151 615
2193 615 -900 331 525 -1180 -15 -121 -1153 96 -29 -85 370 -85 -93 5 -478 667 283 -78 1296
2212 1296 44 -318 719 -494 -674 783 -197 -217 408 -556 -391 -96 -479 218 4 375 914 -193
2230 -193 386 418 -835 467 800 -381 915 522 -948 230 -75 -1057 352 -238 -180 66 -277 15
2248 15 -414 -451 854 -18 -51 1337 -151 -112 767 -756 -304 604 -284 113 302 -516 -468 -429 -484 -24 -339
2269 -339 478 233 -641 282 230 -521 847 444 -93 998 235 -556 352 -237 -520 136 -276 132 60 -673
2289 -673 108 -678 -446 793 -409 119 946 -584 84 747 -557 242 823 -137 493 126 -339 54 -455
2308 -455 -237 144 -626 336 126 -916 508 -277 -891 846 488 -241 1159 151 -345 421 -232 40
2326 40 280 -182 454 -182 -348 -30 -903 -309 476 -683 81 707 -772 212 432 -618 346 918 67
2345 67 476 99 -113 88 -320 116 -8 -262 558 -253 -894 263 -539 -727 615 -214 -75 689 -358
2364 -358 -213 388 -195 255 422 319 820 -216 -145 -76 -887 -53 240 -687 180 21 -1019 -114 73 -696
2384 -696 430 141 135 538 136 103 155 -241 461 263 -462 733 -351 -717 235 -580 -565 385 -290 -56 423
2405 423 -559 77 38 -153 140 263 273 565 4 159 290 -691 221 262 -878 243 -24 -917 125 -364
2425 -364 -577 380 -109 68 226 -150 267 12 -268 763 109 -20 763 -291 -328 330 -628 -261 429 -262
2445 -262 84 140 -745 -279 -222 -225 508 -170 461 441 -470 607 322 -529 545 306 -274 697 -309 -911 402
2466 402 -516 -307 249 -388 122 118 -292 156 -352 -103 973 -242 319 891 -355 -74 762 -892 14
2485 14 99 -421 138 28 -434 -320 -644 -241 9 -343 281 365 -323 564 205 -361 696 203 -263 776
2505 776 -35 -312 294 -815 -15 102 -269 358 -359 -416 130 -474 -72 737 -380 485 679 -512 544
2524 544 396 -316 607 305 -213 175 -110 -483 -243 -447 -186 61 -557 412 -217 -668 418 -231 -466 681
2544 681 121 84 662 -552 104 522 -314 32 88 -204 56 -569 -385 -121 -788 -233 189 -693 446 418
2564 418 -695 551 172 -344 634 358 83 426 -99 -150 31 -455 146 -25 -285 358 -566 -356 357 -563
2584 -563 -133 540 -252 204 576 -236 288 199 -297 213 269 35 365 -494 -123 -57 -761 248 287 -569 243
2605 243 -90 -555 327 -141 -272 723 245 185 275 -113 226 141 -127 482 145 -123 404 -509 -416 340 -609
2626 -609 -210 302 -373 272 239 -157 98 77 -81 459 220 223 308 -399 61 -75 -495 383 -66 -534 373 -209
2648 -209 -581 168 -215 4 380 -11 195 275 -300 443 -139 107 667 -46 332 470 -524 -20 83 -553
2668 -553 49 270 -568 264 -51 -474 214 -69 -8 378 63 195 229 -212 329 176 -231 769 -99 -5 432
2689 432 -561 -406 158 -605 -219 258 -192 197 -128 -75 217 74 66 601 -45 472 480 -343 252 -37 -415 119
2711 119 58 -459 113 -237 -397 -39 -227 297 117 -141 326 37 73 533 85 21 836 -134 141 174 -442
2732 -442 -351 -61 -636 -44 -140 -320 -41 -313 -219 47 -328 112 428 -175 383 431 -233 291 22 -182 257
2753 257 -51 -395 22 -427 -207 -35 -775 12 -100 -335 415 -327 -236 762 -108 -13 657 -130 398 370 -298
2774 -298 103 185 -497 34 33 -70 105 -428 -225 -22 -365 342 173 -201 484 207 -38 486 -115 122 535
2795 535 215 104 166 -409 -125 -47 -508 364 -213 -553 267 -357 -37 137 -459 326 502 -168 425 326 -236
2816 -236 300 5 -111 411 -103 19 -2 -399 246 -163 -544 195 -80 -294 198 -166 -66 378 -111 286
2836 286 651 120 452 180 -112 217 12 -153 273 -335 -81 147 -685 -145 35 -634 213 51 -380 499
2856 499 -87 -188 356 -90 250 394 -20 247 172 -371 140 -271 -286 348 -198 -302 261 -480 -223 190 -275
2877 -275 160 364 -59 421 -46 -236 321 -55 56 299 -265 229 16 -583 170 -149 -489 64 15 -331
2897 -331 292 -313 -134 348 -49 210 585 133 468 118 -207 468 -282 -103 169 -298 57 280 -702 -40
2917 -40 -129 -482 44 -203 -112 405 -223 -166 274 -39 164 443 -221 222 -94 -167 234 -196 -270 118 -183 -31
2939 -31 163 -417 -39 74 -282 169 66 -10 416 -64 9 508 13 -104 483 -95 -8 153 -319 320 -195
2960 -195 -434 272 -115 -74 226 -360 -78 186 -163 248 328 -91 556 233 -255 374 -237 -153 274 -296 148
2981 148 102 -617 30 -99 -264 225 -151 -17 291 -143 -187 579 -180 393 362 -190 210 111 -402 96 -112
3002 -112 -300 164 -456 93 70 -326 122 -4 -192 376 189 -112 384 -72 -2 471 -113 102 254 -372 222
3023 222 67 -132 -64 -296 -237 335 -292 -252 308 -398 -21 409 -7 356 422 -184 379 197 -105 507 -216
3044 -216 85 156 -219 135 -26 -644 149 -97 -490 290 -28 28 256 -271 -66 467 -79 213 261 -98 373
3065 373 -107 -236 -24 -329 -53 252 -236 78 86 -409 -33 -131 -238 119 45 144 459 -216 27 475 45 468
3087 468 535 -413 47 12 -547 98 -306 -194 120 -339 -25 34 -158 -110 181 -246 366 243 18 316 134
3108 134 -150 298 -188 -82 220 -325 183 -32 -547 110 -193 -394 219 -164 64 259 -247 107 247 -149
3128 -149 680 144 28 413 -180 -361 243 -191 -61 213 -317 77 -250 -683 204 -118 -277 265 12 70
3148 70 238 -24 120 544 -214 173 161 -76 88 -82 -349 30 -347 -220 301 -393 -97 167 -431 180 111
3169 111 16 401 292 22 344 -149 24 18 -278 61 172 -558 -88 89 -417 215 -276 -472 183 -133 -8
3190 -8 227 -428 234 336 -344 466 42 29 378 -18 -310 138 -139 206 123 -182 111 -260 -488 -22 -317
3211 -317 -232 386 24 94 301 -113 -74 243 31 238 207 -248 86 -18 -241 109 -311 36 394 -497 34
3232 34 -45 -308 51 27 -128 492 -73 27 587 -75 117 141 -107 307 142 -347 132 -232 -361 51 -116
3253 -116 -116 316 -224 94 10 -339 34 272 -129 488 42 -77 85 -307 -65 23 -154 29 169 -478 -96
3274 -96 -124 -244 121 -66 -14 272 37 104 56 -106 321 344 -23 429 105 -284 268 -223 -124 -136 -326 -80 126
3297 126 -247 -66 -175 -268 148 -94 -234 277 38 42 435 -303 283 293 -223 310 6 -285 251 -28 -231
3318 -231 47 -466 -191 258 -344 -30 -48 -468 370 2 -5 460 74 -67 557 -229 53 276 -114 36 -100
3339 -100 -116 111 -122 -130 -227 -203 -46 292 -275 309 331 -271 272 76 -60 384 -24 -90 134 -204 -177 336 -390
3362 -390 45 16 -547 36 -156 -179 -43 -62 -60 664 -280 184 303 -110 243 98 -229 106 101 -134 215 -416
3384 -416 -89 -129 -185 -156 109 -356 82 103 -536 342 -101 -61 488 -231 -58 293 -161 95 -179 -82 -15 -96 -222
3407 -222 -172 -526 -239 157 -341 -15 163 -95 178 272 -158 255 -9 -199 349 -97 -175 153 -255 4 268
3428 268 -203 438 -75 -107 232 60 -328 303 -200 116 387 -299 266 270 -212 176 34 -100 434 -97 -132
3449 -132 -106 -210 -69 -176 -307 -40 -90 -223 165 -48 -273 177 4 -150 325 71 -35 286 -116 60 60
3470 60 -200 363 -1 -40 148 -221 -137 174 -239 -71 161 -351 -66 141 -82 170 -71 147 272 36 157
3491 157 218 -149 188 -72 -136 170 -141 -401 19 -45 -343 14 -149 -218 468 -273 -9 39 -113 416 -108 -149
3513 -149 288 -43 46 123 -418 -151 77 -274 36 137 -116 188 126 -190 433 16 -27 297 68 181 165 -204
3535 -204 219 -210 -13 392 -101 -318 160 -128 -163 143 -210 114 -59 -1 226 -41 -41 307 -176 96 277
3556 277 -109 195 206 -290 89 283 -189 180 -82 -333 104 -215 -57 100 -110 -29 115 -164 331 -37 48
3577 48 347 64 -100 359 -163 82 321 -282 -331 78 -202 -20 -95 -83 115 -427 88 350 -120 11 148
3598 148 -260 141 139 -115 94 118 -133 183 -73 37 -70 -214 -175 138 -77 135 -72 -248 274 -89 -76 377
3620 377 38 72 293 -30 60 204 -171 278 102 -231 76 -91 -201 52 -60 -171 139 -2 -45 203 26
3641 26 306 185 7 258 -186 30 289 -117 -102 223 -156 51 -90 -162 -11 56 -45 22 -354 2 89 -148
3663 -148 -123 197 -7 213 68 -108 256 -34 -92 100 27 -118 25 -464 149 -144 -136 187 153 -169 256 -16
3685 -16 69 203 -70 211 513 38 231 83 26 51 -15 -60 223 -224 -150 141 -474 -84 -13 -11 220 34 -193
3708 -193 8 95 -49 12 -124 -18 -9 -24 -185 -127 -15 -27 -221 -255 52 -172 -297 140 -168 -40 154 -38 -4
3731 -4 331 -120 -141 -144 -103 153 15 170 14 -255 -274 -124 -216 141 52 -351 90 -19 84 141 -1 101 267
3754 267 -87 271 79 63 141 -25 -33 281 -148 -172 166 -65 -71 95 -161 -219 -43 -157 116 238 -186 106 -25
3777 -25 -238 91 21 61 275 -222 54 5 -486 -156 -45 -53 89 -211 -242 35 -200 71 176 5 130 11
3799 11 -86 192 139 -184 249 -241 -75 237 24 10 -142 -117 -163 -59 -132 114 90 -57 151 -213 -21 96 -165
3822 -165 201 57 -126 194 -113 -230 79 -145 -234 82 -65 -35 -17 -211 189 25 -330 219 223 18 75 58
3844 58 133 148 -76 173 -22 -281 355 60 179 -66 -84 -186 172 -148 -2 282 154 211 102 -45 39 -89
3866 -89 -86 303 -85 -4 99 184 -153 25 110 -123 66 -206 29 -65 54 292 69 -14 -39 -141 53 179 -27
3889 -27 171 150 -166 133 -32 -247 -90 -158 97 72 -128 -60 -76 -297 106 -210 -105 -41 60 -206 128 -113
3911 -113 108 243 105 36 107 -11 10 64 -90 25 -98 -81 -100 -48 45 148 -5 -14 65 -110 283 242 -187 93
3935 93 81 -81 71 -268 26 -134 53 -111 10 -160 155 -79 -336 -43 -160 -37 7 24 82 77 -187 255
3957 255 -19 49 58 143 72 148 18 -16 170 -245 -61 108 -167 53 70 -284 71 126 -48 205 -92 -52 44 77
3981 77 171 120 -34 -207 98 -17 247 -263 -63 -3 -84 -136 -68 22 -26 90 -148 62 61 41 86 8 18 -26 -44 143
4007 143 -66 -90 92 -166 -235 -89 -141 -208 282 -105 -250 194 -135 126 272 88 187 -10 55 453 -60 -8
4029 -8 144 55 54 12 -406 -53 67 -119 -57 -74 37 -3 4 -32 -16 -80 155 205 28 139 250 113 169 184 29 117
4055 117 -195 -260 69 -162 -165 83 -37 -34 -93 -16 76 199 141 96 -117 -113 -32 -267 181 -103 -206 -11 -196 -137 194
4080 194 -28 -257 -79 -49 71 -235 189 265 7 125 134 -14 -82 127 140 56 137 -65 -37 -160 -197 -151 -101 -204
4104 -204 -81 -38 -209 -84 69 240 -31 -93 252 16 153 107 -139 13 43 101 -81 135 -31 103 87 -149
4126 -149 74 245 -23 -174 -136 91 211 81 -4 261 -105 -9 -68 -138 65 -47 43 132 -79 234 137 -123 140
4149 140 143 -40 69 -83 119 88 68 47 329 254 147 68 30 117 -117 -72 -14 -108 -110 44 -151 96 23 -80 -34
4174 -34 34 74 -99 166 -57 192 189 42 25 130 -84 208 42 12 114 -112 172 -90 92 9 -43 -183 264
4197 264 -88 25 104 -182 115 144 -124 -10 238 191 180 -46 15 147 -132 -15 173 -216 -136 -112 -68 -145 -49
4220 -49 -256 98 -40 -133 126 61 -100 284 -167 209 130 -95 -32 -207 -111 25 -91 -88 -56 -103 66 68 52 -3 241
4245 241 -159 166 -136 -181 234 173 -106 211 -137 -158 40 23 -51 -79 39 -185 -164 -53 163 -96 208 21
4267 21 44 -56 132 126 211 120 34 99 247 33 29 100 111 -29 28 29 84 144 17 95 -30 143 163 -138 -22 81
4293 81 27 25 -66 76 -148 -270 -68 -203 -266 133 64 -177 81 65 -47 110 -286 18 -46 42 284 -36 -69 263
4317 263 -273 -73 -52 31 -83 106 -229 150 -31 -7 57 108 -132 79 -343 -12 184 -223 118 308 105 -50
4339 -50 51 -111 57 90 -207 22 77 -56 -77 64 154 42 55 -160 -104 -18 -38 -65 22 102 -33 -77 234 -211
4363 -211 117 83 -38 166 -53 -158 -110 -77 -51 -4 108 63 -15 25 -55 -139 -146 28 -64 -250 176 -118 133 211 36
4388 36 -15 -98 -133 -215 50 -149 -81 -105 -101 125 -136 57 149 -58 160 89 91 36 110 -9 118 47 56 64 -146 -81 70
4415 70 -141 -19 126 -177 -107 -201 84 40 10 -138 -13 -82 14 24 -131 -43 302 -111 97 -104 10 -105 -294
4438 -294 74 -37 -4 214 103 -145 115 46 -95 94 31 167 29 -66 52 49 16 -28 -23 60 120 245 19 11 -15
4463 -15 -121 69 -76 -169 149 -110 112 253 63 198 -11 136 204 -188 -66 88 64 -103 -12 -63 159 -43
4485 -43 -110 153 -161 -20 99 265 103 -71 -42 276 -142 -77 264 8 -44 -137 -124 -17 196 -141 -117 197 -166
4508 -166 28 105 138 164 213 -50 227 146 -124 14 -301 120 -188 -89 1 -69 -10 105 -79 -40 100 -104 -119 -33
4532 -33 90 -139 -10 -20 133 -28 -21 -156 17 -146 220 -49 -30 -126 -264 41 -43 28 84 -19 -157 -78 -91 -78
4556 -78 194 -84 102 -28 -104 -105 65 28 129 -17 29 123 -149 2 69 -22 -7 -78 -31 128 136 -50 104 69 -60
4581 -60 120 -39 -137 -20 -137 -27 57 -94 217 46 32 212 29 17 195 -73 24 -37 -95 21 204 -156 35
4604 35 -67 -224 -232 -105 -25 -111 -29 -104 135 -48 -24 67 116 39 -67 37 -2 -68 -11 -71 -247 18 57 -97 -114 -30
4630 -30 130 -9 -142 182 116 79 47 94 -204 227 159 -216 94 -36 33 -3 -153 -5 -228 2 154 -64 137
4653 137 -83 -66 -54 -44 -195 18 27 -199 -101 -63 -27 -59 147 -100 -108 141 99 160 65 102 89 -148 92 -96 1 -66
4679 -66 191 122 -200 -44 70 29 -146 -126 76 -10 -129 -87 4 103 109 40 72 18 -58 267 208 -138 141 21 -119
4704 -119 53 76 -2 -145 135 25 38 -36 196 -108 -80 -211 -54 -15 51 -211 286 -132 -203 84 -91 60 -72
4727 -72 -67 18 59 115 -158 62 -6 80 -140 -16 84 -57 293 -65 97 -20 11 15 -43 71 24 -79 -87 -72 -98 20
4753 20 54 -132 -261 -119 16 190 43 -19 91 141 -140 39 -97 32 -77 -21 22 -128 -160 -1 -4 3 -112 91
4777 91 -138 -57 65 65 -1 242 82 22 56 52 37 -130 -24 88 55 -201 -123 -106 121 -68 167 179 -51 -23 -105
4802 -105 35 100 -78 -99 131 24 -96 -115 -4 79 6 -8 -42 88 -220 -41 55 12 -15 -184 -135 -132 -30 -5 -128
4827 -128 9 47 30 -100 -124 -141 207 -143 150 310 -243 266 168 93 -96 -113 90 -71 -19 26 141 -212 196
4850 196 -43 -54 28 -185 -24 47 3 43 -153 205 -146 61 16 -15 -16 -45 -252 -165 47 -155 112 129 139 -83
4874 -83 53 -196 205 -148 -94 88 -32 -8 -86 76 82 39 -55 52 64 21 122 196 33 330 52 75 13 -159
4898 -159 70 159 156 88 -67 -22 -23 -299 207 38 -104 -147 147 44 25 58 107 -14 -105 28 -64 -70 -43 54 -149 -26
4924 -26 -70 95 142 87 -125 105 -262 37 138 120 -29 -225 -164 28 81 -33 -182 -52 34 -28 -74 11 296 -97
4948 -97 87 105 -94 90 110 -28 -166 162 108 168 52 111 -6 117 53 -41 -59 177 -186 29 -78 -53 44 -8
4972 -8 -175 112 11 122 -160 15 38 -135 127 -23 194 -111 164 -30 189 128 198 -5 220 151 160 -89 105
4995 105 -223 74 87 -7 140 -130 0 4 -85 -24 186 -63 70 -43 40 192 109 -15 -120 -67 50 113 260
5018 260 -70 -81 -4 5 10 -58 101 196 -94 -53 90 137 150 46 -72 -118 14 -101 111 199 11 -36 -49 -105 -25 94
5044 94 43 -44 275 82 -55 203 4 -42 142 -103 -15 -1 39 -290 91 133 -64 192 -20 -137 63 43 -55
5067 -55 -85 22 203 -272 -213 -21 2 -128 -20 -16 33 192 -122 -13 -203 -163 -9 115 6 16 -40 -104 -95 -180 -73
5092 -73 12 122 205 129 -3 125 114 -286 8 78 2 26 53 4 -144 93 -87 -46 -49 267 -177 23 168 -85
5116 -85 -102 150 91 186 97 41 91 -22 -194 99 1 -26 -194 52 -75 -62 134 -74 86 -20 -94 -183 -107 187
5140 187 -104 -5 67 134 27 112 -33 -25 6 -18 -25 65 58 -81 9 161 -2 -137 -49 122 -36 -192 -120 7 31 85
5166 85 -48 45 52 116 -99 -80 -86 -128 -19 -42 -55 54 -71 -33 74 271 54 -79 -46 -141 141 200 1 -99 -2
5191 -2 -222 138 119 78 100 15 -121 -32 45 56 13 147 -16 163 -71 80 32 -93 81 59 -261 -185 0 -56 192
5216 192 -15 37 -26 -12 54 18 76 -101 -64 -104 -139 -15 66 14 -41 62 215 77 74 134 -8 -181 130 192 -217
5241 -217 -132 216 9 95 -25 -92 26 126 134 75 -96 -84 286 -87 -189 -21 -36 -50 5 -78 -40 24 73 -30 64
5266 64 -81 -115 1 407 51 328 -31 124 58 -192 12 -101 70 142 71 -51 -5 -8 -58 107 10 143 45 40
5290 40 11 -56 -3 -100 77 34 84 -30 -24 -61 206 -32 -55 13 74 -45 -162 295 -102 166 46 -19 243 -7 -179
5315 -179 -129 -60 -103 -100 242 13 128 -13 138 25 -129 -19 127 -139 -86 207 -23 89 -6 -31 -111 -6 -23
5338 -23 108 -130 -149 136 108 230 -207 114 92 -72 -179 -144 208 -129 -2 4 6 -51 -135 59 26 37 -182 -107 40
5363 40 -34 -18 154 -10 60 15 -1 -108 -35 -82 31 207 95 46 33 -168 50 35 -45 -110 4 24 84 75 57 -40
5389 -40 -176 -23 106 79 17 -162 -172 -109 -78 82 54 69 188 52 -138 -6 112 -22 30 225 -81 -90 -63 77
5413 77 -71 13 -92 255 169 11 -254 -58 19 97 20 -106 -114 -122 -138 32 -232 130 154 154 36 57 113 -277 -143
5438 -143 13 168 6 51 -88 -203 -7 -115 246 81 25 1 106 -101 8 122 -18 -141 41 5 195
5459 195 28 82 160 -149 -56 108 190 23 141 165 -25 -100 -20 -23 -235 -82 6 58 89 -195 116 207 0 99 273
5484 273 164 -148 -91 -198 -111 -33 28 -51 -29 2 133 -41 265 55 155 43 59 -134 110 -125 -214 67 4
5507 4 -98 -34 86 103 -173 106 85 237 -3 103 133 6 190 118 -111 24 -152 3 119 169 36 29 -87
5530 -87 -193 34 18 40 -68 35 9 -124 222 207 13 -139 231 129 36 -116 -71 -7 -86 -99 -96 -83 14 82 -58
5555 -58 -52 47 5 -38 180 231 -42 -26 111 -39 43 -4 1 113 -64 27 -66 26 -135 -29 -163 -74 149 -16 93
5580 93 14 60 12 9 150 62 100 -68 59 140 -131 164 85 86 46 -79 39 -182 -31 141 51 138 -69 130 -27
5605 -27 16 -3 -170 -88 -125 -130 -134 56 -110 67 -71 241 -112 -169 212 -21 225 65 -90 69 -260 -38 -1 -88
5629 -88 118 -157 -146 -137 -146 -86 43 -204 -68 89 71 143 1 150 90 -119 86 177 -59 90 -106 -51 0 -115
5653 -115 106 -254 27 -3 -188 99 24 -11 77 -134 -64 -138 114 37 160 -183 -134 -147 15 111 68 56 -135 -7
5677 -7 190 29 -59 -193 -144 -204 -34 -174 -12 -71 -43 -170 -71 61 2 -103 68 19 -75 -35 150 72 -110 -238
5701 -238 -69 -62 -150 68 94 35 -279 33 -131 61 28 238 -6 -111 256 253 -146 -112 39 41 117 -230 -35 103
5725 103 -109 -106 -71 -27 -110 -126 -28 131 -18 99 -28 -168 208 61 -25 -9 -7 192 -107 -264 188 -177 -13 12
5749 12 138 97 101 -43 -65 -154 -49 205 -17 -19 28 -100 248 33 80 17 16 59 83 -131 -2 128 -45 71 23
5774 23 -104 64 96 13 107 59 -124 112 -46 10 -87 181 -61 -112 11 -115 33 37 6 -106 204 -70 49 81
5798 81 -16 100 -148 180 108 -100 238 71 -23 79 -92 -7 -69 -32 2 27 -149 29 -337 42 -38 -131 149 -125
5822 -125 -129 170 -79 199 -24 5 -190 174 128 -26 -28 -56 -24 -134 15 -190 62 1 -17 -158 27 -91 -69 -7
5846 -7 -65 22 227 -48 59 -44 14 154 -50 235 -35 -85 23 -79 -17 94 -110 -33 6 -173 -246 -106 139
5869 139 217 -37 -97 -132 136 127 -237 -39 46 137 120 116 -166 115 -190 18 -112 139 -79 -110 0 58 41 -45 122
5894 122 212 117 -114 -6 199 -41 94 -216 -76 -72 50 -64 -111 -136 172 186 -41 33 -67 -182 23 -2 -247
5917 -247 -9 -183 115 -215 -163 3 -12 126 -68 -261 18 61 -100 227 -193 -105 13 -120 -16 -103 55 -196
5939 -196 -9 5 -26 118 -81 72 55 111 -1 -8 -77 54 167 -84 -16 33 -81 -58 177 73 175 26 58 -89
5963 -89 -99 217 280 -77 -204 25 106 -18 -57 322 -234 -62 -198 15 65 -3 91 -136 119 -21 -95 168 -76
5986 -76 64 -88 -130 146 140 86 111 111 31 -49 -3 -54 1 178 87 50 26 105 141 -2 -49 -39 196 -20 -60 67 187
6013 187 -153 -45 116 -30 -134 -44 124 -63 -115 -144 -114 -102 -57 -196 189 -11 11 115 5 39 -43 21 -37 -80
6037 -80 97 131 29 89 -4 -7 1 0 207 2 -7 179 73 34 -105 215 -142 -105 74 -45 -29 4 5 101 -20 -180
6063 -180 154 32 10 68 -106 -164 -108 -59 -73 93 -82 3 -104 66 -183 -42 68 42 8 -37 208 -227 77
6086 77 10 -55 69 -60 -60 99 14 -41 -30 44 254 -88 -202 -50 -51 -85 37 -5 26 131 -112 -100 26 228 153
6111 153 -5 14 85 129 -35 86 242 110 105 64 68 -162 192 27 -109 40 4 25 -96 -16 -18 5 -54 -16 -29 210
6137 210 -112 -52 44 209 -75 -36 41 -262 149 5 -132 -5 -66 -3 -34 30 -98 -9 160 -83 -50 8 -18 310
6161 310 120 -81 -102 76 -214 -52 -13 -117 -47 -67 -38 -100 112 -34 -21 158 -33 56 36 -130 100 -45 32
6184 32 -173 -91 -170 55 24 107 -64 16 115 105 -51 -268 -56 -62 -4 99 -70 81 258 167 17 147 -94 93
6208 93 -142 208 19 28 16 -91 -49 -55 -54 -49 -45 -26 -125 -76 41 -127 174 21 157 137 83 -18 66 11 10 -70 83 167
6236 167 -51 -11 -201 -128 -50 -114 298 95 -76 103 -113 -80 -118 25 41 -41 3 -136 -85 43 0 80 10 -35 202
6261 202 -54 69 -139 -18 -58 -33 -32 -170 1 17 -69 108 -104 -77 -3 -88 226 13 2 48 -3 31 17 -57 110
6286 110 -165 140 46 -86 -68 -22 9 -112 -17 -17 84 172 -90 33 -80 24 6 116 38 24 -17 208 80 -92
6310 -92 -135 138 37 79 -90 -130 42 -16 -130 116 220 101 180 -9 235 -214 61 227 -1 -92 54 39 -16
6333 -16 104 -1 58 -124 -124 98 -167 -102 131 -55 -299 68 -12 -41 153 44 -57 51 153 -113 26 49 115
6356 115 -10 -84 -192 41 293 -8 -186 117 -150 -168 -31 -222 -67 105 43 93 12 76 37 90 154 -31 118
6379 118 19 -94 -22 38 72 -18 38 250 -15 -47 -33 133 -154 -75 2 -227 -93 -41 148 -77 -154 141 105 128 -3
6404 -3 8 15 -138 -36 247 -14 -6 66 9 18 131 -83 67 -43 16 18 -16 13 -52 134 -120 242 -46 27 39 -62
6430 -62 175 14 142 88 -50 9 58 -138 -107 65 91 151 207 -71 -72 42 10 8 134 30 15 57 142 140 96 192 -15
6457 -15 43 -81 34 -162 74 118 30 3 -58 116 -126 -76 -20 279 14 220 20 -144 289 -151 -75 -46 45 -192
6481 -192 29 107 216 -20 -66 16 -137 -111 -46 81 24 25 -221 -89 181 -84 82 46 31 184 238 41 73 -57
6505 -57 -34 -99 -31 279 127 -38 214 122 -235 -30 -48 195 -150 -89 63 100 150 -85 -124 -71 153 145 27 90 15
6530 15 -28 -22 -31 -36 229 -37 -88 84 -26 95 -31 30 -67 -114 -11 -38 -28 -142 -36 -55 79 266 177 -155 133
6555 133 -189 -13 4 28 124 69 -47 85 88 -48 207 9 -140 -102 -4 -8 -17 -28 6 94 -132 -5 181 121 21
6580 21 14 87 -7 54 55 -139 -117 -102 -179 -58 90 51 108 191 -93 -72 28 97 153 123 128 106 -55 125 65 13 15 83 64
6609 64 136 58 -24 -7 -38 164 36 -140 -19 178 -41 -125 57 -5 -105 172 -76 -124 -319 13 110 20 -88 -129
6633 -129 -148 -160 180 -241 49 -250 -79 -46 -72 -29 -173 -85 13 -12 57 -39 32 41 139 -25 -75 21 -329 191 -192
6658 -192 -124 44 -68 -90 156 -15 50 -14 -132 -127 -85 85 105 -97 -18 126 -94 -62 74 115 138 91 203 -54
6682 -54 -84 126 32 -50 -81 -140 285 -133 -267 -159 16 115 -129 -25 -249 58 264 -191 -125 -150 18 -249 388
6705 388 164 -3 -19 -16 -96 -46 -60 -97 12 72 -112 39 16 -5 267 -66 -82 43 56 -101 4 4 -199 -204 -24
6730 -24 -142 22 36 13 116 -54 -7 -3 -66 -7 262 -219 -167 308 251 148 -54 12 -27 166 231 119 -230 -65
6754 -65 106 -110 14 115 -42 126 241 41 38 87 60 -112 171 65 -112 -118 -142 74 21 23 -53 -66 26 32 -28 157
6780 157 -120 154 19 -23 -71 44 -68 -79 232 189 -77 126 -105 -130 -37 -121 -125 163 50 -16 129 154 145 113 -112
6805 -112 169 2 -54 -73 -47 -104 -63 -57 31 172 -140 215 -78 -12 2 82 -15 72 164 -82 -13 -12 -71 43 -157 -2
6831 -2 -45 -246 -13 -7 48 31 21 -48 -178 -13 132 76 66 45 -39 -30 64 -119 -106 -278 116 -7 -89 46 -116 -186
6857 -186 73 -40 -66 -31 4 -120 -94 -260 -8 -128 -52 77 -135 -169 -174 -94 71 -12 -104 32 -73 -12 -26 -136
6881 -136 -8 29 51 -161 -126 127 -15 57 -90 -238 -68 89 -166 -153 80 156 -32 -110 147 -209 -7 97
6903 97 -198 -147 -83 -85 80 -34 143 15 174 55 36 -181 -50 152 -2 138 -24 75 -65 37 -235 112
6925 112 -103 -3 -21 125 -20 -32 -175 -43 19 45 -36 -137 90 -102 -113 -152 134 -53 134 122 -158 33 -10
6948 -10 -102 -3 -19 -86 127 -88 -104 -89 -17 47 136 -30 41 27 64 -11 -137 -24 -240 172 118 212 -149 131 27
6973 27 -63 36 108 8 -104 50 -53 167 116 188 -2 -107 35 150 99 86 -185 77 -99 108 107 207 -8
6996 -8 12 -71 -39 -234 73 72 -86 -16 -82 -79 43 27 18 20 -28 80 -260 77 16 -156 180 96 234 179 26 15 -153
7023 -153 -91 -76 58 -107 -84 -99 183 201 3 113 -117 86 67 -143 162 136 -29 219 189 -103 -42 97 21
7046 21 24 24 165 -129 -58 -218 70 14 -221 94 39 168 -26 -18 -18 -72 -71 10 47 51 -11 -70 -98 -60 -55 371 -9 -51 62
7075 62 7 -341 226 99 -1 -23 -116 -35 -3 85 -40 216 -85 184 -96 -18 196 -145 15 -39 -17 70 -28 158
7099 158 92 -66 -53 105 34 22 -54 -95 -146 -40 -104 -30 -221 57 104 -79 -128 3 -136 -222 7 -180 97 60
7123 60 134 -56 -171 -27 -60 28 81 -172 13 -18 -33 102 -90 -244 49 -24 166 83 -129 -201 -5 -45 56 17
7147 17 127 -5 -58 -39 38 17 59 62 145 99 62 32 31 -120 115 27 136 -111 -259 89 39 -33 39 -281 22 -38
7173 -38 -171 -19 46 182 68 57 4 -12 304 122 20 -23 61 106 25 -80 64 22 -142 -67 91 85 -188 -110 -48
7198 -48 50 24 -46 -50 -227 88 63 -10 30 -125 -24 -268 122 -148 -188 107 9 53 -46 -209 -101 -27 125 -138 16
7223 16 115 -134 -180 -58 -60 -121 -231 135 17 -11 53 -81 45 10 -105 -60 -68 -74 110 344 33 -149 142 49 140
7248 140 28 -32 -87 130 0 -26 -62 94 57 -27 168 -10 140 47 -10 151 71 -158 -161 -129 4 34 -37 -4 -69
7273 -69 -112 -35 -22 15 -73 142 77 204 -6 -149 125 49 120 72 -25 -277 -87 -101 94 141 48 -104 69 -86 304
7298 304 291 -1 184 -113 -97 123 16 112 55 -23 49 -130 -52 128 -149 -184 117 77 127 -4 44 195 -262 52
7322 52 -222 -23 3 122 60 14 -129 27 187 -78 -177 -101 162 -84 119 84 -59 -48 151 -133 16 -123 58
7345 58 189 -31 -58 71 85 163 8 148 -3 -175 -109 7 -71 56 -24 -147 -10 -180 -130 -162 -57 167 56
7368 56 -31 -12 65 -80 -213 13 -21 -228 -14 86 -66 -76 -44 -33 146 126 26 -59 -114 -86 -4 -168 96 -56
7392 -56 -19 4 -110 46 -9 -163 150 -11 11 -48 8 -142 41 -2 12 244 -207 -72 -2 -223 -9 -21 126 -24
7416 -24 -66 116 61 9 -6 152 -73 132 -3 -58 -63 21 142 -4 -40 -228 -22 -138 136 -148 -249 -27 -96 -18
7440 -18 78 -75 6 -193 -80 150 -91 -150 -135 -23 -101 70 8 -58 136 8 -18 -67 -210 34 -24 -59 134 264
7464 264 214 125 32 -22 57 -187 -250 169 73 -122 148 17 16 -106 -161 -109 126 -188 32 162 -8 7 256 -289
7488 -289 -77 -193 11 105 -116 -51 -37 66 -172 -200 -11 -99 -277 -32 -2 165 -79 149 -234 16 152 18
7510 18 -59 150 -90 -56 -138 25 182 -123 -40 -20 -4 77 -106 -137 158 -21 127 7 -10 -50 -123 261 78 77 -32
7535 -32 76 -87 -8 -81 -7 157 -40 53 -37 102 94 232 60 -122 6 -127 -26 84 -19 30 23 213 50 168
7559 168 -53 93 -44 -72 -139 -11 -142 -144 -18 64 -98 152 -12 110 102 237 10 10 241 45 73 96 -75 267
7583 267 92 -2 166 -100 155 37 -208 303 -30 31 69 -281 121 -46 -49 117 -36 -97 253 133 -168 71
7605 71 -15 -76 104 29 -205 39 -65 46 -41 -190 80 66 -29 -21 2 -215 5 137 -63 254 -48 112 -68
7628 -68 -201 -86 -139 22 -38 -150 28 -149 -76 3 -6 -5 113 102 112 186 48 -104 150 336 109 -57 -55 -43 60
7653 60 -61 -159 -57 -78 48 29 93 -95 -27 -64 -81 187 -38 6 156 165 -72 94 0 13 -79 31 38 40 26 -85
7679 -85 9 76 -125 33 -66 39 115 -120 14 -56 2 -17 -161 -40 -92 -150 -206 38 15 -96 91 -71 80 143
7703 143 -80 -56 124 -39 33 98 117 41 -121 -18 70 -91 -121 41 -83 76 -85 192 -59 -205 -41 -151
7725 -151 35 -85 51 204 268 -104 -41 -6 49 -195 -71 77 -45 166 -12 -73 30 -275 -93 215 150 43
7747 43 -31 15 37 -138 -81 -34 40 177 -75 -112 -98 16 58 -61 176 10 -44 37 -59 41 27 128 59 -62 79
7772 79 -6 -1 91 -53 -130 -199 -43 5 9 -10 6 -62 -20 -67 -29 -268 66 -6 -231 26 -29 135 -184 -18 340 -115
7798 -115 229 11 196 -190 28 -80 -110 87 147 -193 -193 -57 -32 -66 134 188 115 98 -55 -197 -82 188 -25
7821 -25 58 282 55 34 -53 -147 170 80 22 -215 -59 5 -8 73 -23 153 112 8 -70 117 226 -79 11 -138 113
7846 113 104 -12 -7 159 50 -33 -24 -83 -317 -55 -33 -46 80 -16 -17 -147 1 42 178 -11 -113 -165 127 -50 -16
7871 -16 104 79 -70 -43 -84 -67 -154 -90 61 11 -164 -122 76 20 -91 -85 -39 65 -143 -134 85 -109 -150 -245 -10 -101
7897 -101 -56 75 108 -30 -214 184 -64 -264 162 -56 208 -59 24 -104 74 28 238 -109 114 -7 98
7918 98 55 98 -93 -99 118 -218 -182 -206 -151 105 -93 -48 -1 151 24 52 -9 77 134 131 101 44 -27 -54 186 21 -9
7945 -9 -78 -74 -71 57 47 -3 -134 -2 -195 -36 -22 32 -103 -28 21 -50 22 10 -77 -128 85 -90 -61 63 -18 15 -117
7972 -117 -84 29 126 -31 -179 -239 93 137 26 186 -401 55 67 176 182 -41 -69 -96 -16 -44 -11 -117 156 286
7996 286 2 -98 -13 33 27 65 -78 -28 31 -36 70 -169 -2 -36 104 142 -126 -109 -107 -110 -45 99 -23 159 -19
8021 -19 11 -241 159 4 63 -94 71 49 -173 -12 -54 43 -33 100 -31 109 -95 -61 167 -101 -174 44 49 24
8045 24 -142 74 103 -142 -107 141 193 -127 221 237 30 -16 -52 -128 40 18 275 -192 45 42 48 -74 65 34 -20
8070 -20 237 319 70 15 100 -142 7 54 -84 -82 43 28 -162 -48 -2 -40 -44 -36 -44 315 -29 211 -8 162 222 125
8096 125 -95 -64 -69 -56 66 -22 28 80 61 -26 64 161 9 18 25 56 93 -103 116 -254 39 7 -116 343 -45 102
8122 102 64 55 169 144 -112 150 97 -153 94 -162 5 -133 74 56 -72 177 -121 145 108 -192 -23 69 -30
8145 -30 9 99 -14 -218 30 190 -37 59 40 50 -163 -113 -148 76 -16 332 47 36 -86 -75 -163 -9 -136 209
8169 209 88 111 26 -165 299 44 269 -19 81 32 280 25 44 -178 -302 -265 -126 -117 91 -29 39 -21
8191b1
##END NTUPLES=NMR FID
##END=
