##TITLE=1H_18-2025
 200.13MHz, CDCl3,
 8 sc
 
 29.1.2025
##JCAMPDX= 6.0         $$ Bruker NMR JCAMP-DX V2.0
##DATA TYPE= NMR FID
##DATA CLASS= NTUPLES
##ORIGIN= UXNMR, Bruker Analytische Messtechnik GmbH
##OWNER= pz
$$ XWIN-NMR		Version 3.5
$$ Wed Jan 29 14:09:33 2025 Russian Standard Time (UT+4h)  she@DPX200
##.OBSERVE FREQUENCY= 200.1313
##.OBSERVE NUCLEUS= ^1H
##.DELAY= (6, 6)
##.ACQUISITION MODE= SIMULTANEOUS
##.ACQUISITION SCHEME= undefined
##.AVERAGES= 8
##.DIGITISER RES= 18
##SPECTROMETER/DATA SYSTEM= spect
##.PULSE SEQUENCE= zg30
##.SOLVENT NAME= DMSO
##.SHIFT REFERENCE= (INTERNAL, DMSO, 0, 14.3821)
##AUDIT TRAIL= $$ (NUMBER, WHEN, WHO, WHERE, WHAT)
$$ ##TITLE= Audit trail, XWIN-NMR		Version 3.5
$$ ##JCAMPDX= 5.01
$$ ##ORIGIN= Bruker BioSpin GmbH
$$ ##OWNER= she
$$ F:/spectra/data/she/nmr/H-C/1/audita.txt
$$ ##AUDIT TRAIL=  $$ (NUMBER, WHEN, WHO, WHERE, WHAT)
(   1,<2025-01-29 14:08:38.81 +0400>,<she>,<DPX200>,
      <created by zg, POWCHK disabled, PULCHK disabled
       configuration hash MD5:
       00 E9 B6 7A A2 85 ED C7 34 08 36 98 17 FE 4E 26
       data hash MD5: 16K
       9F AF 2C DF E5 02 2E 62 0A 7B 1E CF E4 FB 55 11>)
$$ ##END=
$$ 
$$ hash MD5
$$ 32 06 AF D2 1E 88 FA 45 89 90 4C 19 F9 19 18 25
##$RELAX= 
##$RELAX= 
##$RELAX= 
##$RELAX= 
##$RELAX= 
##$RELAX= 
$$ Bruker specific parameters
$$ --------------------------
##$DU= <F:/spectra>
##$EXPNO= 1
##$NAME= <H-C>
##$PROCNO= 1
##$TYPE= <nmr>
##$USER= <she>
##$AMP= (0..31)
100 100 100 100 100 100 100 100 100 100 100 100 100 100 100 100 100 100 
100 100 100 100 100 100 100 100 100 100 100 100 100 100 
##$AQSEQ= 0
##$AQ_mod= 1
##$AUNM= <au_zg>
##$AUTOPOS= <>
##$BF1= 200.13
##$BF2= 200.13
##$BF3= 200.13
##$BF4= 200.13
##$BF5= 200.13
##$BF6= 200.13
##$BF7= 200.13
##$BF8= 200.13
##$BYTORDA= 1
##$CFDGTYP= 0
##$CFRGTYP= 5
##$CHEMSTR= <none>
##$CNST= (0..31)
1 1 145 1 1 1 1 1 1 1 1 1 1 1 1 1 1 1 1 1 1 1 1 1 1 1 1 1 1 1 1 1 
##$CPDPRG= <>
##$CPDPRG1= <>
##$CPDPRG2= <>
##$CPDPRG3= <>
##$CPDPRG4= <mlev>
##$CPDPRG5= <mlev>
##$CPDPRG6= <mlev>
##$CPDPRG7= <mlev>
##$CPDPRG8= <mlev>
##$CPDPRGB= <>
##$CPDPRGT= <>
##$D= (0..31)
0 0.7 0 0 0 0 0 0 0 0 0 0.03 0 0 0 0 0 0 0 0 0 0 0 0 0 0 0 0 0 0 0 0 
##$DATE= 1738145318
##$DBL= (0..7)
120 120 120 120 120 120 120 120 
##$DBP= (0..7)
150 150 150 150 150 150 150 150 
##$DBP07= 0
##$DBPNAM0= <>
##$DBPNAM1= <>
##$DBPNAM2= <>
##$DBPNAM3= <>
##$DBPNAM4= <>
##$DBPNAM5= <>
##$DBPNAM6= <>
##$DBPNAM7= <>
##$DBPOAL= (0..7)
0.5 0.5 0.5 0.5 0.5 0.5 0.5 0.5 
##$DBPOFFS= (0..7)
0 0 0 0 0 0 0 0 
##$DE= 6
##$DECBNUC= <off>
##$DECIM= 32
##$DECNUC= <off>
##$DECSTAT= 4
##$DIGMOD= 1
##$DIGTYP= 9
##$DL= (0..7)
0 120 120 120 120 120 120 120 
##$DP= (0..7)
150 150 150 150 150 150 150 150 
##$DP07= 0
##$DPNAME0= <>
##$DPNAME1= <>
##$DPNAME2= <>
##$DPNAME3= <>
##$DPNAME4= <>
##$DPNAME5= <>
##$DPNAME6= <>
##$DPNAME7= <>
##$DPOAL= (0..7)
0.5 0.5 0.5 0.5 0.5 0.5 0.5 0.5 
##$DPOFFS= (0..7)
0 0 0 0 0 0 0 0 
##$DQDMODE= 0
##$DR= 18
##$DS= 0
##$DSLIST= <SSSSSSSSSSSSSSS>
$$ [...]
##$SUBNAM0= <"">
##$SUBNAM1= <"">
##$SUBNAM2= <"">
##$SUBNAM3= <"">
##$SUBNAM4= <"">
##$SUBNAM5= <"">
##$SUBNAM6= <"">
##$SUBNAM7= <"">
##$SUBNAM8= <"">
##$SUBNAM9= <"">
##$SW= 18.0517328524113
##$SWIBOX= (0..15)
0 0 2 0 0 0 0 0 0 0 0 0 0 0 0 0 
##$SW_h= 3612.71676300578
##$TD= 16384
##$TD0= 1
##$TE= 0
##$TE2= 300
##$TE3= 300
##$TEG= 300
##$TL= (0..7)
0 120 120 120 120 120 120 120 
##$TP= (0..7)
150 150 150 150 150 150 150 150 
##$TP07= 0
##$TPNAME0= <>
##$TPNAME1= <>
##$TPNAME2= <>
##$TPNAME3= <>
##$TPNAME4= <>
##$TPNAME5= <>
##$TPNAME6= <>
##$TPNAME7= <>
##$TPOAL= (0..7)
0.5 0.5 0.5 0.5 0.5 0.5 0.5 0.5 
##$TPOFFS= (0..7)
0 0 0 0 0 0 0 0 
##$TUNHIN= 0
##$TUNHOUT= 0
##$TUNXOUT= 0
##$USERA1= <user>
##$USERA2= <user>
##$USERA3= <user>
##$USERA4= <user>
##$USERA5= <user>
##$V9= 5
##$VALIST= <valist>
##$VCLIST= <CCCCCCCCCCCCCCC>
##$VD= 0
##$VDLIST= <DDDDDDDDDDDDDDD>
##$VPLIST= <PPPPPPPPPPPPPPP>
##$VTLIST= <TTTTTTTTTTTTTTT>
##$WBST= 1024
##$WBSW= 4
##$XGAIN= (0..3)
0 0 0 0 
##$XL= 0
##$YL= 0
##$YMAX_a= 179729
##$YMIN_a= -208084
##$ZGOPTNS= <>
##$ZL1= 120
##$ZL2= 120
##$ZL3= 120
##$ZL4= 120
##$ABSF1= 10
##$ABSF2= 0
##$ABSG= 5
##$ABSL= 3
##$ALPHA= 0
##$AQORDER= 0
##$ASSFAC= 0
##$ASSFACI= 0
##$ASSFACX= 0
##$ASSWID= 0
##$AUNMP= <proc_1d>
##$AZFE= 0.1
##$AZFW= 0.1
##$BCFW= 1
##$BC_mod= 2
##$BYTORDP= 1
##$COROFFS= 0
##$CY= -3
##$DATMOD= 1
##$DC= 2
##$DFILT= <>
##$DTYPP= 0
##$F1P= 0
##$F2P= 0
##$FCOR= 0.5
##$FTSIZE= 0
##$FT_mod= 4
##$GAMMA= 1
##$GB= 0.15
##$INTBC= 1
##$INTSCL= 1
##$ISEN= 128
##$LB= 0.25
##$LEV0= 0
##$LPBIN= 0
##$MAXI= 10000
##$MC2= 0
##$MEAN= 0
##$ME_mod= 0
##$MI= 1.114404
##$NCOEF= 0
##$NC_proc= 0
##$NLEV= 6
##$NOISF1= 3.799351
##$NOISF2= 2.8
##$NSP= 1
##$NTH_PI= 0
##$NZP= 0
##$OFFSET= 14.38212
##$PC= 1
##$PHC0= 254.9229
##$PHC1= 6.392229
##$PH_mod= 1
##$PKNL= yes
##$PPARMOD= 0
##$PSCAL= 0
##$PSIGN= 0
##$REVERSE= no
##$SF= 200.129724274929
##$SI= 16384
##$SIGF1= 3
##$SIGF2= 2
##$SINO= 400
##$SIOLD= 16384
##$SREGLST= <1H.CDCl3>
##$SSB= 0
##$STSI= 0
##$STSR= 0
##$SW_p= 3205.1282051282
##$SYMM= 0
##$S_DEV= 0
##$TDeff= 0
##$TDoff= 0
##$TI= <>
##$TILT= no
##$TM1= 0
##$TM2= 0
##$TOPLEV= 0
##$USERP1= <user>
##$USERP2= <user>
##$USERP3= <user>
##$USERP4= <user>
##$USERP5= <user>
##$WDW= 1
##$XDIM= 8192
##$YMAX_p= 0
##$YMIN_p= 0
$$ End of Bruker specific parameters
$$ ---------------------------------
##NTUPLES= NMR FID
##VAR_NAME=  TIME,          FID/REAL,        FID/IMAG
##SYMBOL=    X,             R,               I
##VAR_TYPE=  INDEPENDENT,   DEPENDENT,       DEPENDENT
##VAR_FORM=  AFFN,          ASDF,            ASDF
##VAR_DIM=   8192,          8192,            8192
##UNITS=     SECONDS,       ARBITRARY UNITS, ARBITRARY UNITS
##FACTOR=    0.0002768,     1,               1
##FIRST=     0,             0,               0
##LAST=      2.2672688,     0,               0
##MIN=       0,             -208084,         0
##MAX=       2.2672688,     179729,          0
$$ Real data points
##PAGE= N=1
##DATA TABLE= (X++(R..R)), XYDATA
0@%%%%%%%%%%%%%%%%%%Nj3J6j6J6j6J9k6L1l2L7m4M7n3O1o9P6q4R6j06J16j29
40f8J44j60J77j95K15k36K61k87L14l48L83m20M63n13N70o33P07p95R00j028J186
61F37j388J655k021K552l378M802p663J5285o8375j50190K96060K5472k43186
74a29738J27672J51711j93815p4996K10231L916k16474P2315J63228j41655m4349
85g1954J64762o7958j34330Q7477Q0517n2545m5113N5420L1019r3840J7384J14284
97H5123r4313p9213J35392J8279j07075L6950O1346q9420n0758J31469K2494j56677
109h6403O5356J26501j63759k4906J87682r8967j25109J69387M4549j54829K9374
120c1124J17948r8298r0733J56333L4623j76443O4206J29210j45398m0888J40422
$$ plain form
0 0 0 0 0 0 0 0 0 0 0 0 0 0 0 0 0 0 0 0 5 -8 8 -8 8 -8 11 -15 16 -16 21 -23 24 -29 32 -37 39 -45 51 -55 61 -68
40 -68 76 -84 93 -102 113 -123 138 -149 165 -183 200 -220 243 -270 300 -333 374 -421 479 -549 637
61 637 -751 904 -1117 1435 -1943 2859 -4804 10481 -57894 -208084 87976 113448 -129738
74 -129738 -2066 149645 -44170 -119166 91065 94981 -121493 -49178 114050 -27605 -71954
85 -71954 92808 24850 -109480 -22003 58514 5969 -39144 16276 47295 -46545 -29161 85123
97 85123 -9190 -88403 46989 65268 -41807 -4857 56489 -32931 -83689 47780 70274 -86403
109 -86403 -21047 105454 -58305 -83211 104471 5504 -119605 49782 94331 -60498 -31124
120 -31124 86824 -11474 -102207 54126 88749 -87694 -23488 105722 -39676 -80564 59858
131E9858m1773r1145P2564O5176o7348n6526Q0646K6572j10181L4934J10473q0156
143C094n7509R3149N704r3265Q618R5672l3929r7189R6168O1518j52997J7458
155e3508J38156j03953o6790J40618K399j14098M3656P9340q3403n2786J21424
166E1055N297j24248P1021P3677j20988K522R4848o3757m2318P4439J6045n6816
178a9223q518N0270j8883n3458O3955L4645p8371J5304N8537m3404k8901L3956
190E909J5106l3537j2852O5470q569q9574M9882N3158q8759J3260Q6268n4547
202A215m8948O5713K1399p1644l536Q1271l1580o4456Q8331J6832j11580L9601
214a7382O7684p3427r257O7899j8469n0091K4127M0395m4076l3894O8639K801
$$ plain form
131 59858 18085 -73060 -496 64680 -2668 -59194 21452 48024 -62157 -27223 83250 3094
143 3094 -54415 38734 44438 -48827 -40209 55463 21534 -75655 20513 82031 -70966 -53508
155 -53508 84648 -19305 -86095 54523 56922 -57176 -13520 65820 -17583 -70369 51055
166 51055 56352 -67896 3125 76802 -44186 -41664 53184 -10573 -52891 21548 37593 -19223
178 -19223 -27741 22529 3646 -49812 14143 48788 -29583 -14279 44258 854 -28047 5909
190 5909 21015 -12522 -25374 40096 31527 -58047 -8165 44993 -43766 -30506 55762 1215
202 1215 -47733 17980 39379 -32265 -35801 45470 13890 -50566 37765 54597 -56983 -17382
214 -17382 50302 -23125 -32382 35517 17048 -33043 -8916 31479 -12597 -46491 22148 24949
226B4949o0642M7542K8008o4135K792M1523j0280k2580J0891L2628k6047l8512
238c3863N0930K816o4983L9540M2495n1846l966M0706j5589l6922J8552M3164
250C1034l3126k7718O5852j1078o7666N1234K4411o4480J9426M6600l0803k4487
262b0801K5516J3247m0509n644N5321k2047l8388N5254J180n4867K7275K4610
274B0147k8632k078K4153Q522k8336q001L6239k2504l2690M8138M859m2324K2880
287C73J7856k9149r230J9772J2990k3560n13M2109k6195l3808M7031l494m2282
300b8100L3683K0236l1253k354J8738l446k8016P291L5185k8381j5663M7455j8756
313F619l7197L6286N686k8112J3876J8945o286j7945P134J9380k8781q373M1331
$$ plain form
226 24949 -35693 11849 39857 -24278 -21486 20037 9757 -12823 -1932 30696 4649 -33863
238 -33863 17067 19883 -45100 -5560 36935 -14911 -18877 21829 6240 -30682 -12130 31034
250 31034 -2092 -29810 36042 24964 -42702 8532 32943 -31537 -12111 34489 3686 -20801
262 -20801 4715 17962 -22547 -28191 27130 5083 -33305 21949 23129 -31738 -4463 20147
274 20147 -8485 -10563 13590 22112 -6224 -14225 22014 -490 -33180 14958 19817 -22507 373
287 373 18229 -10920 -20150 -378 12612 -10948 -11461 30648 4453 -29355 17676 14182 -28100
300 -28100 5583 25819 -5434 -7788 10950 7504 -20512 -13221 21964 -6417 -22080 25375 6619
313 6619 -30578 5708 11394 -16718 -2842 16103 9817 -8128 -994 18386 -10395 -18768 22563
326B2563j6547k4051L2223m393k7116R286J1079k884j0912R482K0622k6032r768
339a6448L4531j8983k0776L6078J02k2306J1080P514j0571j3878J1621J6931k5316
352a0421L90L2894k7299j7871L3158j0320j9028K2131Q038j1132n868R637N860
365A0169k3630O691K7743k4246n761K9125j8319j6560J6309n82o697N19Q675O723
379A0159k0569L036K0698k3688l472K9503j1931r923J5972l296j0533k608R412
392B760O660j8249Q253J8647k8087k132K4832k0135q035K2805k297q370K281N183
406D116k619j3830J3177J4398k2824O437J9593k2427l122J4827j0791l198O482
419B19M095P54j3230N494Q738j9784P597J9202j7132l43J4722q620n592J947M718
$$ plain form
326 22563 6016 -18035 14188 9795 -17321 -8035 3044 160 -10752 -1270 19352 -6680 -16448
339 -16448 18083 -900 -21676 14402 14504 -7802 3278 10792 221 -13657 -2036 14895 -10421
352 -10421 -10031 22863 -4436 -22307 10851 531 -18497 3634 11672 540 -5328 4309 10169
365 10169 -13461 -6770 20973 -3273 -9034 20091 1772 -14788 1521 939 -5758 -5239 3436 10159
379 10159 -10410 -7374 13324 -10364 -13836 15667 3736 -6187 9785 6489 -4044 -6652 2760
392 2760 9420 -8829 -576 18071 -10016 -12148 12684 -7451 -15486 7319 5022 -3348 -1067 4116
406 4116 1497 -12333 844 15242 -7582 -1145 18448 -3979 -7101 7726 -3065 -6263 219
419 219 4314 5068 -8162 -2668 6070 -13714 -6117 13085 -4047 -4390 10332 1712 -3880 -1933 2785
434B785J365j0154J2624P790k5566O870J5329k2855L525J8525j1368l818P070
447B122J63n578o709J3206L674j6080J5151Q380k2819O968R951j4971M308P233
461D999k230K2o879M188J366j3828J1351Q484j5343P803P770j1151R42J988J88
476c30J676m224J1938R21j9495J0867O664j9897J1401J0508j5757K409P769m202
490B48n457k057R567k625p530J8472k007k0231J3986L773j3564J0821L568p854
504h90K043m46K982l514j0816J0906K602q921J1519j330j2513N495J473J109K711
519B410n226P941L31j1203J2592j370j7655J3177O853j0797N876J435q594k178
533f408K685Q180o155o056J5060n800j0114J6308o052j3392J5844K288o205M964
$$ plain form
434 2785 4150 -6004 6620 14410 -11156 -4286 11043 -11812 -8287 10238 -1130 -4948 2122
447 2122 2285 -3293 -10002 3204 6878 -9202 5949 14329 -8490 -1522 8429 -6542 -2234 4999
461 4999 2769 2791 -4088 100 1466 -12362 -1011 7473 -7870 -67 7703 -3448 -2506 -518 -330
476 -330 1346 -2878 9060 9981 -9514 1353 8017 -11880 -479 10029 -5728 -3319 4450 248
490 248 -5209 -7266 2301 -324 -7854 10618 8611 -11620 2366 6139 -7425 3396 6964 -890
504 -890 1153 707 3689 175 -10641 265 2867 -6054 5465 4135 -8378 -2883 -1410 -301 2410
519 2410 -2816 5125 5456 -5747 6845 5475 -12180 997 7850 -2947 2929 4364 -4230 -6408
533 -6408 -3723 4457 -1698 -7754 7306 1506 -8608 7700 1648 -11744 4100 6388 183 5147
547E147l052k839j605j141R001n301o475J1883n425n886Q495o101k806O431j155
562h29O519k197r410R986k756q515J4082j404j0124Q695L20n908j194j2L748m873
578c872o1J3474j0959p934J5359q121p332J6047l382o449P706j124k612k308l03
593a871N944n555L65R262r942l269Q410q244K89O942m601M261l83n717P397m722
609a434m264J1151l963l402Q678m503m009J895j582K758l657P53R005j1069k511
624f154J2379j1825k304J4553p321k911Q660l223k548p61J240L361n262M008O571
639H463j1920J166P252j0642K422O517o192L341O14l910M306m661p78P906n030
654a146J401O389o900n05K297l001L246k161L62N837q762M64P496j2028J464J0918
$$ plain form
547 5147 2095 -744 -2349 -3490 5511 210 -6265 5618 193 -5693 2802 -3299 -6105 326 -829
562 -829 5690 3493 -5917 4069 1313 -7202 6880 5476 -4648 4047 4367 -1541 -2735 -2747 1001 -3872
578 -3872 -3933 9541 -1418 -9352 6007 -2114 -9446 6601 3219 -3230 4476 3352 740 -1568 -1871
593 -1871 4073 -1482 -1117 8145 -1797 -5066 3344 -4900 -4611 2331 -2270 1991 1608 -4109 3288 -1434
609 -1434 -5698 5453 1490 -1912 6766 2263 -1746 149 -1433 1325 -2332 -1579 7426 -3643 -6154
624 -6154 6225 -5600 -7904 6649 -672 -3583 5077 1854 -694 -1455 -215 3146 -2116 1892 8463
639 8463 -3457 -2291 4961 -5681 -3259 3258 -2934 407 1021 -2889 1417 -3244 -4022 3884 -1146
654 -1146 255 6644 -256 -761 1536 -1465 1781 -380 -18 5819 -2943 -2479 5017 -7011 -5547 5371
670E371q229M86O864n515r46Q30J043K075m305N698L871j1264M855M574j1724
685f316N415N372p455L818Q55m128K430m204J899M608n660M803L867p935K815
700A84J586m340M718j408k02M562o826J857L605j0355M282O721q575L676M286
715C771o630R54M48M85J785l445N746J716q698O804J418j0748P337L704p301M941
731B287J5m440J631k906K423J632n084O657O50p174N901m07n409O093p45m41L898
748D581n287K013J070p257N613K519p546O048P54o236L172r66o14K057k678N445
764B688L21o727O889j005p935Q602O65n668N739j174l619J339k571K305L2l568
780c687O532j581n922O985l070m388P281j647n29L782m304K053J37m958N922r63
$$ plain form
670 5371 -2858 -2372 4492 -1023 -1969 -1139 -96 1979 -2326 3372 7243 -4021 834 5408 -6316
685 -6316 -901 4471 -2984 834 1689 -2439 -9 -4213 -2314 2294 -3366 1437 5304 -2631 184
700 184 1770 -2570 2148 740 538 5100 -1726 131 3736 -6619 -2337 4384 -4191 -515 3771
715 3771 -2859 -1905 -1457 -972 813 -2632 3114 4830 -3868 2936 4354 -6394 943 4647 -2654 2287
731 2287 2302 -2138 -507 -3413 -990 642 -4442 2215 2865 -4309 1592 1185 -4224 1869 1124 683 4581
748 4581 -706 1307 2377 -4880 733 3252 -4294 1754 2508 -3728 -556 -1522 -2136 -79 -2757 2688
764 2688 3009 -3718 3171 2166 -5769 2833 3498 -2170 3569 2395 -1224 115 -2456 -151 -119 -3687
780 -3687 2845 1264 -4658 2327 -743 -5131 2150 503 -26 3756 -548 1505 1642 -3316 2606 1643
796A643m794O787j947m538M192l532o47K578j862M336j181m749O242k408m761
811d641Q240k255l873O693k132k390J820l212J918k39j956O020l998m289O689
826B395m286k898P008l430o6L994k915J603p21l573N560j760k197O381m384l140
842b429M748l897k70K689l413L650n37l303N083l687l523P666l082j141O069m221
858D02q75K332l037K258n92k041N373m023k166N671o393r60O438m190P01L538
874B436l866J789l81k533M949k715n66N963n214p53M245n609J029K740l167K969
890A316r17k641L817m097j084N848m052L64N366m745R07J764l578K710o75o82
906c79M478m166r40M347o471O52M996m899J979K293m089K460j131j568L910k947
$$ plain form
796 1643 -3151 3636 1689 -2849 1343 -2189 -2836 -258 -2120 2216 1035 -3714 2528 120 -4641
811 -4641 3599 1344 -2529 4164 2032 -358 1462 -1750 168 -71 -2027 3993 -5 -4294 2395
826 2395 -1891 -4789 2219 -1211 -1277 2717 -198 1405 684 -2889 2671 911 -1286 5095 711 -2429
842 -2429 2319 -1578 -1848 841 -2572 1078 541 -2762 2321 -1366 -4889 2777 -305 -1446 4623 402
858 402 -473 1859 -1178 1080 488 -1553 3820 -203 -2369 3302 -3091 -4051 2387 -1803 -1102 2436
874 2436 -1430 359 -22 -2555 2394 -321 -887 5076 -138 -891 3354 -2255 -1226 1514 -1653 1316
890 1316 399 -2242 1575 -2522 -3606 2242 -1810 -1446 3920 -825 82 1846 -1732 978 303 -379
906 -379 4099 -67 -1007 3340 -3131 -2479 2517 -2382 -403 1890 -2199 261 -870 -2438 1472 -1475
922a475J332M493n233R68L056n352K362J934l447L310j180k212K993m077o9M201
938A604m425K311L358m966J806J347l129L127o76m65L555l879P89K818n875J847
954h53L154m817L018J535m271K371j334j087L323l257J822L179m584K779J597
969B575n499L615J144k765L766j751k049K774l906J000K433m502L350K029m720
984b506L059m1l363L359j048M98L190l955J501J824n156L358J613m645L583M48
1000A719l387K754k206j371K917k588K482J604m562L306M76m058M427l67k591
1015a445M245j727r00K065l814J097J654l668L659K78m249L592j408k213L557
1030G23j878N57K518l147K017Q39m127L524O48l403M238r07k928K764k383l55
$$ plain form
922 -1475 -143 4350 -883 85 3141 -2211 151 2085 -1362 1948 768 -1444 1549 -2528 -2597 1604
938 1604 -2821 -510 2848 -2118 -312 1035 -2094 1033 357 -108 3447 -432 357 3175 -2700 -853
954 -853 2301 -2516 502 2037 -2234 137 -1197 -2284 1039 -2218 -396 2783 -1801 978 2575
969 2575 -2924 691 1835 -930 2836 1085 -964 1810 -2096 -1096 1337 -3165 185 2214 -2506
984 -2506 553 512 -2851 508 -540 -42 3148 -807 694 2518 -2638 720 2333 -2312 1271 1719
1000 1719 -1668 1086 -1120 -2491 426 -2162 320 1924 -2638 668 1144 -2914 1513 1146 -1445
1015 -1445 2800 1073 173 2238 -1576 -479 1175 -2493 1166 1444 -2805 787 -621 -2834 723
1030 723 -1155 -598 1920 -1227 790 1629 -2498 1026 1674 -1729 2509 1602 -1326 1438 -945 -1300
1046a300K073k919K450P88l544L512j040l307M449q70j614M116k547n8J886l364
1062a289J865M73k802L516n10k984L336k316j808L388k399O36K603k997J906L11
1078I29l503L812m55k225M479k146j532K616k670P6J840k736K141J57k677K968
1094A074j643k685M205j957k55L675k818J66J924l104K254J54k252L653j489j938
1110a036K921k754j141K957k638J235J782l177K290n59k506L588j202j254M025
1125B531k353o55K556k915Q36J318k374K268j89k283K822k484j445L373k522K91
1141a225K864k682R29J145k574K131m4j574L533j843j192K868l079l19K490k808
1157a380J539R05k310K000j282j579K899j722m51L448k749O52J898l182J569P59
$$ plain form
1046 -1300 773 -2146 304 1092 -2452 1060 20 -3287 1162 292 -1322 2794 247 189 2075 -1289
1062 -1289 576 1049 -1753 1763 1253 -1731 1605 -711 -2519 869 -1530 -894 1709 -1288 618 929
1078 929 -2574 1238 783 -1442 3037 891 -641 1975 -695 -619 1221 -1515 626 783 -1894 1074
1094 1074 -569 -3254 951 -1006 -1261 2414 -404 -238 1686 -1418 836 990 -1262 2391 902 -1036
1110 -1036 1885 -869 -2010 947 -1691 -456 1326 -1851 439 -120 -2626 962 -240 -1494 2531
1125 2531 178 -477 2079 -836 0 1318 -1056 1212 1023 -1260 1562 -922 -2367 1006 -1516 -1225
1141 -1225 1639 -1043 -114 1031 -1543 588 544 -1030 2503 660 -532 2336 -743 -1062 1428 -1380
1157 -1380 159 1064 -1246 754 -528 -2107 792 -930 -1381 2067 -682 -30 1868 -1314 255 1014
1173A014j793K293p28j564K383k349n80K645k900Q57K081k965J810L56k541K174
1189A93l34o76K853j916k93K309k891O10J624k685J896K05k073K245j832j023
1205a788K562k275M95K737k855R84J313k819J767N48j705K681r12q46J997k593
1221g09J24J838k830J495J340k832J884N3k558K592j042j68K442k175N90J722
1237A766k860J420Q08k186K126Rj649K031j703r99K293k567J143J726k961J675
1253G2P24k710K387p5j442K440r96l48J635k409Q21J228k544K079N38k820K043
1270F23n47j938K263j422k87K358j910R95R06k596J677P34j764K387o86j337K203
1287A659j971k68J738k305J051J219k467J696k71k112K268n29r24K537j801L29
$$ plain form
1173 1014 -779 1514 786 -778 1605 -744 -1324 1321 -1579 -722 1359 -1606 204 560 -1981 193
1189 193 -141 -817 2036 120 -173 2136 -755 -145 1479 -1206 690 895 -1178 1067 -765 -1788
1205 -1788 774 -1501 -1006 1731 -1124 -140 1173 -1646 121 669 -1036 1645 733 -113 1884 -709
1221 -709 -585 1253 -1577 -82 1258 -1574 310 363 -2195 397 -645 -813 1629 -546 44 1766
1237 1766 -1094 326 1134 -1052 1074 1083 -566 1465 -238 -1237 1056 -1511 -368 1358 -1603 72
1253 72 796 -1914 473 398 -1044 1396 400 52 1687 -722 99 1327 -1217 862 1400 -1420 623
1270 623 76 -1862 401 -1021 -1308 1050 -860 135 1041 -1555 122 856 -908 1479 793 -544 1659
1287 1659 -312 -580 1158 -1147 -96 1123 -1344 352 81 -2031 237 -292 -1216 1321 -480 -151
1303a51J432k136J167P97k332K536k57j795K199j480j319K118j628L7J807k088
1319a093J174K90j949K107k88j437K830j168q07K075k216K47J554k328J400Q81
1335A272k408J832n12k023K288j091k94J917j471N05J042k025J269L70j759K498
1351A410o69j133K123j871p58J975j979N89J332k268J475j07j724J930r69o35
1367a279K523j542j31J960k336Q67J164j999J910k00j768K105j140j369J669j142
1383g08j06J594j620Q82N82k058J706j92j184K562j025r03K062j652l62J476j800
1400g46J036M87j613J288n50j267J736j159m51K122j512K38J571k216J098O31
1416F93k010K351j83j215J620j347n22J560j794N53J143j562J014J36k048J817
$$ plain form
1303 -151 1281 -855 312 1109 -1223 1313 1056 -739 1460 -20 -1339 779 -849 -812 995 -1093
1319 -1093 81 371 -1578 529 241 -1196 1634 466 -341 1734 -482 -235 1319 -1009 391 1272
1335 1272 -1136 696 184 -1839 449 -642 -936 981 -490 15 1057 -968 301 671 -1088 1410
1351 1410 741 -392 1731 -140 -898 1077 -902 -313 1019 -1249 226 119 -1605 325 -644 -1279
1367 -1279 1244 -298 -429 1531 -805 62 1226 -773 1137 937 -831 1274 134 -1235 434 -708
1383 -708 -814 780 -840 42 624 -1434 272 80 -1104 1458 433 -470 1592 -60 -422 1054 -746
1400 -746 290 777 -836 452 -98 -1365 371 -788 -1239 883 -629 -391 1180 -1036 62 693
1416 693 -1317 1034 851 -364 1256 -91 -613 947 -847 -294 849 -713 301 437 -1611 206
1432B06n79n86K140j359j92J700j637J40J255j636J064N64j401J481j151j048
1448a039J751j443J00J397j883R04R56j852J160K82j281J713k15p75J530j362
1464e7j13J314j554P51N98j713J234k62j431J724j062p01K135j240N7J449j946
1481h17M88R03j260J515K4q88J091j111m99J467j791N72J229j875J026M50j892
1498a368J054K23r77J963r08k79J405j584L13J067j557J210M42j527J370n71j279
1515a003J783j672o7J578j221M2J267j845J133L03j200J668m39o66J363r42l15
1532b33J079j775J193O69j701J207J18j829J425k27j181J521o49J70P98j136N59
1549HM08j333J623j15j147J657j000q98J662j292j21J292j372N10N98j630J009
$$ plain form
1432 206 -373 -959 1181 -178 -370 1330 -307 -167 1088 -548 516 1080 -321 1160 9 -1039
1448 -1039 712 -731 -631 766 -1117 -213 743 -1109 51 333 -948 765 550 -225 1305 -57
1464 -57 -170 1144 -410 341 939 -774 460 198 -1233 491 -571 -1272 863 -377 -320 1129 -817
1481 -817 -329 574 -686 829 853 -35 1056 -55 -554 913 -878 -306 923 -952 74 524 -1368
1498 -1368 -314 -91 -1068 895 -13 -292 1113 -471 -158 909 -648 562 1004 -523 847 276 -1003
1515 -1003 780 -892 -959 619 -602 -560 707 -1138 -5 298 -902 766 327 -339 1024 82 -233
1532 -233 846 -929 264 933 -768 439 557 -1272 153 -74 -1255 266 -383 -213 585 -551 8
1549 8 416 -917 706 591 -556 1101 101 -797 865 -427 -548 744 -628 -118 480 -1150 -141
1566a41J91j113J301l53k79J327j178J53J019j656J211N57j614J281l19j362J428
1583D53o82n83J234j000L22P08j127N60L83j219J576k90q08J606j034n20J508
1600A087j327J10J025j517Q62lj264R35k32n52J505r15k26J242j444P18N01j312
1618h07J393K49j434J540m50j193J257r24J21Q67j030L97M16j350J059k85q73
1635a047J751m99m81J435j441kJ256j377N00P71j411Q37K21j290J064n86k79J020
1653D42q05l8J056j474P92L13j196J307J22q20J244p49o38J122p91o8R23r91N10
1672B61N9j257J087n31o53J682j006j98J474j320K08R84j429P15P05r48R35o5
1690G03j210P22m52m05J306j342P92K47j305J099j34j148J318P3j083J547o35
$$ plain form
1566 -141 50 -1063 238 -115 -394 933 -245 -92 927 -729 482 1039 -575 706 387 -975 453
1583 453 -229 -812 422 -578 -256 452 -675 -115 268 -951 625 335 -473 1133 99 -421 1087
1600 1087 -240 -130 895 -622 240 237 -1027 -92 -324 -876 629 -286 -512 730 -714 4 505 -807
1618 -807 586 835 -599 941 491 -702 555 -369 -248 619 -411 -14 402 -948 111 -174 -1047
1635 -1047 704 205 -276 1159 -282 -284 972 -405 95 866 -545 292 513 -777 287 -299 -578 442
1653 442 -363 -401 655 -819 -27 286 -910 397 519 -301 943 194 -444 678 -113 -181 742 -249 261
1672 261 320 -937 150 -381 -1034 648 -358 -556 918 -402 -194 790 -639 76 781 -167 768 703
1690 703 -507 215 -237 -642 664 -678 114 361 -944 155 21 -1127 191 264 -819 728 93
1707I3m79J252j155K44O49q69Q35k23j034J129p63l89J239j038NJ170j421O13
1725a42O18j318R94M57p91P09k26o53J052j155N20N95j088Q32M0j367Q66M6q20
1744h31J226m68l96J029q91J27P76j070Q64K27q57R67n65o17J067r82N9J115j143
1763c63K9R18j339N98L76q45P48K04o97J043n65k85P17o00L05M89j119O58P9j127
1783g76J026n43m66J104o17k58Q18p42K42L55p79P13J49n30J066p47j53J052j161
1802b47N1R83j332Q15K68j370N68L54q29Q90j46m01R23p96mP30q67O86K98r92
1822d18J146k38r49J105p98m71R69p37j29J099j023M54J7o89P07j90l14R64n58
1841e3k94J000r38J00Q40q34P29Q2j423R15j3q14J009l87k51Q22r87L83L16p71
$$ plain form
1707 93 -386 866 -289 -45 604 -265 570 347 -687 442 -321 -710 529 -509 -504 666 -755 -142
1725 -142 476 -842 152 609 -182 527 301 -352 700 -455 65 660 -428 404 444 -923 -57 -11 -831
1744 -831 395 -73 -469 560 -331 -204 572 -498 366 593 -264 703 138 -479 588 -394 -335 780 -363
1763 -363 -334 584 -755 -157 219 -626 122 326 -371 672 107 -178 539 -61 244 733 -386 272 351 -776
1783 -776 250 -293 -759 345 -272 -530 288 -454 -212 143 -636 77 226 -304 762 15 -138 914 -247
1802 -247 -196 787 -545 270 538 -832 -264 90 -739 151 5 -396 527 -269 -273 457 -410 276 574 -418
1822 -418 728 490 -459 646 -152 -623 346 -391 -520 579 -444 10 27 -662 45 -145 -459 505 -53
1841 -53 -347 653 -285 -185 655 -179 550 632 -791 124 111 -703 306 -81 -332 490 -497 -114 202 -569
1861e69O92L29q96J177m58n17R80q29m52J137p67k7N98r75N15m5m50P51m80OQ14
1882E34q94J39N40o79L55O80j000R90m6r50N65j40o04P67p56L09L50q37M34J99
1902d4o58J050P0j226J356m79l89R45o30q3P94q24J00M31p35M22j04n28N39k59
1922b52j59R06r89m2Q74r22N20M71p82P22J03o87Q09n19l08M29o08M32M81r67
1942d88N05L5o45R06k80o32J030m60l04P75p42K75M58p55O83J61q69O72j64m40
1962b79Q25r60O0P51r39M58N60r60M74K21p24J062l88m33P56m70M9N49r04O07
1982C15K54r44O04l5q52R19l40k47R13j042N7O01o39M24K61m51P13m07l33O11
2002C82m71n1P91r28J45N01r40M62M77j196J066j21p79R61l23l07Q13p49L02L37
$$ plain form
1861 -569 123 452 -444 733 275 -242 738 -91 -543 594 -173 -200 398 -577 -62 -107 -557 194 -286 -280 534
1882 534 -360 -221 319 -360 -5 675 -325 665 619 -331 234 94 -510 257 -499 -190 160 -677 -243 -44
1902 -44 -702 348 418 -808 548 69 -320 625 -5 -88 706 -118 -18 413 -322 100 -4 -532 7 -252
1922 -252 -411 495 -494 -536 338 -584 -64 407 -375 347 450 -237 572 53 -255 174 -434 -2 479 -488
1942 -488 17 52 -593 313 33 -599 431 -29 -333 442 -300 -25 433 -322 361 522 -347 325 161 -279
1962 -279 546 -414 -354 397 -542 -84 476 -484 -10 211 -513 549 161 -272 484 14 63 612 -292 315
1982 315 569 -375 229 194 -658 261 -79 -326 587 -455 -398 203 -436 -12 249 -202 511 104 -229 382
2002 382 -89 -140 651 -277 -132 369 -571 -109 368 -828 238 117 -662 299 -24 -331 482 -267 35 372
2022C72n80N15J79p67P45n04n71J071o51l81R90r20J61M34o27O03J45m61O96m30
2042A9j31M67m29j76P62p41N10L19r36M41P9p04O97j89n77R15n80j00N88p39N57
2063E2K12n77P78L0p02P42l90n79R65p88J27O46j027K58K70o81M47K73m34O64
2083B86m81j52R46q57K52M81o78L89L75q19Q24l80o62R05n25j79O31o52J49L43
2103A96q05O57K6k81P50l54n87R32p53j14R00o48J63K48o99N13r0p13Q97m12j11
2124b85O17n82Q6K97n51L73O22j050P70O0o22P20o8o01M25k40p2O05q91L85Ln84
2146e83P00k92j17P33m00l07N41n45L09N15o62L43L12q14N66J01p32P19n73R9
2166h7L64n60K25K95p47O14K79p28O45k02l22O18m50k54Q27p13K89J84n65M73
$$ plain form
2022 372 -208 307 486 -281 464 -40 -611 460 -191 -572 418 -502 -341 93 -534 69 214 -247 449 19
2042 19 -112 355 -74 -250 512 -229 281 600 -336 105 184 -520 177 -12 -589 326 -254 -354 234 -505 52
2063 52 264 -313 465 495 -207 535 145 -434 531 -257 -130 516 -511 -253 17 -664 -217 56 -378 286
2083 286 -195 -347 599 -258 -6 475 -203 186 561 -258 566 186 -476 429 -96 -275 356 -296 -147 196
2103 196 -609 48 74 -207 543 189 -398 534 -219 -333 567 -81 82 330 -369 144 54 -659 238 -174 -285
2124 -285 332 -250 -164 133 -418 -45 577 -473 297 357 -265 455 387 -214 211 -29 -101 504 -387 -2 1 -583
2146 -583 117 -175 -292 441 41 -266 275 -270 39 554 -108 235 547 -267 299 400 -332 387 -186 -87
2166 -87 277 -283 -58 237 -510 104 383 -345 300 98 -224 394 -56 -310 517 -196 93 277 -288 185
2186A85j58l68O41m49m57Q49o77P6N66m88K76K74o42M08K50n80N20j85k43P33
2206E31n34j15O10p11K11R0o88P05k01m96J004n63j80P11n25O3N45o42J62L54
2226C31o03O43k09n91N87m79j17P48o48N6L75n59M73n4m24P10p9m74P82l81j77
2247i0N75n50K05L47p82M08Kp75O86J79n22N31k89o7L13m92J27L39l73L33K86
2268C91o74R21l10n03P13o97K38L98m79J2J21p17L80L05o62Q13k31n32Q52n86
2288b47J01N91l97j9N36q64N14K6p22R85n58j38N37m60k21M45m56J86L54o09P32
2309C16k76k52O90m26j48K90l53K15M63q93O57P7p16M96m2m75N02l79n4P10o27
2330b25J18L51m06K54J04m59O32l35l81R90o95j72N37m95M8M11o56L22K27o11
$$ plain form
2186 185 27 -341 300 -149 -606 243 -434 -358 208 -280 -4 270 -372 36 286 -294 226 41 -202 531
2206 531 -3 -118 492 -219 -8 82 -606 99 -102 -598 406 -157 -337 374 -151 -88 457 -185 -23 331
2226 331 -272 371 162 -429 158 -321 -438 310 -338 -282 93 -466 7 -47 -471 239 160 -314 468 87 -90
2247 -90 485 -65 140 487 -295 113 115 -660 26 205 -317 214 -75 -142 171 -321 -194 145 -228 105 391
2268 391 -283 638 328 -175 538 -159 79 477 -2 10 131 -586 -206 99 -563 250 19 -513 339 -247
2288 -247 -146 445 48 29 565 -299 215 241 -481 504 -54 -192 345 -115 -336 109 -347 -161 193 -416 316
2309 316 40 -212 478 52 -96 194 -159 56 519 -374 283 360 -356 140 98 -377 125 -254 -308 402 -225
2330 -225 -107 244 -162 92 196 -263 369 34 -347 643 -52 -224 313 -182 -134 277 -379 -57 170 -441
2350d41O72n30jP74o02J15M97m92q8M75p54M66K16m65L88l95k17O77l79k27K96
2371a5l92M68K8m89M35K5l15N90k86J1L76m50J28L33n91K22M20o96L15l46M4L19
2393A34n7k42M84r12O28M25p28M79K03p79N04Q7k34L85m14j31M35n09M43P1o06
2414c34K47N3l16O32l11k94O26m64R1M53l95N1L61m39m8L58k96K66k39q2L32l64
2436a12m4N69q06L48K09n87O52N3o80O73j97k55N67l67p8N04n45J50J06n79O17
2457A98q6k88L18l24k97O37l67K84L23m98L15L08o84N07k42k74L05m4j79L57m73
2478b04J09L65n43L30m3m52P42j35o10N80j14k61N94n37M34L67r70N94j30m61
2498c45O02k35j47J60l18O3N64n99J95K06n83N41J01m40N25j89l78P98n84N4M40
$$ plain form
2350 -441 231 -299 -300 474 -128 -13 484 -8 -96 379 -375 91 307 -158 230 -165 -382 295 -84 -311 -15
2371 -15 -407 61 89 -400 35 60 -255 335 49 60 436 -14 114 447 -144 78 498 -198 117 -229 -185 134
2393 134 77 -165 319 -593 35 460 -268 211 414 -365 139 226 -8 377 -37 -168 267 -242 201 272 -334
2414 -334 -87 -34 -350 282 -29 -323 303 -161 -70 383 -12 39 400 -39 -87 271 -25 241 2 -80 252 -112
2436 -112 -156 413 -393 -45 164 -423 229 282 -398 275 78 -177 390 23 -55 449 -96 54 160 -419 198
2457 198 112 -176 142 -182 -479 158 -209 75 398 -100 215 523 -161 346 104 -170 135 91 -88 269 -204
2478 -204 -95 270 -273 57 14 -438 304 169 -441 139 25 -236 358 -179 255 622 -348 246 116 -345
2498 -345 257 22 -125 35 -283 -220 344 -255 -60 146 -437 104 205 -235 290 101 -277 521 -63 -9 431
2519D31n52K11J90o38M22j47j64J15J18k25L05l31K73K80n99L35N8k26K81k8m65
2540c56N78l02K06L24n97O2k1k95R6M37m29L52j23lL73k58j25L23l75K29J25l92
2562a71K68J35k75L29q9o25O75m88ON67n38n7M60l07J84O1k00L18p7j94K75m80
2584b23J53L43l75J40q0k62L55M7l20M68k04l64M93k07j48K98l38K28J87m86N61
2605B66k64k44N01l10k02N92n00J83Q4j99j32L24l93K87l1m54O20j38m27N64k68
2626a41K1M58n32L77p5k88L21r7m47M20l08J25L39m35L01j9k78K79N2j02K33K01
2648D05o15M58m48J25R6j29M0L73n89K89P0n01O34k43j6L19n48J25L43l37P5k4
2670i8k8K27J25k07K33l3l70L33l68J01J39k81K64O1m28M80j61j92K51r2O1J77
$$ plain form
2519 431 -121 90 280 -358 64 -83 -247 -132 -14 -239 66 -265 8 288 -311 24 82 -144 137 109 -356
2540 -356 222 -80 126 450 -147 -85 -106 -401 -305 132 -297 55 -68 -71 302 44 -81 242 -133 96 221 -171
2562 -171 97 232 -43 286 197 -428 247 -241 -235 332 -206 -263 197 -110 74 135 -65 253 176 -18 257 -223
2584 -223 -70 273 -102 38 -42 -304 51 98 -222 246 42 -322 171 -36 -184 114 -224 4 191 -295 266
2605 266 2 -242 259 -51 -253 339 -161 22 106 -93 -225 99 -294 -7 -38 -492 128 -10 -437 127 -141
2626 -141 -120 338 -194 183 108 -180 141 44 -403 17 -291 -166 173 -262 39 20 -258 21 73 -29 204 405
2648 405 -210 248 -200 -75 21 -108 -68 305 -284 5 75 -426 208 -35 -51 268 -280 -155 188 -149 -74 -98
2670 -98 -126 101 226 19 252 219 -151 182 -186 -85 54 -227 37 98 -330 150 -11 -203 48 -44 17 194
2692A94l91K53Q3k50J67J93j61J74j52m22N15l10j0N61p88J44L26l20R0J30j77
2713a51K71j59n0K22j01k01N44n68K41n7k19L35K8m32L90n6l59N79l07j03L39
2734A86m16L28K76n59R8M41l38J29j14j89L60k84J02K71m03NR5l71J40M34m44
2755b53M43k06j51K67k17O9K79m58K55N2k41L65k16j03M33l94k46N04l38J3M91
2776C48o65K27L30n14L30k27M6L92l31r6M49k75K4pj54K19p9l63M83m8k65J56
2798b0j60P8K08l13J34K91l62J71qj46K62p1o4K43k65r5K58l23J94K07m24J22
2820h3J24j91K86k36l6J64j44k3N96o75L44L2k05L85m24k0K03j11j18K97k67m
2842a06J95k81K10K32l57J61j16j92M26j04oL59o41N8L14k32L1J49p5Q5q0j77
$$ plain form
2692 194 -197 56 139 -111 56 249 88 262 110 -312 203 -107 -117 444 -344 -200 126 -194 -104 26 -151
2713 -151 120 -39 -89 133 32 -169 375 -193 48 -9 -228 107 135 -297 93 37 -322 257 -50 -153 186
2734 186 -230 98 374 -185 -87 354 16 145 31 -158 202 -82 20 291 -112 -107 -12 -383 -243 191 -253
2755 -253 190 -16 -167 100 -117 -48 231 -227 28 80 -161 204 -12 -115 318 -76 -322 182 -156 -143 348
2776 348 -317 -90 240 -274 56 -171 -125 267 -64 -160 289 14 38 31 -123 96 17 -346 137 89 -176 -20
2798 -20 -180 -102 106 -207 -73 218 -144 27 19 -127 135 64 0 243 -22 -117 141 -182 12 219 -205 -83
2820 -83 41 -150 136 -100 -136 28 -116 -139 457 -218 126 158 -47 338 -86 -106 97 -14 -132 165 -102 -106
2842 -106 89 -192 18 250 -107 54 -62 -254 172 68 62 421 -220 -162 152 -80 -49 100 25 110 30 -147
2864a47K06j56j71M05m28R5M55l20J51jl17M38q1l55L53j19j13J66j46J29pn31
2886d94N85k59N4J93O4j95N9o9O4J77r9j37M38l95%J96k18J89k22P7K07l64m4
2909a93N44o45L32K6oK2k8q3J19q8j60M48k77q3K11l27K00J0l06L90k50m9L80
2932A87j13p1J10k84Q4J45r8K31J3j72j7K1m1Q6J8p0J52j84j13K19l98L68K2j02
2956gR2l0j74J53k71J83J51k65j0M68l19K29k16j06N01l90k21L75k71M9L55l04
2978b8N4J36k23N1K39l48K71j13L5L51p06M31J85m14m0K76l43P9L84k81K56l81
3000a29j10L15n6J98M9n50M25o4k85L89j56n3o3L66l66K45o0k22K88k95J28J38
3022A32l43J48J25j97L19k40r3K62j36Q2J86l53K50j89n2M08j15m12L98k86n9
$$ plain form
2864 -147 59 -97 -268 137 -291 -196 259 -61 90 89 -228 210 129 -226 127 8 -105 61 -85 44 37 -494
2886 -494 91 -168 -114 79 143 -52 7 -62 2 179 80 -57 381 -14 -14 182 -36 153 -69 8 215 -149 -193
2909 -193 351 -294 38 64 58 80 52 -31 88 0 -160 288 11 -72 139 -188 12 22 -284 106 -144 -193 187
2932 187 74 3 113 -171 -87 58 -40 191 204 32 15 36 -5 81 99 29 181 -3 -116 103 -295 73 95 -7
2956 -7 85 55 -119 34 -237 -54 97 -168 -178 290 -29 200 -16 -122 379 -11 -232 143 -128 -79 276 -28
2978 -28 26 162 -61 -10 229 -119 152 39 74 425 -281 150 335 -79 -119 157 -186 -107 277 -4 252 -129
3000 -129 -239 76 20 218 267 -283 142 78 -207 182 26 -27 -90 276 -90 155 95 -127 161 -134 -6 132
3022 132 -211 -63 62 -135 184 -56 -149 113 -23 59 245 -108 142 -47 -99 309 194 -218 180 -106 -165
3043a65L05k49J9R6l45K13M28n50M70j81m1K33l52M5J7J47j69Lj02J43J60n03
3065c78M52L6q9j1m5o2K80k89J82l0p0P8J94l99M14k88L0K87m05r3M18m68J33
3088a23K57l22J33m9k4K05o7j28L05l90M33j12j98J50q9j30J8M13j76j16p4M8
3110c6J4k8J3N1%k0R4k90J15R2n8J81l64L2N77l20k63L19j39Q5M6j6m8j3l60K04
3136a32O9k1Q3n1L16o4m11L77j15K9K16l25k25L16J6j06J93l74J6L59m92K81L09
3159B64n19L92J11j49K4m19L75J12k14N8J08j81J05k0l66M01l27J86j19j05J85
3180i8L03k61K50j24k07J19k62K01o0K59l9Jj23J93Lk39Q1q4nJ71J75l89K26m7
3204D4j32J54M5k20L3q9K37K5k21K17P6l66K55j84k24M52k44K93k45K3R8o5l5
$$ plain form
3043 -165 140 -109 -90 6 -339 -126 302 -248 222 41 0 233 -119 -74 -57 90 -79 -76 -178 -35 125 -378
3065 -378 74 110 21 10 -35 -97 183 -106 76 46 -24 54 248 -151 263 -25 5 292 -113 -206 212 -256 -123
3088 -123 134 -188 -55 -104 -128 77 10 -118 187 -203 230 118 -80 70 -19 -149 -131 282 106 -10 -84 -36
3110 -36 -22 -50 -37 14 14 -6 88 -202 -87 5 -53 128 -236 -204 373 53 -210 109 -30 55 101 85 37 24 -336 -132
3136 -132 -63 -84 -1 -52 264 200 -211 166 51 80 296 -29 -254 62 78 -28 165 -209 -193 166 -326 -45 264
3159 264 -255 137 248 99 123 -296 79 191 -23 35 143 -38 67 47 -319 82 -245 -59 -178 -283 -98
3180 -98 205 -56 194 70 -137 -18 -280 -79 -139 120 81 82 -41 152 155 -84 -3 -87 -92 79 254 -135 91 44
3204 44 -88 66 111 -109 -76 -165 72 97 -124 93 169 -197 58 -126 -350 102 -142 151 -94 -71 27 -38 -73
3227g3K17l69L20K53m37L74k35J10l2P1k13J56k31j57K52j34Q1K26m36K87O8j54
3249e6jJ66k46J62O9j59J29P7k34J67l84L23no4J13j98qM32m71N1K33Mm5J73j91
3274C7O6j19j94K07O9j21L0j50K94J15k45j84P2J11K4K9k10R9K2r3J59J00k54
3297a36J5J84j31K72k35K06r2l00K58K32l41R5J25l04P4J61j25k8PO3N6J5j25
3320e4J2o1o4K67p3q0J9j3K80m90P6J86l3o6L3J12J28r7j56LL17l12L19k32j7
3345DR6j10N6O8l28K33j00Q2L6J8r5J79j10k8rj67J61JK8q4j3J71P1j69J07J26
3371B24j56K21m04o7j0J80P5K5J12k90o6J88P9P2k98J27p5l41K52J02J83n0j73
3394i0J46k1R6k05N7RLnk46J64K16L1q8j87L7K23l08Q7Q5K9O7k24j2K34k5j05
$$ plain form
3227 -73 144 -225 95 348 -89 285 50 160 128 199 -14 142 -89 -246 6 -128 -47 179 -257 30 98 -56
3249 -56 -57 109 -137 25 94 -65 64 141 -93 74 -310 13 8 -56 57 -141 -149 283 -188 -137 96 100 55 228 37
3274 37 103 -16 -210 -3 66 -55 -25 -175 119 234 -11 -195 -123 -12 12 41 -169 -70 -48 -141 18 118 -136
3297 -136 -121 63 -68 204 -31 175 83 -217 41 273 -68 27 152 -152 -78 83 -42 -70 -63 0 56 71 -54
3320 -54 -42 -103 -167 100 27 -53 -34 -47 233 -257 -181 5 -28 -94 -61 51 179 82 -74 -71 246 -66 253 21 4
3345 4 100 -10 46 114 -214 19 -81 1 37 55 -40 139 29 1 -8 -175 -14 -13 15 -69 -82 89 160 -9 98 224
3371 224 68 289 -115 -182 -192 -12 63 88 200 -90 -156 32 111 183 -115 12 -63 -404 -152 -50 133 83 -90
3394 -90 56 35 131 -74 -17 -8 -5 -10 -256 -92 124 155 67 -120 -83 140 -168 -81 4 33 100 -124 -136 98 73 -32
3420c2J27k73J48%j06P1J25j8m5j9j00L68l14p1K92J15l86J71OmO4k72J6M0J47
3445E0j25j21K83o4j8R0J39l03P1J49m64L96j43K0j11J16Q1K9k92K29J60l23J56
3468EJ09l02K29K1k22L04l10j11L44K0k9K08k41K13k24Q8l6j01j75K04J16k32
3490a22J51j97J11J60k44Q0k2j1K15j34l3L06l72P2J10j92J9R9n5J41K9k63J41
3513a1M9m7MK3m2j49J29K18J4k77J06Qj26J09j04O1n4q5L83Rk85K76k40O5MJ20
3539A58k26J32j07J81j7k82J44J14J5j0R6k70K85j05k32J74qr2j6j17K97j47N1
3562A8q1J51l4q5R7k6Mj49KL24k91P1J37l49K40Q4k35J7Q9j42J40K16l11K39q4
3587D2L9N5j38N9N5lj1J01j53J02j27j07M2j50J83m2N6P8j0p9L04j92j34L4O7
$$ plain form
3420 -32 95 -178 -30 -30 -136 -65 60 42 -3 -22 -122 246 -68 -139 153 268 -118 53 59 55 119 -153 -137 -97 50
3445 50 -75 -196 87 23 5 95 234 -69 2 151 -313 83 -60 -40 -151 -35 46 75 -217 12 172 -151 5
3468 5 114 -188 41 62 -160 144 -166 -277 67 87 58 266 25 238 14 102 66 -35 -210 -6 110 -122
3490 -122 29 -168 -57 103 -141 -61 -83 -94 121 -13 -46 260 -112 -40 70 -122 -103 -4 -59 82 111 -152 -11
3513 -11 38 -9 -5 18 -24 -173 -44 174 188 -89 17 25 -101 8 -96 -35 -89 -174 209 218 -67 209 -31 34 38 158
3539 158 -68 64 -43 138 121 -161 -17 97 112 102 198 -72 213 108 -124 50 42 -50 -66 -183 114 -33 18
3562 18 -63 88 54 -31 66 40 44 -105 -103 221 -70 1 138 -211 29 113 -122 -105 -16 -158 -18 198 -113 126 42
3587 42 81 136 -2 57 112 109 98 199 46 148 21 -86 -44 -194 -11 -53 3 81 71 -8 296 104 -30 4 71
3612G1j33k0J10j0jj00R5J75j24k23R0j71M70m36L7L84k18kL9p6p2J41n2J0N5
3637C9l39L14K0kj39O4J4K94l27K38M2j6l03j78K25J5P3j9K42k64J80j86KK9q0
3662f2j1J01R4M8k58J49j38J34j01M2K7j25R8r8P3j04J59r5J04m45M39j29L05
3685B07k96Q3j13j2p6J04L4o7J50k53K34N3P8j89m2J11p2K01l02K02Q1j67Mj32
3709a79L33k25R3n0j5q8K05j19O4o9J57k20N0j5j2O1J11k99L0J71L0k1k20J54
3733g3L8n1J97k0j15KR2p9j9R9j45j46J12J00K81j94j19J4J29p4j21PN7J16j16
3758b8J88j85J11p4r0J20k9K09k72J96n10L66J17J3k59J44j35P2M1n2K3j37m1
3781b12J53L2j52L46j32j73L37j57j82P5Q7j58K54j81q1m0J51J64j14r6j7J36
$$ plain form
3612 71 -62 -82 28 18 17 -83 12 187 63 -160 -70 -241 229 -207 -170 214 -4 -6 33 -43 -115 26 -26 -16 39
3637 39 -300 14 34 32 -107 -43 -29 265 -62 176 218 202 -101 -279 -54 -39 34 15 257 -7 173 -13 -11 18 -62
3662 -62 -73 28 122 170 -88 61 -77 57 -44 -2 25 -100 -2 -100 -27 -131 28 -67 37 -408 31 -98 207
3685 207 -89 -6 -119 -131 -207 -103 -69 -136 14 -239 -5 48 126 -63 -105 6 -66 135 -167 35 116 -51 -47 -179
3709 -179 154 -71 22 -28 -43 -131 74 -45 19 -50 107 -113 -63 -78 -90 -29 82 -217 -187 -16 14 -7 -227 -73
3733 -73 -35 -86 111 91 -24 -22 70 -9 -28 71 -74 -220 -108 -8 273 79 -40 -26 103 29 -92 -85 -28 88 -28
3758 -28 160 -25 86 12 -78 42 13 222 -50 146 -364 2 119 132 -127 17 -118 -46 -5 -57 -34 -171 -212
3781 -212 -59 -27 -179 167 35 -138 199 42 -140 -65 22 -136 118 -63 -144 -184 -33 131 17 -79 -96 40
3803D0j85J59q7M6L36k17J05o1l5j46roJ87J39l76O5NR2j58LL1P0o1K82j70R9
3829A48p8q4k5K2Q1j12Q6J25l63J30N1n9j4K05L6r5P3k40J49m5R0k0J7lJ4J36
3855B25k26j43J66l6J53j52k43M41k17Q5j60j25K98O2R7j01r9j03M8J53k5J1j84
3878g5j60L39n1k36J88n7k8O5k2J4k5j53K32L5m8R2l3j70R9n3J21J63m01L64p6
3903A24k82J71n7J37j82L9%J05J89l62M12k14k66J44O0P1J59k21K34k80j4J9l6
3926e0j3m8J19p8J90j46J58p9q3l7p8L94n7l31J19K9J23j18l5J75q1j16R4j05
3950e4J24j57Q3j30K93p8j39P2k8l2L00j48j88L69n73K78m1R0K6M7j53R8L3k07
3974a15L6k31L35O0j79K38j19j5q2M0k8M2O7j45J68j71J60j19N3P5k16K63j80
$$ plain form
3803 40 -145 14 -73 -27 309 92 197 136 101 -45 -54 -60 127 266 -110 -45 -40 52 -106 -103 -72 -2 -63 219 49 148
3829 148 70 -14 -39 -17 64 -48 38 163 -200 -70 -19 -78 -92 113 149 54 127 -113 36 -9 81 61 78 75 89 225
3855 225 -1 -144 22 -14 139 -13 -256 185 -32 53 -107 -232 66 128 225 124 25 -78 -30 123 98 109 -75
3878 -75 -235 104 53 -183 5 -52 -80 -15 -37 -23 -48 -201 31 66 18 110 77 -93 6 -47 74 237 -164 200 124
3903 124 -158 13 -44 93 -89 -50 -50 55 244 -118 294 80 -186 -42 18 89 248 27 261 -19 -33 -14 -50
3926 -50 -63 -111 8 -70 120 -26 132 53 -30 -67 -145 249 192 -139 -20 9 132 14 -21 154 73 -43 51 -54
3950 -54 70 -87 -4 -134 159 81 -58 14 -14 -46 254 106 -82 287 -286 -8 -49 41 67 114 -39 59 92 -115
3974 -115 -79 -310 25 85 -94 144 25 10 -72 -32 -60 -18 49 -96 72 -99 61 -58 -5 70 -146 117 -63
3997f3K13j38K10P7k65j1r1J20Lj6l40L97j17J02j32J06q0k54L68j84J8l5PJ65
4021F0k92K35J09k44K09k7j03J49l52K96k82M41j58l0N5K19k20Lk02M8M2J14j35
4044f5N3m9j89L47j3j82J40j44j9P9j45J66q2P9M2J32k84K66k43jJ12N8J5j75
4068a02o1P3J92j49J09M1n1M7k15J83k87L29j03l2j40J10K58j94k2q8J54N4k36
4091a30J77R2p5mj8P7Nj97J27M7M7j72k8j94J75m8oL8K00k53K03J1l87L44J38
4116A69q6P3K4J6O8l39K61m35J89J48k56K34L2l13K8K92L2q7J4k15K37j23O3J24
4140A50l7q3K42j81j47rj0N1j74LL03M5j53K56l00J30j07j98J45p0J15P7K38j73
4164A13R1l56r7L69j35j29M26l34J37n1k43K07M1M9m36L04K2l3L6p3rJ44j84J15
$$ plain form
3997 -63 150 12 222 299 34 23 -68 52 55 39 -301 96 -21 81 -51 55 -25 -279 89 -95 -77 -112 -105 60
4021 60 -232 3 112 -132 77 50 -53 96 -256 40 -242 199 41 11 66 285 65 68 -134 -86 -44 70 -65
4044 -65 -12 -61 -250 97 84 -98 42 -102 -121 -42 -187 -21 -103 -24 18 150 -134 132 -111 -112 0 58 73 -102
4068 -102 -163 -90 102 -47 62 103 52 99 -116 67 -220 109 6 -26 -166 -56 202 8 -14 -102 52 106 -130
4091 -130 47 139 64 60 42 119 124 -73 54 101 148 -24 -52 -246 -71 -119 -125 -87 113 -140 63 74 -313 31 169
4116 169 83 156 180 196 264 -75 186 -249 -60 88 -168 66 98 -215 -187 105 137 50 64 -151 86 -37 26 150
4140 150 113 30 272 91 -56 -65 -75 -24 -198 -195 108 153 0 256 -44 86 -21 -219 -74 -144 -29 48 286 113
4164 113 204 -152 -249 120 -15 -144 282 -52 85 34 -209 -2 39 88 -348 -44 -22 -55 -19 -92 -101 43 -141 -26
4188b6j26K35J45k24L7j38N6N2p6k21L95j66K8o5K07J09l16l1P3J77r7J44m0j15
4212A7K00k13J06Q8l14K07j95k37L98J05k32O9j87K52k0j36K08rk14P5j3j76J14
4235a07N5r5M02j87j23P7M0k44N33l40J13j10N7k6q1JP3j52K56r5k52L20k1k11
4259a17L12k17j02M2L2k27L21k81k1L05k38L67k44Q7J55l8Kk64O8M5L4j81J30
4282c0J84qj62L2j18M0O3j83K03rr3N19o41J79K46l13J67j42P0L6NJ5J19Q4j96
4307F7K3k30K04J11l48j8K17l03M38l16K38j41o6Q7j2r9Nk9J45l3j87J84K29n5
4331A11k61M41O4k76Mj71M7L16m01J87j05mM4N2m9K35l23j16L09k6M4j19j77K97
4355A23k52o2K94j60o6K82j31k69K47K19n15K92j32K10O9Nj35J88L0k05P0M9O
$$ plain form
4188 -26 -152 83 228 4 41 -97 -41 11 -65 -286 109 -57 -29 -94 113 222 -94 -125 -52 125 28 172 132 17
4212 17 217 4 110 198 -116 91 -104 -341 57 162 -70 -1 -188 64 44 -92 116 107 -107 -32 -45 -221 -107
4235 -107 -52 -147 255 68 -55 22 62 -182 351 11 124 14 71 45 -36 -35 38 -114 142 47 -205 115 94 -117
4259 -117 195 -22 -124 -82 -50 -277 44 -237 -258 47 -191 176 -68 19 174 136 138 -126 -58 -13 21 -160 -30
4282 -30 154 146 -16 16 -102 -62 1 -182 21 12 -81 438 -203 -24 222 -91 76 -66 4 40 45 60 179 263 67
4307 67 90 -140 64 175 -173 -191 26 -277 161 -155 83 -58 -124 -37 -49 -148 -143 -172 -27 -60 -247 -63 166 111
4331 111 -150 291 355 79 83 -88 -41 275 -126 61 -44 -48 -4 48 -1 234 -89 -205 104 78 122 3 -174 123
4355 123 -129 -191 103 -57 -123 159 28 -241 6 225 -290 2 -130 80 149 154 19 207 237 32 102 151 157
4378A57M5j24k4K1R6r8k57L75j58r3Nk3m4K34k10K52r1j14J38p9j69L36k51n0
4402a26R2j40J21K84k05P0o0k38J98l3l7J59j28N8k6j51m0J11j06P7K71j99K26
4425A78k39R2J13lr4Q8l45L64Q6k49j21J12j57j6M04j58Q3j56q9j6p5J72j22K46
4449I8j72k0M3L6k03J17K70k93l9L26l89L20j16Nn6L9K34j14j33j1K4M6j77R6
4473f9M9K9P3k18K51j10o1J18j1j52L94l59O2l1j07J32J73o7l03K18qk5J0LR7
4498H8O1j99L04j97j5Q2n2j68L96k96K4o1j20J05M7J61k46K17n5O7k16K83j28
4521H2j09O0j63j6R0R9j96K88J2Q8l74M3J7O7j02J05K32l36K69j13J04O0k67L3
4545b7k90L29J83j53r0J00k18Q0L28j04n5J2k33J64o3J10j03J43k45K06j18K39
$$ plain form
4378 157 202 78 54 75 171 73 -184 191 33 -60 -55 -78 -122 112 -98 154 63 -51 87 8 -161 175 -76 -126
4402 -126 -34 -174 -53 231 26 96 36 -202 -4 -37 -74 85 -43 15 -11 -162 -202 -91 -197 -120 151 -48 178
4425 178 -61 31 144 141 47 135 -210 154 240 -9 -130 -18 -175 -191 213 55 138 -18 -107 -123 -198 -26 -148 98
4449 98 -74 -94 -51 -15 -218 -101 169 -124 -163 163 -226 94 -22 -17 -73 -34 200 86 -47 -58 -34 12 -165 -69
4473 -69 -20 9 82 -136 115 5 -56 62 51 -101 293 -66 -4 -35 -142 -10 163 96 -207 11 3 -22 -12 -9 88
4498 88 149 -50 254 57 42 124 72 -96 300 4 28 -33 -153 -48 -1 160 -86 131 76 143 -73 210 82
4521 82 -27 33 -130 -146 -56 43 -153 135 147 235 -139 -96 -79 -12 -114 -9 223 -113 156 43 147 207 -60 -27
4545 -27 -317 12 195 42 -48 52 -166 -86 242 138 83 95 -138 26 -37 73 -30 113 -132 74 -44 195
4567A95j81q7J32r8j37l0J82L1K0r1J42K5q7q7J97k00J90q9J00rL8k79O4J27q8
4592b0j2r8K78j97OR0P6j14M9j77J68j59K10j27K75l87j01M23l41J22O8j93L53
4615A92k58k93M52j6j56K81k44N6j42K21r4j03P7M5J35k71K56j70J82j50k2k2
4637d4P8O1r5k97K69K06l68J22k2K23l39M36m10J89K20m06J09q0l6K60j9o8K82
4660B71n40L41k70J01R7J0N0q4K5N5N2j03K38k88k9R6q7j3m3K09l66M07j25n9
4684e5L7n6J62L05n26J12Q7j64M01l19o3J57j97J77o1j14J56r2k8k8J98q7K91
4707B93k74j18K20k2k75K59j93L23l12l6L73k71j74K07j12J41N8j89j5J26J4n7
4729c4J44j80rJ07L8r8J33l66J75Q4J90k82J68n4J15j18lJ9p7K27k83q4K86j54
$$ plain form
4567 195 14 -73 59 -39 -176 -206 -24 7 27 -64 78 103 16 -71 126 -74 116 27 127 118 156 -123 -59 68 -20
4592 -20 -32 -130 148 -49 -43 47 123 9 58 -119 49 -110 100 -27 248 -139 -240 183 -158 -36 32 -161 192
4615 192 -66 -359 93 77 -79 202 -42 14 -128 93 -1 -104 -27 18 153 -118 138 -32 150 0 -22 -44
4637 -44 34 95 0 -297 -28 178 -190 -68 -90 133 -206 230 -180 9 229 -177 -68 -148 -184 76 57 -11 271
4660 271 -269 72 -198 -97 0 10 60 -24 1 56 108 5 243 -45 -74 22 -65 -78 -121 88 -278 129 4 -55
4684 -55 -18 -74 88 393 -133 -21 66 -98 303 -16 -79 78 -119 58 -3 -117 39 -53 -81 -109 89 2 293
4707 293 19 -99 121 99 -176 83 -110 213 -99 -135 238 -33 -207 0 -112 29 87 -102 -117 9 23 -34
4729 -34 110 -70 -79 28 66 -32 101 -265 -90 -6 184 -98 70 16 131 13 10 29 -48 179 -104 -188 98 -56
4753e6kJ04j04Q0J8j43M08k73j73L46k40k0K52j87J39k6j05k62K78j42O2J54p9
4776B9J35k02k5P4J50k80K14k49J21J89l50J82P7k91K57N3l51K63j68L1K03j06
4798d4k8L7K30l32L43k64O0J5k2p7J12r6J30k28J35L28l61J50j84nL4J50j1M7
4822A19l85K65J93j73J50q3j75M0K27m06L11j71k01K28J88j44J83j35j26n1r3
4843b39K34j67J65P8j51M8P8p2j02P8Q5kn1j75J03J41JO5k25R8L06m54J21L38
4867C01l70K29M6k48l1J88j06J21Q3k68J84j32J22j14m6K6O3q3K23k76j18J54
4889e2r3OK46k65p4K68k00R3K44r7n9L9M3l2j95j62N10n31K16J76q3J51l50kK93
4914I0j69Q2q5O6QJ7j53K14j59L9J83j58j78K25Nj17J60j88jJ80j66nJ92k74J1
$$ plain form
4753 -56 -58 46 -58 22 40 -103 305 32 -141 205 -35 -55 197 10 149 123 18 -244 34 -108 -46 108 29
4776 29 164 -38 -63 11 161 -119 95 -154 -33 156 -194 -12 65 -226 31 84 -267 -4 -172 -141 62 -44
4798 -44 -72 -35 195 -137 206 -58 2 17 -5 -82 30 -66 64 -164 -29 299 -62 88 -96 -101 -67 83 72 119
4822 119 -266 -1 192 19 169 86 -89 -49 178 -228 83 -88 -289 -61 127 -17 166 31 -95 -146 -239
4843 -239 -5 -172 -7 71 -80 -32 46 -26 -128 -50 35 33 -18 -193 -90 51 52 117 -108 -10 296 -158 -37 301
4867 301 -69 160 206 -42 -73 115 9 130 213 -55 129 -3 119 5 -41 -15 48 -35 188 -88 -206 -52
4889 -52 -145 -139 107 -158 -232 36 -164 -71 173 76 17 56 99 67 -128 -290 220 -311 -95 81 -2 149 -201 -203 90
4914 90 -79 3 -82 -16 -8 9 -144 70 -89 -50 133 -25 -203 22 27 -90 70 -118 -119 61 -105 -110 82 -192 -181
4939a81j06K94J52j86O7r1j02J06O5k04K46k5M7j23r0J62j1j42pP0J84j0O0k02
4963b7J41j00o7N2J35j57J8J80k39n5p2K17o1J47l2L8j02K85j89k50nJ63j7J24
4987A27k28K94k44r5J64R0l01J84k1J72l29l9J62J9r5J85N9k59M40k15k41J03
5009f8l9o5J87k21M26j55j46J25J00k28N2J70l45K58k54K81%l23L20j31j75J97
5031c4j3J29m2j83k9K97j50j8J59k17N2n1k8J99j96r2K31J0k23K88K3K1J57m14
5055a24K33M5k39R2j78j18L94j15J1M1L1j88J17q2P7K79k99OL20k41o2J42q3k3
5079C6j52O7K21k51o4J89k71L65k6j38J10k44j68K79q9J7J9j57M83R0m43L20l2
5102A61j51J31k75j5L30n2j44Q1j21mM1j23J7K66j92J15l2j40K42l5j13J3K09
$$ plain form
4939 -181 -287 7 159 -27 40 -51 -153 -47 18 -186 60 35 82 -41 -131 31 20 -122 -129 -59 125 115 175 -27
4963 -27 114 14 -53 -1 134 -23 -5 175 -64 -119 -191 26 -35 112 80 118 16 301 112 -138 -143 20 3 127
4987 127 -101 193 -51 -146 18 108 -193 -9 -30 142 -187 -226 -64 -45 -140 45 104 -155 285 70 -171 -68
5009 -68 -107 -172 15 -206 220 65 -81 44 144 -84 -32 138 -207 51 -203 78 78 -245 75 -56 -231 -34
5031 -34 -47 82 40 -143 -172 125 -25 -43 116 -101 -49 -100 -128 71 -125 -217 14 24 -199 89 112 133 290 -124
5055 -124 109 154 -85 7 -171 -289 105 -10 1 42 73 -115 2 -80 -3 276 -23 -17 303 62 0 142 59 36
5079 36 -116 -49 172 -79 -143 46 -225 140 114 -24 86 -158 -326 -47 -136 -119 -100 -257 226 316 -127 193 161
5102 161 10 141 -134 -149 181 129 -15 66 -55 -59 -18 -141 -124 142 -50 65 33 -107 135 100 -13 0 209
5125B09p6j07j05K01m08K36J03j48J46N3k71P0J73k00K76k88J74k27J84j09Q8
5146b6M5O9M5j78J57p1Nk55L59j20J66j96k27L56j94J41J43j65l8O0j25j77K37
5169A1j60K46j17j65K86l35J34K02k53R2R3L0k79K66L7k4j0R6j51R9j69K45K9
5192B03r4Q7l05L87m01k57M42p1j45j4J1r9K53mk65K50k4J09K94k92q3k9J61j14
5216@J81j07J00k37oL28l84P0J12q4l1K04j3k88Q8K92k18J27k23K5j18K40J2r
5240F1r3K9l96M34j10J80r3j36J82j33K31k54Q7m6J00o1J5M0Nj14P9K30j28j2
5264I7j80Q4q2J16J01k83J01K08j83j82L25l18J29J42PM6j12l52M82r3l4K08m46
5287b19K19j80M3KJ46j5Nl5K32n7j91J55k33K66k10L11k04M4Lj11j0r6J36J17
$$ plain form
5125 209 133 26 -79 122 -286 -50 53 -95 51 104 -167 -97 76 -124 152 -136 38 -189 -5 -114 -26
5146 -26 19 88 133 -45 112 41 46 -209 150 30 196 0 -227 129 -65 76 219 54 16 76 -49 -226 11
5169 11 -149 97 -20 -185 101 -234 -100 102 -151 -59 34 64 -215 51 88 64 54 150 -1 98 -71 174 203
5192 203 109 196 -109 278 -123 -380 62 -9 -154 -168 -157 -256 -3 -7 -272 -22 -46 63 357 65 -18 -47 114 0
5216 0 181 74 174 -63 -69 259 -125 -55 57 -27 -58 146 133 -155 -67 225 7 134 -89 -64 -182 58 70 61
5240 61 -32 -3 -399 35 -75 105 12 -124 58 -75 156 -98 -11 -57 43 -18 -3 37 42 -72 7 237 109 97
5264 97 -83 1 -81 35 136 -147 -46 162 -21 -203 122 -196 -67 75 82 128 16 -336 146 53 19 227 -219
5287 -219 0 -180 -137 -135 11 -4 1 -34 198 141 -50 105 -128 138 -72 239 35 79 82 -29 -39 -135 1 118
5311A18l10J08J94j12P4J60k02J5j01K5J55m33K82L3K3J56l01J40j03k5M0J79
5333A15j01R1k5O9k13K09M5j89n9J63L7j79R8O5N9k24J73k92k7K05N8j92j2K3
5357a03K62o7m63L91k95J08K09R9j15R0k29M4J86k21J81J43m70J21J74l65L61
5378D1m2j53J70k45K35%N3K3J31k66J49R7o9l9m20L22P2j50N1J53K0j40n6K53
5402A90j37p4O2k04K87k92O3o5N4J10j42J14N0p1J95k75j4J74J08n9Q9Q1k46j20
5426a22R3O0J86k15J66j09R4j22J4l8p5q0J35J53j52K9j91J34L5P8qk0P8k60R1
5451d6m7J14p2j00J45P2j06J72j59R9j33K2M3K8m1j91M13k13q6r5n9L64l7j19
5475c2L7R6m29L18q5K10o6p7K89k26o2J28J2j99K24j96J69j08k07N6J69j96K31
$$ plain form
5311 118 -192 -84 110 -2 72 232 30 45 -56 -31 124 -309 -27 6 29 185 -116 24 -79 -104 -64 115
5333 115 14 105 80 149 -64 145 190 1 -58 105 142 -37 61 126 185 -39 134 -158 -185 20 78 -114 -126 -103
5357 -103 159 92 -371 20 -275 -167 42 141 26 116 -113 -69 117 -104 77 220 -250 -129 45 -320 41
5378 41 -1 -154 16 -229 6 6 59 82 213 -53 96 193 124 85 -335 -13 59 -91 -40 113 133 -7 -63 190
5402 190 53 -21 41 -163 124 -168 -105 -170 -116 -6 -148 -34 16 -55 140 -135 -149 25 133 74 163 244 -2 -122
5426 -122 -29 31 217 2 168 59 153 31 45 7 -68 -148 -13 140 -12 17 -174 -40 -5 73 65 45 123 -137 -46
5451 -46 -93 21 -51 -151 -6 66 -40 132 -27 72 -61 -39 4 32 -9 -200 213 0 -86 -181 -240 124 87 -32
5475 -32 5 101 -328 -10 -95 115 49 -28 261 35 -27 101 113 -86 138 -58 111 3 -204 -148 21 -175 56
5498E6Kl9q3J18j7qJ54j35r5l5N5J0j10J19L02m02RJ46p6j67K69p2m9k97L46k2
5524b1jN4j87K33j37j58J05J43N5pj02j38J66O9Jj62J41M4J1%j81K13m4j41N7
5549A3j54R8R7l9L12k15j31J35P6q4j99O2J62l1j0J1l9p7J69l53K9J46J94k31
5573e9J20l1N5j96K01Qo2J27j19k28Q8J46J9J11l28K18JM1j97n4J86o9K73j67
5597H4o3M7k94L38J4j07M0K7N1j42Q3r3O4j03r2J32N0P1r7k6K01l78K10k9l7L
5623d6M8k3j0K62m72K69j23q5L03k85R8K34J12r6j15J29r4O9Q3k18j30J64l9m8
5647a3kQ0k53K40Q4k21K20j03k15J34J60q9J98j33j56J31j8j39J02o6J77l49J08
5670a23J18r0P0k8J88j19j08%J89j28j9k0j00J25LR7k72L53k75M7J61j42kJ02
$$ plain form
5498 56 58 19 -64 54 37 29 183 48 -47 -82 -27 -17 -127 -8 294 -108 -99 47 -29 -196 73 1 -48 -345 1 -21
5524 -21 -22 32 -155 78 -59 -217 -112 31 86 79 -23 -161 5 74 75 -87 54 98 109 109 -72 141 97 -44 13
5549 13 -141 -43 54 15 327 112 -19 116 192 108 -91 -29 133 102 92 103 64 -13 156 -197 -168 -22 172 -59
5573 -59 61 30 85 -111 90 98 36 163 44 -184 -96 50 69 180 -148 70 71 112 -85 -139 47 -22 251 84
5597 84 21 68 -226 112 126 19 59 86 137 -5 78 -15 49 -54 -146 -14 36 107 10 -16 185 -193 17 -12 -49 -46
5623 -46 2 -21 -31 231 -241 28 -95 -180 123 -162 -64 170 282 186 71 200 106 175 258 40 -90 74 35 -13
5647 -13 -15 65 -188 52 136 -85 135 32 -183 -49 111 22 220 87 -69 62 44 -95 7 -59 118 -231 -123
5670 -123 -5 -95 -25 -53 135 16 -92 -92 97 -31 -50 -70 -170 -45 -42 55 -217 136 -139 -92 69 -73 -75 27
5694B7j06J20J5q4l6q2n3J48J08j96K05j16J1P6m6J9l1k3j0J84k83J69K3j25N4
5719c2k5J53m2j82J10K63j41j12K11l87J70k9K7R8lL4J3j61J31k47K01J29l86
5742b07J45J33o3k10J78l2l2L27j57m0L1k0L1l8p4l6O1M0j67J57l2j3o9J67j02
5767b2k30K09j39J08J90k0j81J61K7M7m2l21K22j4R5j22M7M7o3J4N3p0q7K24j82
5792d9J28N4j13r9K65k63K50j43k27K18m7k2L1k24K82k7n9P8o3J03N4j66j9J92
5816A34J70j92r1M5L5k54K16j2j42K00k37O4N0n4K56j66j80J84j9O7n9q8K37p
5840A57q8P3l66K19j5J33%k03L9L2J47j75J24J9k22M95m34j50L25j58J34m7P7
5863A16j22n5J68m8j4k10K75j30L9J0L9M6K4k84K01j17k20L70j49J73k18O2KO8
$$ plain form
5694 27 -79 41 56 -28 -64 -146 -199 -51 57 -139 66 -50 -39 37 -9 10 -21 -44 -54 130 -153 16 39 -86 -32
5719 -32 -57 96 54 -128 -18 245 104 -8 203 -184 -14 -43 -16 82 79 113 126 -35 96 -151 50 179 -207
5742 -207 -62 71 8 -202 -24 -56 -88 239 82 42 73 53 84 46 -28 -64 -3 37 -130 27 -5 -18 -87 80 -22
5767 -22 -252 -43 -182 -74 116 96 -85 76 103 150 108 -213 9 -5 90 -32 15 62 -1 13 66 -4 -91 133 -49
5792 -49 79 133 20 -79 186 -77 173 30 -197 21 -26 -48 -17 -241 41 14 -45 33 -30 73 127 -39 -58 134
5816 134 304 112 21 66 101 -153 63 51 -91 109 -128 -64 -14 -68 188 22 -158 26 7 74 15 -73 164 157
5840 157 69 142 -224 -5 -20 113 113 -90 -51 -19 128 -47 77 96 -126 369 -65 -215 110 -48 86 39 116
5863 116 -6 -61 107 59 45 -165 110 -20 19 29 68 114 138 -146 55 -62 -282 88 -61 112 -106 -44 -42 26
5887B6OJ04j05p0Pn0J32L7k23L02j3k00K95k65nO7j47K09m1j13Q7j%k13l1J92
5913a3j60K24j11J38k4l57M29j19q6J22q5j24J53J15q1J77m47J98K23l69K13K3
5935C9k47K69L6q5j57K08k05J94k42J25oL9J04j19j82J99N2k07J82N1k06K85k37
5958a10J65j98K3L7N8oJ97r0m3J82l11J29j98K30J4Jj32K62k48J45k32NJ29J25
5982A34j31j77K15J0j7KJ50k36J91k34J0R2O2K1j41K29l47K37k82K16M0O3k88
6005a81K13j1R1k62P8J34k5J03J1k49l0l7J71N5p7JN9q6Q5L6nj4r6J25k69K72
6031I2j4j92K34k06K20k36NmK2J50j75p6j67K21J43j4Q8P0k96J63l7%J9l0j46
6056a66K65j89Q8K52j85M6n9p1n5J84n0J04j92j51K25j35L64k56O3j13J27q3j01
$$ plain form
5887 26 32 136 31 -39 -32 -82 50 87 -136 166 153 -47 248 -17 -22 45 -102 107 66 -47 40 39 39 -174 -205 -13
5913 -13 -173 51 -60 78 54 -303 126 7 -79 43 -42 -166 -13 102 21 198 -249 -51 172 -197 16 39
5935 39 -208 61 97 12 -145 63 -142 52 -190 -65 -71 -32 72 -47 -229 -30 22 -185 -3 48 -158 127 -110
5958 -110 55 -143 -120 -83 -25 -31 166 76 33 215 -96 33 -165 65 79 80 -52 210 -38 107 -125 -120 9 134
5982 134 3 -174 41 51 34 36 186 -50 141 -93 -83 9 71 92 -49 180 -167 70 -212 4 44 107 -181
6005 -181 32 21 112 -150 -72 62 37 140 151 -98 -128 -165 6 61 -16 -15 44 -42 43 79 74 60 -36 89 -180 92
6031 92 78 -114 120 -86 134 -102 -97 -101 -79 71 -104 -180 -347 -126 17 3 91 161 -135 28 -9 -9 10 -20 -166
6056 -166 99 -90 -2 250 65 111 52 -19 -74 110 60 164 -28 -179 46 -89 275 19 82 -31 96 13 -88
6079h8l4P1L6j08o5M00k13q5M1l3J85J7k41J16L19l56O5J9j61M1R2K18k66k00
6103b30L18j41J77m5m4o9P4j82J03J51p2j4K01k58m1n4l8m9J64P3q6J44j6j78
6127a12J88Rm6j40M9N3m7O3L1K11k85J05j47N9J85Mj33N9k29K16l2k68L00j38
6151d5K8L22k63n4j21J22j27Q1ql0R9J90j00n9j37J69r7nJ43k15K94l28K85k17
6175g3J70j23K42l31O6K0j10K17Q3q3k85K3R4o0J14P4R7j15j8k3L3M6p5l8J85
6200A30j07j70J32N4j38M5J1R4j65j30M18k45Q7j14K12j93m5J77p9N1p4J0J75
6223A36Kk66Q5M8J59k12J20r6j5pL5M8Q4k09J05k64K77r6K4j08K6MJ99o5j17N7
6249d6K33k01n8O3R0l8M3p7j27j27O8J93l2j39N9M9n6j0K70l36K15r1J42K1l4
$$ plain form
6079 -88 -122 -51 -15 -123 -188 212 -1 -86 -45 -78 107 124 -117 -1 318 -38 27 46 -115 -74 18 236 -30 -230
6103 -230 88 -53 124 79 35 -34 40 -142 -39 112 40 26 227 -31 -72 -126 -164 -213 -49 24 -62 82 66 -112
6127 -112 76 85 39 -101 -52 1 -46 17 48 259 -26 79 -68 -9 176 180 47 106 -123 93 61 -207 93 -45
6151 -45 -17 305 42 -12 -133 -11 -138 -57 -65 -95 4 194 94 35 -102 67 -30 -35 108 -107 187 -141 144 -73
6175 -73 97 -26 216 -115 -49 -29 -139 78 161 78 -207 -184 -90 -150 -36 38 135 20 2 -21 12 58 -17 -55 130
6200 130 23 -147 -15 39 -99 -54 -43 51 -114 -244 174 -71 16 -98 114 -79 -124 53 -26 25 -49 -39 136
6223 136 138 -128 -43 5 164 -48 72 -24 -39 -46 -11 37 121 -88 17 -247 30 -66 -42 -150 -124 -120 79 14 -103 -46
6249 -46 187 -14 -72 -9 81 43 86 9 -118 -245 -177 16 -16 -155 -96 -47 -103 -113 157 -179 36 -55 87 108 74
6274G4Q6j20j48pO8L5J58j96l1K3J51j00K28k09n7O5n1K27j66k3m9q6J92j35m1
6299a12J18m4K80l27J36j21J19k56R9j18K64Mj80j1J18k2j48O4J04o7j08J64r
6322e3j35R2L02l49K7J12J67j91K75j79j31J6L04k62K2j23K96m06J18K02J47L8
6344B89m34M36m86K89q1j34J73k7j22J54j26Q8mk18J67K12k94QJ64o1N2J63l75
6367a67J63j6J04o5j82K2JJ69K4k11L56j12l12J56Q0r0q1L22k31R0j47MK00j06
6391b9l1K11P2q2q0k1l2o1P2o7k1K63j56n6J33l56L45k31p1J71o9K11j1j21M6
6416B9j18O0P4r0J42j35Kj22k3J69Jo4L15k63L0k52M10m02J77J0J74r5j70R9P1
6441B9p0J99l14K65k2r6L7J29j44O7o4j2M3o9J22k58J37J24O2p04O23j49L1K12
$$ plain form
6274 74 160 40 -108 -115 -47 -12 146 -50 -81 -58 93 -7 221 12 -45 20 -31 196 30 7 -42 -128 64 -71 -112
6299 -112 6 -38 242 -85 51 -70 49 -207 -108 -226 38 42 -138 -149 -31 -53 -201 -137 -33 -100 -208 -44 -53
6322 -53 -188 -96 206 -143 -116 -4 163 -28 247 68 -63 -47 257 -5 17 -106 190 -216 -98 104 251 289
6344 289 -145 291 -195 94 13 -121 52 25 -97 57 -69 19 15 -203 -36 176 -118 -110 54 -7 45 208 -167
6367 -167 -4 -20 84 19 -163 -141 -140 29 53 -158 198 86 -226 -70 10 -80 -161 161 -70 20 -127 -123 77 -29
6391 -29 -60 151 223 141 61 40 8 -53 19 -48 -69 194 38 -18 115 -241 104 -127 -198 -27 -96 115 104 -17 29
6416 29 -89 -29 45 -45 97 -38 -36 -158 -181 -12 -11 -75 240 -23 7 -245 165 -237 -60 -50 124 29 -141 -42 29
6441 29 -41 158 -156 109 87 -9 28 157 13 80 16 4 47 -22 100 -158 -21 103 165 -539 84 -65 -34 178
6465A78j52j50J75j20K79l40M5L08m21K05J89k29M2l2O0K7N7j65K54j06R5J4j90
6488B3l3J76r8K5jj5qJ4l3k9j25Q4P5k14J97P7J21k19L0j48K01k17J06J19j42
6513c4l1N5j9R6N4j46K5j61M4J74p0o8J45j41j21J59p4J21O5n3M5j49p2p7J32
6538a01J51K36m29KJ09M1n1O4k02J27J84o8J3l11J37J93k40M3K88j70J9K21j59
6561I7j08K6p6J58j39k4J28K15j81k49N6J00m2n4K11j98mJ03o8K65k04J15q8J36
6585A75m46J73L1J22J44j20n0j01Nm0K52j26r7o4R8L18m48K25L0L1q8j76M7J98
6609I3k31J88R7l07J14k7m5K31j38J36j71M7j5n9L6r7J66O3k21J62j50K00j64
6632i2J39j37P1l7j54K66O5o3m8K74l96l0J84J74k71RJ56k45K31R7O4k44J52p
$$ plain form
6465 178 26 -124 51 -69 210 -130 -85 223 -198 7 196 -33 9 -23 37 64 121 -44 210 104 199 213 23
6488 23 -10 166 68 93 92 77 69 83 50 21 -104 -20 55 -159 38 115 236 17 47 -101 100 -117 -11 108 -34
6513 -34 -65 -10 -29 67 121 -25 0 -161 -117 57 -13 -81 64 -77 -198 -39 -113 8 73 20 65 -84 -156 -233 -101
6538 -101 50 286 -143 -141 -32 9 -42 22 -180 -53 131 63 76 -235 -98 95 -145 -102 186 16 35 256 97
6561 97 -11 15 -61 97 -42 -66 62 277 96 -153 -97 3 -39 -93 118 -80 -84 19 -49 216 12 127 39 175
6585 175 -271 -98 -67 55 199 79 29 -72 -67 -107 145 19 -78 -142 -44 274 -174 51 81 112 24 -152 -105 93
6609 93 -138 50 147 -160 -46 -73 -118 113 -25 111 -60 -13 -28 -87 -51 -148 18 81 -140 22 -128 72 -92
6632 -92 47 -90 -19 -56 -210 56 121 58 10 284 -112 -142 42 216 -55 -46 110 -135 96 193 257 13 165 158
6656A58k08N6j44K64l19J69J36l00K55k5J21l81K54J04p5j45K55k91j3J52j00
6677g7m2K32j72K32l02j3J69j10M3K70k53J24q5P4P3k15M8P6j44j7M3P6Ln4j04
6702a25O9K19k6j67J60m3j29j0M9J75k43J78j10M1K2j05J1Kk07M2L68k13j19q3
6726b44M07q3q6J61q7j2p0J12j30l4K83k37K2J12j22O0n5l4J25j04J60j24o5P3
6750B8lK59j30j94J07J77p8k73R8qn1J92j34j35K97l33K39jJ82r9j75J56l74L97
6774A44n2k66K43n9j49J46P8j26P6J81n27K2L97k28K85j83JN6j59K41M9J51l68
6797d7qP9j59p4J22J15rp9k1R1p4j1m7J0J54j31N1J02m0k4J97j23k25J51J14l4
6823H0l35J68J35J13l08J54m1Q4r1O8R0l26K08j54n4K11K38p2l22J0lJ77k42j7
$$ plain form
6656 158 -50 6 -138 126 -193 -24 112 -188 67 42 163 -218 36 140 65 -80 175 -116 -129 23 -77
6677 -77 -119 113 -59 173 -129 -142 27 -83 -40 230 -23 101 16 90 163 -52 -4 72 -72 -89 -46 30 33 -21 -125
6702 -125 -56 163 137 -30 130 87 -42 -52 -3 172 -71 107 -3 38 60 -45 -34 -32 -239 -197 171 -42 -161 -244
6726 -244 163 80 -6 155 68 56 -14 98 -32 -66 217 -20 2 114 -8 52 -3 -37 88 -16 144 20 -45 28
6750 28 25 284 154 -40 67 244 166 -107 -9 -17 -68 124 -10 -145 152 -181 58 57 239 140 -35 121 -253 144
6774 144 92 -174 69 10 -139 7 85 -41 35 216 -311 -289 108 -120 165 -18 -17 39 -120 121 170 321 -47
6797 -47 -55 24 -135 -209 -87 28 19 -60 -81 10 -64 -75 -122 -112 42 -89 -38 64 24 0 197 74 -151 0 114 80
6823 80 -255 -87 48 161 -147 7 -34 50 -41 27 117 -209 -1 -155 -209 2 240 168 -154 -144 -147 30 -212 -229
6847b29J39L12k39N1j57J35j04J93j81N8Q6j12J62j07k05j43L58K4PQ6p4K30l40
6870e0j34K27lQj76J16J40n5j08q9J66k8j02N8P3j93O0j10K20j81J51q4L6k0j74
6895b52K44r5J47L6j52J90l19M9L86l33L4J24j45rJ66q7k2N6l2Q4m0J90j35j18
6919c3l8j6J94j53J55k32n9J15N0J06j77J21KJ69j26L4k03K01J0j14J51n4k92
6942a89M08j04q4j5j09J45j03k37J82J2m0J81J63Mk58j27J07j42L56k98Q6K7N2
6965A7O2j46j18L29n1j87J54k32J76M7k44J00J59m7J61l47K14J26q1j39L5j31
6987a43J89J1J41j83R3k49J34M5J4K8m0J42k34J19O7l09L73k61J2J02J09mj07
7010D9J60k83M1R8Pr4P4Q8k05O9J40r4k9L0J8J72k42j46J59J41l29K37m08L62
$$ plain form
6847 -229 -90 222 -17 34 -123 12 -92 101 -80 -22 64 -48 114 7 -198 -341 17 41 48 134 60 290 -50
6870 -50 -184 43 40 48 -128 -12 128 73 -35 -124 42 14 -88 -30 43 -150 -90 -200 20 -161 -10 -94 -58 -78 -252
6895 -252 -8 -103 44 80 -72 118 -201 -152 234 -99 -65 59 -86 -95 71 -16 -38 18 -14 70 30 220 85 -33
6919 -33 -71 -87 107 -46 109 -123 -182 -67 -17 89 -88 33 35 204 78 112 -91 110 120 6 157 103 -189
6942 -189 219 115 31 16 -93 52 -51 -288 -106 -94 -134 47 210 214 -44 -171 -64 -206 150 -148 -62 -35 17
6965 17 79 -67 -185 144 93 -94 60 -172 4 51 -193 -93 66 19 180 -167 47 173 92 -47 -12 -143
6987 -143 46 57 198 15 108 -141 -7 38 52 80 40 182 -52 67 134 -175 198 -63 -51 51 160 156 49
7010 49 209 -74 -33 65 72 -22 52 140 -65 4 144 50 21 51 69 241 -1 -147 12 153 -176 61 -347 15
7034A5j42K67j85J94N1j29j43R1K59k97N8k5m7J65k24j06J61j52N6J63O8j00o9
7057g1R3L7j61R3PMM8N3m1j94J15J56k0j93L27k30M1M9k05R7jL10j21k07K0Qj62
7084a48J07J85J4Qj31P2K1Ml19J81r6%J14k9k0j4o4N1m7j08K12mj9J94q6j15M5
7111Hr2O4O2k91K08L3o1J9o5J50K3k6Lq0P9J07j94K36j98l0k28L19p2j24M5M0
7137f5q1K62j45k2K06L0j3j99J23j07J6K2k38J86n2rJ64o3R4L2p4j43J23N9k90
7162a84J79J07J5j6p2j67l3O0J21M3k25J56m6K28k72j43J61J43o7J30k85J08K0
7185c9N5qPOJ0J63l83O8j5L2J40j6m2K6K75j75l15K64j02Qj61K66j78R3r0L78
7211B67j69M4j30P0R2J5j53J31j28k17K48k09Q2K34l66L12k28k3L0q6J18J10j89
$$ plain form
7034 15 -127 140 -45 149 200 71 -72 19 278 -19 39 14 -33 132 -92 -198 -37 -189 -133 30 98 -2 -71
7057 -71 22 59 -102 -9 -2 2 50 103 62 -132 -17 139 119 -74 253 23 64 113 -92 5 4 314 193 -14 6 14 -148
7084 -148 -41 144 158 166 35 107 128 132 -187 -6 -102 -102 12 -17 -37 -51 -115 -64 -111 -219 -7 -11 -30 164 78 -37 8
7111 8 -84 -20 42 -249 -41 -8 -69 -50 -115 35 58 32 35 -45 34 141 -53 183 -15 -45 -273 46 -26 -150 -105 -65
7137 -65 -146 116 -29 -51 155 185 172 -27 96 -11 5 27 -211 -25 -77 -86 78 15 109 141 67 -76 47 106 -184
7162 -184 -5 102 117 101 29 -138 -171 -111 10 53 -172 -16 -62 166 -106 -249 -88 55 -12 118 -167 -59 -39
7185 -39 16 8 15 21 31 194 -189 -121 -136 -104 36 20 -22 4 279 104 -211 53 -49 -41 -202 64 -114 -21 -111 267
7211 267 98 142 12 82 174 189 36 167 39 -178 70 -139 -57 177 -189 123 -105 -128 -98 -184 -66 44 -145
7234a45R6K7q1O8j52K9q1L66Qr3J10nj27J6Q4j61J74o1j08K57k06l98L39J53n6
7259E3o2j65J72L6q0l9p7J05J27m2K7m2q2K29j49P7q4k4n0L19k25O8m8K7j40r9
7285a68NL60J1j75O2k02J07j14J67j4J98m01J44j29J79M7q7O4o1M6J7o6J02k05
7309a13k3M9j9O7j58L90m27p5M02%q1j05Q2p2M38m85J60P4j13J17k33K19j31J91
7333A54j99Q7p8P0J69l31l0J13N6J16j82K86J11l66J27j02q1N5k4K48k51j45n1
7356b48L07j20K4M5J16j60n7K70l94J94L20l76J54j67LJ62kOk32p3L20r4j22M29
7380C05l25j38P4K92l09k5p5J54J10l37O1J42l7j31L31L9j00o7J48k92J21k31
7402b90K39J09p3m4J78m8j62J29L2L5k15n2L49j11l00J41K5J08K75j09k82j3J25
$$ plain form
7234 -145 -49 -22 -103 -35 -187 -158 -239 127 135 42 152 147 20 36 120 -41 133 72 -36 221 15 -383 -44 109 53
7259 53 -9 -174 -2 34 -46 -85 -162 -57 70 28 55 13 -69 160 11 88 4 -20 -70 249 24 92 44 71 -69 -168
7285 -168 -163 197 208 33 95 -107 0 -114 53 39 237 -164 -20 -149 30 77 -10 54 -7 39 56 -10 92 -113
7309 -113 -136 -87 -106 -39 -197 193 -234 -309 93 93 12 -93 -11 -83 355 -130 30 104 -9 108 -125 94 -37 154
7333 154 -45 42 -36 34 203 -128 -158 -45 11 127 -55 231 342 -24 103 1 -80 -25 -49 199 -52 -197 -248
7356 -248 59 -61 -37 8 124 -36 -93 177 -217 -23 297 -79 75 -92 -89 73 71 77 -155 -228 92 -2 -124 305
7380 305 -20 -158 -84 208 -101 -126 -201 -47 63 -274 -213 -71 -108 -239 92 131 31 -36 112 -180 -59 -290
7402 -290 -51 58 -15 -59 119 71 -91 38 70 105 -110 -162 187 76 -224 -83 -58 50 325 216 -66 -79 46
7425D6n3j86%K31j51J73J49k59J01n3o4K86j46O7k47R4m0n7K62j62J76k71q6P3
7449a17M9P1mJ9j71k4J25K22j91J15L3k63Q4J26K9k77K95j29J59k68R5Q7k2p8
7473c5N0o8J59r9L1M9j20j7n3J56L7j38%R8jn6p4M3j11J60k31J12j3P1K37k79
7499i2J91o7k60M94k16k55Q6L01j25J51k06j71J45Q6k2m0Q1k33J58o4J20nj42
7522h5Q1J18M5l91K69r2M3j18O4J41j36J64l18K13j4j14Q8O3j93M0J50L5K5k14
7546a36J65J27l43K89k9j16P3k4J64k62J32po2J11n5J00j13j11J57j05K03j27
7568C1j10Q1o8j28L74nk26J35j51K46j95P7l22K95m9J17O6j9q9k2p5J47j71p2
7592a33J09o9p0K57p8P6Qnj0o3J03j70M4j71K40j5j35L6j57K83J1j61Q9J91l41
$$ plain form
7425 46 -7 -193 -193 38 -113 60 209 -50 51 -2 -66 220 74 141 -106 -12 -52 -109 153 -9 167 -104 -190 -117
7449 -117 -68 3 -1 18 -153 -177 -52 170 -21 94 127 -136 -52 74 103 -174 121 -8 151 -117 -22 65 43 -35
7473 -35 15 -53 106 7 38 87 -33 -50 -103 53 90 -48 -48 50 49 -7 -81 -38 -149 11 -220 -108 -121 -50 187 -92
7499 -92 99 32 -228 266 50 -205 -119 182 57 208 2 -169 -24 62 40 0 81 -152 6 -58 62 57 -85
7522 -85 -4 114 159 -232 37 -55 -12 -130 -66 75 -61 103 -215 -2 -16 -130 -42 21 -172 -132 18 53 78 -136
7546 -136 29 156 -187 102 73 -43 30 6 170 -92 40 33 -29 82 27 127 14 -97 60 -45 158 31
7568 31 -79 2 -66 -194 180 175 -51 84 -67 179 -16 61 -261 34 -15 102 168 149 60 38 -37 110 -61 -133
7592 -133 -24 -93 -163 94 16 92 100 95 85 22 125 -45 -1 -172 68 53 -82 -46 -203 80 91 -70 19 210 -131
7617a31m2J92O9pp8J48k29K50j31j41J97j02L6l6n9J45J73j60k2J33M4m11K13
7640E1qP0jp5o1J12J3J4j71J21j2k03M5N1J9L5n4J3J32j42m4L8J16J66o7l48J12
7667g8Q5Pj7K7r3p6J55N2j16J41O1k53j25J42J40Q2j2J2k59P1J21J59k05l3O4
7692E2l60L49J4k62K37J16k70M6J80Q0l29J69l00M4K23m0M8j12L37j95k05J93
7714A5M5k6J1l3j13L10k04N6J24k03R1O2j33K8n3P8m2pm7j10J26J56j20j60K26
7739G7j85L08j50j34K86j79j55K06JOl2k9J95j80j58l3J78j90K48n1j32O1j19
7762a61J25P5Q0j4j57q3K2R0J8M0j75J92k29J30N9K1j22R1J50q1j40l0j6Q8r1
7787a18K50l7k55K29k17J89m7o0K4K8ro1J41m8l3J79j25o3Ok6j1J5J05L2l7N8
$$ plain form
7617 -131 -173 19 88 81 3 151 -78 172 41 -100 97 -5 31 -5 -64 81 254 94 72 205 249 -162 51
7640 51 43 113 112 37 -24 88 101 115 -56 65 53 -150 -105 -54 -35 0 -54 -41 91 -51 -95 -57 59 225 158 -190 -78
7667 -78 7 14 -3 24 -69 -145 10 62 -54 87 148 -105 -230 -88 52 134 122 134 -125 -54 67 226 21 -12 52
7692 52 -308 41 55 -207 30 146 -124 -78 102 182 -147 22 -278 -234 -11 -51 -3 -115 222 27 -178 15
7714 15 60 34 45 12 -101 209 5 61 185 -18 73 135 2 30 -23 55 13 6 -41 -151 -25 131 11 -149 77
7739 77 -108 200 50 -84 202 23 -132 74 75 81 49 20 215 35 -123 -156 22 -168 80 29 -103 -42 -161
7762 -161 -36 39 119 105 -52 -135 -113 -23 -5 35 -140 52 -177 -47 12 33 -89 2 152 71 -69 -99 -115 -27 -118
7787 -118 132 95 -160 69 -148 41 -6 -66 -42 -14 -23 -84 57 9 -24 155 30 -33 -27 -53 -64 -49 56 88 51 109
7813A09k80K79r2Q4k61J49j34K14q7o6J27L9k40K71j04m8P1j08J85K3j06J53q0
7836I8k72k1P2p6J58q6Q6O7N5Qn2j7j35l1P4p4M6J89j86k5O6j86K07j9J19M2j21
7863a4N5k72J86K45P7m68K05M2l2M4q8Rm5o6Q2J77j01j65R4O4Q8j8m7j26l3K79
7889A72l06K39k2J44l13P2N4j66j38L34j21J38j50L7rR8k03P3L50j83O2k60J79
7912H1k25K9j05J43R1k25k5J62P9j2J50j89J43k5j52m9K19p4mJ54q8r1M2o8j5
7937e4j2l2k6N2l9J75k62J10J45l45K76J31J8p4J08p1p6m7P5j01M6J20j38K2p7
7962g6M75k85j76J63j54j3r1L11m11M0K26L08k79j5j50J35R0j18l44J34L50k5
7984I5k31J02M3j09K95l25j27K81j22J03Q2j27LP6N4k2K02m37J9J40J87k08l4
$$ plain form
7813 109 -171 108 16 100 -161 -12 -146 68 -19 -85 42 81 -159 112 8 -40 31 -77 108 131 25 178 98
7836 98 -174 -195 -123 -199 -41 -127 -41 26 81 89 37 20 -115 -146 -72 -146 -100 89 -97 -122 -56 -242 -35 -54 65 107 -14
7863 -14 41 -231 -45 200 277 -191 14 56 24 68 -20 -11 -56 -122 -40 137 36 -129 -35 29 117 99 52 -74 -107 172
7889 172 -134 105 83 227 -86 -14 40 -126 -264 70 -51 87 -63 -26 -35 63 -140 -67 283 100 162 -98 81
7912 81 -144 -115 -220 -77 14 -211 -236 -74 5 -7 143 -46 97 72 -80 -129 90 16 12 166 78 -13 29 -39 -54
7937 -54 -66 -98 -124 -72 -111 64 -198 -88 57 -288 -12 119 137 63 171 100 24 -23 52 -49 -3 117 -21 1 -76
7962 -76 399 114 -62 101 -53 -66 -157 154 -257 -217 9 317 38 23 -127 8 98 -20 -364 -230 120 95
7984 95 -136 -34 9 -100 195 -130 -257 24 -98 5 87 -40 -37 39 93 71 273 -164 -145 -5 182 -26 -60
8007f0JJ45l6rJ07j26L98m77K57k60J2L2q0M0l9L1R5On4l0j04r4L80q4j6p7n9
8034a01J16PR9r3j58K74j11l23K73k74L46j88J83n4J62L1j60J6J00o8N0n5r6J05
8058H1mk2K73n30L15j60m5J28J18m3j57M4r4J86m9kj78L41r3j78l6J68k0Rk08
8083a56K18K87m89M7K19j75R6L2oQ0j45Q6k40K55r7r0P5k7K32r6n8j30R2j29M5
8108g4j34O8K42m6p8J98j79M6L6k21J19l0J40R1j31O8P3k68J46O8k33o0J34m0
8132f5J63j20J41O5q5l41K65j18J98J5j17J98k24J80l16J43j20PJ93J03l55Q4
8154a06J68j0j95J39P8j55J17Q1k56J82K3j14P6J16j53P4p7l2n1J02l2N0k17K64
8178G2j01R1M3j46M9Q7k52J85J69j38j06J58k3
$$ plain form
8007 -60 -59 86 50 41 148 22 420 -57 200 -60 -48 -16 -96 -56 -95 -64 31 37 -17 -47 -151 -245 135 51 35 -42 -101
8034 -101 15 22 121 28 -130 144 33 -290 -17 -291 55 -133 50 -4 158 189 29 45 145 77 127 72 -24 81
8058 81 77 55 328 -202 113 -47 -92 36 154 111 -46 -2 -96 90 41 39 -139 202 109 -69 -105 63 43 52 -156
8083 -156 62 349 -140 -93 126 -49 47 79 73 153 8 94 -146 109 12 -78 -3 -30 202 106 48 -82 10 -119 -74
8108 -74 -208 -140 102 56 -22 176 -3 43 79 -142 -23 -53 87 178 47 115 188 -80 66 134 -99 -159 -25 -65
8132 -65 98 -22 119 184 99 -242 23 -95 103 118 1 199 -25 155 -161 -18 -138 -131 62 165 -190 -106
8154 -106 62 52 -143 -4 74 -81 36 117 -139 43 66 -48 28 144 -9 65 -12 -44 -95 7 -25 25 -192 72
8178 72 -29 62 105 -41 8 95 -157 28 197 59 -47 111 88
8191H8
$$ Imaginary data points
##PAGE= N=2
##DATA TABLE= (X++(I..I)), XYDATA
0@%%%%%%%%%%%qJ6j6J6j6K4l2M0m8N6p1Q0q9J05j28J51j75K01k28K65l04L44l90
34b07M41m98N60o28P02p85Q77r75J081j198J326j465J618j785J969k170K390k632
52a379K900l200L533l906M328m810N370o024O798p736Q900j0390J2374j5157J9368
67A0969k6563M2076j35666J31943J56970l08422Q1665J82463j55731j19943K14899
78G4660L3416k08774K8293K05401j15726j05945J55489j8380j60185R0894J03241
89H2384o9431o2229M8173L7014p1248j3433J12450n5621r9574J24485N1888j27380
101d2522J1981Q1424o2971n3741J11307M1844j49619J2851J49500j21330q4914
112a06190J86870l9568j63892J45515Q4584j68873n307J37169o2546j02632J31290
$$ plain form
0 0 0 0 0 0 0 0 0 0 0 0 0 -8 8 -8 8 -8 16 -16 24 -24 32 -39 41 -48 57 -71 80 -95 106 -122 143 -161 183 -207
34 -207 234 -264 296 -332 370 -415 462 -513 568 -630 696 -769 849 -936 1033 -1137 1253 -1379
52 -1379 1521 -1679 1854 -2052 2276 -2534 2836 -3188 3610 -4126 4774 -5616 6758 -8399 10969
67 10969 -15594 26482 -109184 22759 179729 -128693 -47028 135435 -20296 -140239 74660
78 74660 108076 -100698 -72405 132996 17270 -88675 66814 48434 -111751 -20857 82384
89 82384 12953 -49276 -1103 35911 -35337 -48770 63680 8059 -91515 32970 84858 -42522
101 -42522 -30541 50883 -12088 -65829 45478 87322 -62297 -49446 100054 -21276 -106190
112 -106190 80680 41112 -122780 22735 107319 -61554 -66861 70308 7762 -94870 36420
123C6420P0424j73415J2751J60049j13497q8335J52243o305j18273O2871P2334
134F7267p2210o2310O9568M6299r5429M082J18418o0426q6499R1128K8832r2194
146d3474N450R4197j6351r8800O0391Q4271j31734k8110J54719o5239j06481J30192
158C9031L0866j32358K2436R5412o2090o4939J05843L5209j27695L2929J05574
169H0218j03703l6080J15840l8500o8303P4131K3420o7837j4356M9557k074n3261
181d0948M2075M9020p6031j0132P2596l3399m1258M2566K0894k8656j3474M6564
193B9817N513q3645K6889P7945p4076k0726R2420m0056p0180O1661L2099o7966
205c0305j2582P8198q579p6429O1528M4751j06870J3360R6873o0360l6358P4148
$$ plain form
123 36420 106844 -66571 -53820 106229 -7268 -95603 56640 50335 -67938 -5067 67267
134 67267 -4943 -67253 2315 48614 -46815 -42733 75685 15259 -71240 19888 48720 -43474
146 -43474 -38024 56173 39822 -58978 1413 85684 -46050 -74160 80559 15320 -91161 39031
158 39031 69897 -62461 -40025 55387 -6703 -71642 34201 69410 -58285 -25356 80218
169 80218 -23485 -59565 56275 17775 -50528 23603 47023 -20814 -35170 14387 12313 -40948
181 -40948 1127 50147 -25884 -36016 36580 3181 -38077 4489 25383 -3273 -16747 29817
193 29817 35330 -48315 -21426 56519 -17557 -38283 54137 14081 -56099 5562 37661 -30305
205 -30305 -42887 35311 26732 -49697 11831 56582 -50288 -36928 59945 -415 -36773 37375
217C7375r922n9543K0277M2193l2623m0057N7595K1786p0090K2753M6097o1267
229b5426r692N6610p440k7435J0925K5844j5546l8717L8070K4912o1985K0191
241i689N6879n1206k4376M6133j0272l7344J6914M0506k2696l8861N0732J1022
253B7742p2156L4501N0677o1485J884N8593k9079l4684K6796J6977l1528j1604
265b3366M9353o580n2321L9716J9911o0942J6255M1876l0260q881K6848M240k4041
278h192j0683L3492m093l6998L8883K0585m9959J0358K8579l0171j1676K3522
290C647J0724j9596r753L3087j1753m2321L9278J8138m7204K3557L3016l5236
302d416r401K4044j476k1599M058L3401j6872k9770L9071k592m7819L0444K1841
$$ plain form
217 37375 27453 -32090 -11813 30380 -2243 -42300 15295 37081 -33009 -10256 35841 -25426
229 -25426 -35118 21492 14052 -13383 -2458 23386 7840 -30877 7193 32105 -29880 -9689
241 -9689 47190 -4016 -28392 17741 7469 -29875 -12961 27545 4849 -34012 16720 27742
253 27742 -44414 -9913 40764 -20721 -18837 39756 10677 -24007 2789 19766 -11762 -23366
265 -23366 25987 19407 -32914 6802 26713 -34229 -17974 23902 -6358 -15239 11609 15849 -8192
278 -8192 -18875 14617 10524 -26474 12409 32994 -16965 -6607 21972 -8199 -19875 3647
290 3647 14371 -5225 -14978 18109 6356 -35965 3313 21451 -25753 -2196 30820 -4416
302 -4416 -13817 10227 8751 -12848 -8790 24611 7739 -22031 17040 14448 -33371 -2927 18914
315A8914l4494P816K2917j1519j6387M361K0260j5474j5359L9100k738l6161K6809
328H045Q551l2922R563J7473o568r155K968J5803j8100j9031L2612l722k9363
341b3846L1875J0563l0814P846J3508j0753q480J0313J7780j7437j1588L0889
353A9856j5532k9304L2709K787k7957J9533J1459j7872n948Q008P406j5179o70
366a0704K9448j4683j8317K9308p757k4817K0675O612j1539K278M567L285j5204
379f848n474K2359j3834j3721L0114n184k1099J6474J420j2900K536R579P527
392A0949j3209j074K0539j9770j2896K9000j0965j7224K4050L32j6640K602M026
405b80j297r040P193J7248j8423m612K3908j6286j1857K2008n096p946J0287J257
$$ plain form
315 18914 -15580 -7764 15153 3634 -12753 -8392 11868 -3606 -18965 20135 17397 -18764 8045
328 8045 16596 -16326 -6763 10710 4142 -5013 -2045 13758 -4342 -23373 9239 5517 -23846
341 -23846 8029 18592 -12222 -4376 9132 -1621 -10101 212 17992 555 -11033 19856
353 19856 4324 -24980 7729 10516 -17441 2092 13551 -4321 -10269 -2261 5145 -10034 -10704
366 -10704 18744 4061 -14256 15052 7295 -17522 3153 9765 -1774 504 5071 8356 -6848
379 -6848 -12322 10037 -3797 -17518 12596 7412 -13687 2787 4207 -8693 -6157 3422 10949
392 10949 -2260 -3334 17205 -2565 -15461 13539 2574 -14650 9400 9732 -6908 -4306 -280
405 -280 -1577 -10617 -3424 13824 -4599 -9211 14697 -1589 -13446 8562 3466 -4480 5807 7064
419G064k218r815k55J2458j3800j603K2190j4465j0513J7198o793r025O909M043
433A375K565o711M801J1231k0682j706K2822j6474n611K2893j0049j1715R042
446A781p81n619l623Q699P568j5939N387J4565k1403M7J8827j2473n08J2739n090
461D177k620k883M05N347j0141M504J2895j5425j197J2000j1967l027P362j167
475a737K363k136M722M468j7595N169J5631j6824L567J7215j5764l949J1921n637
489A414o455K13P333J396j0513J0467L649k2375R268J3845j5306O174R867j0930
503a953J519L022r66N0p869P642Q148j1589L998L503j4670M215O913l042K318
518A239l959K212M498j1402O601P126j6557Q903J4562j3422J20N613r277k63N182
$$ plain form
419 7064 4846 -4969 -5224 7234 -6566 -8169 14021 -444 -10957 6241 -552 -9577 -2668 1375
433 1375 3940 -2771 2030 13261 -7421 -9127 13695 -2779 -8390 14503 4454 -7261 1781
446 1781 1000 -4619 -8242 457 8025 -7914 -2527 12038 -9365 -9318 9509 -2964 -3472 9267 4177
461 4177 1557 -1326 -921 4426 -5715 -1211 11684 -3741 -4938 7062 -4905 -7932 -570 -1737
475 -1737 626 -1510 3212 7680 -9915 -4746 10885 -5939 -2372 14843 -921 -4870 7051 1414
489 1414 -5041 -4828 2505 3901 -6612 3855 7504 -14871 -5603 8242 -7064 -890 8977 -1953
503 -1953 -434 2588 1622 1672 -6197 1445 9593 -1996 2002 5505 -9165 -4950 1963 -1079 1239
518 1239 -2720 -508 3990 -7412 -811 6315 -10242 -1339 13223 -199 -79 5534 -3743 -4006 1176
533A176M719l522r289J0718O52j5446J2179K484j6604J3597Q546j2228L157R25
547A064m649K772M33O269j079r451R269L06j1116P754q40o737Q070p73j82L45
563A455j0172O788M940j0574J0501M761j3505O780N285q436K24K525K888j760
577A700l395R481n844j3460J4480m08j2756J4034J527j2326O975K158n275Q59
591b250N01N747j624l777Q792n909p879J0761l604m838R195m134j759K598p234
606e414M298J264p014R692M68q192Q208j142o920M711O82J520L01k759P001o090
622F14q029J2718n253q639J4795l139r940R067j590n658K323J342L657k305n00
637e37P346q453l474J1304o927k372R923n864j766L763n812J775k35l792Q172
$$ plain form
533 1176 5895 2373 -6916 3802 4454 -10992 1187 3671 -12933 664 9210 -3018 139 1064
547 1064 -3585 -813 -380 5889 4810 -4641 4628 4934 -6182 1572 732 -6005 2065 1292 1110 1455
563 1455 -8717 -1929 3011 -7563 2938 7699 -5806 974 6259 -2177 -1953 572 3460 1700
577 1700 -1695 7786 1942 -11518 2962 2554 -10202 3832 5359 -6967 8 2166 -3109 -2250
591 -2250 -1749 3998 2374 -1403 7389 1480 -6399 4362 758 -4080 5115 981 -778 1820 -5414
606 -5414 -1116 148 -6866 2826 3294 -4898 3310 2168 -4752 -41 641 2161 2462 -297 6704 614
622 614 -7415 5303 50 -8589 6206 3067 -6873 2194 604 -5054 -2731 -1389 2268 -37 -537
637 -537 6809 -1644 -5118 6186 -741 -3113 6810 946 -820 2943 -2869 -1094 -1329 -5121 3051
652C051k544m222P450n256l687O203j994J920J692k747N453n179l998R467p326
667a717l605J2832o327n730Q414n114l982L563L29K269k691J290N991r331K23
682c586R616r393J176J0146p847l60M011n702J420o23j249N681m529m64N344p941
698d300j56N959m419K656K631l162M429l942k276O997o723l08J0276p599j828
713a765O264o814j396L528j137J649k042J377L888q443K484O591r546M142Q510
728G290q380J808L469o285K018J42j84L322m813J921L515q667K394M001o816M967
744b98K621l856L867l130j547N023n458K719O352p752K264M203p747J251K526
759A038k640K379j453R26K155p405L410L982q564O155N432q209L708K365n739
$$ plain form
652 3051 507 -3715 3735 -1521 -5208 995 -999 921 2613 -134 5319 140 -3858 5609 -1717
667 -1717 -5322 7510 1183 -4547 3867 -1247 -5229 -1666 -1337 932 -1759 -469 5522 -3809 -3586
682 -3586 6030 -3363 -2187 7959 112 -248 3763 -1939 -519 -1142 -2391 3290 -1239 -1703 3641 -4300
698 -4300 -4456 1503 -2916 -260 2371 -791 3638 -304 -2580 4417 -2306 -2614 7662 63 -1765
713 -1765 4499 -2315 -3711 -183 -1320 329 -1713 -336 3552 -4891 -2407 4184 -5362 -1220 7290
728 7290 -1090 718 4187 -2098 -80 62 -122 3200 -1613 308 3823 -4844 -2450 1551 -5265 -298
744 -298 2323 -1533 2334 -796 -2343 2680 -2778 -59 6293 -1459 805 5008 -2739 -1488 1038
759 1038 -1602 777 -676 250 2405 -5000 -1590 2392 -6172 -17 5415 -2794 914 3279 -2460
774b460K862L8P0K436m131L446J085p873M482J319o839O319J324m336L647k878
790a489j018L679m030L733L053o132M689J715p027L609K33l279M510j608O2J283
806A983o672L799K201o816O527J840p057N917P10n306L380p34J49K900k834L392
822C379j027o459N727l89n595O582r47m203M664k603j262K094l700M037K128m677
838b251N362j322n522N627o90k999M645k128j09J794n151L141l83n348O830N0
854A546n168N896k229l839M591j828Q09K295k865L855j210m482N659k604m201
869c775P427k402l246M262l648r93K104k956L805m0k937N328k641l811N951k874
885d46j348N337k647L06J374m060K334q16l440N993k141l312N609l587k506M046
$$ plain form
774 -2460 402 440 510 2946 -1185 2261 3346 -4527 -45 1274 -5565 754 2078 -2258 1389 -1489
790 -1489 -2507 1172 -2858 875 3928 -2204 2485 4200 -2827 782 1015 -2264 2246 638 700 1983
806 1983 -4689 -890 1311 -5505 1022 2862 -4195 1722 2432 -2874 506 -228 -79 2821 -13 3379
822 3379 2352 -4107 1620 1231 -4364 2218 1271 -2932 1732 -871 -2133 -39 -3739 298 2426 -2251
838 -2251 3111 1789 -3733 1894 1204 -1795 2850 722 613 2407 -2744 397 14 -5334 1496 1546
854 1546 -3622 2274 45 -3794 797 -1031 -222 2073 -792 3063 1853 -2629 3030 426 -3775
869 -3775 3652 1250 -1996 2266 -1382 -2375 -271 -3227 578 538 -2399 2929 288 -3523 2428 -446
885 -446 -1794 3543 896 1202 2576 -1484 850 34 -3406 2587 446 -2866 2743 -844 -3350 696
901F96k734J114K376k178L323j554l311N091k967k295O684l643j683M335m222
916i68o72J791k906L416n21k352M971l775k179N286l911K42N059l868J355J416
932B384l762K826j229k340N120k895j574M455m686r66L447l420J662J772k319
947a525L243j640k246M607l781m15N850m026N1L425m859Q35J303k625L064j321
963f0j461L724l825n88L832m841J508M300l628K298P39l833L342j498r56M344
979C397l652p2L601m958M34K369m103K331J530k200K969k621j307L947l746J157
995i24M274m529J593L126m731J712M21k579L225j250o88K635m344L66K851m413
1011c255K327K731m162L032O27l107K842j545p94M036k861J155K099n073J937
$$ plain form
901 696 -2038 -924 1452 -726 2597 1043 -2268 2823 -144 -2439 4245 602 -1081 3254 -968
916 -968 -1640 151 -2755 661 140 -2212 2759 -1016 -3195 2091 -1820 -1578 3481 -387 968 2384
932 2384 -1378 1448 219 -2121 2999 104 -1470 2985 -1701 -2667 780 -2640 -978 794 -1525
947 -1525 1718 78 -2168 2439 -1342 -1757 4093 67 118 3543 -1316 -481 822 -1803 1261 -60
963 -60 -1521 2203 -1622 -2210 1622 -3219 -1711 2589 -1039 1259 1998 -1835 1507 9 -947 3397
979 3397 -255 -327 3274 -1684 -1250 1119 -2984 -653 877 -1323 1646 -975 -2282 1665 -2081 -924
995 -924 3350 -1179 414 3540 -1191 521 942 -1637 1588 338 -350 2285 -2059 -1693 1158 -3255
1011 -3255 -928 1803 -2359 673 1300 -1807 1035 -510 -1304 2732 -129 1026 3125 -1948 -11
1026a1J308l513K855J8k411L148k271q09K519l533J665L310l861K591J609m424
1042a810K277K94j824L313j840k67K249m126J569J294m358L090J501l500L288
1057A150q48k258K604j807K59K978k768J651J646m477K795K45l302L453l86j787
1073h52K794k752n78K085l364K275J666l427L269J87l470L180p84j436L395k190
1089bO21J998l785J605M61l499L492K55l091L194j444k076K857k221N33K499k637
1106a240K437M48l280L126o36k403L754j396j419K748k927M2J362k919K397N66
1122F60k750L131o70k671L218j497j052L482k017R99J357l263J978M7l076L596
1138A472n79k244L159k038j296K036k338J046J547k244K113M42k852L034j153
$$ plain form
1026 -11 1297 -2216 639 657 -1754 1394 -877 -1686 833 -2700 -1035 2275 -1586 1005 2614 -1810
1042 -1810 467 761 -1063 2250 410 143 2392 -1734 -165 1129 -3229 -139 1362 -2138 1150
1057 1150 302 -1956 648 -1159 -900 2078 -690 961 2607 -1870 925 1170 -2132 1321 935 -852
1073 -852 1942 -810 -1388 697 -2667 -392 1274 -2153 1116 1303 -2167 1013 229 -1207 2188 -2
1089 -2 619 2617 -1168 437 898 -2601 891 1146 -1945 1249 -195 -2271 586 -1635 -1102 1397 -1240
1106 -1240 1197 1645 -1635 1491 855 -1548 2206 810 -609 2139 -788 -746 616 -2303 94 660
1122 660 -2090 1041 371 -2300 918 -579 -1631 1851 -166 833 2190 -1073 905 952 -2124 1472
1138 1472 893 -1351 1808 -230 -1526 510 -1828 -782 765 -1479 634 1076 -1776 1258 105
1153A05j733L596j285p34K211k998Q03J069k836K405j80k008L197j688k042K939
1169H21k352m4K992k230J377Q60k638K368m42k035L298j605r38K630k738J04J476
1186I04k721J270J228k239K564p80k189K980j653q38L260j986K85J804k421J181
1202F49K16k351K923j010j581L004k295j127K407k367J53K582k464J681N37k205
1218a248K119q97r88K862j828l04K838k914K06J329l011J964N13j983K368j023
1234Cj516K359k160J45K364k171J073J327k157J534k60j735K497r95p03K305k427
1251e17l35J887k716J009J654k450J725L65k023J901j143o57K717j651M85K010
1267B261l035J006J051k662J965K13j730K284j480j148J873k158O48J973k327
$$ plain form
1153 105 -1628 1968 683 -51 2160 -838 -35 1034 -1802 603 423 -1585 1612 -76 -2118 821
1169 821 -1531 -1575 1417 -813 564 1424 -1214 1154 712 -1323 1975 370 -568 2062 -676 -572 904
1186 904 -1817 -547 681 -1558 1006 226 -1963 1017 -636 -1474 1786 -200 85 1889 -532 649
1202 649 865 -1486 1437 427 -1154 1850 -445 -1572 835 -1532 -1379 1203 -1261 420 957 -1248
1218 -1248 871 -26 -1014 1848 20 -284 2554 -360 -154 1175 -1836 128 641 -1342 1026 3
1234 3 -1513 846 -1314 -1169 1195 -976 97 1424 -733 801 541 -1194 1303 308 -395 1910 -517
1251 -517 -852 1035 -1681 -672 982 -1468 257 622 -1401 500 -643 -1300 1417 -234 251 2261
1267 2261 -774 232 1283 -1379 586 799 -931 1353 -127 -1275 598 -1560 -912 1061 -1266
1282a266J397Q35k480K254l14j525K495j411k73K517k840N15J360k879J332J323
1298A040k075J769o24j726K169j446j01J851j933J263J455k597J654M06k319K315
1314A101k69j401K048j572o25J488k170Q99J014j758J545K51k001J937q97q51
1330a261K554j571L18J853k299P27Q16k398J919N4j625J960p76j230J475j570
1346a054K35J517j950J480R90k583J756R8j756K471n84q88J996j576j58J057k340
1363a289J130N18j677J862r6j835K000j407l38J894j255M86J447k367J495M50
1379A018k273K102l96j054J789j021r17J566j941N55J151j933J706J72j635J828
1395G17n95j533K311q17k21J615j315l2Q48j942J187L25j524K267j278j165K050
$$ plain form
1282 -1266 131 966 -1514 740 426 -1099 1396 -15 -288 2229 -611 -96 1264 -1615 -283 1040
1298 1040 -1035 734 110 -1616 553 -893 -994 857 -1076 187 1642 -955 699 1105 -1214 1101
1314 1101 832 -569 1479 -93 -718 770 -1400 -501 513 -1245 300 551 -1450 487 -410 -1261
1330 -1261 1293 -278 40 1893 -406 321 1137 -1261 658 712 -913 1047 271 -959 516 -1054
1346 -1054 -819 698 -1252 228 1218 -1365 391 489 -1267 1204 620 -268 1728 152 -6 1051 -1289
1363 -1289 -159 359 -1318 544 448 -1387 613 -794 -1132 762 -493 -7 1440 -927 568 1018
1379 1018 -1255 847 451 -603 1186 165 -752 814 -1127 -572 579 -1354 352 524 -1111 717
1395 717 122 -1411 900 83 -138 1477 162 130 978 -964 223 548 -976 1291 13 -1152 898
1412H98j902k51K037j708Q88R18j936J486N5j694K100m23p94J799j441j14J081
1429I99k184Q93Q67j696J776l27j729J902j022q02K094j185J48J443j534N46N95
1446G84j556J659o08r02J983j321q92J793k001J80J437j664R89N64j559J270m18
1463b62q81J999q04l0J385j554L1J171j988J409J97j441J648n11j203J325j106
1480f15n99J769j351Q28O70j441J211p4j146J490p38l70J928j584O6J073j956
1497h39N72R84j444R60Q7j363J298n99p58J591j154N44J222j645J086J00j627
1514i85J521m7j327J943q40r00J547j386l38J206j155O08O16j064R29m43q41J542
1532E86p57k46J701j565L27J237k051Q00Q84j917J563j90j182J284q86k47J061
$$ plain form
1412 898 -1004 -1255 782 -926 -38 880 -1056 430 485 -1209 891 468 -326 1473 32 -82 999
1429 999 -1185 -292 575 -1121 655 328 -1401 501 -521 -1323 771 -414 -266 1177 -357 189 784
1446 784 -772 887 279 -623 1360 39 -853 940 -1061 -881 556 -1108 -119 445 -1114 156 -262
1463 -262 -1143 856 52 22 1407 -147 -116 1055 -933 476 673 -768 880 369 -834 491 -615
1480 -615 -1214 555 -796 32 702 -739 472 398 -748 742 4 -366 1562 -22 44 1117 -839
1497 -839 -267 717 -727 233 320 -1043 255 -344 -1102 489 -665 -121 1101 -544 542 642 -985
1514 -985 536 489 -838 1105 265 -635 912 -474 -812 394 -761 -153 463 -601 328 -115 -956 586
1532 586 -171 -417 1284 -281 46 1283 -768 32 916 -1001 562 372 -810 474 -412 -659 402
1549D02j073N44Q25j629J311R2j360J590j08j294J894j049o97J501j201k90R49
1566D07j275R80J9r35R34n65m92J428r16J74J526j637N56J030j869R57M46j293
1584e25J344m58q28J039j078n8R57j363P01P27j588J302J59j326J580o50k27J554
1602A262j197k19J368j744O38M45j164R76j16j082J453j030n83J621j394N68J053
1619H55j589P55O67j706J452J50r35J331m95p36J132j447L84M98j332J248J40
1636C72j459J428k93j077J405o28l49J523r71Q4R38j168L15N19j125J285n21q26
1654e48J347j211j07R28j300O70P99j552J140m9j019J207J4o99J216o58k51P32
1672F59r96M29L51j261J157k4j228J436n71r71J622r10l77J446j103L51M78r80
$$ plain form
1549 402 -671 -127 698 -931 380 472 -888 702 594 -700 1194 145 -552 949 -252 -542 407
1566 407 -868 112 131 -804 130 -435 -927 501 -415 -241 1285 -352 204 1234 -635 322 768 -525
1584 -525 819 361 -467 572 -506 -564 393 -970 -269 458 -1130 172 331 -995 585 -65 -292 1262
1602 1262 65 -154 1214 -530 108 553 -611 365 249 -833 620 -410 -993 628 -766 -198 855
1619 855 -734 21 688 -1018 434 584 -351 980 485 -251 881 -566 -182 316 -1016 232 372
1636 372 -1087 341 48 -1029 376 -252 -601 922 -49 35 973 -195 120 639 -486 799 278 -548
1654 -548 799 -412 -519 409 -891 -221 578 -974 166 117 -902 305 319 -380 836 178 -73 659
1672 659 -337 92 443 -818 339 315 -913 523 -48 -1019 603 -307 -684 762 -341 10 488 -492
1690d92R14k17o05J434q99k83J046j334J7J130j579N10P43j152Q90j9r99J349
1708D54n31m35J107p09K52M61j106Q15J51j069J177k51o84J020q91n24J297j211
1726f77K41R06q40L16M74j167J047m45k35J257n44k08P35j321K77O99j189J016
1744C42J04j089J078m66q97J135n31j51J017p65J13M29r19Q76l5o22J370o66n46
1763b23J177j257k01J202j328M34P27j136N50Ko76R12l86n1R54q49J85Q38j248
1782c74L94O29j086J017j95p99R75p22l54O76o07J75O01p28O13m9r28J106j72
1801A72m80J221r01k01J085j045j22R23j079N09M84j011P70l56q52J280p14qJ101
1820G76j373O68P53j421R70L4q42J115k25o65Q34q07k81P71r38M44M57q05P50
$$ plain form
1690 -492 422 205 -400 1034 135 -148 898 -436 -419 711 -868 -358 385 -767 123 104 -895 454
1708 454 -77 -512 595 -114 138 599 -507 308 459 -610 567 316 -368 652 -239 -763 534 -677
1726 -677 -436 470 -370 -54 420 -747 300 -145 -380 877 333 125 860 -461 -184 515 -674 342
1744 342 446 -643 435 -31 -928 207 -324 -475 542 -223 -110 319 -600 276 241 -381 989 323 -223
1763 -223 954 -303 -504 698 -630 -196 531 -605 -55 -53 -729 183 -203 -254 700 -149 36 874 -374
1782 -374 20 649 -437 580 385 -414 561 -161 -515 161 -446 -271 330 -398 215 166 -762 344 172
1801 172 -308 913 12 -189 896 -149 -271 652 -427 82 566 -445 325 -31 -883 397 -317 -325 776
1820 776 -597 71 824 -597 373 407 -435 680 455 -210 624 -183 -464 307 -631 -187 270 -535 215
1839B15k27q62J142m04l09J239j033J44O80o16j89P57r31O46K6p43P59n27k64
1858d97R25p98J00Q28j388J083K34j297J041j70l83J040m72l93R03j031K18N32
1876D75r06N73J47r85Q45j31o74J017p96r3Q90o67J60N04p86M83J79o03Q63p9
1896D16n45N77m89k56L21n49N71J93j010P70K93j271J218l37l27R57l74l85P89
1915E62p33J96M33p28P65k11n37O91k64r17J011o29j40R15p09N9O02q60M99K83
1935B88q54R11q5l32Q30q66q9P24r48M14L83j020Q54j16q86J076m80l33R59p10
1955b80p4Q45o33K94J91o62P58j34p40J106p06k13R31r70M2O15r33L19L79r33
1975g98Q28k6m33J055o02j61P95q88K77N09q18N40L10j012R54l32o90Q38m57j89
$$ plain form
1839 215 -12 -874 268 -136 -445 794 -239 -95 585 -31 -220 537 -394 252 278 -465 294 -233 -497
1858 -497 428 -370 -270 558 -830 253 487 -810 231 61 -322 718 246 -147 756 -275 -57 475
1876 475 -431 142 289 -696 149 18 -656 361 -435 -528 362 -305 -145 359 -427 56 235 -368 495 416
1896 416 -129 448 -41 -297 24 -525 46 239 -771 -1 292 -979 239 -98 -425 532 158 -227 562
1915 562 -171 25 458 -270 495 284 -253 438 174 -743 268 -361 -501 414 -295 -236 366 -494 5 288
1935 288 -566 345 260 -72 758 -108 -197 527 -421 -7 376 -644 210 94 -792 284 -196 -529 430 -280
1955 -280 -354 491 -142 152 343 -319 439 305 -435 671 -35 -248 683 -287 -245 370 -563 -244 135 -798
1975 -798 30 4 -429 626 24 -137 658 -230 47 556 -262 278 588 -424 530 198 -492 346 -111 -300
1995c00O02n69M2M16n97M41J19n08R23l13m98J115q56j36Q70j166M58K47p25O87
2015B52l1p60O78l56k1N18l92M3M55p16N25L3n94O75O7p08Q90l76o04P19o63J96
2037a70M74o02K70J95o92O14k95n21J307o33l5N01o81K08M85p20M63K52p22L87
2057H5j63m45R33o52KM56m85L84K04q26O70mo19Q24j40r14J160m53j45O86p47
2078a89L22N2l75J85K21n20M05j19l59Q43p86M4R86j042K91N52p24N17K43q68
2098c21Q62m34l35L10m01J01M21q01N45K52q12P88k95l04O68j14l99P64p35K10
2118c0M72p33K95K39p05P04j68l40N60n72j96Q05o91K06N40j053N96M28q04P07
2138B60j15l95P02l49j10L28p13M31K73n69M47j8p26P85l92l15O95l92P8O42o62
$$ plain form
1995 -300 302 -267 -225 191 -406 35 154 -354 569 256 -242 873 17 -119 751 -415 43 290 -435 252
2015 252 221 -539 139 -217 -238 280 -112 -69 386 -330 195 228 -366 309 376 -332 558 182 -422 297 -366 -170
2037 -170 304 -298 -28 167 -525 89 -206 -727 580 -53 -88 413 -268 -60 425 -295 168 420 -302 85
2057 85 -78 -523 410 -242 -240 216 -269 115 319 -507 163 159 -460 364 224 -690 470 17 -128 558 -189
2078 -189 133 185 -190 -5 216 -304 101 -18 -377 466 -320 -276 710 -332 -41 511 -213 304 547 -321
2098 -321 541 107 -228 82 -319 -218 203 -598 -53 199 -613 175 -120 -424 244 130 -269 495 -240 -30
2118 -30 442 -291 4 243 -462 242 74 -266 294 -278 -474 331 -360 -154 386 -667 -71 357 -447 260
2138 260 145 -250 452 103 -7 321 -392 39 312 -257 190 172 -554 231 -161 -476 219 -173 -95 547 -115
2159a15j3K01l70M72R5m57N84l98j81P07q92K29L72o69M38L48j022O48L3m95P60
2180B75l00j56N69n11K15L71o75N92k18m86O04m9o84N85l28m02R61o88O9M93o55
2201d18M04J77m52M84M1m15R63q82p2N80m82p4N86q84N51J84r22Q20l10l29O27
2222A77m29K19N13p12K82N32p60M12km05P00m87k36M11k49k71N64n52L46N0m60
2243c57M93ln34N17q0j65N15p63L31M88n39K13K22p49O69m8p55P06k22k69M18
2264H8l38J50L03n80L54K77p70P04L8l94O31n55j15O08p91J88M75o01K26K55l99
2285b46M80l69l38O05j85k57N43n01J12O23q49N70J94p52O77K2k92K27m22p9L34
2306I7m74K04K22n22M48m3l57M55kl72P97m45j61N77p55J58N29p25N02n3n00O03
$$ plain form
2159 -115 -128 73 -297 175 270 -187 397 -1 -182 525 -367 -138 234 -435 3 351 -671 -23 10 -485 275
2180 275 -25 -181 388 -123 92 463 -212 380 162 -324 280 231 -453 132 -196 -598 363 -325 -256 237 -418
2201 -418 -14 163 -289 195 236 -179 784 -98 -170 410 -72 -146 440 -444 107 291 -631 189 -121 -450 177
2222 177 -252 -33 480 -232 50 582 -178 234 232 -173 527 40 -196 215 -34 -305 259 -293 53 103 -357
2243 -357 136 133 -401 116 36 -129 386 -377 -46 442 -97 116 338 -411 258 210 -545 161 -61 -330 88
2264 88 -250 -100 203 -377 -23 254 -516 188 226 -168 463 -92 -207 401 -390 -202 273 -328 -102 153 -246
2285 -246 234 -135 -473 132 -53 -310 233 -268 -156 467 -382 188 382 -370 307 329 37 264 -158 -237 97
2306 97 -377 -173 49 -473 -25 -68 -425 30 28 -344 453 8 -153 424 -331 -173 356 -369 133 80 -420 183
2328A83j50m17N90m97N1L34m92M87J17m56L24J92o44P43k65p9M77o96N9P66o37
2349a0L1K16n89N07k89k45O04m41j39O38n43k9O17o01M02L3n21P66k93l92P06
2370D28n07O5L89p87J01N72o77M32J50o15O23Q3m66M52k41j56N07m91K46K96n81
2391a77L20O5n14M57o2k92M59n06J04L68n24M55J98n67K21K14m79M63q2l27O53
2412D47n58NL24j70j61L42p28N86P6n51N00k28p5M24l58J20L76p12M33K42m24
2433i0L63n7k85K43m08r7O66m18j02L16n31K81K18n42O65j09l50O29m84L14Q5
2454C07n38L03K15n10L67J27m73L97j98m02N10k20Q0J75m39L99J37m54K78P8l75
2475b36O09l98J07N64p23q7M49n05K79M8n99N53j8l47M41l43P6K79m72J62L57
$$ plain form
2328 183 33 -384 206 -291 -240 94 -398 89 206 -250 74 266 -378 365 100 21 498 -198 -139 627 -10
2349 -10 21 237 -352 155 -134 -379 225 -216 -355 283 -260 -289 328 -273 129 162 -359 407 114 -278 428
2370 428 -79 -14 375 -412 -311 261 -416 16 166 -449 174 257 -209 243 2 -154 353 -138 108 404 -177
2391 -177 143 208 -306 151 89 -203 256 -250 -146 222 -302 153 351 -216 5 219 -260 203 121 -206 447
2412 447 -111 -106 218 48 -113 229 -499 87 163 -388 112 -116 -191 233 -125 -5 371 -341 92 334 -90
2433 -90 273 216 -69 174 -234 -331 335 -83 -185 131 -400 -119 99 -443 222 113 -237 392 -92 222 307
2454 307 -231 72 287 -223 144 271 -202 195 -3 -405 105 -115 -35 140 -299 100 237 -217 61 139 -236
2475 -236 373 -25 82 646 -77 -164 285 -220 59 107 -492 61 43 -304 137 -206 -130 149 -323 -161 196
2496A96m08L24J73p23P20j19m50M91l14o2K12k71L30J4k66J26Ol36M37K7n19Q14
2518D02k33k91M15k78m5L74n80L89%n08O08k68m09N50k9l84N64l51m2K15k24N2
2540g3L47m78O47l44k83M85l89j37M55m30J51J79l09J87nk92M12j76p9L37o9j65
2562b9J18m16L11K48l30L57k07j34M17l72L3J9j09J9K09l66R1P2k57M20L7n16
2584c85O30k71k45M56q4n7K94m12N7L92l73o8K9k57K85k90M1O06p68K98K43l72
2606b51L42L08n37L87m4l38N27l28l04M32l66J10O0k47K37K43p61Q17m77j69M94
2627A35j82j78N54o20L40O3k26M21r8m60N45l17l2K00l30K7J55k52J95n6J5J43
2649D2k8j18J40k41J70M43m32P4K06l03L5L49n03J12O3j36Q1K0k61N23m38Q4J81
$$ plain form
2496 196 -212 112 285 -438 282 163 -287 204 -110 -172 40 -231 99 113 -153 -27 -21 -357 80 107 -412 402
2518 402 169 -122 293 15 -30 344 -236 153 153 -355 253 -15 -424 126 97 -287 277 -74 -116 99 -125 -73
2540 -73 274 -204 443 99 -184 301 -88 -225 230 -200 -49 130 -179 8 3 -289 123 -53 -132 205 136 -29
2562 -29 89 -327 -16 232 -98 259 52 -82 335 -37 -4 15 -94 -75 134 -232 -141 -69 -326 94 131 -385
2584 -385 245 -26 -271 185 101 44 338 -74 -17 375 2 -66 -37 -294 -9 -299 -258 348 -420 -122 121 -251
2606 -251 91 399 -138 249 205 -133 394 66 -238 194 -172 -62 -2 -249 -12 231 -530 287 -190 -359 135
2627 135 -47 -225 329 -291 49 112 -114 307 209 -251 294 -23 -55 145 -185 -158 -3 -255 -60 -116 -101 42
2649 42 14 -104 36 -205 -35 408 -24 50 256 -47 -12 337 -166 -54 9 -127 -46 -26 -287 236 -202 -118 63
2672F3l77K45M66o32J88P5j18K16k21J16L73n72Q8J18l35K48M60o19R5J87l35
2693b71L35J9r0kL5L7m6j05L33j31l94L68n0R5qk47j94O35m33J98k20k39N55j5
2717A65l64K84J06k26L38k76Q8L17n80R9J65k40K04k63o9O20n93K51J89l03P5
2738a3J71l07K82Q2l88K42K29n58P94m86l69N09k63o3K53m53M96j40k74L70j51
2759c7k03N29l89LL33m51J40L16j23r6J23l23L03qj62L94l42o7R0r6j24M43o12
2782c59J83K61k27K16R5m27N45l83J10K09l02M5K52l99K94rk11K71k70j66R2J15
2804f5j05K31o0J31n1j63K26k34r0L69l08qL58j58j45J37k03R3O1n46P22k67k32
2827c07M12k35r4M10k55M3J13l41M06j56m2L4J69j23L14l85j51K40j29L8L5k01
$$ plain form
2672 63 -314 -69 397 -235 -47 28 -90 126 -95 21 394 -178 -90 28 -307 -59 401 -218 -123 64 -271
2693 -271 64 83 -7 -9 26 63 17 -88 245 114 -280 88 38 133 125 -122 -316 319 -114 84 -136 -375 180 165
2717 165 -199 85 191 -35 303 27 115 432 -148 -49 116 -124 80 -183 -252 368 -225 26 215 -88 -13
2738 -13 158 -149 133 215 -173 69 298 -260 534 48 -321 188 -75 -138 115 -338 158 18 -256 114 -37
2759 -37 -240 289 -100 -97 236 -215 -75 241 118 22 145 -178 125 117 -45 349 7 -60 30 -66 -190 253 -359
2782 -359 -176 85 -142 74 169 -258 287 -96 14 223 -79 -34 218 -181 113 104 -107 164 -106 -272 -180 -65
2804 -65 -170 61 1 132 81 -82 144 -90 -180 189 -119 -127 231 73 -72 65 -138 -45 16 -530 192 -75 -307
2827 -307 105 -130 -224 186 -69 -26 87 -254 152 -4 -46 -12 157 34 348 -37 -188 52 -77 -39 -4 -205
2849b05K74n0l37O47q4l05L80m67L2N64n88J01L8k54J37J95l68N60l30j4J26k26
2871a74j19K76m60N84Q1j67K20k5l78K57j50n4K96j50q6K77l29J5L67l89K71k20
2893e7m0K84k13KL72m13j40L02k12J98K30n69M74j92j70L28k28RN7k20R2J22k37
2916b21J87m9r9K65m1l32K73n2k1K94k61j22K37j80K33Q1m72L19j28j72O14k66
2938H7R2J35m81K60P5l58K60O6j54J60Nk37L08j91n7kN3J63k18k3Q5J48j75R9
2962A00j89k8j3K5J05K24m99K67J83m09M65k85j87N88l83nM8k13K05J48k93O3
2984h3J66k38K72j57K4R1Q5l11K82k03K30l5k25P9J5k33K61j37mJ71n4j74K13
3007C5r7p4K50j72qK88k03J84j15k04L36n15J21L62j09j53Q1Qj72J11m1l7J68
$$ plain form
2849 -205 69 19 -318 329 245 -60 320 -147 -115 449 -139 -38 0 -254 -117 78 -290 270 -60 -74 52 -174
2871 -174 -293 -17 -477 107 188 21 241 216 -162 95 -55 -109 187 37 -49 228 -101 -86 281 -108 163 -57
2893 -57 -97 187 -26 -24 348 -65 -205 97 -115 83 313 -256 218 26 -144 184 -44 -35 22 -198 -106 16 -221
2916 -221 -34 -83 -182 83 42 -290 -17 -69 -90 204 -57 -179 58 -122 111 192 -280 39 -89 -261 353 87
2938 87 179 314 -167 93 168 -190 70 136 -18 142 147 -90 218 27 -30 -32 21 184 -34 -57 28 176 1 100
2962 100 -89 -117 -130 -105 0 224 -275 -8 175 -234 231 -54 -241 347 -36 -41 7 -206 -1 147 -146 -83
2984 -83 83 -155 117 -40 -16 75 160 -151 131 -72 158 123 -102 -23 -8 -241 20 -117 -121 50 -4 -178 35
3007 35 -62 -136 114 -58 -66 222 19 203 88 -116 220 -295 -174 188 79 -74 7 15 -157 -46 -87 -124 44
3030D4j81K81l60K01O3j63M31j92k42N94m78j11J64j39j19M62j05k75L82l11n2
3051a06J53j88K55j50k24L94r9k7K12k51J58J24j36j15j02P5K1rL5L57n10j20
3073b53L91m13P6J81q3L24j2k65K27j86j92M10l90J77J72k98K75r7j48J87J27
3094B10l48N2j08K28L7n9P6Q7j99O2l0j54K12j83J1J85q7j85K08j85P4J40j86
3117a42J78j37j58M24j30L4m4j08n2K75k18J29K7p8m5J60k04K96j71j00J82j71
3139e3k12M74l19J26K48l81l3L19j85Q9jk14M07k69k16J83J06j38K50m5J73l26
3161a7k83M43q8R9j63J14j57Q0m5pL62m60L65k51k43K93j29j00L76k56R9O4l55
3184b59r5M58q4J54j67l1l7K33l33J92k6J14K4l95L04J64k73q7K31l00K29k16
$$ plain form
3030 44 -137 144 -216 -15 48 -115 316 124 -118 476 -2 -113 51 -88 -207 255 150 -125 257 -54 -106
3051 -106 47 -141 114 -36 -260 134 35 8 220 -31 127 251 115 0 -102 -27 -6 -15 20 377 -133 -253
3073 -253 138 -275 -199 -18 -101 223 211 -54 173 -13 -205 205 -185 -8 164 -134 141 44 -104 83 210
3094 210 -138 -86 -194 34 71 12 88 175 -24 38 8 -146 66 -117 -106 79 -8 -193 15 -170 -96 44 -142
3117 -142 36 -101 -259 165 35 69 25 -83 -135 140 -78 51 78 0 -45 115 -89 207 36 -64 118 -53
3139 -53 -265 209 -110 16 264 -117 -150 169 -16 73 72 -142 265 -4 -220 -37 69 -69 181 136 309 -17
3161 -17 -300 143 55 154 -9 105 -52 28 -17 -24 338 -122 243 -8 -251 42 -87 -187 189 -67 32 96 -259
3184 -259 -354 104 20 174 7 -24 -61 172 -161 31 5 119 143 -252 52 216 -57 -144 87 -213 16 -200
$$ [...]
8191D
##END NTUPLES=NMR FID
##END=
