##TITLE=1H_18-2023
 CDCl3
 8 sc, 
 10.4.2023
##JCAMPDX= 6.0         $$ Bruker NMR JCAMP-DX V2.0
##DATA TYPE= NMR FID
##DATA CLASS= NTUPLES
##ORIGIN= UXNMR, Bruker Analytische Messtechnik GmbH
##OWNER= root
$$ XWIN-NMR		Version 3.5
$$ Mon Apr 10 14:09:32 2023 Russian Standard Time (UT+4h)  she@DPX200
##.OBSERVE FREQUENCY= 200.13135
##.OBSERVE NUCLEUS= ^1H
##.DELAY= (6, 6)
##.ACQUISITION MODE= SIMULTANEOUS
##.ACQUISITION SCHEME= undefined
##.AVERAGES= 8
##.DIGITISER RES= 18
##SPECTROMETER/DATA SYSTEM= spect
##.PULSE SEQUENCE= zg30
##.SOLVENT NAME= CDCl3
##.SHIFT REFERENCE= (INTERNAL, CDCl3, 0, 15.7039)
##AUDIT TRAIL= $$ (NUMBER, WHEN, WHO, WHERE, WHAT)
$$ ##TITLE= Audit trail, XWIN-NMR		Version 3.5
$$ ##JCAMPDX= 5.01
$$ ##ORIGIN= Bruker BioSpin GmbH
$$ ##OWNER= she
$$ F:/spectra/data/she/nmr/H-F/1/audita.txt
$$ ##AUDIT TRAIL=  $$ (NUMBER, WHEN, WHO, WHERE, WHAT)
(   1,<2023-04-10 14:08:26.09 +0400>,<she>,<DPX200>,
      <created by zg, POWCHK disabled, PULCHK disabled
       configuration hash MD5:
       00 E9 B6 7A A2 85 ED C7 34 08 36 98 17 FE 4E 26
       data hash MD5: 16K
       7B 14 B7 CD 3B 3E 3B 31 07 C0 FC 8C F2 06 FE 2F>)
$$ ##END=
$$ 
$$ hash MD5
$$ C6 00 21 E0 0C C9 4A E5 DE DC E6 71 97 82 AE 6B
##$RELAX= 
##$RELAX= 
##$RELAX= 
##$RELAX= 
##$RELAX= 
##$RELAX= 
$$ Bruker specific parameters
$$ --------------------------
##$DU= <F:/spectra>
##$EXPNO= 1
##$NAME= <H-F>
##$PROCNO= 1
##$TYPE= <nmr>
##$USER= <she>
##$AMP= (0..31)
100 100 100 100 100 100 100 100 100 100 100 100 100 100 100 100 100 100 
100 100 100 100 100 100 100 100 100 100 100 100 100 100 
##$AQSEQ= 0
##$AQ_mod= 1
##$AUNM= <au_zg>
##$AUTOPOS= <>
##$BF1= 200.13
##$BF2= 200.13
##$BF3= 200.13
##$BF4= 200.13
##$BF5= 200.13
##$BF6= 200.13
##$BF7= 200.13
##$BF8= 200.13
##$BYTORDA= 1
##$CFDGTYP= 0
##$CFRGTYP= 5
##$CHEMSTR= <none>
##$CNST= (0..31)
1 1 145 1 1 1 1 1 1 1 1 1 1 1 1 1 1 1 1 1 1 1 1 1 1 1 1 1 1 1 1 1 
##$CPDPRG= <>
##$CPDPRG1= <>
##$CPDPRG2= <>
##$CPDPRG3= <>
##$CPDPRG4= <mlev>
##$CPDPRG5= <mlev>
##$CPDPRG6= <mlev>
##$CPDPRG7= <mlev>
##$CPDPRG8= <mlev>
##$CPDPRGB= <>
##$CPDPRGT= <>
##$D= (0..31)
0 1.2 0 0 0 0 0 0 0 0.06 0 0.03 0 0 0 0 0.0002 0 0 0 0 0 0 0 0 0 0 0 0 
0 0 0 
##$DATE= 1681121305
##$DBL= (0..7)
120 120 120 120 120 120 120 120 
##$DBP= (0..7)
150 150 150 150 150 150 150 150 
##$DBP07= 0
##$DBPNAM0= <>
##$DBPNAM1= <>
##$DBPNAM2= <>
##$DBPNAM3= <>
##$DBPNAM4= <>
##$DBPNAM5= <>
##$DBPNAM6= <>
##$DBPNAM7= <>
##$DBPOAL= (0..7)
0.5 0.5 0.5 0.5 0.5 0.5 0.5 0.5 
##$DBPOFFS= (0..7)
0 0 0 0 0 0 0 0 
##$DE= 6
##$DECBNUC= <off>
##$DECIM= 32
##$DECNUC= <off>
##$DECSTAT= 4
##$DIGMOD= 1
##$DIGTYP= 9
##$DL= (0..7)
0 120 120 120 120 120 120 120 
##$DP= (0..7)
150 150 150 150 150 150 150 150 
##$DP07= 0
##$DPNAME0= <>
##$DPNAME1= <>
##$DPNAME2= <>
##$DPNAME3= <>
##$DPNAME4= <>
##$DPNAME5= <>
##$DPNAME6= <>
##$DPNAME7= <>
##$DPOAL= (0..7)
0.5 0.5 0.5 0.5 0.5 0.5 0.5 0.5 
##$DPOFFS= (0..7)
0 0 0 0 0 0 0 0 
##$DQDMODE= 0
##$DR= 18
##$DS= 0
##$DSLIST= <SSSSSSSSSSSSSSS>
$$ [...]
##$SUBNAM2= <"">
##$SUBNAM3= <"">
##$SUBNAM4= <"">
##$SUBNAM5= <"">
##$SUBNAM6= <"">
##$SUBNAM7= <"">
##$SUBNAM8= <"">
##$SUBNAM9= <"">
##$SW= 18.05172834244
##$SWIBOX= (0..15)
0 0 2 0 0 0 0 0 0 0 0 0 0 0 0 0 
##$SW_h= 3612.71676300578
##$TD= 16384
##$TD0= 1
##$TE= 0
##$TE2= 300
##$TE3= 300
##$TEG= 300
##$TL= (0..7)
0 120 120 120 120 120 120 120 
##$TP= (0..7)
150 150 150 150 150 150 150 150 
##$TP07= 0
##$TPNAME0= <>
##$TPNAME1= <>
##$TPNAME2= <>
##$TPNAME3= <>
##$TPNAME4= <>
##$TPNAME5= <>
##$TPNAME6= <>
##$TPNAME7= <>
##$TPOAL= (0..7)
0.5 0.5 0.5 0.5 0.5 0.5 0.5 0.5 
##$TPOFFS= (0..7)
0 0 0 0 0 0 0 0 
##$TUNHIN= 0
##$TUNHOUT= 0
##$TUNXOUT= 0
##$USERA1= <user>
##$USERA2= <user>
##$USERA3= <user>
##$USERA4= <user>
##$USERA5= <user>
##$V9= 5
##$VALIST= <valist>
##$VCLIST= <CCCCCCCCCCCCCCC>
##$VD= 0
##$VDLIST= <DDDDDDDDDDDDDDD>
##$VPLIST= <PPPPPPPPPPPPPPP>
##$VTLIST= <TTTTTTTTTTTTTTT>
##$WBST= 1024
##$WBSW= 4
##$XGAIN= (0..3)
0 0 0 0 
##$XL= 0
##$YL= 0
##$YMAX_a= 206508
##$YMIN_a= -175784
##$ZGOPTNS= <>
##$ZL1= 120
##$ZL2= 120
##$ZL3= 120
##$ZL4= 120
##$ABSF1= 10
##$ABSF2= 0
##$ABSG= 5
##$ABSL= 3
##$ALPHA= 0
##$AQORDER= 0
##$ASSFAC= 0
##$ASSFACI= 0
##$ASSFACX= 0
##$ASSWID= 0
##$AUNMP= <proc_1d>
##$AZFE= 0.1
##$AZFW= 0.1
##$BCFW= 1
##$BC_mod= 2
##$BYTORDP= 1
##$COROFFS= 0
##$CY= 11.3945322036743
##$DATMOD= 1
##$DC= 2
##$DFILT= <>
##$DTYPP= 0
##$F1P= 2.36226072786647
##$F2P= -0.459571619588291
##$FCOR= 0.5
##$FTSIZE= 0
##$FT_mod= 4
##$GAMMA= 1
##$GB= 0.15
##$INTBC= 1
##$INTSCL= 1
##$ISEN= 128
##$LB= 0.24
##$LEV0= 0
##$LPBIN= 0
##$MAXI= 10000
##$MC2= 0
##$MEAN= 0
##$ME_mod= 0
##$MI= 1.114404
##$NCOEF= 0
##$NC_proc= 0
##$NLEV= 6
##$NOISF1= 3.799351
##$NOISF2= 2.8
##$NSP= 1
##$NTH_PI= 0
##$NZP= 0
##$OFFSET= 15.70392
##$PC= 1
##$PHC0= -19468.96
##$PHC1= 7.8008
##$PH_mod= 1
##$PKNL= yes
##$PPARMOD= 0
##$PSCAL= 0
##$PSIGN= 0
##$REVERSE= no
##$SF= 200.130013532006
##$SI= 16384
##$SIGF1= 3
##$SIGF2= 2
##$SINO= 400
##$SIOLD= 16384
##$SREGLST= <1H.CDCl3>
##$SSB= 0
##$STSI= 0
##$STSR= 0
##$SW_p= 3612.71676300578
##$SYMM= 0
##$S_DEV= 0
##$TDeff= 0
##$TDoff= 0
##$TI= <>
##$TILT= no
##$TM1= 0
##$TM2= 0
##$TOPLEV= 0
##$USERP1= <user>
##$USERP2= <user>
##$USERP3= <user>
##$USERP4= <user>
##$USERP5= <user>
##$WDW= 1
##$XDIM= 8192
##$YMAX_p= 0
##$YMIN_p= 0
$$ End of Bruker specific parameters
$$ ---------------------------------
##NTUPLES= NMR FID
##VAR_NAME=  TIME,          FID/REAL,        FID/IMAG
##SYMBOL=    X,             R,               I
##VAR_TYPE=  INDEPENDENT,   DEPENDENT,       DEPENDENT
##VAR_FORM=  AFFN,          ASDF,            ASDF
##VAR_DIM=   8192,          8192,            8192
##UNITS=     SECONDS,       ARBITRARY UNITS, ARBITRARY UNITS
##FACTOR=    0.0002768,     1,               1
##FIRST=     0,             0,               0
##LAST=      2.2672688,     0,               0
##MIN=       0,             -175784,         0
##MAX=       2.2672688,     206508,          0
$$ Real data points
##PAGE= N=1
##DATA TABLE= (X++(R..R)), XYDATA
$$ [...]
1614A316k75m92q63l06J247P30M48q42j435j89K86Q27R62r06j301k60j73N53Q54
1633A81n45l72p23L87J344J20j10r14m61Q75P36O96P6j173p29k05J004J059po85
1653E54m46q84L88R57k16k89n40n59O79O76K05k52j018m6N38N81R83o20r28l53
1673e90l88J105J021j03p15q08k45O84K45L33l93j071K02M58K45K88r16k41M10
1692d79K80J228k12n66o69n14P08J000M1J53q79o07L10L79M53L9q16m67J45M01
1712g2O59n72m80om90J225O13n2k81j144k79O87N44P55k99j397K4lO81Q36n72
1733C77o56l37k11P32K74n30r6p25N79P79L22K60r37m19M73J41N66O15q56m18
1753f7l09L55P53m9k19m62m67N67M43k70n19p74m4P70L59L70k64j023N0L27Q02
$$ plain form
1614 1316 1041 549 -314 -620 627 1357 1805 963 -472 -661 -375 452 1414 508 -793 -1053 -1226 -673 181
1633 181 -364 -736 -1459 -1072 272 392 282 -632 -1093 -218 518 1214 1290 117 -612 -817 187 1246 1239 554
1653 554 108 -776 -388 569 353 64 -476 -1035 -356 320 525 273 -745 -791 -253 328 1311 691 -237 -590
1673 -590 -978 127 1148 1045 330 -478 -723 -39 206 539 146 -925 -723 -265 -20 268 -648 -889 -479
1692 -479 -199 1029 817 251 -418 -932 -224 776 817 970 91 -516 -206 173 626 665 -151 -618 -473 -72
1712 -72 587 15 -465 -471 -961 264 877 825 544 -600 -879 -192 352 1107 808 -589 -565 -568 113 949 377
1733 377 -279 -616 -827 -95 179 -351 -447 -1172 -593 186 508 768 -169 -588 -115 26 592 1207 351 -67
1753 -67 -376 -21 732 683 464 2 -465 102 545 275 -244 -1018 -1062 -292 67 437 173 -850 -800 -473 329
1774C29O86l30n85o18j10Q89N17j00k29p24J4N23j5J17o83m71J34K03O50L04q30
1795c29j27l84K52J077J22r1o70p44N64N26K86L12o91k63J85J49N35j08o74j57
1815b30l2O08J49n62k74l32l31J135M04l4l67p25l09N67L25P04m34n33n7M3O28
1836C43L15k47l84m56L33N28k14L58o41o51L31O27M93j57n54m80K2J11M58L11
1856D46l63j65l44L36K93M0k51l44j52N83J37P4p0o87j39N81L33K71k55o37p3
1877c86j65P20M69m00m02k92LO58R7M2m18m79L40J66P59J0r91m71j72P03P44K85
1899H20n53o11m56K92N58M85R3l63o43j4M13L30P8n70j08L42L7M93l57n53m4j78
1921e09N73L33R4m79m00j33K80M88J54j2n15p7K1J85L03m26j01K27O9M63j7m99
$$ plain form
1774 329 1015 685 100 -518 -628 261 778 678 449 -275 -261 262 247 364 -319 -790 -656 -453 197 501 -329
1795 -329 -456 -840 -588 489 611 520 -150 -894 -330 196 482 794 103 -160 25 174 709 601 -73 -230
1815 -230 -262 346 495 -67 -341 -673 -1004 131 535 501 134 -591 -900 -333 -8 696 262 -271 -328 -285 343
1836 343 658 411 27 -429 -96 432 218 576 -65 -716 -385 242 735 578 24 -456 -434 -323 135 446
1856 446 83 -82 -426 -90 203 243 -8 -352 -504 79 216 290 220 -467 -606 -25 308 579 324 -313 -386
1877 -386 -551 169 638 238 -164 -456 -453 205 302 344 -74 -553 -213 -47 712 722 -269 -740 -912 -209 535 820
1899 820 267 -344 -800 -508 50 535 628 265 -378 -392 21 351 429 -141 -249 93 130 623 266 -287 -331 -509
1921 -509 64 397 491 12 -388 -521 -241 247 401 389 -126 -203 -182 3 306 -120 -221 6 75 538 521 22
1943B2q4m44N65O14j14m00m36n29M33L28M39P6p21l52N4L04N41J1j51m94l0J44
1965b24M77P8o0m67j12K98K56L26M7j025K02l2M45M11j63n3n73m11O84K23r3j44
1987I0l86j28L32J20O1j34j12K7k49O63J5n38K0J3J95N53j41l44r3j3Q8K68r3
2010B14J23n41k22M15P8L01k97k30k65K9M82M21l95l27k53j83O84L01j57j43l05
2031b70m9K72K04M11k92l69l08N6N73K01m12j03m31J80M04L34j62j26l01k28L57
2052e9K22J17k33k12m3J64J16M9j81J84l86K64J83o6j6l17J7L39J35O9j01m64
2074b19J59L1L18M4j26n72K41j46M81ll65K2k02M3L02K09l0m90m65N86L14J30
2096B62O8k64m60J7J72M65J66l83R0l40k84O59M4p7j60j66M7J91J46p2m54K50
$$ plain form
1943 22 -62 -506 59 673 559 159 -277 -806 -373 -45 394 470 -251 -603 -549 -245 296 307 156 -338 -368 -224
1965 -224 253 331 271 -196 -308 -10 246 572 619 -406 -204 -236 209 620 457 404 -169 -580 104 327 234 90
1987 90 -296 -424 -92 28 89 -45 -157 -130 -379 284 299 -239 -219 -206 -11 542 401 57 -36 -49 39 307 214
2010 214 337 -204 -426 -11 67 368 71 -159 -424 -395 87 508 113 -214 -467 -650 34 335 178 35 -270
2031 -270 -319 -47 157 568 276 -93 -401 -345 228 429 17 -86 -517 -337 67 401 239 113 -188 -416 -59
2052 -59 163 280 47 -165 -208 -44 72 121 -60 124 -262 2 185 119 103 -214 -197 142 277 346 245 -219
2074 -219 -60 -29 289 333 207 -365 -124 -270 211 208 -157 -135 -337 -294 8 217 187 -303 -768 -182 132 262
2096 262 330 66 -394 -377 -205 260 426 43 133 -207 -491 168 212 135 -25 -191 -144 47 193 121 -333 -83
2118h3q0j2L87k71j84J88j55P5M43j14j26m8k07L49j31L65k8n22J54j9J89J26
2140B96k94n5k02M1M79j48l45K5p8N1L08J09p3k97k63L12J98J61Km11K10j92J02
2163f4L43j71ok07j59M63K01j77P4l22l53K65L19j0k4j86j20J83RJ71Nk72j59
2186a97l3L97J9q4m4j73l3J94L2J11m6k26R2j45K56rk0j44j7m9J93L07l08J6k98
2211b09L5J96J99k93p0%K7Q6k5j2l8j25o3J33K26j28j33pJ18J85K06o8J91m33
2235bM7K1Qjn6r9j4J8O1J41Q2k78k30J51K00N3j69J02l49N6M09L7m6Q9l63K67
2261A35j34Q9J02k10l0M7m5K07R5j32n0k61J20l7K28j45j72j48J80K2J64N8k34
2284a51Q7M4j2J24p6J14l04P1M24j18j46R2k38J35k2J60K24j22k89j71j43L66
$$ plain form
2118 -83 -163 -175 212 -59 -243 -55 -210 -135 308 194 68 20 -187 162 31 396 368 -154 0 -19 170 296
2140 296 2 -53 -255 -214 265 117 -228 -203 -281 -230 78 187 114 -183 -446 -134 64 225 227 -184 26 -166 -64
2163 -64 279 108 102 -105 -264 199 400 223 297 -25 -378 -113 206 196 172 -14 -134 49 58 229 234 -38 -197
2186 -197 -230 167 186 102 58 -115 -148 46 78 189 143 -83 9 -136 120 111 91 -53 -70 -119 74 381 73 89 -209
2211 -209 -174 22 221 -72 -142 -142 -115 -29 -54 -66 -104 -229 -292 -159 67 -61 -194 -201 -83 102 308 240 431 -2
2235 -2 45 66 74 73 17 -82 -96 -78 -17 124 206 -72 -302 -151 49 102 -67 35 -314 -258 151 188 142 231 -132 135
2261 135 1 90 192 -18 -48 -1 -46 161 256 124 74 -187 -67 -104 124 -21 -193 -341 -161 -139 25 83 -151
2284 -151 -64 -20 -32 92 16 130 -174 -103 321 203 57 149 -89 46 24 184 408 286 -3 -174 -317 49
2306D9Oj33j16j49J25M20j71J47k30k29J77l6L52j91ql06K25K01L33k23j42j22
2328b1j48K81J8j0r9p9OK2K90L5j38j14j60l4PM9P1j84J72k20M88l9q6j95j3J51
2354E0O7K4k14k20M13j30J1J49k8l8k89J79r9J91r8j62P0j52P3J46N0J53k90L4
2378a10J23K06j9j93q3n1K7l1K06m5P0R8m67L12Lj31K02j87J01k08K11Q9Q9k22
2402a0J41j84Q4K99k35j35j25kJ18J24j7l6p3J4M8O5l7j44ln0k3J73p2O4j5J78
2428A47j49m3J40Rm5k37nJ04J82o8J4Kk00J90P5k08j8L38l04j0J59k67m1J73k41
2453c03K57J41k0J22k10n1J54n3Q1k3j94j7P3O9J67j95Nj82M1J54j9j50J49j72
2477a76J13K69j35L0k4k31J63R1l7J52l3j74oR5j0l1P9k76Q0p2K07N8O0k55j45
$$ plain form
2306 49 55 -78 -194 -343 -218 202 31 178 -52 -281 -104 -140 212 21 13 -293 -68 133 466 243 101 -21
2328 -21 -169 112 130 120 21 -58 -52 -30 260 295 157 43 -117 -151 -144 -95 -24 -208 -36 -256 232 193 107 -88 -101 50
2354 50 117 141 -73 -293 120 -10 1 150 122 84 -205 -26 -125 66 -32 -194 -124 -276 -203 -57 -7 146 -144 -110
2378 -110 13 219 200 7 -76 -127 -100 -131 75 30 100 198 -269 43 46 -85 117 -70 31 -177 34 123 212 -10
2402 -10 131 -53 31 330 95 -40 -165 -167 -49 75 58 22 -51 -37 11 76 39 -105 -108 -158 -181 -8 -80 -16 -31 147
2428 147 -2 -45 95 104 59 -178 -183 -79 103 35 49 51 -149 41 116 -92 -110 228 -76 -86 73 -194 -235 -62 -303
2453 -303 -46 95 75 197 -13 -64 90 37 118 95 -99 -116 -43 26 193 -2 3 -179 -138 16 -3 -153 -4 -176
2477 -176 -63 206 71 101 77 -154 9 100 63 215 182 8 2 97 87 56 135 -141 -61 -133 74 132 192 -63 -208
2502b08J31p9L76l87K65m48K47K82j15O2P1k15L2P1n8q2J00j54R1N4p0j6K5K7
2526BlJ31j68L91j91k46o3J30q2K51m6o7j41K72k12J61m8j61J62J84l45Q9o8R6
2550B8J6k06J92K58O3j87j75q1OP2n0J46m7j24K29o7O2j46p0m8J55j72m2L9j13
2575b62K9j7L62Mjk02J9M0R2p8J14j91O9J45j36J44p6J7K64m14L1l4n8N5R7r7
2601h4k83J86J2K47j68oR7J29k07J36jJ00m08K75JJ82J5m5N0N3n6q9p3j77k19
2626c33K4J72J25r1J0r0K37OJ64j94o2j13M4j8K27L6l4k64M18j63K29l27J49k53
2650a01J6j32J58Q3m2J7l10J18K14J30Nq9k92K29k78L70j32L18j77p0J88P0m2
2673B51j99j84o8K78N2Ml77n6n5K17J91J17Mk09k0N9j99R9J22M0qJ26j79N1J15
$$ plain form
2502 -208 -77 -156 220 -167 98 -350 -103 179 64 126 197 -18 14 85 27 -55 45 -109 -18 36 -34 -50 -25 2
2526 2 -1 130 -38 353 162 -84 -147 -17 -99 152 106 39 -102 170 -42 119 71 -90 72 256 -89 0 -68 28
2550 28 44 -162 30 288 351 164 -11 -92 -86 -14 -64 82 35 -89 140 73 135 -11 -81 -129 26 -146 -188 -149 -262
2575 -262 -233 -250 112 116 115 -87 -68 -28 64 -14 100 -91 -22 123 -13 131 55 72 336 -78 -47 -81 -139 -84 13 -84
2601 -84 -367 -181 -169 78 -90 -96 1 130 -77 59 58 158 -250 25 26 208 223 178 228 281 225 136 63 -114 -333
2626 -333 -309 -137 -12 -103 -93 -183 54 60 224 30 -32 -145 -101 -119 108 144 110 -154 264 101 330 3 152 -101
2650 -101 -85 -217 -59 24 -18 -1 -311 -193 21 151 156 67 -225 4 -274 96 -36 282 105 35 223 293 251
2673 251 52 -132 -200 78 130 134 -243 -299 -354 -137 54 171 175 -34 -54 5 -194 -95 27 67 59 185 6 57 172
2698A72j08o6J14K0m4K3k21j48r5K00K88o6n1p7Q8r4O5O5k2jl09M37N4j03J60
2723B81p8k27K29m5J25j29k20k2j75J82M8k45J26r0J3K6J45N1j05Q2j06n7J59
2746c2L93k82j14J81J94J3ql55Q8j03o4M5n8J45k76R5j00k1K04J6N2J9k9j52K75
2771A26k8N4j8k14M13Q7j16j23j8j11N9J35k23j54K5M3k77J62K07J11l99j6L54
2794G9k10l4J30o5l3J60J78j85L6J85p6l1j9PQ9m11J61k75J55Q5J07j39J31k76
2818b51J65Q4M2N0j87N2k7P7Q5J11j08q6K0J58p5m0R9j56L0n7J00J15j57l09K37
2843b8p3J20k0P8k16k2J93p0K12k96q5L54n3K1J04n3j22k59K33q0Q9R4o3j63J92
2868H7j37J9Qm4J94j82Q0L2J13m4p9Qj1klR7j38L7j16K30R8j63k78K35j92J84
$$ plain form
2698 172 64 -2 112 132 88 111 -110 -258 -353 -153 135 69 18 -59 29 -65 0 65 43 42 -267 170 224 121 281
2723 281 203 -24 205 160 285 156 -64 -86 -261 -79 -31 -276 -150 -240 -227 -201 -56 -5 -110 -28 -134 -191 -32
2746 -32 361 79 -35 146 340 353 345 -10 78 -25 -89 -44 -102 43 -233 -138 -238 -259 -55 -39 13 32 3 -149 126
2771 126 98 152 134 -80 333 420 304 181 163 52 111 246 23 -131 -106 -63 -340 -178 29 140 -259 -275 79
2794 79 -131 -165 -35 -100 -133 27 205 20 56 241 165 134 115 122 211 -200 -39 -314 -159 -74 33 -106 25 -251
2818 -251 -86 -2 40 90 -97 -45 -72 5 90 201 93 7 27 185 110 70 169 13 43 -14 86 201 44 -265 -28
2843 -28 -101 19 -1 77 -139 -161 32 -38 174 -122 -207 147 94 115 219 166 44 -215 18 -62 27 121 58 -105 87
2868 87 -50 -31 -23 -67 127 -55 25 57 170 126 47 55 44 42 39 136 -2 35 -81 149 247 84 -194 41 -151 33
2894C3J58j93j41r8J88O9j5P8n8q8K8J88n3J36j97l1L8Q6q1J33l06P3l6n3K56
2919A14j00J9j3j30R6K8j52K35j59j28K27o5K42o8k43J06J83j25K25k54J19r5
2941F2j31P5p0J25M9q3P1l4j47J1J60k43j53K89j28L89l34Mn7J31N7r7O6k05J02
2966i1L25j48J10m8j49Pj88K37J15j99N7m7j88K52R2l4j56J3j42K04j3R1O0k81
2990a21O8J40k10L66j17l35J91j38K85j13j32J39j51n3L08q0O5k72M5J8K45Q6
3012B34k67j78JJ02L7J51o3J33q9o8Om7P6k5j05Q9o4N3k2J33j21K8j51N3M34j14
3038B16l07j17J62J21k7K2Jj56j8J60P1q9j22j70L41j78K36j54l0j51N9l9L67
3061A98j55o4J73l77k8R4K01P5j45l19L09lk2K30k26j27L3K86O6L4p9k23J15k30
$$ plain form
2894 33 191 -2 -143 -241 -53 16 1 79 21 -67 -39 149 96 232 35 4 42 128 47 180 -126 -53 -89 -142 114
2919 114 14 33 20 -110 -14 14 -138 97 -62 -190 37 -28 214 146 -97 9 192 67 292 38 157 62
2941 62 -69 6 -64 61 110 27 98 64 -83 -72 88 -155 -308 -19 -147 242 -92 -88 -145 -14 43 -54 12 -193 -91
2966 -91 234 86 196 148 -1 6 -182 55 170 -29 28 -19 -207 45 137 103 -53 -40 -182 22 9 100 160 -121
2990 -121 -53 87 -123 243 126 -209 -18 -156 129 16 -116 23 -128 -181 127 47 112 -160 -115 -97 148 234
3012 234 -33 -211 -210 -108 -71 80 17 150 61 -7 -1 -48 28 3 -102 -13 -77 -24 -46 87 -34 -6 -157 -104 330 216
3038 216 -91 -208 -46 75 48 70 71 -85 -103 57 128 39 -83 -253 88 -90 146 -8 -38 -189 -130 -169 198
3061 198 43 -21 152 -225 -253 -159 42 117 -28 -347 -38 -41 -63 167 -59 -186 -153 133 199 233 154 -69 46 -184
3085a84L21n1k15oo1L08j29N1n2j1j33J74Q6J25l9k84K52l06K01R9Q4j08j36M9
3109C5m8k3K06o7k50l2N4R5qO0j86k36L44J2J26O9k76L9j7K14K6K79k86Lj43P9
3135F9K16l0k13p7K45k88K40M4k96j60qJ24Q8J17l0j68J7Q3J68K2o1j11J77m3
3159A25o6R5mj54L7N5l4l4J9j3j52M2J7P5Nj86M9M0n3J43N8l09J67o4J95K82j53
3186A82lj08j02Q9j78K64j12n6m76M58J47L8j33m33K62j69K77O5K6n4j6R8J05
3209A71k00P3k5k68K18J62K9J93l46q2J01qO0l2j70q2J30p4M7j11J42L4p0K76
3233A68r8J07L5j57j98M34l04M15k01j91J34l30J90J22q0k91J53k97J89l2J40
3254i2%j23R8j66L75Q0k24r8l7K14K98J18k91J41m18J03K14M6k98j13J74j03j25
$$ plain form
3085 -184 137 86 -129 -135 -196 112 -17 34 -18 -29 -162 12 98 223 184 -100 152 -154 47 146 230 122 -14 35
3109 35 -13 -36 170 103 -147 -179 -125 -30 -38 22 -164 -400 -56 -44 82 151 -125 -86 -103 111 137 416 130 133 -10 69
3135 69 285 255 42 -35 210 -78 162 206 -90 -250 -258 -134 -46 71 41 -127 -110 -27 141 163 102 -9 168 125
3159 125 59 154 150 -4 33 88 54 20 39 26 -126 -84 -67 8 13 -173 -124 -84 -137 6 64 -245 -78 -142 53 335 182
3186 182 179 71 -31 58 -120 144 32 -24 -500 -42 105 143 10 -423 -161 -330 -53 12 38 -16 -32 66 171
3209 171 -29 44 19 -249 -31 131 160 353 7 -75 26 18 78 46 -124 -206 -76 -150 -103 -214 -72 -38 -108 168
3233 168 70 177 212 55 -143 291 -13 402 201 10 144 -186 4 126 46 -245 -92 -389 -200 -232 -92
3254 -92 -92 -215 -117 -283 92 172 -52 -150 -187 27 325 443 152 293 -125 -22 192 238 -60 -173 1 -102 -227
3277b27O0J57j71j5k10K43K07N5r6K60l77K07J32j66O5j47J82j91J90J3J24m36
3299a41O6R0Pj5ll80K02%q2J27M2M8j50j14K84Q3J83j69j76o7L33M7M8p4k33k0
3325f4r1K91Q8k04j25q7J88K02j28j9k75q3kK10J30Nm3q5J9j3M02l16J80j26j47
3350i3J27K81k02o0j12P1K33k56m9Q3m50K60J39K6O6p8j2j23J61K1l0R1n9j37
3374a02n2J67L40k49j22r0J66j75L28j60j3J72m15K74R8k51n8O8j42O4J87K5J60
3397B20k28j83Q9K10j0L9k40L3J14o9J48k80K62l15K05J74k26J2o7k37K06J10
3419c3o7J53Jj13N2j7J38L03j98q6r2M0J30R7l32P0k29J73J19J93m49J52j68J10
3443e3P8JOj75j75J43J60j7J02P1j52P3J96k76K18j40l09K93J51j48J51j76j94
$$ plain form
3277 -227 -167 -10 -181 -196 -406 -163 44 99 3 263 -114 93 225 59 124 -23 159 -32 158 171 295 -141
3299 -141 -75 15 22 7 4 -376 -174 -174 -256 -129 -87 -39 -189 -303 -19 64 247 78 -98 -165 168 215 263 189 -44 -64
3325 -64 -155 136 224 20 -105 -192 -4 198 70 51 -224 -307 -309 -99 31 36 -7 -92 -73 -86 316 0 180 54 -93
3350 -93 34 315 113 53 -59 12 245 -11 -60 23 -427 -167 -28 -2 64 -14 -26 -149 12 33 3 94 35 -102
3374 -102 -154 13 353 104 -18 -108 58 -117 211 51 38 210 -205 69 167 -84 -142 -74 -216 -152 35 60 220
3397 220 -8 -191 -102 108 98 137 -103 -70 44 -25 123 -157 105 -210 -5 169 -57 -45 -112 -349 -143 -33
3419 -33 -100 53 54 -59 -7 -24 114 417 219 133 41 81 211 308 -24 46 -183 -10 109 302 -147 5 -163 -53
3443 -53 25 26 32 -143 -318 -175 -15 -32 70 141 -11 62 258 -18 200 60 -249 44 195 47 198 22 -172
3466a72J92j84L17J0k27J7l58K28p8J72P7j47j01M4J63J54O8k04N4j1kJ89O7k44
3490B4j9j59L12n6j00J66k37k11L12j55J51k7ok43J88q1K77q3j11M0m4J28P3j80
3514d1K17j88m9K66J12j57n1l07K18k88L09j15N8j30J9q5K77o1L2k27M4K46L2
3537A31l2j34Jj19L33NL79j81k47M3k29R6J77j47j79n6p0J2O3l7O7p1O0q7O8L33
3563A79r3l68L39kj8K31k80N6N4k23L77J09l5l42k55P3J39J6kn8k51J32J40K59
3587A77j35r1j40K7J19L21o3K00k50j87R8K79P2n7m26Jm3Q1j75K08j09o9OJ51
3611eL2L5l80J44l3K37Q4j71J35j89k6L13J62M3k24j11o1o5M0M33n10p3K74l66
3635b82J96K84l03k08K00J37M7j03J52k86J96P9J8LJ39k6p7j84J94j54P2m4j78
$$ plain form
3466 -172 20 -164 153 163 -64 -47 -405 -177 -255 -83 -6 -153 -254 -210 -47 107 175 -29 25 14 12 201 268 24
3490 24 5 -154 158 102 2 168 -69 -280 32 -123 28 1 -5 -248 -60 -141 136 53 -58 -18 -62 66 139 -41
3514 -41 176 -12 -61 205 317 160 109 -198 20 -268 41 -74 -16 -146 -127 -212 65 4 36 -191 -147 99 131
3537 131 99 -35 -34 -153 180 185 564 383 136 179 -50 46 223 76 -103 -159 -229 -217 -154 -191 -124 -195 -135 -222 -154 179
3563 179 86 -282 57 55 37 268 -12 44 98 -125 252 361 326 -16 -271 -198 -59 -43 -45 -103 -354 -222 -82 177
3587 177 42 -49 -189 -162 -43 278 215 415 165 -22 76 355 427 370 -56 -55 -98 -17 -192 16 -93 -162 -156 -5
3611 -5 27 62 -318 -174 -207 30 114 -57 78 -111 -137 176 338 381 157 46 -15 -80 -40 393 -117 -190 84 -282
3635 -282 -86 198 -105 -313 -113 24 71 -32 120 -166 30 109 127 130 269 243 166 -18 176 22 94 50 -128
3658a28r3K35j9n0K2m37K56j08M26J24l62K2j49Q8J70M70j40l04j2LJ15J44Rk88
3682fP5j93P8K8JJ29k19j71L55N6r8l07K99j86J99q8k1L05k46J3K35j36Q7J35
3706C24m37J35k9j0J8r5p8R9R7P4k48j55J62j21lK96q7M9J9k39J16L61J55jm64
3731f2J89J5p7R5p1j07J64k20j39L91j24j22k29j3J07K38R9k9k41J8K15l59K29
3754c3J69J49k91o8PN8P8J25n2j45J11R3j36k12k51K57R1R0k56J42j30m0J66J9
3778e9J73j36k0j2K5J51j1P6M4m04K64L9k9r8j41J9J09r1L47p8j70L9l16K12o6
3803a33K62j03n1k53K66J2K63n7l51K69k89K58J01j03k02jk02L32K29k18Pk10
3825a74J47K4L1M1k41o2K09l7J39n7J71k84J19N5J24m0k62K95m03J80K77k31o1
$$ plain form
3658 -128 -221 14 -5 -55 -33 -470 -214 -322 104 228 -134 -112 -261 -173 -3 467 327 23 11 14 129 273 282 -6
3682 -6 69 -124 -46 -18 -17 112 -107 -278 77 133 35 -272 27 -159 40 -48 -69 236 -10 3 238 102 189 324
3706 324 -113 22 -7 -17 1 -94 -172 -73 24 98 -150 -305 -143 -264 -267 29 -58 -9 10 -229 -113 248 403 402 -62
3731 -62 127 142 65 160 89 -18 146 -74 -213 178 54 -68 -297 -310 -203 35 134 105 -136 -118 97 -262 -33
3754 -33 136 285 -6 -74 -67 -9 69 194 142 -3 108 201 65 -147 -398 -141 -50 40 -216 -74 -204 -244 -78 -59
3778 -59 114 -22 -42 -54 -29 122 111 187 231 -173 91 130 101 3 -138 -119 -10 -101 246 168 -2 37 -279 -67 -133
3803 -133 129 26 -25 -278 -12 0 263 206 -145 124 -165 93 194 91 -111 -112 -314 18 247 29 36 -174
3825 -174 -27 -3 28 69 -172 -234 -25 -62 77 20 191 -93 26 81 205 165 -97 198 -205 -25 252 21 -40
3848d0j94k91N81k43K84k02j59K13Q1j41R7j39J92p5j89L06L6L4j64j35O5M8k5
3871f0M29l33j26mRJ56J39j77j0j43p1J27Q6qJ71k06K9P3oj0l2M1j57O6R0m8l1
3898fK0j22J23J2o0Q4Oj16J80p6l10K60k14J25l2J00K60j30k55L6P5J67K23k96
3922E4R8j78L1j5M4K7k4k43j7M24j0Pk97J40n5k58N93j81k27J79qJ42j41L1J78
3947B94l07j80J68j25J31K3J4J11N7r8M9j03k01J44k53K27J07k15J56N7k71L20
3969A05j5K56k41l6J07O0k95K96j08j99l4K9L46j22k63m5M7L55L1k40r8n2N5j9
3993h0KJ87K9l9n6p7J22K39l14j6p3r0Q9K06k7L2k25K1M4j18K55k44J03k51J24
4018a57j36K77%J7J5j37Q3J80j35J37o1j7k4o5J26m8j38J38l2L6j1o2n7P9J21
$$ plain form
3848 -40 -234 -525 56 -187 97 -105 -264 -51 30 -111 -14 -153 39 -36 -225 81 117 151 -13 -148 -83 -35 -60
3871 -60 369 36 -90 -94 -85 71 210 33 23 -120 -191 -64 22 14 185 -21 8 81 75 65 33 74 -83 -17 73 25 -6
3898 -6 14 -108 15 27 -33 51 57 -59 121 45 -265 -5 -219 -94 -126 -26 234 104 -151 -115 -40 127 350 54
3922 54 152 -26 5 -10 34 61 37 -206 -223 201 191 198 -99 41 -14 -272 321 140 -87 92 84 226 85 116 294
3947 294 -13 -193 -25 -150 -19 4 18 129 186 88 137 34 -167 -23 -276 -49 58 -157 -1 56 -215 105
3969 105 90 346 105 69 176 236 -59 237 129 -70 -104 -75 271 149 -114 -159 -112 243 274 34 -64 -116 -61 -80
3993 -80 -78 109 138 99 43 -34 88 327 13 -3 -76 -166 -77 129 102 134 -91 -70 -26 -144 111 -133 -30 -281 -157
4018 -157 -293 -16 -16 1 16 -121 -38 142 7 144 83 66 42 -23 103 55 -83 55 23 59 48 -14 -71 8 129
4043A29j45K04k63J03j64K5K25j01oK9j26j8K66m0K6k12O3M8q9K39j41o3K05m10
4067b16K42o5O2J0l02J11J93j78K95k23j5k56L32J02j09N2j6k43J10L44r4K61
4089C97l78o7k45K78J38J8k06j83J53P7J24O5k04M3k8N4j02K5J67k18J6K02j59
4112c3O4N3l5L9J7j46J95J0j94k03J51j06K32j31j0Q6p5K26j14rm1Lk9J28R0J6
4138A84l16R8j58j18O01N6k60k64M3r8K32K2q2k66K17j40J00K07O5j19j62Q8J88
4161A18K15j43k97L13l56J84N7j30K58l10R7J31l15J54K76l84J16j27J51p4K6
4182d0LK3K18J0j9j85n6L1l0J82j7R7j74Lk4n9M8J01l2j40J66r8J52j4l13J11
4208e6J39j37J15J8M4q6j95L8K64J4o3j45j78J92k4J16j39K1J87k55J52oR6q4
$$ plain form
4043 129 -16 188 -75 28 -136 -111 114 13 7 36 -90 -108 158 118 144 -68 -5 43 -46 193 52 -11 194 -216
4067 -216 26 -39 23 33 -269 -158 35 -143 152 -71 -86 -342 -10 92 -17 35 19 -224 -114 230 136 397
4089 397 19 -48 -293 -15 123 141 -65 -248 -95 -18 106 171 -33 10 -18 36 -66 -41 126 -92 -76 126 -33
4112 -33 31 84 49 88 105 -41 154 164 -30 -233 -82 -188 44 -87 -97 -11 -86 140 26 17 -24 -21 -50 78 168 184
4138 184 -132 -34 -192 -310 291 347 87 -177 -134 -232 0 22 -60 -326 -109 -249 -149 58 123 4 -158 -70 118
4161 118 333 190 -107 206 -150 34 91 -39 219 -91 6 137 -178 -24 252 -132 -16 -143 8 -66 -40
4182 -40 -37 -14 204 214 195 10 -46 -15 -45 137 120 217 43 46 22 -37 11 112 80 -60 106 8 160 146 -167 -56
4208 -56 83 -54 61 79 123 37 -158 -120 144 158 95 -50 -228 -36 -60 56 -83 -62 125 -130 22 16 112 28
4232B8j33k1q5K35P6oj77l6m2J43J25k95O8J3K1J44K70k13J3M9q0L3m5j3k08n
4258a41K19j22O0L3k11L4J10J93M8l24K04p7q5N8R6O2j97J60l87M22J5R0m15j09
4282b64L08j52J43L4j19J16k78o3M12k59Q5J73k08q1K57j71K39J88m49j87J86
4303i0K41n8j33J92o4k7J80l51n6O2L1J38RL4j96m8j94L77p5K57l21K5K6o5l8
4328a44K72j87j%J13M1j92K12L9k52j99K16K7M95l05m7k44J68k41J34J95j8k80
4351a98K90m4K8o8r7K5o5K11N8j54n0J39k10O8J04j1k21K90l65J15K65R7k7j40
4375D0k13J37K9k8j56J94N0P1mr9q3j3J80j90L54j07n8j91j82K58J96j53K2Q8
4399A42l73K92l0k06K46j49N4r6j72J39J83J44j98p1O8K68p1Q5l14j06n9K73J96
$$ plain form
4232 28 -105 -126 -211 24 100 94 -83 -119 -161 -18 107 -188 -120 -107 -86 58 328 115 128 177 97 130 85 72 -136 -141
4258 -141 78 -44 16 49 -162 -128 -18 175 223 -101 103 26 -59 -1 95 157 -40 120 -267 155 170 260 -155 -264
4282 -264 44 -108 35 69 -50 66 -212 -275 137 -122 -37 136 -72 -153 104 -67 172 360 -89 -276 -90
4303 -90 151 93 -40 152 88 61 241 -110 -166 -104 -73 65 74 108 -88 -136 -330 47 -28 229 -92 -67 -41 -106 -144
4328 -144 128 -59 -60 -60 53 94 -98 114 153 -99 -298 -82 -55 440 135 88 -156 12 -229 -95 100 82 -198
4351 -198 92 48 76 8 -89 -64 -129 82 140 -14 -64 75 -135 -67 37 26 -195 95 -270 -155 110 207 180 40
4375 40 -173 -36 -7 -35 -191 3 53 124 120 21 -62 -75 105 -85 269 162 104 -87 -269 -11 185 32 54 142
4399 142 -231 61 31 -175 71 -78 -24 -120 -292 -153 30 174 -24 -95 -27 241 170 255 -59 -165 -224 49 245
4422B45j97P8l24K89j83J67j35K64j74l1m5J90j08J04k02J19Lm6J01j76k06K91
4444B4j73J46J09n3p1M7J18m29M58j15q3k63L64O9p5N8Ro2l1n6J79j06j50j2L4
4469f4Q2l7J55j33Q0p3%K05k4R5l76L9MK0O7J9q5q6MK56k24J37l2j68q4K67rJ1
4497D6qk52R0j4K71j71J7k58N05l36p2K76l13o7L20Q0rK5n0l1l00K16K08k82K15
4522A06k78J9M7J46Q2j9k33J13J09Qj06Q0r3K5j48K70k13J40m9j05p1L64oj1p9
4547I8k69R6P0O9r0J05n7P5N9n7L6k7m0j44O3O9J1j92kk1K50k57J48J4j18J94
4573H3j46J4J20R9k05K6K1j5j66L11n2j26p4J74k34K26j03j19J74o8J81k09K14
4596A26q0l9j61J03J35K3K3k54N2J30r9P8J3j54l8L6K11k4N0k25N7P1m3j5N4j8
$$ plain form
4422 245 48 126 -198 91 -92 75 -60 204 30 -1 -46 144 36 140 -62 57 60 14 115 -61 -267 24
4444 24 -149 -3 106 53 -18 29 147 -282 176 61 -22 -285 79 148 73 131 140 78 47 -9 170 64 -86 -98 -64
4469 -64 18 -19 136 3 83 10 10 215 191 286 -90 -51 -47 -27 40 59 -26 -112 -108 148 -76 61 29 -139 -223 44 35 46
4497 46 38 -214 -124 -138 133 -38 -21 -279 226 -110 -182 94 -219 -286 34 114 105 130 80 49 -251 -35 173 -109 106
4522 106 -172 -153 -106 40 122 103 -130 -17 92 100 -6 74 -19 6 -142 128 -85 55 6 -99 -170 194 188 177 98
4547 98 -171 -75 -5 64 -26 79 22 97 156 99 135 108 68 -76 -13 56 67 -125 -127 -148 102 -155 -7 7 -111 83
4573 83 -63 -49 71 170 -35 -9 12 -3 -169 142 90 -36 -110 64 -170 56 -47 -166 8 -60 121 -88 126
4596 126 46 7 -154 -51 84 107 130 -124 -72 58 -41 37 50 -104 -142 -106 105 81 131 -94 -37 34 -9 -24 30 12
4622A2j36K37j05o8J80n8n6j11J79p9j4j04K76o9n9J71j82K2N6k65N2J38Q9k85
4646a79P5K97l1J10j08j44q0R8K0k08P0J62j31j06K46r4P5P5j21j46P1L7j37J32
4670a7r8m0R4J67j0M9j88O8m09L62J02O7j04n7L0k7K1L14k85k8J34l96K40J59
4694A48o3j85R4o1K41p2J5j9l02J26q0nL4K73k58M3J10m1R0J28l11QqJ40M1n0
4720C6j04J9J06kk5o6j72N4K81k18J42K0j67J01q3K81l5L4m08Q5j91K07J21n8
4744d2J30r4j15m1J01K84k31q7P8J43j2j33j98M24j59r4J21R8j79O8q5j24K10
4767F3n0L7m2j74K13J4J85q9l71K59J8p1J53q3j18Q7M1j63Q4J17k02l0N7J36k32
4792a61L18l31J45l6J35r7J70k89J85M1r2l0P3L6m0L6n3kp9K52l36J82J7q3J11
$$ plain form
4622 12 -124 113 8 -60 120 62 6 -105 74 -5 -19 -123 153 84 25 196 14 36 92 -173 -121 17 106 -179
4646 -179 -104 193 162 272 164 20 -60 38 58 -150 -80 82 -49 -155 91 -3 72 147 26 -120 -49 -12 -149 -17
4670 -17 -115 -155 -61 106 96 145 -43 25 -384 -22 80 147 43 -14 16 -11 10 324 39 11 145 -251 -11 148
4694 148 85 -100 -6 -67 174 102 117 98 -204 -78 -158 -163 -129 144 -114 -71 39 -2 88 216 -95 -87 -95 45 86 36
4720 36 -68 -49 57 55 30 -36 -208 -154 127 -91 51 71 -96 5 -78 203 168 202 -206 -121 -312 -105 16 -42
4744 -42 88 -6 -121 -162 -61 223 -8 -95 -17 126 114 -19 -217 207 48 -46 75 173 -6 62 -23 -147 63
4767 63 13 50 8 -166 47 61 246 157 -214 45 63 -8 145 62 -56 31 72 -91 -7 110 -92 -122 -65 71 -161
4792 -161 157 -174 -29 -65 70 -27 143 -146 39 80 -12 -42 31 67 27 63 10 8 -71 181 -155 27 44 -39 72
4817G2j08l4J23m3r2L4P8mq0m3J17j89J01o4J38q0K7J88k79J74r4j9L9j1J00J22
4843A73k5j86KOJ02j78nJ1j7J41j34K58n4j39N6r5J48L4l0m3l2L1Q5k2k02Q3J76
4870A44q7o2K8J51k5p8j31m9P4k4r2J20j83K03L9O4j06J28j90L4JK7P3j07l9K98
4896B11j96K91j28k12qj53J23K18j3o1j6q2l2j00J74k2r0K39j78N9M5j71K31j27
4920BK1M3J04k87O3J02j89K15kmrp8J01o0K6K7p3O6o2O7M4o5r5K38k12o8Q0l9
4948d4p4P6N1J77j85m6J43r7j76J95M2o4P7pl58j0M17j36K13j57O5l4k7k5j7l0
4974c1m5J86j52J59o8J39p2l7j27J36k52J41n3j74K21mn2O4O5q0O4l0J56o5l17
4999b28J27K11p7M5M5m4j57J12K40p0k22k9j2L9j5L40l27j51J63J22J0o7J61j92
$$ plain form
4817 72 -36 -70 53 10 -82 -48 30 26 -54 -97 20 -169 -68 -132 6 -74 -47 141 -138 36 -58 -77 -38 -49 51 173
4843 173 148 -38 -36 -30 72 -106 -111 -100 -117 24 -110 148 94 -45 11 -84 64 98 68 25 -7 24 109 87 -115 -32 144
4870 144 57 -5 23 174 149 71 -60 -109 -35 -59 -151 -31 -214 -11 28 92 -14 114 -76 -42 -41 -14 59 -48 -87 211
4896 211 15 306 178 -34 -42 -195 -72 146 133 72 56 -26 -58 -158 16 -6 -96 143 -35 24 69 -102 129 2
4920 2 23 66 170 -117 -54 48 -141 74 72 68 59 -19 82 22 48 75 2 68 6 73 117 52 -43 195 -17 -85 -5 -44
4948 -44 -118 -42 9 186 1 -45 98 1 -175 20 62 -2 75 68 -290 -300 117 -19 194 37 102 68 41 16 -1 -31
4974 -31 -76 110 -42 117 49 188 116 79 -48 88 -164 -23 -76 -250 -29 -33 -85 -21 44 -36 28 -2 154 89 -228
4999 -228 -101 110 33 78 123 79 -78 34 274 204 -18 -47 -59 -20 -35 305 -22 -173 -10 112 122 55 216 24
5023B4j53J47k4P5K3j0K8l39Q4K56o1j7J03k07j32L29j61L5K6M5j36J12J72o1
5047A58k39J24q1K31l0k60j1j9M1KQ2J49j07j17J43j9j32L31k99lqn0Q9m4J20
5072E1k6L7j97L14K5j30N3l26J54P4J6J47m6k05J33l6j37J26K2j39K8J87k28J77
5096G4m7p5j04R0J02j48K57m26J15J13l3R9J15j21k03L37j32r9O5j38J10Q8k05
5119a66J59L26j59j53JMN0J2k43P7M3K30j69k30K5K7L56p9j44J96l8j06j80J95
5143C4l7K09j66p2l5lJ69k7k9J6L0Lq2j71J11J25J8k42J88m2J83k11M6O1K4j78
5169g8L7j6O1j68P3j7j4R1Nj74K64Q1o7j70NjK0J37P5j05Qj3Q0r2n4R7o1O7M7
5198A18ok32l2N1R0J14j15J07O0j65k62J80rJ61J21k48J81k72LK24pJ23l81L35
$$ plain form
5023 24 -129 18 -6 69 92 82 110 -229 -145 111 50 33 136 -71 -203 126 -35 0 26 71 -65 47 219 158
5047 158 -81 43 -38 193 163 -97 -108 -127 -86 -84 -2 147 40 -77 66 47 -85 246 -53 -56 -64 -114 -25 -69 51
5072 51 25 62 -135 179 204 74 127 -199 -45 29 45 192 146 -59 74 38 -99 27 49 -90 -62 125 -103 74
5096 74 27 -48 -152 -62 40 -108 149 -277 -162 -49 -82 17 132 11 -192 145 13 -86 -21 -159 -49 39 -166
5119 -166 -7 319 160 7 8 12 62 74 -169 -92 -49 181 12 -218 -193 -166 190 111 -33 163 125 19 -161 34
5143 34 -3 206 40 -32 -67 -70 99 72 43 59 89 92 10 -161 -50 75 93 -149 39 -3 180 -31 15 76 100 -78
5169 -78 -41 -57 4 -164 -91 -108 -122 -31 -26 -200 64 145 78 -92 -87 -88 -68 69 144 39 47 34 114 22 -32 65 4 71 118
5198 118 112 -120 -152 -101 -11 103 -12 95 155 -10 -272 -92 -101 60 181 -67 114 -158 -155 69 62 185 -196 139
5222A39k78Q0M7j2m9K64l05r0J62J40j23J60l12L74j32k64L71j90Q8j20R9K08
5244B57k71J00l60L07Ln9j51J30p3n7L56k21K38j95o3%L1j11K19p0n9r9O7p7K78
5269A20R8j83p8J78P4k33J25K8k15L3j81K13R7k0J02k46J18l5J4j54K87j45m6
5292d9K4Q0l0N2r7Q6J9L7j77J3l8J23r9M3r6kO8J7Q2k55K19j17p5K36k6n0q9J09
5320HO7k01jJ14J90q1k67K11p9o7M9K53L7l95J73K10k59K0K8N6Q8k71l3O3J30
5345D3j7Q2l15L80k76J30klP2j19Q8K6j42L7J30j63J35o6r1P5q8K42k72J90r1
5370a5J9J39k83R7J38j21Q1R4r4j10J49r8n5j38J35J95o5l3J7k9o5L8J68k89P1
5395e4J66j61K61j40r1j8O4n4J51Jm59M35r8J43r8o4j18J02J20p6k6J4N7j73P
$$ plain form
5222 139 -139 -59 -12 -24 -73 191 -114 -204 -42 98 -25 135 -177 197 65 -199 172 -18 70 -50 49 257
5244 257 -14 86 -274 33 36 -23 -174 -44 -117 -174 182 -39 199 4 -59 -59 -28 -139 80 10 -49 -148 -81 -158 120
5269 120 218 35 -43 135 209 -24 101 129 -86 -53 -234 -21 76 56 158 -88 30 -5 9 -145 142 -3 -49
5292 -49 -25 55 25 77 -20 66 85 122 -55 -42 -80 43 -56 -13 -109 -111 -43 -26 56 -199 20 -97 -172 64 38 -12 -101 8
5320 8 75 -126 -127 -13 177 96 -171 40 -39 -106 -57 196 233 -162 11 221 -38 -18 10 66 154 -117 -150 -87 43
5345 43 26 108 -207 173 -103 27 25 22 94 -25 63 89 -53 -16 114 -49 86 20 -71 4 -84 158 -114 76 -15
5370 -15 4 143 -140 -43 95 -26 55 149 55 -55 94 -4 -59 -197 -62 133 68 35 52 23 -42 -4 164 -125 -54
5395 -54 112 -49 212 72 -19 -37 27 -27 124 125 -334 101 3 146 48 -16 -134 -32 88 12 -14 0 57 -116 -109
5420a09R4nP3j7L9J12k83j40K07o2J11J8R1j06P8Lj01L5q3J00M6j45J00j89j15
5445b48L34p7K0j10n5L08o3k7j79r3K34r8J61rn6j22kK32k54J80o8Q6k6m3r7J91
5471A19j54J78p8n8k21M4N6L7j8K30j76j31K42j43J67R1j49r4K29k65J58o3j12
5494a11o5Q4O7j95K34k12J20L19k68O6k33K54K0kn9J18q4k07L62k70RoJ74M4k16
5519e7j04NK29j45J92j87Qj08J12J84r8l4k13J22J90r4K31j84j82J52j01J03m
5542A7j10P1l0P1k74J28L71j52j07J35p7k0j27P3j50J87q8J8m8R2J44j53K8p3
5566g4J34j13K71j78P4j05q0J06O4n6K6j09J71%n2k75J42M8pJ90k96L00k23J84
5590A42n2j94K04k15K24j02j60L9K82j27J8J36k62R1j6q8M55l31j20m3J0j02K79
$$ plain form
5420 -109 -15 -20 53 36 75 187 -96 -236 -29 -91 20 38 129 23 101 104 3 38 -45 55 101 -44 56 -133 -248
5445 -248 86 9 29 -81 -136 172 109 82 -97 -190 44 -54 107 98 42 -80 -82 150 -104 76 8 94 68 25 -72 119
5471 119 -35 143 65 7 -214 -170 -114 -77 -95 135 -41 -172 70 -73 94 185 36 -58 171 -94 64 1 -111
5494 -111 -176 -92 -25 -220 14 -198 -78 241 -27 39 -194 60 80 78 19 137 53 -154 208 -62 -53 -59 115 159 -57
5519 -57 -161 -156 73 -72 120 -67 -59 -167 -55 129 31 -3 -216 -94 96 2 233 49 -133 19 -82 21 17
5542 17 -93 -22 -52 19 -255 -127 244 92 -15 120 43 23 -104 -31 -181 6 -82 -64 -112 -20 124 -29 -1 -74
5566 -74 60 -53 218 40 114 9 -71 35 99 43 69 -40 131 131 79 -196 -54 -6 -13 177 -119 181 -42 142
5590 142 90 -104 100 -115 109 7 -153 -114 168 41 59 195 -67 24 8 -80 375 44 -76 -119 -109 -211 68
5613F8J27m4l15J59n7j5M7l5J17J36j65J03k70J23l7K8J56j11O4q3J72j66k8M8
5637B2J07k13M6K3K7n7K14o0k99R1j4L03k32J2j61J64L3q5L00k83J61j88J11r5
5661g3O9J63k05L5Q4R5j28lR0p3l2pj09R8L3j35JQ6m4p0J90j45K28m8o1J08K1
5688A68j40j23J79Qn4j04J06j18NJ06q7M7R2J27l30K09j00j19R9jj2P5q9Q9K5
5713E8l0K01j54j90J26J15K8k85J28k1K23k59l8J62N3p3j73J11J03O2r7lj94L6
5737a11K28j62P7j02J28q8k41M21l4k27K67o6j19j76P2Q9o6Q9J19K41l57n2nj64
5761b39J15J64kJ31j52J87j93J7p5k9J19k73J81L7P1j37J04N7m0N6o1J41k36N0
5785gj79L03j22K5K5j34J3J35q6m4R9j53J01l8N4j67L35K8k33R0Mj02K40j65k
$$ plain form
5613 68 195 151 -164 -5 -62 -77 -30 -65 52 188 23 126 -144 -21 -58 -30 126 15 79 -4 168 2 -26 22
5637 22 129 -84 -38 -15 12 -45 169 109 -190 -99 -113 190 -42 -30 -191 -27 6 -79 221 -62 99 -89 22 -73
5661 -73 -4 159 -46 -11 73 168 40 37 127 54 22 15 -94 4 37 -98 -97 -11 -55 -125 65 -80 148 100 39 147 168
5688 168 28 -95 84 92 38 -66 40 -78 -73 33 -54 -7 85 212 -118 91 -9 -128 -29 -30 -42 33 -56 33 58
5713 58 28 229 75 -115 11 126 154 -131 -3 -24 199 -60 -98 64 117 44 -129 -18 85 147 50 47 -147 -111
5737 -111 117 -45 32 -70 58 -30 -271 150 116 -111 156 90 -29 -205 -133 -44 -110 -21 98 339 -18 -70 -75 -239
5761 -239 -124 40 38 169 17 204 11 28 -47 -76 43 -230 -49 -12 59 -78 26 83 43 99 38 179 -57 -7
5785 -7 -186 117 -5 20 45 -89 -76 59 -27 -71 28 -125 -24 -62 -8 -175 160 188 -45 45 49 -53 187 22 20
5810B0K0k40L08j39J46k43J65J11k8q6j18m1K30M6N1k94k3J27j31K77j36J50j03
5833F9j28L5nq9J28o5J88j09p6n0j1J16L5p7J05N8o1k9r0K3M0j17L77l26K1L5
5859cm2p7J45oo0K9n9KJ4j04L11j72o7p5K34n5R2N0j52j69K00M2j41q4O3J35M1
5886I2k06M0K7l6J0k8N9oJ69q9j07J8%J72R8j04q3o5J40jj1j63K7J07M7j47P3
5913C3l7P7n5K31k37PO2Q5q2j68J93o4p5P8j60M1R4j20Q2m3n4K8K62j31K1j19
5939e1j7K07j98o7M3O0P8O7k4m1j40l9J86J18k72o7R0K7k46L44J7m6j20J53k31
5964a69K53j53L27j06q1l1j08Q1J37j66q1l9J61O1q6K69k47J86j67Q6M0or1n5
5988A5k51J68R7l8J9o2pP2K33k12R4j61n2J13MM7nN1k12K2K9J31j7j23k0L8r3
$$ plain form
5810 20 40 -200 108 -31 115 -128 37 148 120 34 -84 -125 105 151 202 -92 -115 12 -119 158 22 172 69
5833 69 -59 -24 -29 -118 10 -55 133 24 -52 -102 -113 3 38 -39 66 124 63 34 -56 -33 7 -110 267 -59 -38 -3
5859 -3 -45 -122 23 17 -43 -14 -73 -71 -57 -161 150 -22 -89 -164 70 15 107 157 5 -164 36 78 -63 -147 -84 51 92
5886 92 -114 -74 -47 -83 -73 -101 -42 -48 121 32 -75 -57 -57 115 213 109 26 -39 101 100 89 -74 -47 60 107 -40 33
5913 33 -4 73 18 249 12 19 81 166 84 -84 109 45 -30 48 -112 -71 23 -97 -15 -58 -112 -84 178 47 68 -51
5939 -51 -68 139 -59 -126 -83 -23 55 122 98 57 -83 -122 64 182 -90 -157 -67 -40 -286 58 75 29 -91 62 -169
5964 -169 84 -69 258 152 71 40 -68 13 150 -16 -97 -136 25 86 0 269 22 208 41 127 167 161 70 15
5988 15 -236 -68 29 -9 10 -52 -59 13 246 34 128 -33 -85 28 32 79 74 125 -87 -65 -36 95 78 -45 -65 -27 -120
6015a20J73j41lJ03l7K5oQ0j46N3J74j56O7J04l68J43K46L9k87JK84lj54k86L46
6040A31j45M8M2o1K02l92J72pK46k26J29k01J32j71K02k4j89J01K13j84P7k4j40
6063f9Q8j51J88q6k4k11J95k6P6j24K36k80J64j43o3M45j39p2K3k6M6l02K78J2
6087C5o3o8k70L07L3L0j7j95Q7K08j07J58k39K83j49o4J57Mr7j92Q6JL9J22k64
6112a75J86P8j30J01j4p5J30j23P6j16J95k45R8m5J22l7q5K15l57K95j48Q5m2
6135a1J79j20j94J11J31j28q5R5l7J42Q2n8Nk72K54j22K03j13j69J98k15n9O4
6158a19p0J89M8o7j46K6J62l4k7m3J76n8L1k7j08J66j58J44N3k92l0K00M6j63
6182a01m5J32nj3R9j70L8J61m2n8o8J24K21j77l05ML38j49j02k1J51J36r6N8m6
$$ plain form
6015 -120 53 -88 -91 12 -25 0 -6 74 -72 -19 155 -1 66 170 -198 -55 191 230 -57 -56 228 225 71 -215 131
6040 131 -14 34 76 15 217 -175 -3 -10 236 10 139 -62 70 -101 101 77 -112 -11 202 18 95 71 -69
6063 -69 19 -132 56 -30 -54 -265 -70 -96 -20 -144 92 -188 -24 -167 -230 215 76 4 27 1 47 -255 23 35
6087 35 -28 -96 -366 -59 -26 4 -13 -208 -121 87 -20 138 -101 182 33 -31 126 130 33 -159 -73 -72 -33 89 -175
6112 -175 11 89 -41 60 46 -29 101 -22 54 -62 133 -112 -14 -59 63 26 -59 156 -201 94 -54 31 -11
6135 -11 168 48 -146 -35 96 -32 -117 -22 -59 83 165 107 112 -160 94 -28 175 62 -107 91 -124 -183 -119
6158 -119 -189 0 48 -19 -165 -139 23 -11 -38 -81 95 37 68 41 -67 99 -59 85 138 -154 -184 16 62 -101
6182 -101 -146 -14 -19 -32 67 -103 -65 96 54 -4 -72 52 273 96 -209 -205 133 -16 -118 -139 12 148 52 110 64
6207F4j85L8j63L26j65j2J01J23l71J63Q9M3N9m3m3j09K52j52p8R2j49L9J2K10
6231A41j68j5J04k48J78q2N7J33k24lJ81k75J54O8O6n8k7l2o5K69m5j95m3J4J64
6256D9k01J63K23j61m36L29N6K9l5l0RL0j06j6MO1JL2n3J36j12n5J71j96O6JJ15
6283G4j44L2j16Q8MJ85j15P0l9K6k3j09QK6j21K10j03o4K44Q6j38R0j83K1L3m5
6309cj41J02nj11L70j81o6j7r0oN0j39K70n0J01n4k5lj11K04L5j43m1j2kK11j27
6336A6K00l16J3J8J14J30j69n1K9qM6L1j18P2L3m2p9p3J80l6o3j6J0MK56j77k75
6363b71L55Q2m6k34K9k1O2Kj3p5R8K06p3k03J35j2k65K84j36n0K29j90K49j06
6387C6M9j18N0L7j0j17Q6n6L95l76q8N5pJ73k70J35P6k5r9rO7J34l4L0n2o8L2
$$ plain form
6207 64 -121 -83 -246 80 -85 -97 4 127 -244 -81 8 51 110 67 24 -85 167 15 -63 29 -120 -81 -69 141
6231 141 -27 -42 62 -186 -8 -90 -33 100 -124 -127 54 -221 -67 1 67 9 -18 -50 -115 154 109 -86 -129 -115 49
6256 49 -152 11 234 73 -363 -34 22 51 16 -14 -5 25 -81 -97 -93 -32 -31 1 -52 84 -28 -83 88 -108 -42 -41 74
6283 74 -70 -38 -154 -66 -62 123 8 78 39 65 42 -67 -59 -33 -154 56 -47 -111 133 219 81 171 -12 9 42 -3
6309 -3 -144 -42 -47 -158 212 31 -35 -52 -142 -148 -98 -237 33 -17 84 30 5 2 -109 95 130 -13 -54 -66 -68 143 16
6336 16 216 -100 -87 -69 45 175 6 -45 -16 -24 22 53 -65 7 40 -2 -81 -154 26 -10 -73 -89 -79 -75 181 4 -271
6363 -271 84 166 120 -114 -85 -106 -44 -42 -55 -130 -32 174 101 -102 33 21 -244 40 -96 -146 83 -107 142 36
6387 36 85 -33 17 54 44 -73 13 -43 352 -24 -112 -57 -64 109 -161 -26 50 25 -74 -83 -16 118 84 114 62 -6 26
6414B6o1K4j61K54l2j42J21J35j08l56L41k92L49j19k5O5m2J25J6l6m16M71k58
6437a21K57k22N9p5J1n7J85P%p1j06J62j47J27Q5j73r5R7LJ42J2q1j44K47o0j75
6463a33J32J10k68K14j81J06Lp4J6K62k75J00n2J3N6ln2J20q8J3j11R1j7J31k26
6488a13K29j64j10J48j5n3J98j77Q0lo4j04l4Q1J83j23lP6L1l06K11K19k49K30
6512A68j73N2K2l2j08o3K67j78J10j19P8j40O8O0j08J14n8o5K2K13L4j24m3K52
6536B49l00J07R0k17J84q8P8j82j4Q0J36j32P0j88J76n0l5L19j93J14k91J79j84
6559i2j0K38o0q8j17k19O02l12Kj6L28k76J2J8M8j98J54J36p6K7j35K28j95L6
6583C5J1J02J61m69O5J12j04Ql7K0m4K51j69k29K00R7K05k88m8J31l4r0J68q1
$$ plain form
6414 26 -35 -11 -172 82 50 -92 29 164 56 -300 41 -251 98 -21 -46 19 -23 102 118 82 -334 137 -121
6437 -121 136 -86 -27 -102 -91 -148 37 44 44 -27 -133 29 -118 9 94 -79 -174 -77 -74 68 80 -1 -145 102 42 -133
6463 -133 -1 109 -159 55 -126 -20 -17 -91 -75 187 -88 12 -40 -27 29 26 -26 94 6 19 -92 -1 -18 113 -113
6488 -113 116 -48 -158 -10 -25 -78 120 -57 23 20 -44 -148 -182 -101 82 -41 -44 32 63 -243 -32 187 -62 168
6512 168 -5 47 69 37 -71 -134 133 -45 65 -54 24 -116 -48 12 -96 18 -40 -105 -83 130 164 40 -3 249
6536 249 -51 56 146 -71 113 25 103 -79 -93 -13 123 -9 61 -127 49 -1 -36 283 90 204 -87 92 -92
6559 -92 -102 136 76 -12 -129 -348 254 -58 -56 -72 256 -20 -8 10 58 -140 14 150 74 101 -34 194 -1 35
6583 35 46 148 309 -160 -95 17 -87 -79 -116 -96 -140 111 -58 -287 -87 10 215 -73 -121 10 -24 -114 54 -27
6607b7L4P9J3r5L7k31J59oN1j39j6j35J50O9qj3L74l71J6J14J48l03J3J18j10
6632g9K64j42J0K04j7k73J9J07j1p7o0K0j72N15l02j11J19P3L3j46J06Nm1j03
6656e9j30M8J02j58k44N65j78l0m2M0J77j17j73J89J00k15R1J50j76P2J70r7k46
6679a61K47j54m2N6P9Oj76L55j58n2j3J18j63K09j20l7J77j11j71k0J37m0Q3J93
6703B42k54j77K97k9ok30J47K9J16o8j45K29k50J26L4l4l8q5J52j25O1n9J29m7
6727A5P0o0o6N7j74J71K4k01J35R5j98R1l7J23P8j49O3K20l11O0k07L11p1P3M
6752A16j56N4p3o3Q5j55K16r1j00K15j23o8K9L26m86L36j41O8j2j64K43j12o1
6775a17J45O0j7j58R1l3p4rK34j86J17J32k93K57o2j08l3j1Q8j57K4J39mj5L5
$$ plain form
6607 -27 7 86 99 4 41 -190 -31 -37 14 -125 -141 -276 -126 -57 -65 -78 296 -75 -59 55 203 -100 -87 31 -79
6632 -79 185 43 53 257 240 -33 -14 93 82 5 -55 -35 -207 308 6 -105 14 87 120 -26 80 85 44 -59
6656 -59 -189 -141 -39 -197 -441 124 -54 -84 -126 -86 91 -26 -199 -10 90 -125 -34 116 -60 12 182 85 -161
6679 -161 86 -68 -110 -54 25 31 -145 210 52 0 -13 105 -58 151 31 -6 171 60 -111 -131 6 -34 49 242
6703 242 -12 -189 108 79 73 -157 -10 19 135 67 -78 151 -99 27 61 27 -11 -96 56 -69 -8 -67 62 15
6727 15 85 25 -41 16 -158 13 37 -164 -29 66 -132 -41 -78 45 123 -26 37 257 -54 6 -201 110 39 112 116
6752 116 -40 14 -59 -122 -37 -192 24 -67 -167 48 -75 -143 -114 212 -274 62 -79 -11 -23 -187 56 -56 -117
6775 -117 28 88 71 -87 4 -29 -103 -112 122 -64 53 185 -108 149 87 -21 -54 -65 23 -134 -110 29 25 10 45
6800D5j69J14N1Mo8Q7j39J88n1k39J64q3j06K47J28k77O0q7J92M2j21n2J87j77
6824f0RlJ09j18q9R6j62OK73j03L6p2J84k34P7o4K74q8j12R5m8j88K32K8k11K66
6850A33j23Nnp4J00KMJ05k03P0O5j54K43k79Q8J25k00K29p3r7l6L0J07K1j3o0
6876A0l2jp9J97j49j87L07L5R5j78P2j91j1Lp5K10m1j06Q0k2N6j09P4J00J58k72
6902e6n6J20j48M15j20r1j54J17n8K27l68K00j08n2o9K5K92l4j6J46k62j81M37
6925B06j87m0n7J02o4pnJ51J78k11j84K07P1k20q5J47J39j85J01o3q9l2J38J25
6949A36k31J40k6L2j19o9K41j42Qj23l0J81P9j41O8J59j05k10K51k73J83m1Qj1
6973c5J68j75j11M83k59m2m0J22k30J67o7j76J97l0J13mM5j90K5Q5j92J5J19J0
$$ plain form
6800 45 -124 -10 41 45 -23 64 -75 113 62 -177 -13 -96 -202 45 173 -104 -44 -131 61 103 -18 -70 117 -60
6824 -60 -51 -54 55 -63 -152 -56 -218 -212 61 -42 -6 -78 106 -128 -51 -115 159 71 -41 54 6 -182 50 78 -133 133
6850 133 10 15 10 -64 36 38 42 147 -56 14 79 -75 168 -111 -23 102 -98 131 58 -39 -75 -45 62 83 70 10
6876 10 -22 -23 -102 95 -54 -241 66 101 196 18 90 -101 -112 -109 -184 26 -15 -121 -41 -63 -7 -116 -42 58 216 -56
6902 -56 -112 8 -140 275 155 64 -90 27 -31 196 -172 28 -80 -132 -201 -176 116 82 66 212 -50 -231 206
6925 206 19 -21 -78 24 -40 -47 -52 99 277 66 -118 89 160 -60 -145 2 141 -44 57 -6 -95 -127 11 136
6949 136 -95 45 19 51 -68 -137 104 -38 -30 -153 -183 -2 77 -64 4 163 58 -152 99 -174 9 -32 -24 -35
6973 -35 133 -42 -153 330 71 29 -11 111 -119 48 -19 -195 2 -28 85 81 126 -64 -39 46 -146 -131 -12 -2
6997bL6L4j70l3R1LR8j03J04P6j23J28Pj43k5j25L42l29J19L5KJ15k31j34J36
7022i2o5K1J35K7j86N7Q4J05Qk12K0K06k40O9J15k92L71q6j85K17L2k22J15k8
7046b6P9P9l27R8J0K8K55k94J3k9K34l4j75Q3q2J10j15K15j23r7K18j58J02j58
7070i4R5J4j77K91l28K22q0J19Jp3j1j7J20j41l4J8N5QJ57l47K12L9J52k35J29
7095I5p6r7J06O2q6L2L9j83M5K7l8k01L02Ok1K9p6JK24k46o1o0K38J57l08J70
7121H0j72R2K4O0j37K24j03J29l85J97j1Kq5pL05j81M7m6Q2j9j88P6Q5Q3j55Q2
7147G9J4j90K07l27K16n7J57N8k40J09qK43l14P0K72k23j80J22J00j39p0J95j21
7170b7jK21k95J7J14j24P6O8n3j85K94r2p4Q6j68J71n4L1O3k9J2j29j3R4p2k0
$$ plain form
6997 -2 34 68 -102 -135 -44 -41 57 -46 58 134 11 139 146 3 -22 -147 195 -134 -15 20 22 137 -94 -228 -92
7022 -92 -157 -136 -1 26 -160 -103 -19 86 94 -118 -98 108 -132 -63 52 -240 131 45 -140 77 109 -113 2 -26
7046 -26 53 132 -195 -97 -87 -59 196 -98 -85 -114 120 86 -89 -6 -88 22 -93 122 -1 -98 120 -38 64 -94
7070 -94 1 15 -162 129 -199 23 -57 62 63 -10 -21 -38 82 -59 -93 -75 -20 -12 145 -202 10 49 201 -34 95
7095 95 19 -78 28 90 4 36 75 -108 -63 -36 -74 -275 27 33 12 41 -35 -34 190 -56 -117 -177 61 218 -90 80
7121 80 -92 0 24 84 -53 171 68 197 -188 9 -2 0 -85 -92 213 32 79 33 115 96 -92 -16 69 152 -3 79
7147 79 93 -97 110 -217 -1 -58 99 157 -83 26 18 261 -53 17 289 66 -114 8 108 -31 -101 94 -27
7170 -27 -28 193 -102 -85 29 -95 -19 49 -4 -189 105 13 -61 25 -143 28 -26 5 68 39 51 -78 -91 3 -69 -89
7196h9j25K13P8j91J45j11q2K45k27N1J13j91J76Loq0j4L2J57j03m6L60k28l9
7220D1R6k25P1j48R0j8M4j41J88N4k9j9N1p3j0J21j12J25q3m4j2o5J86K9k65J28
7246b0j81M00k51P8o3J22j37J17J59j95k02J98o0J04k8j86K11P3j59J04k13L06
7268A77p9k22J79J83j89J5L6j31O5r7K08o7o3m8P2jn1K8l09L22k59L18k48Q8L22
7293B49j46k1k7J60j92n2j3o9J93m9L8M0j46K49j88OQ3j51J29k5J1q2L2M3q9O6
7319D9j53P0N6M0n5j13K32j43P1k84J14J33N3m6m3n1P4q5J47j7q2Q1j12M2q9J53
7345D2j43J41Q4k76K45j34K13j66k8m5MM4K4J90r7j33n6J88Q7j33J6j33K64j87
7369A1N9j07LJ09k55K59J0J56k28M2K5j60P1j00J19K8j9j63J63N9Q8j89L5N5j00
$$ plain form
7196 -89 -214 -1 77 -114 31 -80 -162 83 -144 -93 20 -171 5 8 2 -78 -92 -60 97 -6 -52 308 80 41
7220 41 137 -88 -17 -165 -75 -93 -49 -190 -2 52 23 4 55 -18 -28 93 -19 106 23 -21 -33 -98 88 117 -148 -20
7246 -20 -201 199 -52 26 -37 85 -52 65 224 29 -173 25 -35 69 41 -145 66 139 -20 84 -129 177
7268 177 98 -124 55 238 49 64 100 -31 34 -63 145 78 15 -33 39 38 -13 15 -294 28 -231 87 -161 -73 249
7293 249 103 82 55 215 23 -29 -42 -111 82 33 71 111 -35 214 26 32 115 -36 93 68 79 -3 29 72 -17 49
7319 49 -104 -34 22 62 7 -106 126 -17 54 -230 -116 17 70 24 -19 -70 4 -81 66 49 -33 48 -64 -22 -111 42
7345 42 -101 40 124 -152 93 -41 172 6 -22 -67 -63 -19 5 195 98 -35 -91 97 184 51 67 -66 198 11
7369 11 70 -37 -34 75 -180 79 89 245 17 59 84 -76 -5 -105 14 42 23 -140 23 82 170 -19 16 71 -29
7394b9K85k53J53j06ql19M52j34j1j61L2J70j61j4K79k31J83j4p6J03l69M3K31
7417D5o8OJ1L4P8k50K86p0k64N0J19j67P1J05J52k19J70j70O5n3J39o3nJ59j65
7442dq1pL1n5M9p2L4K88j47P4p0p1l3Q1j39R0J84k54J48NR7j83J10j9o9P9K5j47
7470e6M9q5Q0J24j65P2M2N8j19m8K87l18R9J9j0K8Qj59K58n8k61O7L1j19K72j10
7496a4j0p1J45l21L40r0k9m9R4l7J36o0j61J07j53K65j52N0KL5M7n4j22O7L2j69
7522a72R8n4K21k53Q0q0K34k27J47L1K6K7J07k60O5J8O5j1J32p2q4J2n5o9J01
7547B7j49R6J38k11K35m2k7m4Nj87K99Pk63J39M8j36J19J4Q9J9k84J01J13j67
7571f1K37k3k31q9mJ29J39P1j2l70J91J29N9l69J45J30j62J65j94K47k30M3J1
$$ plain form
7394 -29 256 3 156 50 42 -277 175 41 30 -131 -99 71 -90 -104 175 -56 127 113 37 140 -229 -186 45
7417 45 -23 -17 -6 28 106 -144 142 72 -192 -142 -23 -190 -119 -14 138 -81 89 -81 -16 -69 70 7 2 161 -4
7442 -4 -85 -92 -61 -116 -67 -139 -105 183 36 110 40 -31 -64 17 -122 -32 152 -102 46 51 148 -35 75 56 -13 66 91 -56
7470 -56 -7 -92 -12 112 -53 19 61 119 0 -48 239 -79 20 39 29 57 65 -94 164 106 -155 -88 -57 -176 96 -14
7496 -14 -24 -95 50 -271 69 -21 -50 -99 -5 -42 94 34 -127 -20 -173 92 -60 -10 -8 27 74 20 -102 -35 -3 -172
7522 -172 -74 -128 93 -160 -80 -160 74 -153 -6 25 51 78 185 -75 -10 8 73 62 194 122 38 50 -5 -74 27
7547 27 -122 -26 112 -99 136 94 67 23 28 -159 140 147 -116 23 71 -65 54 68 157 176 -108 -7 106 -61
7571 -61 176 153 -78 -167 -171 -42 97 168 156 -214 -23 106 165 -204 -59 71 -91 74 -120 127 -103 -60 -49
7594d9P2j96K26P3k08Q5Q3p3j42K3P2j11O8J56o2j16m2POJ28n8K35j8j50J91l6
7620A64l06J55j0j6O4r2J6J08k77K31j46K4J9O7j74J42J72j89Q1j94K87j80K38
7643A84l86K47j30J16l2K4Mj63J35m1j64J12O5Jk53J57K94j34r2M1N5m0J52p5
7667G7n3J08j0k34K43k25M37k43j12N8m9R7M7k36J46o5J1j85J8n9L11o6j44J15
7691a3l9J99j29o2J25m4q7J25k09Q6JM1J24n0q6j2K10j47j9q6J75j71lJ41j35
7716f5O8P2K0lk38K04r5K86m15J69L8r6j0K30j82M9l5J07k08r2L93j35Mq3M1m9
7742b5M7n7K15l63K53J96k77J46k61J93J13p3o2l9J21J1k63K12k07l6j1J05N8
7765dM7O1k16J80k08J14Jj0Mmk2K7j27L39n1j58QJ1pnnN1n0K3j08K83j94Q4l2
$$ plain form
7594 -49 23 -173 53 126 -82 3 86 13 -129 -106 -34 -145 -77 79 17 -99 -141 -134 -128 0 -58 177 159 9 200 164
7620 164 -142 13 3 -13 51 -41 -25 83 -194 37 -109 -85 -66 1 -173 -31 141 -48 33 -161 126 -54 184
7643 184 -202 45 -85 31 -1 23 27 -136 -1 -42 -206 -94 -29 -28 -281 -124 170 36 -56 -15 40 0 152 77
7667 77 24 132 122 -112 131 -94 343 100 -12 46 -3 94 141 -95 51 -14 -3 -188 -170 -229 82 16 -128 -13
7691 -13 -52 147 18 -44 81 37 -50 75 -134 -48 -47 -6 118 68 -18 -30 180 33 14 -72 103 -68 -71 70 -65
7716 -65 3 75 95 92 -146 58 -37 249 -166 3 41 -55 -65 165 -17 32 -3 104 -104 -196 197 62 66 -17 24 -25
7742 -25 22 -35 180 -183 70 266 -11 135 -126 67 180 107 45 6 127 138 -125 87 -120 -156 -167 -62 -4
7765 -4 43 104 -112 68 -140 -26 -25 -35 -31 -35 -57 -30 -157 182 131 -27 -19 -8 -15 -20 -25 26 -24 -1 -109 174 -20 64 32
7794C2l22K94k5kj91K00r0J55j53Mr5K2J26J07j11J8Q0M3j69M4NJ5K5n9m8l5N1
7821g9j0J62k24K68O3k40J34l1m2r6J48r9o3Q4J07j85J87O5k78L23k39Q0n0k6
7845d1l1J06O1q4l5j4L4Jl9J13j39K20j52j06J06L3l7k2J24p8%L7l19L9M0K34
7871E1j21j5K40j07j22K8O7n1Mj28K17k60J98j4R3k33l3L2J17J49l4k9n1J10l8
7896G0M1j40j52K10n8j87L72j47l1J43N9Mp6p7k3j35K07j86J21p0j2L04k87N8
7920Hj06J15J34j90J43o9k56K62o6r9N2J08R3%r9j75J44j65J32K4J66j16m6j54
7944a60K11O7j70KL7R6m5j44K24l17L29kj21p1L5j39J37o1K98m45J80R4j6j4k05
7969b00L72j31k4q3M8Mj73L46j56K0q1n1K54j38K53k35P8k78J07N4J34j57JlL4
$$ plain form
7794 32 -290 4 -21 -23 -214 -14 -104 51 -102 -98 -193 -171 -45 62 -49 -31 49 92 -77 -33 -28 -13 12 -47 -95 -130 -79
7821 -79 -89 73 -151 117 180 -60 74 43 1 -95 53 -46 -109 -25 82 -103 84 149 -129 194 -45 35 -15 -41
7845 -41 -72 34 95 11 -24 -38 -4 -3 -42 71 -68 152 0 -106 0 33 -4 -26 98 20 20 57 -262 -223 -183 51
7871 51 -70 -85 155 48 -74 -46 21 -30 -26 -154 63 -197 1 -13 80 -153 -186 -154 -37 112 78 49 -2 108 70
7896 70 111 -29 -181 29 -29 -216 156 9 -22 121 180 184 108 31 8 -127 80 -106 15 -55 -67 237 -50 8
7920 8 -98 17 151 -39 104 35 -221 41 -25 -124 -72 36 129 129 30 -145 -1 -166 -34 -10 156 40 -6 -160
7944 -160 51 118 -52 -50 -13 83 38 -106 118 -199 130 128 7 -64 -29 -168 -31 -92 206 -239 -59 35 19 5 -200
7969 -200 172 41 17 -66 -18 -14 -187 159 3 23 -58 -109 145 7 260 25 103 -175 -68 -14 120 -37 -36 -39 -5
7994epq1J77m5q2J22p6J50o4r9r7K78j26n6q6M6j20j6K55K1j93M1j93L57O2K3
8020A86j77J04k07j39L88j73J81l32L40n7j77n6k4L07n0p0N5L1j42j42L1K43r6
8043B4j9Q7l04J68J10j27p2J02j21K29M7k66O4l6Q2K11j35J20r2N5k67J15r2J61
8067D4n5R4O7j61J47k00J16j16Pj71K61k12O5L35l47K60k05Q9J27k16J17O4j19
8090iJ9M1j13J83l9r4q8J32k9LJ20pk01p3R1Q3R2k53K23j19Q0m7mJ2n3q9L00r9
8118F2R6k04k57K18J29m4O2q3j54J56QJ64j11j12M7J54j40j13P1K0J93j67M6j80
8142a39O9j2Q1Q3m8ok12R0l6J6J90K6j8jM0rj14K6J46j86N3M7q4J74l43L79j01
8169A11k2j93R0M5j56L7R3q6R2Q6o4m2N4k8Jk60K12K2j9Q3J19k27
$$ plain form
7994 -5 -12 -93 84 39 -43 79 3 153 89 -10 -107 171 45 -11 -97 -51 -171 -187 68 89 -104 -63 -256 101 163 186
8020 186 9 113 -94 -233 155 -18 163 -169 171 114 -63 -119 -143 164 114 44 99 130 -12 -154 -123 120 24
8043 24 5 92 -212 -44 66 -61 -133 -31 -152 77 124 -142 -78 -114 -32 179 44 164 72 127 -140 -25 -117 44
8067 44 -11 83 150 -11 136 -64 52 -64 -57 -228 33 -179 -114 221 -126 134 -71 18 145 -71 46 110 -9
8090 -9 10 51 -62 121 82 -12 -100 32 3 6 126 119 -82 -155 -64 19 111 -142 81 -38 42 -5 -9 3 -50 -139 161 62
8118 62 158 -46 -303 -85 44 0 62 -21 -175 -19 -11 153 42 -70 -23 131 -9 -122 -51 -31 162 -5 41 -139
8142 -139 -70 -82 -1 82 34 28 -184 -94 -130 -114 76 102 84 83 123 114 0 26 172 -14 39 86 2 176 -167 212 111
8169 111 89 -104 -14 31 -125 -88 5 -81 11 97 33 -9 45 17 18 -242 -30 -8 -27 56 175 -52
8191e2
$$ Imaginary data points
##PAGE= N=2
##DATA TABLE= (X++(I..I)), XYDATA
0@%%%%%%%%%%%%%%%qJ6j6J6j6K2l0L2l8M6m9N7p0P8q8J04j20J36j52J69j92K18
37A15k43K72l04L37l76M18m62N11n63O21o86P57q34R19j013J117j232J361j507
56g92J673j862K081k342K653l032L510m132M977o198Q134j1668K0212p9440j09558
71a75784J08440J19623J29753K4476r1417j10385m3548M4428R0245L8716j181
82A33366p0802p7094j592J4173J5200K3251l3626l5172j7497j8437k012j2257
94h2499l591K6400K6383N8789M0228j9793j8062k6079j3364L9805K9616P701j7505
107D8029m0169j7938j4025P77K0928j0036P155J9647k7082l4617m8786n0228J9614
120a26731P1277Q5581M4380l7451o2587m9548K1078J10305Q3769J7828m6868j08821
$$ plain form
0 0 0 0 0 0 0 0 0 0 0 0 0 0 0 0 0 -8 8 -8 8 -8 14 -16 16 -22 24 -25 32 -38 40 -48 56 -64 72 -80 89 -103 115
37 115 -128 144 -160 177 -199 219 -243 268 -295 326 -360 397 -437 482 -531 586 -646 715 -792
56 -792 881 -981 1100 -1242 1411 -1621 1889 -2243 2734 -3464 4670 -6998 13214 -66226 -175784
71 -175784 -67344 52279 182032 206508 115091 4706 -38842 5586 95831 134547 133366
82 133366 62564 -14530 -16122 -1949 13251 36502 2876 -32296 -49793 -68230 -70242 -82499
94 -82499 -86090 -59690 -33307 25482 65710 45917 27855 1776 -11588 28217 57833 65534 48029
107 48029 7860 -10078 -24103 -23326 -2398 -12434 -5279 14368 -12714 -47331 -96117 -146345 -126731
120 -126731 -55454 30127 74507 37056 -25531 -75079 -54001 56304 140073 157901 111033 2212
132B212n9136K6147O4022O9896P245n0237n7982m2930J1862K2542r182j1016k9281
145e5838j4887K9714J5216K80j2932k2224K0367M5809M7947K4230m2267n4423
157a9008k8596J86N7048N2462M070k1085m7456l1100N281J4479K3857K000j7062
170d924p925k4551j4923M584j65L1905M4109J9381M056l0891l6525k583K1693
183C241M7213K5510k2317l3007l8170m493M0974K4663L747k4643m7442j4463Q525
196c0662J5909R641k6792k4946j328J6565M4597J9532j9202k3331k2358J5187
208b7188M4940K4407Q51l3083l7296M662K5688L7929K0229k8470l2209k0500j056
221b1096K8883J1531j1992j8821k4632N445K1189J2493J0472j3041j1836Q712
$$ plain form
132 2212 -56924 -30777 33245 103141 110386 60149 2167 -40763 -28901 -6359 -15541 -26557 -55838
145 -55838 -70725 -41011 -25795 -25515 -38447 -60671 -40304 5505 53452 77682 35415 -19008
157 -19008 -47604 -47418 9630 62092 66162 45077 -2379 -33479 -28198 -13719 10138 12138 -4924
170 -4924 -12849 -37400 -52323 -47739 -47904 -15999 28110 47491 51547 20656 -15869 -18452 3241
183 3241 50454 75964 53647 20640 -17530 -22023 18951 43614 47361 22718 -24724 -39187 -30662
196 -30662 -14753 -5112 -31904 -56850 -58178 -41613 2984 22516 3314 -20017 -42375 -27188
208 -27188 17752 42159 43010 9927 -27369 -22707 2981 40910 61139 32669 460 -20040 -21096
221 -21096 7787 19318 7326 -11495 -36127 -30682 -9493 3000 13472 431 -11405 -2693
233b693M138J0890K805j4037K060N114O656R050j4172j0956J50M333K0376Q21
247B4535k2612k1327k1674Q081K8709J2150K65k3688k5810O218J8252K5823J3529
260B2451j9642j5249n338R258K7466N470j0881j1847j0434J8081K2675J625j1108
273B2527l1466j7851J5623K1139K0942n540l5387k2310n684J9573L3176N671j1084
286I329k0142j8141J2425J6748R439M258j4471m009Q070L071O179r278j4219N690
300e051Q217J4732N925k1097j7666r910N446K5838R650o300j5260k0751N323J6911
314c993J2093Q411j3356j2298M851N364J2303m59j6843n045K024J4616J8932o913
328A9687j5804j7189r027J9690J7460L473r823k7268j1334J0263J6090J9449k961
$$ plain form
233 -2693 1445 12335 15140 1103 3163 8277 14933 23983 9811 -1145 -995 3338 23714 24535
247 24535 1923 -19404 -41078 -32997 -4288 7862 8127 -15561 -41371 -35153 -16901 8922 22451
260 22451 2809 -12440 -17778 -8520 18946 24416 13535 1688 -8746 9335 32010 33635 22527
273 22527 -8939 -26790 -11167 9972 30914 25374 -10013 -32323 -38007 -18434 14742 20413 9329
286 9329 -10813 -28954 -16529 219 9658 13916 -555 -4564 3506 6577 12756 3478 -10741 -5051
300 -5051 3166 17898 23823 2726 -14940 -24850 -19404 6434 16084 9784 -5476 -26227 -20904 -3993
314 -3993 8100 16511 3155 -9143 -4292 1072 13375 12916 -3927 -8972 -6948 7668 26600 19687
328 19687 3883 -13306 -22333 -2643 14817 18290 8467 -18801 -30135 -19872 -3782 15667 12706
341A2706j6987p035j912J3993J4228p011r075j0279K57J9502R635r28j0154j7311
355a0371L523J3933J0192M547j8499j9897l539M474J8060Q771j0286q176q542
368a5810O300J7172J514m959j2118j1222J1519J2652O892k85j7072n728Q655J2074
382I584J6089n797j9633j2025o871J1492J5131k937o447j2167l506J5038J0012
395G963L774o424j6999m02Q497R648Q820j0173j2216N54P239J9253R361r819j2702
410F374j5454M47J3668K868k464j2991j5507N120J0984J0260L746j4024r641l15
424a6929O504J4913j050j1180o127l150J4944J9622L711l030j2641p964Q793P345
438A3761M363o871j8301n056K846Q843J2268o495j1118m343p09J1862O989o560
$$ plain form
341 12706 -4281 -11316 -13228 765 14993 7982 -1093 -11372 -11115 8387 18022 17094 6940 -10371
355 -10371 -6848 7085 17277 21824 3325 -16572 -20111 -15637 2423 11194 908 -7268 -15810
368 -15810 -9510 7662 9176 4217 -7901 -19123 -7604 5048 11940 11655 -5417 -11145 -2490 9584
382 9584 25673 19876 243 -11782 -18653 -7161 7970 5033 -1414 -13581 -17087 -2049 7963
395 7963 11737 5313 -11686 -12088 -3591 6057 14877 4704 -7512 -6958 281 19534 28895 19076 6374
410 6374 -9080 -8633 5035 7903 5439 -7552 -23059 -17939 -6955 3305 7051 -6973 -16614 -16929
424 -16929 -10425 4488 3438 -7742 -13869 -17019 -2075 17547 21258 18228 5587 -2377 6416 13761
438 13761 18124 11253 -7048 -12104 -9258 -415 11853 5358 -5760 -10103 -10812 1050 8039 1479
452A479q634j1848L334J5621R587O777o315j2248M140O956P879K854j4562j3150
466h130m947L263J2736P57q293p817p898R884J4473Q22n597j5428j0759R169J4007
481c758J3865J719j1940m450K435J2714J7510k531j0832j0465r883O953Q598r42
495H993m585j1016k277P672M965M658q568j3538o00J978Q008Q153p166o495j041
510a0859N218J5391P188j631o917j2338J536N654N84J145r405r063M668N411N958
525B540l75j0323m083L75Q490R782o662r456n949J9J9291J7451J984o803j5646
540F35n430J0332J2703Q727r878j9252r510k723J2366J4571l756q555r534o799
554a6103Q051N753P26n053r918K198P530P193Q289n785p021L052M120J0080M967
$$ plain form
452 1479 -7155 -19003 -15669 -48 9539 16316 10001 -2247 1893 8849 16728 19582 5020 -8130
466 -8130 -13077 -9814 2922 3679 -4614 -12431 -20329 -10445 4028 4850 -747 -16175 -26934 -17765 -3758
481 -3758 10107 11826 -114 -4564 -2129 10585 28095 25564 14732 4267 -5616 1337 9935 8993
495 8993 4408 -6608 -8885 -1213 3752 8410 -158 -13696 -14296 -12318 -4310 3843 -3323 -9818 -10859
510 -10859 -5641 9750 16938 15307 8390 -3948 -2412 3242 3826 4971 -4434 -13497 -8829 -3418 2540
525 2540 2165 -8158 -12241 -11866 -3376 6406 -256 -9712 -15661 -15642 3649 21100 23084 16281 635
540 635 -4795 5537 18240 26967 17089 -2163 -11673 -14396 -2030 12541 8785 230 -9304 -16103
554 -16103 -8052 -2299 -1573 -6626 -16544 -14346 -6816 377 8666 2881 -4140 -1088 3032 13112 18079
569A8079r010j0277r290O59J0036M827K432n243j0450J154K126O77L730l900j799
584f249M081J240J717m750l511O096Q738J3456M888j4041j2863q114K937J7060
598A0685R925m434j4495j7635j996R977J2945Q959j0782j4429o032r27J1054Q832
612A647l716m707l921L794J1896N295o34q925r288N876Q643Q064K499j4130j2953
627a0560k030N887J5600P745n534j1011j3411m67Q516N699P092l367p929O60o39
642c749K091M406J61L365K728j280k213r673m276M262N489R308K70j1787q429
657i327m391N159J2811M083l713j1213r453M486P769Q668L756r844n960K074M956
672a39J0344L06q970p057l008R075J0852R41n615j3969p738R324J1860R491j507
$$ plain form
569 18079 9069 -1208 -10498 -9839 197 5024 7456 2213 -8237 -7083 -4957 -4280 -550 -4450 -6249
584 -6249 -2168 -928 789 -3961 -7472 -1376 7362 20818 25706 11665 -1198 -9312 -6375 10685
598 10685 20610 16176 1681 -15954 -17950 -7973 4972 13931 3149 -11280 -17312 -18239 -7185 1647
612 1647 -2069 -6776 -10697 -6903 4993 10288 9654 729 -8559 -2683 5960 14024 16523 2393 -10560
627 -10560 -12590 -6703 8897 16642 11108 97 -13314 -13781 -5265 434 7526 4159 -3770 -3110 -3749
642 -3749 -1658 2748 2909 6274 9002 7722 5509 -4164 -8440 -4178 1311 10619 10889 -898 -9327
657 -9327 -13718 -8559 4252 8335 4622 -6591 -16044 -11558 -3789 4879 8635 -1209 -7169 -5095 -139
672 -139 10205 10511 1541 -5516 -8524 551 11403 12344 6729 -7240 -14978 -5654 6206 15697 14190
687A4190j6758j2154j777J0150J6559M641o185j1850j1068M172J0253P340N284
700A2797p125q503k151r74M208L098k43K032j353j579j428o507j15M466L983O806
716G412k122q056m785k983O777R021K595j053p833m815M157L400M319j68p277
731a411o16L069M059L646o798q483l398L338J3409P645m961j1016j4791j862J3446
746d724J4012Q663p205j7826j0082jJ3583J6127K384n847j2223r258M661P332
760d04N920K841o074l429j83n20K598j794j885K969J385L411m16o839m013j480
776g913L107Q570K194j325m083n743J654L039J833K965k712n39K096j945r3l613
792b508l140M609N366N440j66j0360q558l094M885J3269N508m005r874j2075Q22
$$ plain form
687 14190 -2568 -14722 -16499 -6349 10210 14851 8666 -3184 -14252 -10080 173 7513 12797
700 12797 5672 -2831 -4982 -5956 -1748 1350 1107 3139 1786 207 -1221 -7728 -7843 -3377 606 7412
716 7412 5290 -2766 -7551 -10534 -3757 5264 7859 6806 -1027 -5842 -1685 1715 6034 5866 -1411
731 -1411 -2027 1042 5101 8747 1949 -6534 -9932 -6594 6815 14460 9499 -1517 -16308 -18170 -4724
746 -4724 9288 17951 10746 -7080 -17162 -17163 -3580 12547 14931 9084 -3139 -12397 -7736 -404
760 -404 5516 8357 2283 -1146 -1329 -1849 749 -1045 -2930 39 1424 4835 4419 -2420 -6433 -7913
776 -7913 -4806 3764 5958 4633 550 -5193 -3539 -500 1333 4298 1586 1047 3143 1198 1105 -2508
792 -2508 -5648 -1039 4327 9767 9601 -759 -9317 -12411 -7526 5743 11251 7246 -2628 -14703 -13881
807a3881J0745J0106O072o963j1513m138J051R812P531k156m075o417l24P518
821C368K928j7m391o449J437L714L526R24p266n346M30L303P730K196m919m558
837c390m275K394O234K048P62k920m016K653J279K223J518l174P11J008o87O0
853B428m183l230K264K284M685J36p061l287k169M422Q589J268l209o739o366
868a0168M117P476O298K303p588o076l00K895P809J530n274n002m732K573O277
883B138P72j360n290l660L901M434L207r34p619k915K320M747P366o27m758l660
899a938k194M993N516L95j217n846l335J833R49J970n37l575P66M46J165R85l850
916c474j580J286K598N293j96l947k640k189M949P083P86j328n949m946K433K863
$$ plain form
807 -13881 -3136 6970 13042 6079 -5434 -9572 -8521 1291 8822 6666 2591 -3826 -4150 3368
821 3368 6296 6279 1888 -4561 -3124 590 4116 5040 -2226 -7572 -7142 -3839 3891 6087 1168 -3390
837 -3390 -7665 -5271 963 3011 3773 853 -3163 -510 769 2992 4510 1336 2047 3055 2368 2428
853 2428 -1755 -4985 -2721 -437 4248 4384 -2677 -5964 -8133 -3711 4878 6146 2937 -3802 -10168
868 -10168 -6051 1425 7723 10026 2438 -3638 -3938 -1043 6766 8296 3022 -1980 -6712 -4139 2138
883 2138 2910 1550 -3740 -7400 -3499 935 4142 3208 -4411 -7326 -5006 -259 7107 6480 1722 -1938
899 -1938 -4132 861 6377 6772 5555 -291 -3626 -1793 -844 1126 589 -2986 -2220 -1774 -609 376 -3474
916 -3474 -5054 -3768 -1170 4123 3927 -20 -2660 -4849 100 7183 7969 6641 692 -4254 -1821 1042
932A042L675m13o288k645n43K273N135j505l620k126j306M882M406o44j805n198
948d680J7N903M043L417k413o944j214J065M268L720l147m350l690j284M519J918
964A148r17j730m500Q68L892P60J417k749l449K636K848M039J165l911j707n45
980g35K355M841p03k933l123l530K590L440K1r74n030j998K382K087L253j572
996C71m845m77O74L678N063j478l067k016j09M837K693l9k504n172K11L037J564
1013B421J713l662m639N76J381L110J546l299k519j619J979N212L59o37k334l588
1029d000L161L856J247L91l592l014J003J712L105r51m043j267j778K638L995
1044B463j259k308k848j306M016K834Q26j349m482J1K622K935L407k675m179l44
$$ plain form
932 1042 4717 4304 -1984 -4629 -5172 -2899 2236 731 -2889 -5015 -6321 -1439 2967 2323 518 -4680
948 -4680 -4663 1240 5283 8700 6287 -657 -1871 -806 3462 7182 4035 -315 -4005 -5289 -770 1148
964 1148 231 -1499 -5999 -5131 -1239 -479 938 -1811 -5260 -2624 224 4263 5428 1517 -190 -735
980 -735 1620 6461 5758 2825 -298 -3828 -1238 2202 2223 1249 -3781 -5779 -3397 -1310 1943 371
996 371 -4474 -4951 -4277 -599 4464 2986 -81 -2097 -2206 2631 5324 5285 2781 -2391 -2180 857 2421
1013 2421 4134 472 -4167 -3591 -2210 900 2446 -853 -3372 -4991 -3012 2200 2559 1922 -412 -4000
1029 -4000 -839 3017 4264 4655 1063 -1951 -948 764 3869 2918 -1125 -2392 -4170 -1532 2463
1044 2463 1204 -1104 -3952 -5258 -1242 1592 2418 1069 -3413 -3402 -780 2155 5562 2887 -1292 -1636
1060a636L98L431K529k815k786k697O28L930Q10p4k663l760J946K746J515J431
1076B933l399k331J065J907L502J16k422j523k086K488L720j135r88l108k760
1091d021K430K398J083j045m156j254J002K566L349j600k929p54n79L704L749
1106C943j369j577k562mL284J830N66k386l951J020J347J825J723l569k663j22
1122b665Q03L159Q79k137j942j930K217L347M34j61k564k556K669J968J282K14
1138C017l557j598P46J578K699j610k263j429j322K958K779r71j556k789q34L218
1154i34K604J257j563l841j54J357L389L087k541k819j507l26L408K125j144j739
1170F59k866J07K291P87P48k166k618J567R77J544Q42k848j065L76J489K700j26
$$ plain form
1060 -1636 -1238 2193 4722 1907 -879 -3576 -2948 982 1792 1718 -945 -4705 -2759 -13 1502 2933
1076 2933 -466 -2797 -1732 175 3677 3793 1371 -152 -2238 250 3970 2835 1847 -1261 -4021
1091 -4021 -1591 807 1890 845 -3311 -4565 -3563 -997 2352 752 -2177 -2931 -3510 194 3943
1106 3943 2574 997 -1565 -1569 1715 3545 4111 1725 -2226 -1206 141 1966 3689 120 -2543 -2665
1122 -2665 -1862 1297 2176 39 -1903 -3833 -1616 1731 2165 2004 -560 -3116 -447 1521 2803 3017
1138 3017 -540 -2138 -1392 186 2885 1275 -988 -2417 -3739 -781 1998 1027 -529 -3318 -4152 -934
1154 -934 1670 2927 1364 -2477 -2631 -1274 2115 5202 2661 -158 -1665 -1991 1417 3542 2398 659
1170 659 -2207 -2100 191 978 1726 -440 -3058 -1491 -514 1030 1872 -976 -2041 -1665 -176 2524 2398
1187B398j780j639j643K506K072k08j68l044j417J679J024J228q73k353p6N47
1203a747K130J713k382j502k43Q23L794J405j542k263k558J053L807K031O92l820
1219A391l986j97J151L524J896l187k340k108K78L352J053k42j542k269J435J558
1235b33R71J096k295j263J393J407K038k14k650j150n06J421K541q30r85k031
1251a290j775J857J090J74K32k100NJ181j2J096j203p41J559R39J624L43k810
1268A69p96q9J828L087m83j980l051k441J859K925J651j13m290k530O26J515L384
1285A271P46k729j528j416J695L142O23n71j407j459J957J726Q48o01k959j057
1301a719Q56J538K618j055k966j295p35J990K328j75n43k095j732J565Q30J250
$$ plain form
1187 2398 618 -1021 -2664 -158 1914 1706 1538 -1506 -2923 -1244 -220 1008 135 -2218 -2294 -1747
1203 -1747 383 2096 -286 -1788 -2031 -1208 2586 3991 2449 186 -2372 -1319 2488 4519 5211 1391
1219 1391 -2595 -2792 -1641 1883 3779 592 -1748 -3856 -3578 -226 827 585 -957 -3226 -1791 -233
1235 -233 738 1834 -461 -1724 -331 1076 3114 2900 250 -900 -1406 15 2556 1726 741 -1290
1251 -1290 -3065 -1208 -118 56 288 -1812 -1807 -626 -638 458 -745 -1486 73 1012 2636 2979 169
1268 169 -627 -716 1112 4199 3716 1736 -1315 -3756 -1897 1028 2679 2566 -1724 -4254 -3628 -2113 1271
1285 1271 2017 -712 -2240 -3656 -1961 1181 1804 1233 -174 -1633 324 2050 2898 2297 -662 -1719
1301 -1719 -863 675 3293 2238 -728 -2023 -2758 -768 1560 1385 842 -1253 -2985 -1420 -590 660
1317F60P16j378K98O0m4N49j130K47R42L61O70j179k408n33L68K279K270j124
1335A624j827k349j127K375K186J176o01l221o54J123J698K375o86k130r90o6
1351a094J989J655j389j205k065j16K883J350M49j844l124n84J547K282K465k022
1367A177k272j678m67K968K121N19o19k541p44J030O63J168J23j541J61m70L87
1384a5M22r12J71N96K29Q30j442j665n1J79J775J323o83p03j662k41K238J123
1402A512K56j048j942L34N66J206J052j449j443ON68K153M59j756j581j748Q79
1419a976K712N41K98k195k750P75J738K572J335j996j785j368J85L000J170J95
1435B451j166j921n4J008P52Q20j092r81K66k86L40o1j201l2M9P20J250p49q94
$$ plain form
1317 660 1376 -2 296 356 312 861 -269 -22 920 1281 1951 772 -1636 -2169 -1801 478 2748 1624
1335 1624 -203 -2552 -3679 -1304 882 2058 1457 -1764 -2418 -1295 403 2778 2092 -38 -1028 -1094
1351 -1094 895 2550 1161 -44 -2109 -2225 658 2008 2457 613 -2511 -3095 -1548 734 3199 1177
1367 1177 -1095 -2773 -3240 -272 1849 2368 1749 -792 -1536 -506 157 1325 1448 -93 68 -402 -15
1384 -15 407 -505 -334 262 491 1321 -121 -1786 -1837 -1658 117 1440 757 54 -1608 -1849 389 1512
1402 1512 1768 720 -1222 -888 -322 884 1936 487 -956 -950 -382 1771 2230 474 -1107 -2855 -1976
1419 -1976 736 1277 1575 -620 -3370 -2595 -857 1715 3050 1054 -731 -2099 -1914 1086 2256 2451
1435 2451 1285 -636 -690 318 1070 1890 798 -183 83 -203 137 76 -1125 -1157 -1108 -388 862 113 -781
1454g81p75l96J757Q67qk17j584K75J036L07J104n23j364P18K06P08j04j950n51
1473a275K62Q10K104q69j466j324q97J736J946Q82p18k177j317M42J620K489J52
1490B400j530r26r01N01K093Q0n40j104j428P82J027J64m14j576j59N99P05R64
1508G37n13j678j38n5J227J517n12m32r02k16J524O29J49m41j262N28N45NR7j023
1528b14n64M13O05P78j02j472n45j50O98J666j87p96j164k47J085J282M86l91
1546A181j787l77L27R26J118n30j613o06k89J295J169k57q09j146l07J355Q43
1563D93N14m34j567N5P47Q42Q80n82r90m04M19J375J71p68o86j193M55J266J44
1582G37l27r37j117N66R37M74J31q16n13K23M40J060m12q00o0J70O67P87n75n13
$$ plain form
1454 -781 -1556 -1952 -195 672 664 447 -1137 -862 174 481 1585 1062 -302 416 622 1330 1226 -724 -1275
1473 -1275 -1013 -203 1901 1032 -434 -1758 -2655 -919 1027 1909 1191 -986 -2303 -1861 -241 2248 2400
1490 2400 870 -56 -957 -456 1637 1717 1177 73 -1355 -573 454 618 204 -1372 -1531 -932 -227 737
1508 737 224 -1454 -1592 -1647 -420 1097 585 153 -749 -965 559 1188 1337 896 -366 162 707 712 809 -214
1528 -214 -778 -365 240 1018 916 -556 -1101 -1251 -553 1113 926 130 -1034 -1281 -196 1086 1572 1181
1546 1181 -606 -983 -656 270 1388 858 -755 -1361 -1650 -355 814 557 -252 -1398 -1705 -350 493
1563 493 1007 573 -994 -939 -192 650 1530 948 -42 -446 -27 1348 1519 751 65 -1128 -673 593 737
1582 737 410 -527 -1644 -1078 -141 333 464 -352 -865 -642 -202 858 446 -354 -414 -244 423 1210 635 122
1602A22q77k16J173L07P04r17j733Q9P7R30J298o91j041k18n6Q29R96km47q76
1622e49N57P34L47L56q69j180O91P98L62R3q82j186l77N84J074o9m80o72r21Q07
1642g82P54j05K64p16n84J056L07L98k97p37l7J82R92R84o85j088l88n31J087
1661G4O84r9k96j143l51O34N85N19l68q35K04J66P23M45r45m44j47O57J024J53
1681A240m97o08r16K01J169K80M4j131j122O40J70P89j7m89l65J48K81O91m25
1700H3m75k87j19J178N80Q3p75q97J0O59O69O22n90j314l05n9O46J006m70n31
1720b86j05k96J006L06j39l57q63N20O81K92R9q47p58N49J91Q43L95j172n91m76
1740a008J69R13Lr3m68m84L75O79J65n7p86q7N81K22O49m40o60J98k29R98R67
$$ plain form
1602 122 -755 -971 202 509 1213 296 -1437 -1348 -1271 -341 957 266 -775 -993 -1049 -220 776 774 327 -549
1622 -549 8 742 1089 1445 576 -604 87 885 1247 1340 458 -728 -1105 -521 553 484 4 -668 -1589 -782
1642 -782 -28 -133 131 -585 -1169 -113 194 592 295 -442 -479 -297 695 1679 994 -94 -482 -1013 74
1661 74 758 659 363 -780 -1131 -497 88 607 239 -596 -392 -226 497 942 -3 -447 -594 63 1087 1240
1681 1240 743 135 -781 -580 589 869 913 -218 -1340 -700 -530 259 242 -247 -612 -464 -183 508 83
1700 83 -392 -679 -798 380 960 1043 268 -629 -619 40 709 1331 741 -573 -878 -937 -291 715 245 -286
1720 -286 -391 -687 319 625 486 129 -734 -214 467 759 858 11 -747 -198 -7 836 1231 59 -532 -1008
1740 -1008 -839 74 77 -16 -484 -968 -593 86 251 194 -592 -679 -98 124 773 333 -327 -129 -358 640 1607
1761A607p89m52q13k74P01M43j05k22p09o7J63M60M82o35o96L51J90Q88j38m88
1781a03m27l42O68R65J48l0o29p84K19N09K81K54q50m50J11Q9N66l36j91k16j66
1802g14P83M09m60k99n28J29N17P52K26l58q75n0L13O35L49m38n65j28R3K89M21
1823E01n25j54m10K41R97l22j20m44r22O90N10M11K49q87l24j90K69J006J58n21
1843B13l36n15J85M79R8K03m43j67M24J12J39O0q11Q6Q0M24L21k32n75k30j6M61
1865d0N74p7k78o08J9L64M5O7l7k82R8J6L45L42q70q5j0K34R80j02n15m12o49
1888h81N20P89J93O1p99o00L17M64K32K55m95m57j43J90R21k84k02n90k70Q76
1908I7J81K61k72n76j42L03K43N12j2n61q8l02J92N87j29k73k87mM52r2j07j12
$$ plain form
1761 1607 818 366 -447 -721 -20 423 318 96 -613 -680 -517 -57 425 -210 -906 -555 -365 523 385 -103
1781 -103 -530 -872 -204 761 909 879 250 -534 -315 194 475 729 -121 -571 -460 -371 195 -141 -332 -548 -714
1802 -714 69 478 18 -281 -809 -680 -163 589 815 457 -418 -468 -155 480 829 391 -174 -302 -209 80 501
1823 501 -24 -178 -588 -347 650 328 208 -236 -1158 -468 42 453 702 -185 -509 -699 -430 576 734 213
1843 213 -123 -638 -453 26 124 327 -116 -283 141 253 392 452 -359 -273 -193 231 552 320 -255 -485 -501 -40
1865 -40 534 457 179 -429 -410 -46 -1 66 29 -253 -155 -139 206 548 -322 -407 -417 -183 797 695 180 -232 -881
1888 -881 -361 428 621 682 -117 -717 -400 64 296 551 56 -401 -544 -354 567 283 81 -509 -779 97
1908 97 278 539 267 -309 -451 -148 95 607 595 34 -54 -356 -164 423 294 21 -266 -270 182 90 -17 -129
1930a29l22K33K75J34J11m01k20j07L63K51J65n72j67J76J26N57l7m20r4j42M85
1951B65O0K00j73q47J97L16L48K92l61l16k94k46L95M02r2j49k17n53O63J30K27
1972B47j61o85M05P4M00Q8k04m18J18J75L54K01m86on38M4N68J7j52P3m62J29
1994b19L6R5J83m42K30L6k04K22K02m09L7K44l1N06m43j28j86j21Q49j81J53k79
2016A50l34j68M23n3M23n44j22J44k93L25K68j49l18l38K75M90k4P2m26k61J00
2037c60M75J09K98m55l25k3k6O67K12k95k53k82j80M73J9K34M1o47M46j65R3m9
2059Gk97LJ46P1L30k25n18L22j26L17J45j60n8j93J5K58K94o8p5l11L4K39j14
2082C6J91j93N6k16K00J74J22j80l93k57K23O49k32j24k22m14L75J50K00J64l37
$$ plain form
1930 -129 -451 -218 57 191 302 -99 -319 -426 -63 188 353 -219 -386 -210 -84 473 436 16 -78 -220 265
1951 265 325 525 352 -495 -298 18 366 658 297 -19 -313 -559 -164 238 146 -3 -220 -773 -110 20 247
1972 247 86 -599 -194 -120 280 368 164 -254 -136 39 393 594 108 102 -436 -392 176 193 41 114 -348 -219
1994 -219 -183 -88 95 -347 -117 -81 -285 -63 139 -270 -233 11 -20 486 43 -85 -271 -392 457 276 429 150
2016 150 -184 -352 71 18 441 -103 -225 -81 -374 -49 219 70 -248 -586 -311 179 155 227 -199 -460 -360
2037 -360 115 224 522 67 -258 -281 -307 360 572 277 24 -258 -438 35 54 288 329 -318 128 -37 56 7
2059 7 -290 -287 -141 -70 260 35 -483 -161 -287 30 175 15 -43 -236 -221 37 331 263 188 -123 -89 150 36
2082 36 227 34 90 -126 74 248 370 190 -203 -460 -237 412 180 56 -166 -580 -205 -55 145 309 -28
2103b8k79J45K05K43j8k87j10m8K51K29m1j72j40n0K86j75J90Q8l97k47J55K06
2125Fn2q7l2J34l34L36K90j47j67j29J29Q9%J14j09j34j8J22J06K40m45j2p5K50
2149G5J86m6l89J90n04M77J97k04J92k82k99M3M85K21p5n54K01L0J47J46Kj59
2171H0r0k77M27J32l14J69m91R9L75o9L13N9n68J33j09K22K16k67o6k84q1L80
2193a1PK85p6l61J08P6K25q5k56r7J36J11J8K4j1j07j48K43K66j66j1n64J65J95
2217c4K99q5J2l70KJ09K3J37j5k23j1j20L38j3r9J54l60J1L72M4L6N2l87K06j46
2242f8J98J3j54J05p1lK16L3k57o2R7lJ73j93J7j83r6M7K69NJ54m20J97j24m3
2267a53M17j01k82J55p7K77J3j22K7p9l8N0k4K90m10j77n3K20J98K8j31j77J16
$$ plain form
2103 -28 -307 -162 43 286 268 -19 -129 -177 74 303 262 90 -50 -100 186 11 201 289 -108 -355 -200 6
2125 6 -46 -133 -165 -31 -365 -29 261 114 -53 -182 -53 36 36 150 41 -93 -111 11 117 357 -88 -100 -175 75
2149 75 261 215 -174 16 -488 -11 186 -18 174 -108 -407 -364 121 342 267 -287 -86 -56 91 237 239 80
2171 80 -10 -287 140 272 -42 127 -364 -265 110 41 354 413 -155 -22 -131 91 307 40 -26 -310 -391 -11
2193 -11 -4 281 205 -156 -48 28 253 168 -88 -185 -49 62 80 104 93 -14 -162 81 347 181 170 -394 -229 -34
2217 -34 265 180 192 -178 -176 -67 -44 93 78 -145 -156 -276 62 49 -50 104 -256 -245 127 171 207 259 -128 78 -68
2242 -68 130 143 -11 94 23 20 236 269 12 -50 47 44 217 24 41 -142 -238 -191 78 83 237 -183 14 -110 -153
2267 -153 264 163 -119 36 -41 236 249 127 154 75 37 87 63 353 -57 -234 -287 -67 131 159 28 -149 -33
2290c3j59J59M0M9m8j51JL39m0J5l8j64L87k94L42k23q5k87O7O9J55pk11K5k8
2315a20Q9k5oK3j0r8P1l4L90r7k93J22p3m5K16p8L1o1j09n4L19j9Ml97J00K28
2341G4j18J58o9k29N8M0j91K90j64J76j41o1L46r5J56j96l08L31j83L83k87j58
2363a88K19l7J47j18Q1n2q2JJ51L2j62m5k21K55J80m5m8j4l61J85J07K5r7R6l31
2388c22J81J6J19K03k05R1l3k68K03Q4q1J08l72J87P4J33M5l40K00k05L51j75
2410fR7q1k02p7K91K31k76R2k29R3p8Q8J51k5j86R4J0P2K04k2l92n9M2K94J00
2435B26l8j00r5j05K23P2n2j10%N4j3j41K46j57p7P4p6J43o3Jl9k17Q5K76k08
2460i1K36n1l06J12K66q0J97l54O9N0j88L26M1l43M9j07m8K70j90l5P8J25k08
$$ plain form
2290 -33 -192 -33 7 56 8 -143 -142 197 157 172 134 -30 357 63 405 182 97 -190 -123 -54 101 94 -117 -92 -120
2315 -120 -31 -56 -62 -39 -49 -147 -76 -110 280 183 -110 12 -61 -106 110 32 63 2 -107 -161 158 139 143 -254 -154 74
2341 74 -44 114 45 -184 -126 -86 -277 13 -151 25 -116 -177 169 74 230 34 -274 57 -126 257 -30 -188
2363 -188 31 -6 141 23 104 52 -30 -29 122 154 -8 -53 -274 -19 161 116 68 54 -307 -122 -15 10 -87 9 -322
2388 -322 -141 -125 -6 197 -8 83 50 -218 -15 69 -12 96 -276 -89 -15 118 163 -177 23 -182 169 -6
2410 -6 91 10 -192 -269 22 253 -23 69 -160 -67 -145 -57 94 69 -117 -23 -13 59 263 241 -151 -210 -168 126 226
2435 226 188 88 -7 -112 111 183 131 21 21 75 62 -79 167 10 -67 7 -69 74 11 12 -27 -244 -159 117 -91
2460 -91 145 94 -212 -100 166 86 283 -71 -2 48 -140 186 227 -116 -67 -174 -222 48 -142 -177 -99 26 -182
2483a82K58j20J18o9jj42K06L35j61k16o1l4J17QJ24j28j66L9L7j7J20j60O4j27
2507a58Q8r6L11j00k71p8K30L14Jr0j73k6P9l0m1L7J34k08m6J76n8J24k13J85
2531I1r6j51L06j94k0K9J03n1L8q4K35k34J72k52K74N2l9k26j00J40Mj08N6j26
2555a81Q4K16r9J14K8l31Q7O8k3o1J54M2j98o8J15K98R8k46j93Q3L8j29J2P2j60
2580a80J10M6M8n8L8q1r8P3J92j42Ok75K79J96M2J32k89J27p7j58R3j18p0J8L1
2605a15J25j42j62K35R0l13L50k12J59lr4k41K89Q1l7K26N6l7k76p7K98J43j55
2628A88ol61n4L08k38J00P7j26j34J04P5j10j0L7j56J06K96J83o4j28j60J42M1
2651A10M0K23k55m9j60O0NJ2j29J3J2J51j20J05j54R3L3j5r2L86l71K21kJ64j89
$$ plain form
2483 -182 76 -44 74 5 4 -138 68 403 242 26 -35 -69 48 56 180 52 -114 -75 -38 -55 65 -95 -31 -158
2507 -158 -70 -166 145 45 -226 -304 -74 240 241 151 -22 -48 31 1 -40 -3 131 -77 -123 53 -5 119 -94 91
2531 91 -5 -156 150 -44 -64 -35 68 17 55 -29 206 -28 144 -108 166 218 179 -47 -147 -7 -3 -111 -55 -181
2555 -181 -97 119 20 134 162 -169 -82 -14 -37 -98 56 98 -100 -168 -53 245 343 97 -96 -13 25 -104 -92 -20 -180
2580 -180 -70 -24 24 -34 4 -77 -175 -102 90 -52 -46 -321 -42 154 196 328 39 166 89 -69 24 -94 -164 -146 -115
2605 -115 10 -132 -294 -59 31 -282 68 -144 15 12 -82 -323 -34 47 10 236 292 255 -21 -98 200 343 188
2628 188 182 -179 -233 75 -163 -63 14 -112 -246 -142 -67 -177 -187 -150 -306 -200 96 279 215 87 -73 69 110
2651 110 150 373 118 69 -91 -31 -26 -14 -143 -130 -118 33 -87 18 -136 -43 -10 -25 -117 269 -102 119 117 281 92
2676I2J28j0k76K08j67R8k7j77p9N0n4K49j7M8j4l48K38J89j78J27k51R6p1K61
2700A15K2R0m3J05k99M1J87j27p8rj39pK10O2k85k09R8J3O3J69N1Pk37J68M7M9
2726F4M16k51RJ15k17N4j0k59K17k46m2l1K32o9Oj8Kj1k08J72m9j69J70J28J27
2751A32m6j47J26O8R0K9j35l5q1o4J15k7j61j55J45K2KJ41m3pl25j24J97N2L07
2776G6J5p7N0J6J43j79K60m6k87J08l2J52l7l4l18J17O4n0K15m9l06j04K1K96
2800A4j46N6L4n7j01P7J36k4J38L4n3k6MPJ0j37J29j38M8%l2j13N1N3k4K8K21
2827A89m36R5J20O0J34l48J98q7K7K51l5k14J12j85p7L33q2n6N3k39K8M67k49
2850E9j42K06l28J87k13L37jq0k04J32j68L79j69p6j37J0J14J13J30l43Q6j29
$$ plain form
2676 92 220 210 -66 142 -25 73 46 -131 -210 -160 -214 35 18 66 52 -296 -58 131 -47 80 -171 -75 -146 115
2700 115 137 227 184 289 -10 31 218 91 13 4 -135 -142 68 130 -155 -364 -266 -253 -190 -21 30 37 -200 -32 15 64
2726 64 480 229 238 353 136 190 180 -79 138 -108 -150 -181 51 -18 -12 -30 -28 -39 -247 -75 -124 -293 -123 5 132
2751 132 86 -61 65 133 223 252 117 82 1 -63 52 25 -136 -291 -146 -124 -122 19 -24 -31 -356 -480 -283 -231 76
2776 76 91 14 64 80 223 44 304 258 -29 79 47 199 162 128 -190 -73 -9 -59 156 107 -199 -303 -282 14
2800 14 -132 -76 -42 -99 -200 -123 13 -11 127 161 108 82 86 93 103 -34 95 -43 5 5 -27 -140 -89 -36 -60 -32 189
2827 189 -247 -152 -32 28 162 -186 12 -75 -48 203 168 -46 66 -119 -196 137 55 -1 52 -187 -159 308 59
2850 59 -83 123 -205 -18 -231 106 105 25 -179 -47 -215 164 -5 -81 -218 -208 -94 19 149 -194 -108 -237
2872b37K39L9N3j97K0Q3j97n2L25r9Nj09M3L13j00n0m6J4j55L5K18m2O0l07p3
2897b17K70QL9l25J41j75R9J87k7J65l30J37kJ49OJ97m68J41n5J84J19q6l45q
2921a96K98k28K88j08J22k59L4k3N0J8J30l79J98j95K99q9O8k6l4m0N4J53o3j88
2945a16j0k1J15J71L5K9k47O2n4R9J17l70J39m5J24m2J28k67k65K41J95J69j57
2968C0p0J9n9M1L6K37j18m29P4L03K35j78j37j45N4j84K44R8oM0k62m4L26r1r1
2993g7Nk61J7L94K9N0k58m8J15PJ37r5q3O5j56P6K36Rm7j02%M7O0l3n7J09k11
3020g2J40j40K83q5j26q1J5J06q6J20r5k0n0Q0j6J1O9j55R4j80r3M55k02r4J50
3045B8n3J09j33n4J66j83QL89j61N9j1j54J8q0K77O4l65j55J49O9K87j8k25j9
$$ plain form
2872 -237 2 41 94 -103 -83 0 -197 -249 76 -23 -18 -127 -84 229 129 79 33 47 -108 -73 145 103 163 -144 -217
2897 -217 53 61 100 -225 -84 -259 -160 27 0 165 -165 -28 -30 119 125 322 -146 -5 -60 124 243 157 -188 -196
2921 -196 102 -126 162 54 176 -83 -49 -72 -22 -4 126 -253 -55 -250 49 -40 28 2 -32 -72 -18 135 72 -116
2945 -116 -126 -147 -32 139 174 203 -44 18 -36 63 180 -190 -51 -96 28 -14 114 -153 -418 -177 18 187 30
2968 30 -40 -21 -80 -39 -3 234 116 -313 -239 64 299 121 -16 -161 -107 -291 -47 51 45 85 -177 -221 105 14 -77
2993 -77 -72 -333 -316 78 107 157 -101 -149 -34 -27 110 15 -68 -3 -159 -83 153 162 115 13 13 60 120 87 30 139 -72
3020 -72 68 -72 211 126 0 -81 -66 40 -46 74 -21 -41 -91 -11 -27 -16 53 -102 -8 -188 -281 174 -28 -122 28
3045 28 -25 84 -49 -103 63 -120 -112 277 116 175 164 10 28 -52 225 289 -76 -231 -82 -13 274 256 31 12
3069A2j53K02o6o3J83l50J82p3K02N8l8k61Q8m9J53m0j17L22j39Q7j22K11j01
3092A28j39k1k1J7J20k26J05j49N7M7P4J24j89l2J8J81k8j62K63m1Jk05K38M7
3116B07j71j46p3J86M1K44m43Q4J07m19L53J98j70M2j6j73L75j57J48o6l05J92
3138C8O5N2O4j56L9l57L22j12K33Rl64Kj26J98Q7p9j18J21k16M78p9k39J4J89
3162F5n4J76k25K06j42j22K65P2p6j97K13j55j44j48O9P5K92m65R5P1K14l3n9
3185gr9m4J46pJ90K0l3j9nO8j74L18r7l60k0j3K03O0j38j50j63K82m2K50q0l03
3211b17J42mQ8J01j61J51j24p4L12kr3j59K09l34K31Q5o4l04J19j05K13R5o8k54
3235b17j94K84K72k82K88P5k11Q7O7K8J42l33l8K5PJ23K25k98j00q3p5L6K23j20
$$ plain form
3069 12 -141 61 -5 -68 115 -235 -53 -126 76 134 96 -165 -77 -126 27 -13 -130 192 53 140 18 229 128
3092 128 -11 -32 -53 -36 84 -142 -37 -186 -129 -82 -8 116 -73 -105 -87 94 66 -96 167 126 127 -78 160 207
3116 207 36 -110 -183 3 44 288 -155 -71 36 -383 -30 168 -2 40 24 -149 226 69 217 151 -154 38
3138 38 103 155 219 63 102 -255 67 -45 188 197 -167 -165 -291 -93 -6 -85 -203 -82 -298 180 101 -138 -124 65
3162 65 11 187 -38 168 26 -96 169 241 165 -32 181 26 -118 -266 -197 -122 170 -295 -200 -129 85 52 -7
3185 -7 -106 -150 -4 -11 179 199 166 147 142 210 36 354 257 -103 -123 -136 67 127 -11 -161 -324 -42 -84 166 86 -217
3211 -217 -75 -79 9 110 -51 100 -24 -98 214 212 119 -40 169 -165 66 151 87 -217 -98 -203 10 105 37 -217
3235 -217 -411 -127 145 -137 151 226 15 102 169 197 339 6 -32 -7 0 123 348 50 -50 -133 -208 -172 51 -69
3259f9p1j08j4J62lJ32o4P7k11%L35P1k76j07J71j16K07O7J37k44j06q7j12L04
3283G5mj49k3rQ5j15K11j05j24o3K35K02J9j28r5J75J6j53J70j04j16m3M5J99
3307B01m2k17o5r6r4M36l9k14l2j25P0K08JJ37l52j05L40K2L24j58l79J77J8M7
3331F3K68k26J37k04j22N9L7L1K52m51j8K6k89M91k07N6r3J36%P9J13N6l59J64
3355aN1OJ4r7j82J98J38j7j28O1p5J09j22j9L2l7J00o6K7J01o5pk19J0J79K01
3381A92j01O1k21q2N8J38J47n4k42K1k93L60J79j15k18k1l0J25M9J16j4l94L9
3404c00L49M9K39j22k40J1m7M7K17k89J28j12q6M10j26L1j23k81Q8R4N9p0l8k30
3428c42J32JL33k54J31r6p9K24P7j31R6n8k19M25o0N1j36j69j7p6J76J40l07j17
$$ plain form
3259 -69 -140 -248 -262 -100 -103 29 -35 42 -169 -169 166 237 -39 -146 25 -91 116 183 320 76 -30 -117 -229 75
3283 75 71 -78 -101 -110 -25 -140 71 -34 -158 -221 14 216 235 107 12 187 203 50 220 116 0 -43 2 201
3307 201 159 -58 -123 -219 -313 123 84 -130 -162 -287 -217 -9 -8 129 -223 -328 12 34 358 200 -179 -2 16 63
3331 63 331 105 242 38 -84 -25 12 43 295 -156 -174 -148 -437 54 -153 -97 -190 -54 -54 25 138 194 -165 -1
3355 -1 50 56 70 -27 -209 -11 127 110 -18 43 -32 77 -45 -64 -32 -69 31 -35 -8 93 28 21 -198 -188 -9 192
3381 192 91 152 -69 -151 -93 45 192 138 -104 -83 -376 -16 163 48 -170 -191 -221 -96 -47 69 55 -339 -300
3404 -300 49 98 337 215 -25 -14 -61 -14 203 -86 42 -70 -156 254 128 159 36 -245 -157 -63 -4 -74 -112 -342
3428 -342 -210 -209 124 -130 1 -95 -174 50 127 -4 92 34 -185 240 180 231 95 -74 -91 -167 9 149 -158 -275
3452b75k25L04Q3K34j28k00p0L2J52J51Ml9j57J57J15J25K6k77J2j5m2R8p2q6
3476i3j4j22L4M22j86n4j92k9R7R7q0J45N7m4r4J36J75qRp6j70K47k00M9J6k28
3502a06%L8Q4J11k13k51J74M8O1K38j31j54k3J39J56k9RK8j65K10Q8L4Pm23k62
3527c32M42j87K89M9m04j01kj3R0L26r1l38l8K77N9j91J34j44n2K49J77j9j10
3550G0j31Q2J42N3Q1m44J60j90K2L18j87J3j42N9m4j65P3O3L57l96j11L86J25
3573A94N8o8k27J12K24L3j25j08k48N8J57k14K58k10J12k27l0J37K10q8k65q3
3595c40K49pK97j06j59J46j7P7J91k17N9m15K32K4J27R5k98r2O7rk8L66m32L3
3619a57j50o4K69J96j37oJ81q2o2K02n9m3J52n9k37K70j08k29L05k89j29J74J8
$$ plain form
3452 -275 -500 -196 -113 121 -7 -207 -277 -245 -93 58 62 23 -134 23 138 263 289 12 24 9 -33 65 -7 -93
3476 -93 -107 -229 -195 227 41 -13 -205 -234 -137 -40 -120 25 82 38 -56 80 255 247 256 180 10 257 57 106 122 -106
3502 -106 -106 -68 16 127 -86 -337 -163 -115 -54 184 53 -101 -124 15 171 142 151 179 14 224 312 346 353 -70 -332
3527 -332 110 -77 212 261 -143 -244 -246 -259 -169 157 66 -272 -310 -33 26 -165 -31 -175 -227 22 199 180 70
3550 70 -61 21 163 216 297 -147 13 -177 -155 163 -24 -11 -153 -94 -138 -303 -230 -167 190 -206 -317 69 194
3573 194 252 184 -43 69 293 326 201 93 -155 -97 60 -154 104 -106 6 -221 -251 -114 96 8 -257 -340
3595 -340 -91 -98 199 93 -66 80 63 140 331 114 173 -242 -10 14 141 236 -62 -154 -87 -96 -124 242 -190 -157
3619 -157 -307 -371 -102 94 -43 -49 132 50 -12 190 131 88 240 181 -56 214 106 -123 182 -107 -236 -62 -44
3642d4k77L61l54K31R4j97L3Q4j12K43O4K22j00l79J04J87J9J54l7j81K4k80L43
3665B02l1O2m51k16J01K96J8M6l21N1Q1L13J55p6k78j4r8J28J95n2J52k32M5j00
3689b4q8O4K45K50o04JJ10o0j88J55j07M2J40J75k65L7J63p1J74j19J51j94R7
3712H4r7RJ2M0k02j2J0k8J32j7r8J5J74k58M24j5m34q3l7K31J66k6K02r5k17J29
3738Ik50L68N6pj64j66K31J4J01j03r7l40Q4L25k30J19L2j07Q4J00J8R2N3j75
3762D7k8J47n9kM2l40NK73k6Oj32m3J5j61K67Q0k88J74r2J97n8J22j78k02L04
3787G0J72p8J06j4m03nL67n5q7mk06J66j06J13K0M6k22k5k58L86j63O8L1k81K96
3812f6lK99J5j45j35J4m6K73j10J00j37k15L0K22j81K04j29k1n7m1K64j16j23
$$ plain form
3642 -44 -321 40 -314 -83 11 -186 -153 -69 -181 62 126 348 248 -131 -27 160 179 333 296 115 139 -141 202
3665 202 171 233 -218 -434 -333 -37 -19 27 -294 -243 -162 151 306 230 -48 -62 -160 -32 163 111 263 31 76 -24
3689 -24 -112 -48 197 447 -157 -156 -46 -106 -294 -139 -246 -204 -64 111 -154 -117 46 -25 149 30 181 -13 84
3712 84 -13 -4 8 48 -154 -166 -156 -184 -52 -69 -167 -152 22 -236 188 173 -261 -344 -381 -150 16 -10 192 97 -120 9
3738 9 -241 127 183 176 12 -154 77 91 192 89 -8 -348 -264 61 -169 -50 -18 -125 -41 59 77 169 222 47
3762 47 19 166 107 105 147 -193 -188 85 59 65 -67 -110 -95 -256 11 91 -197 -23 -115 82 24 146 -32 -234 70
3787 70 242 164 270 256 -147 -152 215 160 73 69 -137 29 -77 36 56 102 -120 -145 -403 -17 -180 -112 -81 -362 -66
3812 -66 -69 230 245 100 -35 -21 -67 206 96 196 59 -156 -126 96 -85 119 -10 -31 -88 -129 135 19 -104
3835a04p1K65mk32L5J05n3n7O4J87j0J3k61J6L14k27L4n8k06J37J03R0J36l85
3859a69n9J10k8K40J91l67O3k71J41L56j29J99j29j82k0K08K0j9r6n9j13K0l5
3882a28K06j90JO1n2L7J94j92Q5k18p5M21OQ9k26l3K2J1Q7j7j58n8M2Q3m1J04
3908F1L4j91K1N5n1Q8n4k61J90R8JJ02j36o5n5J24K76o3n7mk51O0J60k4P5k37
3934a04J0J09j9J9N1k22k0J22j35L55r1j45j27R8J27O4M9L6k30j30K40J16j8p
3958A48l08J94n0k30M46j75q7K31j92J69j97j31k8k3J31K46N5p1j72k0k5p8M76
3981C09p5l23LJ16J34J21Q4l76j20O3O2J16j43Q6l37j88M04K2K08j69j72K45k83
4004b13L06J03Ok73J53l75M84j12K62k08j82l13O42j90O7l41j1R3j20n3M49j80
$$ plain form
3835 -104 -175 90 86 -146 -111 -6 -59 -116 -52 135 125 138 -123 -107 207 -20 14 -44 -250 -113 -10 80 216 -169
3859 -169 -228 -118 -146 94 285 -82 -19 -290 -149 207 78 277 148 -34 -54 154 174 155 59 0 -113 -93 -128
3882 -128 78 -112 -111 -50 -102 -65 129 -63 22 -196 -271 150 156 245 19 -14 8 19 106 89 -69 -127 -85 -2 -43 61
3908 61 95 -96 -75 -20 -71 17 -37 -298 -108 -10 -9 93 -43 -108 -163 -39 237 174 117 113 -138 -78 82 58 133 -104
3934 -104 -94 15 -4 15 66 -156 -176 -54 -189 166 75 -70 -197 -99 28 92 141 177 -53 -183 57 173 155 148
3958 148 -160 34 -16 -246 200 25 -62 169 -23 146 -51 -182 -210 -233 -102 144 199 128 -44 -64 -89 -167 309
3981 309 234 -89 -86 30 164 285 369 -7 -127 -64 -2 114 -29 57 -280 -468 -64 -42 166 -3 -175 70 -213
4004 -213 93 196 202 -71 82 -293 191 79 341 133 -49 -362 280 90 157 -184 -195 -102 -222 -275 174 -6
4026fq1P5q7K6J18P1l86K01J26N3j37K11j54M8j45J66k1o8J3m1L1p8J50j34J76
4051A27j59J0j80J22J18ok05j96J77K35J86k02o5j09J45P9J02r7m6j69OL12k49
4074f4n4R8j21j31L15j5J21p2l25O5M1M6J58%K2q1k6J03j22L18k56P1J71j93k5
4099D4J13o9j54J68Jj03Oq9n2k13J94J26p2K35n7k92K16L7j49K8K5P2j20K61N7
4124B13l03l1LQ7m5K18j37l8m5K7K53k39m8N7q0M8P1J25j12j94J08R8J3o8J70
4149A51j43J24m96K29L00l36L31k76p2J48j48J94M7j40o3J20J22m9R2k75K55j92
4171g7J25K36j26p3j42M1k1Q7R7l8k17PM8MJ19k8j14L3k76N05k3j31j43o8K77
4196A02L2j43J56k33j60K92M1K04k83J64n02K58k5K36k70M2O9j38J21K19j73K8
$$ plain form
4026 -6 -87 -12 -99 -73 45 116 -270 -69 57 110 -27 184 30 78 -67 99 78 10 23 -18 13 -65 85 -49 127
4051 127 -32 -22 -202 -80 38 32 -173 -369 -192 43 229 27 -38 -147 -2 77 179 82 36 -133 -127 185 -64
4074 -64 -118 -20 -141 -272 43 28 149 77 -248 -183 -142 -96 62 62 84 3 -23 80 -42 276 20 91 262 69 44
4099 44 157 88 -66 102 103 0 6 -83 -135 -348 -154 -28 -100 135 78 -214 2 39 -110 -82 -57 15 -105 156 213
4124 213 -90 -121 -118 -31 -76 142 5 -33 -78 -51 202 -37 -85 -28 -108 -60 11 136 24 -170 -62 36 49 -19 151
4149 151 8 132 -364 -135 165 -171 160 -116 -188 -40 -188 6 53 -87 -150 -30 92 43 135 -140 115 -77
4171 -77 48 284 158 85 -57 -16 -37 50 147 109 -108 -101 -53 -49 70 42 -72 -39 -315 190 167 36 -107 -175 102
4196 102 134 -9 147 -86 -246 46 87 291 8 172 -330 -72 -97 139 -131 -89 -20 -158 -37 182 9 37
4218C7j93K25j8j32L02l38n2J70j63L37n0q4o0L8j37R9J32j36pj17J07j2O9m1
4242b4J87l05L64n9j64R7l81Q0K16O1J13kk04p7j11K40n6J71j63m0j40J12J71
4265H6j17J17j37J07l40K97K48n12L1J06o3L56k74J18j13k79K00J29O2J53k39
4286f4J47k7k24P1J19k03J03O5p4N9k5J22j7k33L32j00M1r4l11K14Q4J50K6q3
4310G8kj16k16J50J01j39J00k1M4J41n4N8k78J7J44qp8KMo9R3l23N17J94k44o8
4336B7r6r5K40Pj02j30j1J53J8P6j00o9O8r5O3J53j23l5l8l1K47q9n9P4o9j96
4362b12L16k05J56n4O5j36p8j6K23n7J09j31k23L96j46j71J08p1J11R2k4P1p4
4385D9j60J46k0q5J74j09j32P6ok3J04p0J24j80M8O9j0J51l0m64M38p7k6J15j81
$$ plain form
4218 37 -156 69 51 -81 221 -117 -169 1 -162 175 125 41 -19 19 -118 -19 113 -23 -30 -147 -40 -52 17 -24
4242 -24 163 -142 222 163 -1 96 -285 -205 11 72 185 183 -21 -98 -209 31 -25 146 -17 -57 -197 -85 86
4265 86 -31 86 -51 56 -284 13 261 -251 -220 -114 -177 179 -95 23 -90 -369 -169 -40 22 175 -64
4286 -64 83 56 -168 -97 22 -181 -78 -13 -87 -28 -53 69 52 -181 151 51 92 -2 -313 -99 -15 135 161 78
4310 78 76 -40 -256 -106 -5 -144 -44 -65 -21 120 66 124 -154 -137 7 -1 -79 -77 -73 -142 -49 -372 145 339 95 27
4336 27 -69 -164 76 83 -19 -149 -160 -7 11 87 -13 -82 -14 -109 -46 107 -16 -51 -89 -120 127 38 -21 53 -16 -212
4362 -212 104 -101 55 1 66 -70 -148 -164 59 2 111 -20 -243 153 7 -164 -56 -127 -16 76 52 123 49
4385 49 -111 35 15 -70 104 -5 -137 -61 -67 -90 14 -56 68 -112 -64 5 -5 146 116 -348 90 13 -13 102 -79
4410g9q5LJ70J24m8m6k5j56J87k4jQ6k01LK54M3k89j9M2J91k51O6K0L8o0J31k66
4437a92M34j94P4q2j28l4J25jK34j49n9Pj61K28j45l9r1P4Q0J57j15n9M3K3J67
4462A97q6J37l05Kj29K51n5J20l84J52N0L2K54l9j8k37o7j33L11J43j48j22j07
4485a81J36K9QJ52j39k16L19o7r7J24j60O7j11j21K45J49k01l9QL3J48j9J42k19
4509a0r3K41j68N4J06j22k38J63o2M35l13O8j5k11K67Pj49j2J34k45K92k90L02
4532A41r5j19Q7j42K95r8r2J57l03L39k05l3K33k54j19L22j5j68J57K1j60j69
4554b20L23m1M0k12J17j85R8J96k4L9q4j68k2O5Q9J59l15M1J23mL00k14j87j17
4578b03L58j70P2L7J5j27j63L25j44J22k23J7RP0P8P7j58K44l93J60J98m0j2j00
$$ plain form
4410 -79 -164 -161 9 133 85 39 14 -142 45 21 20 106 -95 -92 162 205 -84 -103 -61 130 -121 -55 -35 3 -57 74 -192
4437 -192 242 48 122 40 -88 -122 3 2 236 87 28 35 -126 102 -43 -82 -173 -99 -19 138 23 -36 7 30 197
4462 197 111 248 -57 -55 -184 67 12 132 -252 -100 -50 -18 236 197 179 -58 -125 -258 53 196 48 -74 -181
4485 -181 -45 -16 -8 144 5 -211 108 41 -56 68 -92 -25 -136 -257 -12 137 -64 -103 -95 -62 86 67 209 -10
4509 -10 -103 138 -30 24 130 8 -230 -67 -129 306 -7 61 46 -165 102 109 -40 -52 82 -163 129 -161 141
4532 141 46 -73 14 -128 167 69 -23 134 -169 170 -35 -68 165 -89 -208 114 99 -69 88 109 -51 -220
4554 -220 103 62 102 -110 7 -178 -80 116 92 131 47 -121 -143 -78 11 170 -145 -104 19 15 315 101 -86 -203
4578 -203 155 -15 57 94 109 -18 -181 144 0 122 -101 -84 -75 -5 73 150 -8 236 -157 3 201 161 149 49
4602D9rm0J52j68p9N2j47K50m7O8k4p2j40J89j05P0M1j40J30p1P4j15K11J01l99
4627a69P6p5J69Q6Oj39J63k28J19K04j29j32k5K31q4j17P7M3j30m2L3l6K0Q2k1
4652a8j33m5N0J21k06J45k5KL21l31J22Kj11MJ23j04K60k59N5L8n9K27k28k5J31
4677E7j21L7J99O4k04j39K9J92L0q6O5k05N0J58j22P0N5j94m1j2J08J30p3M6j11
4702a8j32%nK70j65n0K62o2m9n5j98KP4K65p0J2l45K61j48J83J95k77k0j62K81
4727D9M7r1Q7k67K50j00J0p9J30j94J35n9P5K04o0j62J1j72K56m6J11j53J01k44
4751a61J60n0k47M57k13j61J38O3J00j6p4J23j03J6q5J44n9k3j27L7R8L2m9m5
4775d5k4J81n4mK1l8k19P9m6J53J81k85N2j37J42P7J08pk68L10q7o6Q8j57Q4j04
$$ plain form
4602 49 40 0 152 -16 -95 -43 -190 60 13 81 57 -15 -155 34 -71 -1 40 -100 30 -41 33 -82 129 230 -169
4627 -169 -93 -168 1 87 93 -46 117 -111 8 212 83 -49 -74 157 73 -44 33 76 -54 -96 -63 -99 -79 3 -18
4652 -18 -151 -196 -146 -25 -231 -86 -111 -109 212 -119 3 5 -106 -102 21 -83 177 -82 -27 11 -48 179 -49 -74 57
4677 57 -64 -27 172 236 32 -107 -78 114 144 58 123 -82 -32 126 4 74 129 -65 -106 -118 -10 120 47 93 -18
4702 -18 -150 -150 -155 115 -50 -100 162 100 51 -4 -202 -200 -126 139 69 81 -264 -3 -151 32 227 -50 -70 -232 49
4727 49 96 5 92 -175 75 -25 -15 -94 36 -158 -23 -82 -7 197 137 -25 -14 -186 70 24 135 -18 83 -161
4751 -161 -1 -51 -298 159 -54 -215 -77 -14 86 70 -4 119 16 32 -53 91 32 9 -118 -81 17 49 0 -45
4775 -45 -69 112 58 54 75 37 -182 -103 -149 4 185 -100 -48 -185 -43 34 142 135 -133 177 90 24 112 -45 39 -65
4801f5q5K74j05N3j64m5J29q7O5n3r9o0L70N1k22J27p1J52j60j27j25L58L3n2
4825I2k7P5j09J53j92J86r4j92J05j55J26N8R3k83L53j59R9k07J40n3K28k1k11
4848EJ22j35l3o0K4J40O4j49R6J9O8m4l56J72M1rJ07J8j9j3r7K65r3r9m8N6j06
4875f4L0N2J38j71l4J15J3lJ06l3j76m1J50j65K92l11N8n4Pj06K50L3o1l7K1j03
4901i4K19j0j59j80K53j86J61J37p1J6k45K82k28m0J67J4j14N8L8RR5j28Q9k54
4925a71J94N4j00j26K8Q2J61O2k18K47k30r8J49Q7k57J67j51l8M9J82N5j97kO8
4949cn9J29j05K90m01K27J7o6j6J07N8j69j8m4K08m6q7m7j23K9M3O4L8P6k59K02
4975D5J83l25L01k96K34k53J44J6J5k38J76L4j9J82j17j33N8r0J09o4M4O0k02
$$ plain form
4801 -65 -150 124 19 72 -92 -137 -8 -95 -30 -83 -182 -242 128 179 -43 84 13 165 5 -122 -247 111 144 92
4825 92 65 140 31 184 -8 178 84 -108 -3 -158 -32 26 119 -164 189 30 129 -78 62 9 237 216 5
4848 5 127 -8 -41 -101 -77 63 127 -22 74 93 161 117 -239 -67 -26 -35 72 90 71 58 -39 226 133 34 -14 42 -64
4875 -64 -34 18 156 -15 -49 66 79 76 182 149 -27 -68 82 -83 209 -102 -44 -98 -91 -197 53 86 25 -12 9 -94
4901 -94 125 115 -44 -224 29 -157 4 141 70 86 -159 123 -105 -145 22 36 -78 -20 18 27 122 -6 83 -171
4925 -171 23 77 -23 -149 -121 -39 122 184 -34 213 -17 -115 34 121 -136 31 -120 -158 -109 73 128 -69 -71 -3
4949 -3 -62 67 -38 252 -149 78 95 29 13 120 178 9 -9 -53 155 109 22 -25 -148 -119 -76 -12 26 102 -157 45
4975 45 228 -97 204 -92 142 -111 33 49 64 -174 2 36 17 199 82 -51 7 -83 26 -38 6 66 -136
4998a36J22n9K96j30k34j0K60o8J76j71o5M9L9j30K65j39j16J34k25M06j86l1
5020D7J37l09l2J38J81l55J57m3L2K5j5J57j64M0o2Q4o4o1J31Jk06L60j88j14
5044a23L52j69j15Q3k65L05n2N7k1J4p1J01k48K26n6J1j69P8j1K07q3j45J90N7
5068A53k23J9P3J3o4qJ5N5k6j56J48L2j9J76K0l56L02J2j65M4j3k18L92m37J31
5093a00J24o6P1M8p4j31K54m9P7j63j19P7M1J78k35J22r1j20K65k38O2L1j58K76
5117H2j07k0J72j76R1O4q9j47J71oK38l98O5L10m04O6J05k02K08K4Rj49m8K70
5141A29l5M7m4n7k59J55n2P8K0q3J57k73O0J70O4j67K31k86K10j30M4J03k23K28
5165H7l0J60j50L7j73m6j05J41K4L10n22M41j19m0j2p6K73k61R3k15K94O1k17
$$ plain form
4998 -136 -14 -73 223 93 -141 -151 109 41 217 46 -19 30 69 -61 204 65 -51 83 -142 264 78 47
5020 47 184 -125 -157 -19 162 -193 -36 -79 -47 -22 -37 120 -44 -4 -66 18 -46 -107 24 25 -181 179 -9 -123
5044 -123 229 60 -55 28 -237 68 16 73 52 66 -5 96 -152 74 18 29 -140 -62 -73 134 51 -94 96 153
5068 153 -70 -51 22 35 -29 -37 -22 33 7 -149 -1 31 12 188 208 -148 154 166 1 45 32 -186 206 -231 -100
5093 -100 24 -42 29 77 3 -128 126 77 154 -9 -128 -51 -10 168 -67 55 -36 -156 109 -129 -67 -36 -194 82
5117 82 -25 -45 127 -49 42 106 17 -130 41 35 273 -125 -60 250 -154 -88 17 -185 23 47 56 -93 -141 129
5141 129 94 141 97 40 -219 -64 -116 -38 -18 -101 56 -217 -157 13 77 -90 141 -145 65 -65 -21 82 -141 87
5165 87 57 217 67 104 -69 -115 -220 -79 -55 255 -267 174 55 15 3 -73 200 -61 32 -183 111 172 -45
5188d5k24N07l17J47N5k40K18j07M8j40K55j97O1O7j86J54rJ59j31j87O5kK54
5211B05j81nj6K2k35M45k97P0M0j9j16J3K02n4j20p3K91j49J05l16J65q9n4J61
5235ej33N5K20ll13M35k45K91j96j71P6j08N7J15l8J14j32j91J23o8J95L5m0r4
5259b1m4n5j4K90N6j49j7j04J34j63J55j26K45j70j03R1n0P0r7p2N3L2P9j17J20
5284B3n3J28k18J15Qk1R8J26k1j84o5L7K3J23j24R3p1m0J05J0l7N7J8j75N9n2
5310c8K16j10j74MJ32J36j08r0L2l1p0J00j5R5k78J05M5j63L38L4j83j3m1P3J65
5335A61o6J1N0k03O6J2o8K8N9j17J7R1NM5l76K80j29P6k%Jo0J64k5J58l0Q2j35
5363I5o4K5r0j63M37n48M40l00J59q6J10J06j48J52K3Q8k10o1L7L4o7q3K39j8
$$ plain form
5188 -45 -269 238 -79 68 123 -117 101 -6 42 -98 157 -40 21 88 -98 56 47 206 75 -112 -47 -49 205
5211 205 24 19 3 25 -210 235 -62 8 48 29 -87 -74 128 74 -46 -119 172 23 128 -188 -23 -112 -166 -5
5235 -5 -138 -83 137 134 -179 256 11 302 106 -65 11 -97 -40 75 37 151 19 -172 -49 -117 78 113 73 -21
5259 -21 -65 -120 -134 156 212 63 46 -58 76 -87 68 -58 187 17 -86 5 -45 25 -72 -144 -91 -59 20 -97 23
5284 23 -30 98 -120 -5 3 -18 80 206 185 1 -64 -27 -4 119 -5 88 17 -23 82 92 55 112 130 -45 14 -38
5310 -38 178 68 -106 -102 30 166 58 -32 0 -31 -101 -1 -16 79 -199 -94 -49 -212 126 160 -23 -36 -77 -4 161
5335 161 95 106 156 -47 19 31 -37 -9 50 -67 -50 41 46 91 -285 -5 -134 -58 -60 -60 -59 -119 45 20 178 148 230 95
5363 95 31 56 -34 -197 240 -308 132 -168 -9 -95 15 121 -27 125 148 236 26 -35 2 36 -31 -114 125 107
5387A07l48L07n7j1Q6mJ72k83Nl7p2K98k2k68N4L31m48J27P7J24j15pj99J14J1
5412e8J35r6p8J58j72k4K13j41M6j12J09J0j01k5J06pj50N6Q4L5l8R9n9j02M3
5437f9k5L2O0K44r1k61K31k84J58L7K06j35j73P1p2Q0K31j97j81M2Q7j23J75J23
5461A66l80L96l65K54p1n3L14l34L6j50K72j78N9L7p6K06r5%Jr8L2l3J28m3k8
5486cN5L7j41MJ73k29o6J12J02jK9j19p2K39j86k1J94j55J7J78k73N3J71n4j48
5511a04QP7l2J2m9Q2j00J32N9P0l8k73K1J35L9j10N3L2q9M5m6Q3r0JP1j39L45
5538A95o4Q0k49J41l01J39Q3J09l3j26j54K78J58l12K9No6P4K3l7J49k1j08j6
5562b4J56l1l14J42L4j72K80O5m6j76r6j0LL14j61J92j95k4j16K63l28J16K2j1
$$ plain form
5387 107 -241 66 9 -2 84 80 252 -31 -26 -63 -135 163 141 -127 -73 258 -190 -63 14 138 23 16 -183 -69 -58
5412 -58 77 -19 -97 61 -111 -135 78 -63 -17 -129 -20 -10 -111 -136 -30 -37 -187 -131 -47 -12 -50 49 -10 -112 -69
5437 -69 -94 -62 -2 242 151 -110 121 -163 -5 32 238 103 -70 1 -71 9 240 43 -138 -96 -9 -132 43 166
5461 166 -214 182 -183 71 0 -53 261 -73 -37 -187 85 -93 -34 3 -73 133 38 38 39 -59 -27 -60 68 25 -3
5486 -3 52 89 -52 -48 125 -104 -170 -58 44 43 72 -47 -119 120 -66 -87 107 -48 -31 147 -126 -73 98 44 -104
5511 -104 -96 -19 -51 -39 -88 -6 -106 26 85 155 117 -156 -135 0 39 -71 -18 14 -75 -30 -76 7 -83 -82 -11 -150 195
5538 195 131 211 -38 103 -198 -59 24 133 100 -26 -180 98 256 -56 -27 -22 -88 -14 9 -28 121 100 -8 -24
5562 -24 132 101 -213 -71 -37 -209 71 136 90 -86 -182 -192 -189 125 -36 156 -39 -63 -179 84 -244 -128 -106 -117
5586a17J77l1Q3n6l9j88J90L1J18o4J15q1l31J88j97J21Jj54L40j22K9m8J15j49
5610f9J9Q4j08J64l53J77L78l35pj31k5K45J1j62J89k3j67J49j88O9J26M0q2k3
5634b2J16j02M3J21j83j13K63Q0l04q9lM39k43j52p6J02K07K8k42O5j0m5k8R4
5658e4N3j37K34K6r5m1r4M1R1K1N8j33O1kl6j69L20j48M8j24J49j87J14J88k19
5683c5p3PJ64j32m3J45jj77J24P8q4P2j8n3m3J60k47J97k02J04k0m2K5J4L49k21
5709D8j9J7J46l56K83k31L7J90k49K43q9p5J6O0R8l9K3m4r8O2o2N4J31M8k67J23
5735E0K08k17J25k60J40k22J75J5K3K5j68o3K16j28K5J03j17j11J18J21j57K13
5757A14k66K50k2P9k3k77J10K1N4p3K9rrR7p0j4L1kj42J96m1j15K6p0J23k91L9
$$ plain form
5586 -117 60 29 112 56 17 -171 19 50 168 104 219 138 -193 -5 -202 -81 -80 -234 106 -16 13 -35 80 -69
5610 -69 -50 34 -74 90 -263 -86 292 -43 -50 -181 -206 39 50 -112 77 54 -113 36 -152 -83 43 83 1 -22
5634 -22 94 -8 35 156 -27 -140 123 203 -101 -190 -193 246 3 -149 -225 -123 84 112 -130 -65 -75 -120 -148 -54
5658 -54 -1 -138 96 122 27 -14 -108 -67 24 45 103 -30 31 29 -7 -176 144 -4 44 -80 69 -118 -4 184 -35
5683 -35 -108 -101 63 -69 -112 33 32 -145 -21 57 -27 45 27 -26 -69 91 -156 41 -161 -57 -77 -119 -94 -80 269 48
5709 48 29 46 192 -164 119 -112 -75 115 -134 109 20 -55 -39 21 119 80 103 59 -39 23 -39 15 146 194 -73 50
5735 50 258 41 166 -94 46 -176 -1 14 37 62 -106 -169 47 -81 -56 47 -70 -181 -63 58 -99 114
5757 114 -152 98 76 155 132 -145 -35 -14 40 -33 -4 -13 -22 75 5 -9 22 20 -122 74 33 -82 -56 -126 -3 -294 -255
5784b55N21l50R8k62K71m9n1J21j10J57Ro1MJ33k97J78k22K03l6j14N4Q8j28K0
5808g8J30K3j63K09l7qj0l2Q5p4m0j02P1r0K74J72j44j19r1k8R5j43RK02k86L10
5834A35j71J80j75J2j0j2J56o4q7m2J40j0l9j28Q8K83j69m5p7J19k45J53k2O8
$$ plain form
5784 -255 266 -84 14 -248 23 -26 -77 44 -66 91 100 39 43 176 -121 57 -165 38 2 -112 -58 30 -98 -78
5808 -78 52 75 -88 121 84 76 66 34 119 45 5 -97 -26 -116 158 330 186 67 -24 -52 43 -100 -91 111 -175 135
5834 135 -36 144 -31 -19 -29 -41 115 51 -36 -78 62 52 13 -115 -27 256 87 42 -35 84 -161 -8 -30 38
$$ [...]
8191a19
##END NTUPLES=NMR FID
##END=
