##TITLE=1H_18-2022
 CDCl3
 8 sc, 
 15.03.2022
##JCAMPDX= 6.0         $$ Bruker NMR JCAMP-DX V2.0
##DATA TYPE= NMR FID
##DATA CLASS= NTUPLES
##ORIGIN= UXNMR, Bruker Analytische Messtechnik GmbH
##OWNER= root
$$ XWIN-NMR		Version 3.5
$$ Tue Mar 15 11:35:02 2022 Russian Standard Time (UT+4h)  she@DPX200
##.OBSERVE FREQUENCY= 200.131346
##.OBSERVE NUCLEUS= ^1H
##.DELAY= (6, 6)
##.ACQUISITION MODE= SIMULTANEOUS
##.ACQUISITION SCHEME= undefined
##.AVERAGES= 8
##.DIGITISER RES= 18
##SPECTROMETER/DATA SYSTEM= spect
##.PULSE SEQUENCE= zg30
##.SOLVENT NAME= CDCl3
##.SHIFT REFERENCE= (INTERNAL, CDCl3, 0, 15.7039)
##AUDIT TRAIL= $$ (NUMBER, WHEN, WHO, WHERE, WHAT)
$$ ##TITLE= Audit trail, XWIN-NMR		Version 3.5
$$ ##JCAMPDX= 5.01
$$ ##ORIGIN= Bruker BioSpin GmbH
$$ ##OWNER= she
$$ F:/spectra/data/she/nmr/H-F/1/audita.txt
$$ ##AUDIT TRAIL=  $$ (NUMBER, WHEN, WHO, WHERE, WHAT)
(   1,<2022-03-15 11:33:56.23 +0400>,<she>,<DPX200>,
      <created by zg, POWCHK disabled, PULCHK disabled
       configuration hash MD5:
       00 E9 B6 7A A2 85 ED C7 34 08 36 98 17 FE 4E 26
       data hash MD5: 16K
       62 0C 27 20 92 EA 91 62 D2 54 AB D3 39 33 FF 4E>)
$$ ##END=
$$ 
$$ hash MD5
$$ 57 2A CF 63 88 46 91 11 A3 0D 4D 29 7B AF E0 DF
##$RELAX= 
##$RELAX= 
##$RELAX= 
##$RELAX= 
##$RELAX= 
##$RELAX= 
$$ Bruker specific parameters
$$ --------------------------
##$DU= <F:/spectra>
##$EXPNO= 1
##$NAME= <H-F>
##$PROCNO= 1
##$TYPE= <nmr>
##$USER= <she>
##$AMP= (0..31)
100 100 100 100 100 100 100 100 100 100 100 100 100 100 100 100 100 100 
100 100 100 100 100 100 100 100 100 100 100 100 100 100 
##$AQSEQ= 0
##$AQ_mod= 1
##$AUNM= <au_zg>
##$AUTOPOS= <>
##$BF1= 200.13
##$BF2= 200.13
##$BF3= 200.13
##$BF4= 200.13
##$BF5= 200.13
##$BF6= 200.13
##$BF7= 200.13
##$BF8= 200.13
##$BYTORDA= 1
##$CFDGTYP= 0
##$CFRGTYP= 5
##$CHEMSTR= <none>
##$CNST= (0..31)
1 1 145 1 1 1 1 1 1 1 1 1 1 1 1 1 1 1 1 1 1 1 1 1 1 1 1 1 1 1 1 1 
##$CPDPRG= <>
##$CPDPRG1= <>
##$CPDPRG2= <>
##$CPDPRG3= <>
##$CPDPRG4= <mlev>
##$CPDPRG5= <mlev>
##$CPDPRG6= <mlev>
##$CPDPRG7= <mlev>
##$CPDPRG8= <mlev>
##$CPDPRGB= <>
##$CPDPRGT= <>
##$D= (0..31)
0 1.2 0 0 0 0 0 0 0 0.06 0 0.03 0 0 0 0 0.0002 0 0 0 0 0 0 0 0 0 0 0 0 
0 0 0 
##$DATE= 1647329635
##$DBL= (0..7)
120 120 120 120 120 120 120 120 
##$DBP= (0..7)
150 150 150 150 150 150 150 150 
##$DBP07= 0
##$DBPNAM0= <>
##$DBPNAM1= <>
##$DBPNAM2= <>
##$DBPNAM3= <>
##$DBPNAM4= <>
##$DBPNAM5= <>
##$DBPNAM6= <>
##$DBPNAM7= <>
##$DBPOAL= (0..7)
0.5 0.5 0.5 0.5 0.5 0.5 0.5 0.5 
##$DBPOFFS= (0..7)
0 0 0 0 0 0 0 0 
##$DE= 6
##$DECBNUC= <off>
##$DECIM= 32
##$DECNUC= <off>
##$DECSTAT= 4
##$DIGMOD= 1
##$DIGTYP= 9
##$DL= (0..7)
0 120 120 120 120 120 120 120 
##$DP= (0..7)
150 150 150 150 150 150 150 150 
##$DP07= 0
##$DPNAME0= <>
##$DPNAME1= <>
##$DPNAME2= <>
##$DPNAME3= <>
##$DPNAME4= <>
##$DPNAME5= <>
##$DPNAME6= <>
##$DPNAME7= <>
##$DPOAL= (0..7)
0.5 0.5 0.5 0.5 0.5 0.5 0.5 0.5 
##$DPOFFS= (0..7)
0 0 0 0 0 0 0 0 
##$DQDMODE= 0
##$DR= 18
##$DS= 0
##$DSLIST= <SSSSSSSSSSSSSSS>
$$ [...]
##$SUBNAM2= <"">
##$SUBNAM3= <"">
##$SUBNAM4= <"">
##$SUBNAM5= <"">
##$SUBNAM6= <"">
##$SUBNAM7= <"">
##$SUBNAM8= <"">
##$SUBNAM9= <"">
##$SW= 18.0517287032376
##$SWIBOX= (0..15)
0 0 2 0 0 0 0 0 0 0 0 0 0 0 0 0 
##$SW_h= 3612.71676300578
##$TD= 16384
##$TD0= 1
##$TE= 0
##$TE2= 300
##$TE3= 300
##$TEG= 300
##$TL= (0..7)
0 120 120 120 120 120 120 120 
##$TP= (0..7)
150 150 150 150 150 150 150 150 
##$TP07= 0
##$TPNAME0= <>
##$TPNAME1= <>
##$TPNAME2= <>
##$TPNAME3= <>
##$TPNAME4= <>
##$TPNAME5= <>
##$TPNAME6= <>
##$TPNAME7= <>
##$TPOAL= (0..7)
0.5 0.5 0.5 0.5 0.5 0.5 0.5 0.5 
##$TPOFFS= (0..7)
0 0 0 0 0 0 0 0 
##$TUNHIN= 0
##$TUNHOUT= 0
##$TUNXOUT= 0
##$USERA1= <user>
##$USERA2= <user>
##$USERA3= <user>
##$USERA4= <user>
##$USERA5= <user>
##$V9= 5
##$VALIST= <valist>
##$VCLIST= <CCCCCCCCCCCCCCC>
##$VD= 0
##$VDLIST= <DDDDDDDDDDDDDDD>
##$VPLIST= <PPPPPPPPPPPPPPP>
##$VTLIST= <TTTTTTTTTTTTTTT>
##$WBST= 1024
##$WBSW= 4
##$XGAIN= (0..3)
0 0 0 0 
##$XL= 0
##$YL= 0
##$YMAX_a= 364372
##$YMIN_a= -490254
##$ZGOPTNS= <>
##$ZL1= 120
##$ZL2= 120
##$ZL3= 120
##$ZL4= 120
##$ABSF1= 10
##$ABSF2= 0
##$ABSG= 5
##$ABSL= 3
##$ALPHA= 0
##$AQORDER= 0
##$ASSFAC= 0
##$ASSFACI= 0
##$ASSFACX= 0
##$ASSWID= 0
##$AUNMP= <proc_1d>
##$AZFE= 0.1
##$AZFW= 0.1
##$BCFW= 1
##$BC_mod= 2
##$BYTORDP= 1
##$COROFFS= 0
##$CY= 11.3945322036743
##$DATMOD= 1
##$DC= 2
##$DFILT= <>
##$DTYPP= 0
##$F1P= 2.36226072786647
##$F2P= -0.459571619588291
##$FCOR= 0.5
##$FTSIZE= 0
##$FT_mod= 4
##$GAMMA= 1
##$GB= 0.15
##$INTBC= 1
##$INTSCL= 1
##$ISEN= 128
##$LB= 0.24
##$LEV0= 0
##$LPBIN= 0
##$MAXI= 10000
##$MC2= 0
##$MEAN= 0
##$ME_mod= 0
##$MI= 1.114404
##$NCOEF= 0
##$NC_proc= 0
##$NLEV= 6
##$NOISF1= 3.799351
##$NOISF2= 2.8
##$NSP= 1
##$NTH_PI= 0
##$NZP= 0
##$OFFSET= 15.70392
##$PC= 1
##$PHC0= -16953.36
##$PHC1= 15.40078
##$PH_mod= 1
##$PKNL= yes
##$PPARMOD= 0
##$PSCAL= 0
##$PSIGN= 0
##$REVERSE= no
##$SF= 200.130013532006
##$SI= 16384
##$SIGF1= 3
##$SIGF2= 2
##$SINO= 400
##$SIOLD= 16384
##$SREGLST= <1H.CDCl3>
##$SSB= 0
##$STSI= 0
##$STSR= 0
##$SW_p= 3612.71676300578
##$SYMM= 0
##$S_DEV= 0
##$TDeff= 0
##$TDoff= 0
##$TI= <>
##$TILT= no
##$TM1= 0
##$TM2= 0
##$TOPLEV= 0
##$USERP1= <user>
##$USERP2= <user>
##$USERP3= <user>
##$USERP4= <user>
##$USERP5= <user>
##$WDW= 1
##$XDIM= 8192
##$YMAX_p= 0
##$YMIN_p= 0
$$ End of Bruker specific parameters
$$ ---------------------------------
##NTUPLES= NMR FID
##VAR_NAME=  TIME,          FID/REAL,        FID/IMAG
##SYMBOL=    X,             R,               I
##VAR_TYPE=  INDEPENDENT,   DEPENDENT,       DEPENDENT
##VAR_FORM=  AFFN,          ASDF,            ASDF
##VAR_DIM=   8192,          8192,            8192
##UNITS=     SECONDS,       ARBITRARY UNITS, ARBITRARY UNITS
##FACTOR=    0.0002768,     1,               1
##FIRST=     0,             0,               0
##LAST=      2.2672688,     0,               0
##MIN=       0,             -490254,         0
##MAX=       2.2672688,     364372,          0
$$ Real data points
##PAGE= N=1
##DATA TABLE= (X++(R..R)), XYDATA
0@%%%%%%%%qJ6j6J6k4L2m0M8n6P2q8J12j36J60j92K29k69L12l66M28m94N66o47
31c45P41q44R57j083J220j373J542j726J928k147K387k652K941l256L599l974
47b085M386m836N328n868O465p125P854q668R583j0618J1803j3168J4756j6637
61h830J8914k1734K5326l0077L6692m6613O3299r8295K94363m02961k34671P67351
73C62764m23927k63588O13129n5750n94385M03956K71712n46666m690M98892k51029
84A0418j59425L62040j33013l73099K48198K30656k12183p1640K38279q3937k43569
95a87275K03034J29395l00650R8119K89999k54860j48799L00665q8565k55502
105b14439K99539J14169l89557J55551K81303m18884l381M62616l03218k31451
$$ y = [0, 0, 0, 0, 0, 0, 0, 0, 0, -8, 8, -8, 8, -16, 16, -24, 24, -32, 40, -48, 64, -72, 88, -104, 125, -144, 168, -198, 230, -264, 302, -345, 396, -448, 509, -574, 646, -727, 815, -911, 1017, -1130, 1257, -1395, 1546, -1710, 1889, -2085, 2301, -2535, 2793, -3075, 3390, -3735, 4119, -4549, 5034, -5584, 6219, -6949, 7807, -8830, 10084, -11650, 13676, -16401, 20291, -26322, 36977, -61318, 233045, -169916, -404587, 362764, -61163, -324751, 288378, 232628, -361757, 42199, 313911, -232755, -237445, 261447, 10418, -149007, 213033, 80020, -293079, -44881, 185775, -26408, -98048, 140231, 56294, -187275, 15759, 145154, -155496, -57377, 232622, -22238, -171037, 129628, 41063, -214439, 85100, 199269, -190288, -34737, 246566, -172318, -175699, 286917, -16301, -247752]
115b47752M46713j12543l62900L78792J30026m75669J34048L80585l41761j18084
125a88545M07258j85735k78478L69858M2223l73017J34835K60240j89205j02470
135a03036K04374o7666k32399K09014K00077k72062n9200K55668j11685j92479
145a69394K14757P0920k59623J20720K61733k99830j52856L33031r0686j97109
155a68337L19807j280l46927J68905J79312k75397K6478K81476j68733j36622
165a21318K49103r6003k41923K44715J01302k22592J02905J13293k14819k3147
175a08484J76353n2530q7539J39506K8199j83135K7916J27447j06076k8174J55516
186H8999l1752j30957P0562O8324j41142k950J99896p7596j46601J68952j2062
$$ y = [-247752, 198961, 86418, -276482, 102310, 232336, -243333, -109285, 271300, -70461, -188545, 218713, 32978, -245500, 124358, 166581, -206436, -71601, 188639, -566, -103036, 101338, 33672, -198727, 10287, 210364, -61698, -120898, 134770, 23085, -169394, 45363, 116283, -143340, -22620, 239113, -60717, -213573, 119458, 28772, -168337, 151470, 150190, -196737, -27832, 151480, -123917, -97439, 184037, 15304, -121318, 127785, 31782, -210141, 34574, 135876, -86716, 16189, 129482, -85337, -108484, 67869, 15339, -72200, 67306, 95505, -87630, -59714, 67733, -38343, -66517, 88999, 57247, -73710, -3148, 65176, -75966, -78916, 120980, 43384, -103217, 65735, 53673]
197E3673j98820J57479J19891k09659J8729J84028j36924j05998J93787k7522
207D8664j78647J71409Q0660k28490O0255J54823j54573j9692J54439q3632r8676
218i3460J30105L6632j32674L4321R5147j05060k3044J25719m8113p6818Q8003
229C0758J6924r6699Q881Q4626l9320m9536J02318j0922j33798P2914O9272j11254
241e5836L6974J11908r3698o7251R9560j8610j01619J07028P8062j38873J9415
252b2940R8495j32183k4117J49455m2333o7531R3538r868j18034L7788Q6731o6193
264a7192n530J04443o5689q7874P9447K138o1859O6391N0496o5428l2810M5826
276A2359j8346n3515P4626M6480q2704J4747M8020p8995j4311Q4353o416m9158
$$ y = [53673, -145147, 12332, 132223, -77436, -58707, 125321, -11603, -117601, 76186, 48664, -129983, 41426, 122086, -106404, -46149, 108674, -45899, -65591, 88848, 5216, -93460, 36645, 73277, -59397, -25076, 70071, -34989, -58033, 67686, 19573, -57245, 30758, 47682, -49017, -40136, 44490, 5170, -44366, 57952, 47030, -86768, -13854, 55418, -55836, -18862, 93046, -652, -67903, 31657, 13047, -88572, 18456, 96518, -42355, -22940, 75555, -56628, -80745, 68710, 26377, -41154, 52384, 42516, -75518, -37730, 49001, -17192, -22722, 81721, 16032, -71842, 7605, 9743, -52116, 14275, 64771, -657, -33467, 12359, -5987, -59502, 15124, 61604, -21100, -6353, 41667, -37328, -51639, 32714, 26298, -22860]
288b2860M3678K0420q7756J0078Q5498o1302k3031R5796m6053o9740P1469M743
300B0940o4549M2421N1117o2684k4047P1322k9678n5273P7363K986p5149M8971
312C740L1934n9332R776M4153k8433l3982M0538J6846n0944K6405M2543o1738
324a8494q471M9322k8875j6954M5740O677m3015k089L1253l5253j3856P2253j3696
337B4542n0381M2927r018n5513L6691M0211k7348m325L4837l0274n2710M6859
349c502K4223m2437M4203K5993p1367k512L2429k5377L222M5614K022m2431o67
362a0587J5474l8851J2221N8744k2593j9510K2410k5991k5961K3001K6073m278
374A0152p163K1448k1999m2907L6120J7018k6568L2059J3431m3377o076K0877
$$ y = [-22860, 20818, 41238, -46518, -36440, 49058, -12244, -35275, 60521, 14468, -55272, 16197, 20940, -43609, -1188, 49929, -12755, -36802, 34520, 4842, -50431, 26932, 29918, -45231, 3740, 35674, -23658, -13882, 30271, 1838, -32144, 8394, 25240, -25704, 701, 43244, -18494, -26965, 22357, -6518, -23472, 22268, 28945, -14070, -16159, 15094, -20159, -34015, 38238, 24542, -25839, 17088, 8070, -47443, -10752, 29459, 2111, -2214, 32623, 2349, -50361, -3502, 20721, -21716, 22487, 48480, -22887, -25399, 7030, -18347, -15125, 30489, 32511, -9920, -10587, 4887, -33964, -21743, 37001, 14408, -5102, 17308, -8683, -34644, -11643, 14430, 10152, 2989, 24437, 2438, -40469, -4349, 12669, -13899, 18160, 31591, -11786, -17862, 3015]
386C015p791j1274L2675J2413m5007R582K3032m3666J3533M2420l1451p173K5257
399A5565j7956j8013J8931J5790j9906j010K4001k4370j0803L6567j3638j9262
411a4104J9602k809q620O628R039l840j7331J5081O976l1691J6062K4466k1212
424a753N286Q915k7021j0011K5837J6874j8220J961J5106l5820j760L5842k5666
437a0430L75M2056j9481k4586P033q187l976K4798K3475j9972k1506J2616j5227
450a3012r779L3995M87p826J3374j5531j8315l063Q861K2201p54J407K872l2593
464a7676n899K1873k363Q260J8171p987k4846o102J5902q526L044L5421k0580
477H692k1829K8209k2538k2053L6644O746j1477J1189q130k5697J975K8645j897
$$ y = [3015, -4776, -16050, 16625, 29038, -15969, -6387, 16645, -27021, -13488, 28932, -2519, -9692, 15565, -2391, -20404, -1473, 14317, -5589, -6599, 17402, -6968, -17771, 18796, 5158, -14104, 5498, 2689, -5931, 697, 9736, 5896, -11435, 3646, 10622, -21069, -5007, 19459, -1753, 3533, 12448, -14573, -24584, 1253, 18127, -93, 1868, 16974, -18846, -20606, 15236, -10430, -10055, 32001, 12520, -12066, -5033, -13220, -17196, 7602, 31077, 11105, -10401, 2215, -13012, -22791, 11204, 11691, 3865, 17239, 1708, -16607, -19670, -10809, 11392, 10638, 12045, 14917, -17676, -23575, -1702, -4065, 4195, 22366, 14379, -10467, -16569, -667, -9193, -6149, 29272, 8692, -13137, 15072, -7466, -29519, 7125, 13871, 2394, 13583, 5453, -20244, -18269, 10376, 8479]
490H479j4873J6873r617j5348K3448r368j6293K0960L145j275j995j5298N485
503e677O838L364P950j6956q464J6223N038l429o051j047k298k826J9816p213
517E268k2050K8403o02k9504K0899j845j9785L0228J1567k7729n402R688q568
530i432k328K8491j037k4859J6948n179k8235K4814J1729j1569J5808n645j7679
543h173J62l235P010J0349M603M483j3451j5677k592P450J6846J778J016k330
557H239k4601P581J2761k1270J9441K1220k2603L601k91k9264R343L0480R28j0947
571D618K421q648j9932K0760J3671k5085J7457J5801k9490M924M177k0330J8013
584a643J7983r959o666m932k094K019P163M293q071L188K151p739O676n678k542
$$ y = [8479, -6394, 10479, 862, -14486, 8962, -406, -16699, 4261, 7406, 6131, 4136, -11162, -5677, 1161, 4525, 12475, -4481, -12945, 3278, 8316, 4887, -1164, -2211, -4509, -7335, 12481, 5268, -16782, 11621, 11019, -18485, 2414, 569, -19216, 11012, 22579, -5150, -10552, -864, -9432, -11760, 16731, 15694, -9165, 7783, 2604, -25631, -817, 10912, -657, 15151, 9506, -8173, -8011, -11246, -4236, 6113, 10716, 15199, 1748, -13929, -16521, -9071, 7775, 9553, 10569, 8239, -16362, -8781, 3980, -17290, 2151, 23371, 768, 4369, 4078, -25186, -15843, 14637, 15565, 4618, 7039, -1609, -21541, -781, 12890, -12195, 5262, 21063, -8427, -3503, 674, -19656, -1643, 16340, 6381, -285, -5217, -7311, -5292, 1871, 6164, -1907, 1281, 3432, -4307, 2369, -3309, -5851]
599e851J7508j1922m670J5301j7616J223K0018j6701m779J3519p565n370J2510
612E605L691j6013J567J1670j9620O927K5369k1976k490J6634k3602N75K0430
625H767r711J766J0601p834j0380j320M890n1R959J0949j6878n976K499j1743
639a4462J4050J0256r362J1407p671j7810R812m017n87K1411m43j1590l161n056
653g223o115O242J9509l504r072J1717j7647j4124K4885l968l127K2348j3693
666F228j6107P848m640j029J2857O624p179p113L031r660k278J9002m872k359
680C53J0460j6840l096J0738q408Q782P255j0745K785j336n412N042K626J05j977
695C32K186J59r464Q476L659j2492J2701j029j6764J5587K494j1442J0828l639
$$ y = [-5851, 11657, -265, -4935, 10366, -7250, -6027, 13991, -2710, -7489, 6030, -1535, -6905, 5605, 9296, -6717, -5150, 6520, -13100, -6173, 19196, -2780, -5270, 11364, -12238, -11663, 8767, -944, 822, 11423, 3589, -6791, -8111, -3221, -3272, 6687, 17636, 758, -5218, -2719, -14462, -412, 9844, 482, 11889, 4218, -13592, -3780, -7797, -8384, 13027, 12584, 994, -2167, -7223, -13338, -7096, 12413, 8909, -163, 11554, -6093, -20217, 4668, 700, -2427, 19921, 6228, -9879, -2031, -6671, -7700, 5157, 11781, 4602, -2511, 520, -9140, -11418, 7584, 2712, 353, 10813, -6027, -9123, 1615, -6793, 1989, 9244, -1501, 1284, -52, -5464, -422, 2204, 2309, 332, 2518, 2677, -6787, 1689, 5348, -7144, 5557, 4528, -12236, 3351, 5845, -5597, 5231, 1592]
709A592j1326P319N304j444j258M121l418r535R230p85p942J8065r46j2546P048
724C479j0512m748J7302L96j18J096j0007k744j83L309M672J610O405p183r606
739f832K730p717P522J7059q433J60m48j8192N857Q961j829R763J239q569n920
754d649k714L254P27R216P654j3156J57m84j5011J2140J0195n925Q693n628j4244
769i775L626K036L723N073p53n23o359j99J676o457R721N238o624N590q618p604
785a0229J2840j336O94M993j0090O41M638l010J951j695J094R05l091L985n019
800b729j343J0991p813k532N795r990O280R743r012J007j024n611M798K376K930
815C866n37k444J986q319l44Q966m524O490M920j3488Q45q07n405J1629K958j200
$$ y = [1592, -9734, -2415, 2889, 1445, 187, 4308, 890, -8645, 585, -200, -8142, 9923, 8977, -3569, 3479, -7033, -11781, 5521, 5917, 5799, 6895, -3112, -5856, -6039, -2730, 1942, 3552, 9957, 2774, -6832, -4102, -11819, -4297, 12762, 4329, 4489, 4041, -14151, -8294, 667, -1162, 8601, 9840, 1271, -4649, -7363, -4109, -3382, 5834, 13488, 332, 489, 5, -15006, -2866, 7329, 1404, 10097, 4469, -9775, -6149, -4113, -390, 4683, 3930, 3407, -2952, -3151, -1475, -7932, 1789, 7027, 403, 5993, -2625, -10229, 2611, 1275, 1969, 6962, -3128, -2487, 2151, -859, 1092, -603, 491, 1396, -1695, 2290, -2729, -4072, 6919, -894, -3426, 2369, -7621, -1341, 8402, -610, 397, -627, -6238, -1440, 936, 3866, 3329, 885, 2871, -5448, -5792, 3174, -1350, 5140, 10060, -3428, -2583, -3390, -8795, 2834, 5792, 4592]
831D592N58r294k995R57K805R364j306l61j718j0776L350J520r92J3828j609p026
847H97J780j1643P7J1187R68M527j340p523k680l732N248L722k82Q492o741r110
863f153M667p064L685J2984n110k06q93q829K772J882K574M829l077J311m023
878f51n522O739k011J987P207q451M33J477o921P059J157l989N454m922k243M055
894H58k511K662j78k199J950m464L807L027n923O730k128q284Q234k101j648R367
910G199n100l524Q11l683L613J603K342K515o969J025k193n779J0218J237j366
925A949N348j0156m092M668k724P678L608m853J353n779l232L227K53P742J731
940F721l891m02j0067Q40Q970k711P515J282j1970K956k054m305Q548K146O66
$$ y = [4592, 5150, -4144, -7139, -6182, -3377, 5987, 4681, 4320, 2602, -8174, -4824, -3304, -4296, 9532, 7923, 897, 2677, -8966, -8889, 2298, 3266, 7793, 6453, -1070, -3750, -7482, -2234, 1488, 1206, 9698, 2957, -6153, -1486, -8550, -4865, 8119, 3009, 2803, 1910, -6919, -4147, -2265, 309, 5138, 2061, 3372, -651, -6173, 566, -1445, 542, 7749, -702, -269, 1208, -5713, 1346, 2503, -1486, 3968, -954, -3197, 858, -1653, 1009, 831, -1368, 582, -3882, -75, 2952, -2971, 3759, 1631, -6653, 1581, -520, -2168, 7199, 2099, -1425, -614, -4297, -684, 919, 3261, 5776, -1193, -168, -2361, -8140, 2078, 3315, 1949, 7297, -2859, -6951, -2283, -5007, 2671, 6279, 1426, 2779, -3000, -6232, -3005, -2752, 4990, 6721, 2830, 2428, -7639, -6799, 2171, -540, 6975, 8257, -3713, -757, -2811, -7116, 1432, 3578, 4244]
955D244K30o291k035l230L866Q532l907K671p77j0725M736J582k393R255j953
970C805l728J799o476J868L732p59M215k452k116O97n013M457J039j761O052o548
986a189l234O711n389K821M729q225K719K137l343L501j227n2P47k336L156m247
1002b721M86Q108n204j14J840r435N760N542l982M356l245m725K664k430K203
1017h97K938q67L508n072l619J034l105P904M399n694L442o345n619Q134j348
1032a207K067O793o022j860j780l444L816K261M769N01o871J335m982k559J0574
1047C391j824Q13M699j0380k006L441k766O742K194k603J36m958j64J048m09P163
1063D517j484j690J470q580K671N420l849O447j069p328M571k389j691N207j980
$$ y = [4244, 4474, -1817, -3852, -7082, -3216, 5316, 1409, 4080, 3303, -7422, -2686, -1104, -3497, 5758, 3805, 77, 1876, -4600, -2732, 1000, 241, 4456, 2004, -112, 585, -4428, 29, 1068, -693, 5359, -1189, -4423, 2288, -3101, -280, 4449, -3776, -1057, 1080, -2263, 1238, 11, -41, 706, -1630, 1526, -2721, -2235, 5873, 669, 555, 2395, -7040, -1280, 4262, 280, 4636, 1391, -3334, -670, -3100, -897, 2041, 1174, 4682, -390, -4009, -2975, -6080, 1824, 6223, 529, 3971, -2374, -7993, 141, -1207, 860, 7653, 1631, -229, -2009, -5453, -1637, 624, 5393, 5894, -977, 358, -4624, -7183, 3391, 1567, 2380, 7079, -3301, -5307, -1866, -4632, 2110, 4304, 1701, 1837, -3121, -3285, -2237, -2646, 4517, 3033, 1343, 2813, -5767, -3096, 2324, -1525, 4922, 3853, -3475, 1096, -1293, -2984, 2223, 243]
1078B43J188j59k666J108l162L277L402n603M041j397n697Q015j304l355N551
1093C482n143q33M038k694K851K88j882R83m028K074K093k256O014l243m679L905
1109I70n477J710P410m489K488k22p553K509M39R22N308j493j29l587l830L825
1125a199j451L831O303p227M90n02p588O523L098j395N550m342m453j71k516M790
1141b59K619Q09J685p004j136J318l256P411J580l628M128o209l686N238k145
1156b535M325L893n039k16k735j023L823l94L652r59m375L436m377j361P218l735
1172d02J392L067p369J671J558k447M484r63j231O65l286K996n8j001M339m542
1188a127j96L261m677M119J950n161L833k274k731M711k107J495K059m047M97
$$ y = [243, 1431, 1272, -1394, -286, -3448, -171, 3231, -2372, 1669, 272, -5425, 2590, 1286, -2069, 3482, -1661, -2494, 1544, -1150, 1701, 1989, 107, 1090, -2938, -864, 1229, -1027, 4987, 1744, -2935, 970, -4507, -2797, 4613, 124, 2612, 2390, -5163, -2654, -2215, -1293, 4015, 2522, 2393, -1194, -5024, -1199, -2650, 1181, 7484, 257, 747, 245, -7343, -820, 2278, 883, 6433, 2091, -2362, -2533, -5049, -259, 2360, 3169, 4854, -2150, -3286, -1968, -5224, 2187, 3767, 139, 4267, -1942, -5628, -390, -2535, 1790, 5683, 644, 428, -2307, -3330, 493, 99, 3751, 2792, -1583, 1853, -2524, -3885, 3333, -402, 990, 4057, -3312, -1641, -83, -2530, 1954, 991, -240, 425, -2861, 135, 77, -924, 3415, -1127, -1323, 1938, -2739, 1380, 3330, -1831, 2002, -272, -3003, 1708, -399, 1096, 3155, -892, -395]
1203c95k306K3M833j695K192l73p035L811n37j570P136k609j363K454o129M07
1219c156K287K25N493j558k587j377m770M486K472q81N001m492l368K666n116
1234d675K554N051k150L377k599n845J720j169L523M263k593P80l547k954L733
1249e31j873L381M015m751J296j634m883N274L12K58L785m256j231m16k003M224
1265I67j3L68J817n787J416J000k926N083q85k348L586l912l24K868k606L247
1281A551K44l013K006k683J301L361l088J910j762k556M643k180K42K996m363
1296a391J184N88l741M044K03l80K222m469l73O29j034N069q13j654J881n281
1312c316R64K945k499N022K83l693J381m019J67L896q85L585r77m446J091l088
$$ y = [-395, -2701, -2678, 2155, 460, 2652, 2279, -4756, -945, -1482, -3052, 4084, 1475, 112, 2566, -3563, -3156, -869, -644, 4849, 3291, 704, -673, -5443, -957, 1515, 634, 5635, 1143, -2225, 441, -4675, -2121, 2930, 780, 4157, 1558, -4287, -2567, -3736, -213, 4050, 1457, 2237, -1310, -4264, -531, -2404, 977, 4992, 241, 1537, -97, -4980, 294, 606, 864, 4649, 393, -838, -1254, -3257, 967, 954, 1322, 3139, -2648, -1232, -232, -3158, 1925, 1040, -1308, 2278, -1634, -1958, 910, -1696, 1551, 1795, -1218, 788, -1895, -594, 2767, -321, 1589, -173, -2729, 1914, -266, -24, 2972, -1391, -207, 381, -3360, 684, 887, 507, 2729, -1740, -2113, -1484, -2518, 2551, 1738, 84, 1965, -3316, -2352, 593, -1906, 3116, 3399, -294, 1087, -2932, -2765, 1131, 246, 3831, 2854, -1592, -501, -3589]
1328c589J264M875j985K385j098n641K365j497R87N627k466K72n04m973K463N05
1344a010O82M456k620q22m81m249L814P08k32M335m078j530J328l811L295K068
1360A853j894K774l268j852K382k357K897J196k905L025k809j360L391k543K334
1375H64J471l716K165j381r15M121k559L51J034l435K608j61j345L336k895OJ277
1392H26l746L076R03j784L257l324j695K476k333K911J928k672J669l001j491
1407c000L423j413L029J129l990J812k365j704M381j123J833J529m734N31j557
1422b219r07N271p35K31L44m920J106N63r91M678j252l80J136m999J095J286o65
1439a358N345j509k673P39l540J629K663j333L011j849k294J879l371J392K911
$$ y = [-3589, -2325, 2550, 565, 2950, 1852, -3789, -1424, -2921, -1934, 3693, 1227, 1499, 995, -3978, -1515, -1010, -328, 4128, 1508, 686, 205, -4044, -230, 478, 246, 4581, 503, -1027, 301, -3510, -215, 1853, -41, 2733, -535, -2387, -5, -2362, 535, 1731, -1174, 1851, -958, -2318, 1073, -1470, 864, 2335, -1381, 784, -597, -1512, 2609, 50, 401, 1435, -2000, 608, 447, -898, 2438, -457, -451, 826, -2920, 156, 1059, -725, 2532, -792, -2487, -11, -2344, 567, 2495, -177, 1492, -1509, -3000, 423, -990, 2039, 3168, -822, 990, -1375, -3079, 1302, 179, 2012, 3541, -1193, -662, -2219, -3126, 2145, 1410, 1641, 1985, -2935, -1829, -1266, -2257, 2421, 1169, 789, 1925, -3074, -1979, -693, -1358, 3987, 2478, -195, 544, -2996, -1367, 1296, -37, 2974, 1125, -1169, 710, -2661, -1269, 1642]
1454A642j846K618j698l477K229j509J803K808l259J415r54k485L396j094P7K844
1470B510l348J068L17k471L244r13m13K205l732J138J029k218L508p85k303J998
1486H34k886J008K676k047J870j461k610K927j977J293K553k502J628r18l249
1501b861K369n82J463L406l320k06j062k557M306j1k63K393l770p7L03k452L304
1518C83Q02j62J931m545q52J202j363M344P23k407J506l634l47K561j260L415
1534B297L46k864J382l215l81L417j082K551M8l797J170j976K87L649j759J345
1550A418n9l858J980n03m92L408j651R1L68l044K081q3j26L152k615l90J243l036
1568b116K561J157k007K285k086j009J945k027J938O11k298K075k007p11K741
$$ y = [1642, -204, 2414, 716, -2761, -532, -2041, -238, 2570, -689, 726, -228, -2713, 683, -411, -334, 2510, -838, 230, 547, -1924, 1320, 407, -6, 2199, -1533, -395, 634, -1584, 1924, 1139, -1164, 834, -2052, -1044, 1632, -415, 1455, -6, -2616, 311, -1666, -373, 2180, -322, 1306, 388, -2861, -492, -1074, 389, 3795, 475, 269, -793, -3350, 956, 945, 682, 3075, -695, -772, -469, -2921, 383, 1185, 1023, 2954, -1591, -2443, -1241, -2604, 1740, 2463, 56, 1562, -2072, -2419, 142, -1118, 2297, 2643, -221, 1161, -2054, -2435, 982, -100, 2451, 2499, -1298, -128, -2104, -1817, 1832, 73, 1418, 1359, -2499, -519, -1022, -1514, 1894, 243, 334, 702, -2342, -261, -344, -470, 2682, 67, -323, 920, -2116, 445, 1602, -405, 1880, -206, -1215, 730, -1297, 641, 1252, -1046, 1029, -978, -1689, 1052]
1583A052k027K009K41l256J996j114j67L606k271L67P56l634K173L55n72K986
1599B500j606p16J15k680K355M80m73L378l172j462J198k846K577K404j949J690
1615A793k040k036J458j135K411J579j677J338k652j748K859j479K688J766l333
1630b08Q97j388k110L604p04J000J736l387o0l40j197L072l45L29P23l513J072
1647h19r2j339M252j245r69J813l304J96J938j101K253n25j472R07k020J308J447
1664A228j871K342j303j702K397k189O21K289k653J391l88k391K701o83M7J520
1680A356k428P32J23j312K691j016p3J450l323J312R58j745L327o02k165J878
1696A163k372m4K167r69J755p68j653P01k151J597K012j842K203j204l119K330
$$ y = [1052, -975, 1034, 1275, -1981, 15, -1099, -1266, 2340, 69, 436, 1192, -2442, -269, 86, -486, 2500, 894, 178, 293, -2387, -32, 448, -25, 3353, 181, -1281, -83, -2929, -352, 2052, 103, 1793, -247, -2283, -825, -1960, 451, 2030, 353, 1691, -961, -2709, 150, -1329, 1359, 3125, -208, 689, -699, -2809, 795, 91, 1091, 2827, -560, -620, -960, -2157, 915, 570, 899, 1622, -1891, -819, -911, -2250, 2002, 757, -212, 1601, -1703, -1507, 431, -670, 1583, 1058, -414, 493, -1527, -219, 1228, -643, 1699, 396, -1306, 1091, -1098, -477, 1812, -841, 550, 162, -2229, 472, -211, -164, 1356, -1072, -340, -217, -1529, 1162, 146, 73, 1523, -1800, -488, 470, -1275, 2052, 1450, -715, 1163, -1209, -1253, 914, -55, 1700, 932, -721, -20, -2171, -574, 1438, -404, 1799, 595, -2524, -194]
1712a94j201N94L137k116O15j94k848J535J14R53K233k080r7p74k128L074l06
1729C17l5K470l270k46R33k637K614J041j276J790k285j186J146q72K352J5q77
1746fJ265k638K16J908k132K394Q69k885J852j188j149K858j313M56N91k027J234
1763C05p97j80K049j970Q64L44k663K464m33j140K784k192o57K054k479J845J069
1780A267j578J433j561m61J222j073K053k2j792J822k442k12K814j987J477J084
1796B044l372R54l38q91K536m34K18J44k570J220n67J64L011k023M34N19l436
1813b387J837J004j330L128j180j726J114k071J162J288o14J624j583r27N88k123
1829b196K256J158j644K294k103j798K378j772J055K352k307P37n74j376J744
$$ y = [-194, -1395, -801, 2336, 220, 835, 641, -2207, -672, -558, 395, 2628, 548, 451, -323, -2451, 623, 317, 282, 2752, -518, -764, 169, -2468, 146, 1187, -89, 1701, -584, -1770, -624, -1496, 856, 871, -6, 1259, -1379, -1163, 745, -1387, 1007, 1876, -1009, 843, -345, -1494, 1364, 51, 507, 1098, -929, 305, -492, -672, 1377, -593, 271, 615, -2048, 416, -17, -1157, 1627, -565, -1222, 832, -1647, 198, 1267, -311, 1122, -439, -900, 322, -751, 1302, 1280, -512, 1310, -1132, -1344, 1470, -517, 960, 2044, -1328, -374, -712, -1603, 933, 499, 717, 861, -1709, -489, -1056, -892, 2119, 96, 530, 1049, -2387, -550, 454, -876, 2252, 1072, -654, 460, -1611, -449, 839, 225, 1849, 266, -661, -73, -2196, 60, 1218, -426, 1868, -235, -2033, 345, -1427, -372, 1980, -327, 410, -164, -1540, 204]
1844B04m85P90R67j942J298j258j159K907j581M84J743l275R16P39j731K438n06
1861E49j048J046j744P96O42j019J916j282p61J825k441J163J709k160K177r48
1877D20k370K537r45L33J879k102N15m87r72J879r70R76Q88k552J204p17j861
1894b345L383m16r83K089k958j90J150j015K249J76r27N36k221O70Q96r29K896
1911B061j086j435J596k908N53K432j635J908l2k722R67r40L99J982q91O99p41
1928B07j661J304j064N34K470k205J216jl074K370J79o93K629k010n89O88j500
1945a200J784j43l68J346k057M20O77k343K568O3j548K006k079n71K131j437R89
1962B38P15k004J255q20j03J526j176J177l67j616J990j253j03K601k536N06R54
$$ y = [204, -281, 509, 1476, -466, 832, -426, -1585, 1322, -259, 225, 1968, -1307, -391, 348, -1383, 1055, 549, -499, 547, -1197, -401, 241, -778, 1138, -144, -905, 920, -1521, -358, 1351, -809, 1368, 420, -1950, 587, -358, -25, 1854, -248, 267, -220, -1192, 687, -283, 693, 1581, -971, 233, -484, -2345, 1038, 622, -361, 1728, -1230, -1420, -270, -1285, 964, 1140, 213, 749, -1472, -802, 94, -835, 2061, 975, -460, 1136, -1772, -1219, 1213, -422, 1486, 1454, -1268, -301, -1241, -842, 1140, 249, 948, 207, -1454, -150, -1214, -680, 1790, -415, 801, 800, -2274, 96, 275, -418, 2211, 201, -388, 300, -1200, 584, 441, 73, 1419, -638, -218, 459, -1884, 684, 747, -801, 1205, -874, -1445, 686, -751, 238, 953, -1051, 204, -616, -719, 807, -369, 808, 441, -1175, 815, -438, -541, 2060, -476, 30, 984]
1979I84k549J682M56j045J820j339n80K63j077J838j59m81J566k400N6J401k144
1996a708K331R22k151J608j400j401K171o14R83R09j811O33j417mJ599j176J711
2013A185L60k712J479j173r55L125j032k55J321k821M54P50n79J948o34o2J00
2030D99j858J518l30n53K846j933o34J671k760R99J783j829J814p02j447J181
2046B65r37P05P26j108J030j133o69J823j760R88J495k475J607l63j805K567p04
2063B52m35J333j575J18N70q65J537q08J19N44k175J539L62j475K536j163j418
2080a004J831j908K97J791j523J136l04j405J036r51J114O81j207J332j189j153
2096a426K195j402O20K243k832O66L52k150K119j10r7J121j561l1k56q12K159
$$ y = [984, -1565, 117, 573, -472, 1348, 9, -571, -308, -1385, 453, 294, -187, 1379, -1021, -965, 436, -1708, 623, 1545, -606, 1002, -398, -1799, 372, -242, 741, 1650, -161, 472, -945, -949, 650, -526, 1185, 1545, -1167, 312, -861, -1816, 1309, 277, 22, 1343, -1478, -1024, -274, -853, 1095, 461, 399, 499, -1359, 159, -171, -724, 2122, 189, -445, 1226, -1534, -535, 1248, -581, 1233, 531, -916, 265, -672, 33, 759, -349, 681, -452, -1121, 702, -1058, -70, 1425, -1050, 557, 194, -1611, 956, 252, -183, 1150, -425, -307, 263, -602, 935, 127, 246, 790, -1385, 154, 516, -959, 1577, 414, -1004, 827, -1081, -784, 1007, -516, 620, 316, -1089, -53, -1004, 110, 791, -416, 916, -273, -1426, 769, -633, -13, 2230, -602, 64, 416, -1734, 385, 275, 178, 1299, -262, -293, -549, -1361, 798]
2113G98p73O2J310k738P35R99j948K476J64j886J837j681n84J580n36R01K67j183
2131b00R68j748Q62Q50j439K002o63k083K206j336m12K447j805K10Q39j876R99
2148a79n1l1J041j337R84k63j586K215r74k61K091k430L88J550k289J665O40j919
2166g46J399p95o28J145o61J044m44q09J091j749N83J703k145J631J24k497J931
2183A77l78n96K157j223r9M95j501R49j55L59J398j889O35j2j953K098l1j036
2201f05K414k108r07J672j667J188Q84j177Q37q47n17P31r12J717Pj067J544j898
2219g11n62K379j724J104J245k610J085j64j331J863l40p6N98j194N57o53l39
2236h73J945j475N43Q06k646J724M03j816K654r34j179J473j457O12Q70r01J052
$$ y = [798, 25, 87, 1397, -1341, -606, 393, -1555, 921, 1085, -801, 1036, -645, -1229, 351, -185, 716, 983, -200, 768, -980, -118, 732, -707, 1295, 632, -1451, 755, -581, -993, 1454, -351, -141, 698, -1178, -179, -230, -261, 780, -557, 427, 164, -1422, 793, -181, -442, 1649, -781, -393, 1157, -1132, 533, 1173, -746, 653, -142, -770, 375, -286, 758, 314, -495, 596, -1153, -570, 1133, -1012, 619, 743, -1754, 177, -201, -797, 1360, 137, 38, 533, -968, -19, -174, 185, 1583, -306, 329, 317, -1636, 462, 431, -605, 1809, -299, -1206, 466, -1201, -13, 871, -306, 531, -316, -833, -102, -1014, 703, 710, -357, 1187, -711, -1273, 1106, -618, 486, 1731, -879, 206, 42, -1289, 574, 234, 158, 756, -438, 119, -534, -873, 1072, -403, 140, 946, -1700, 24, 427, -1389, 1265, 331, -848, 625, -832, -220, 650, -251, 801]
2253H01q49j82P82j516J612L78j990K084j228j167K260j419N3J675j951L72J10
2270a75q05J222k31L97J30j688J488p46o26K518j422j22J391k686R53J203j606
2287h05J805k17j286P34r79O38O88o20J249j230o83J072j984J572J191j966J741
2304I20n40j899J716p35j85K014j212N6q4r51J011n81R58P65j918J178l43j744
2322a574K770j175l75J919j974j69R40j367J148K97n35O07j286N63R2o57J872
2339A096q86r46J734j917K37J797j863J149O49j964J231l70m27J217p11M99l57
2356A68r66J305j000M15J192k023J060L82k167K112j29j188J967j558j71R25j099
2373g75J066L1k10O03j456M12O96j237K048l19j788J753j528k33J868j306P08
$$ y = [801, -48, -230, 552, -964, 648, 1026, -964, 1120, -108, -1275, 985, -434, -381, 1294, -657, -285, -175, -980, 242, 11, 408, 538, -1150, 338, -408, -1034, 1484, 62, -60, 1331, -1355, -402, 801, -805, 1000, 783, -503, 231, -748, -110, 578, -42, 1207, -23, -706, 366, -1618, -46, 1145, -821, 920, 380, -1519, 197, -538, -723, 1291, 79, 135, 51, -900, 111, -470, 488, 1253, -665, 513, 170, -1574, 1196, 21, -354, 1565, -409, -578, 362, -1005, 143, 440, -95, 512, -774, -211, -119, -776, 1096, 210, -736, 998, -919, -682, 1115, -748, 401, 1050, -914, 317, -53, -480, 737, 26, 525, 168, -798, 507, -493, -78, 1114, -909, 151, 533, -1634, 478, 349, -839, 1128, -430, -601, 324, -775, 291, 322, 112, 715, -741, -329, 367, -870, 1178, 859, -929, 824, -704, -937, 931, -375, 333]
2390C33O49j600M90m08J8J019p01P38l29j386J462j116J26K185j844L41R55k241
2408a309J237N56p81J460o61o24L70j015R84j92j17J443j939P2J048j842J542
2425B32M85j688J871r26j110J456p25K28R46j008O59p62j19Q35p15R38J52j661
2443i12J576o56q37K163j420l19J464j823M06N87o79R80n40Q7J26j253J337j24
2461A63r19J943j559m15J566j731P84J246j558R55j86j126J113m72N40L41q93
2478b08O01r34pJ208j325R18P99k081J067M6j588K174m00o55J031j249K77L85
2496E9m28J091o28j8N04j718J297K85j312K142p45j346J757j516mJ454j171O86
2514C89n0r31P26q08O10N00q97J180r13r14J665j157L03J456j691M28O12j496
$$ y = [333, 982, -618, -128, -536, -518, 501, -200, 538, 209, -1177, 285, -831, -705, 1480, -364, -23, 932, -1309, -72, 484, -297, 1163, 502, -122, 248, -767, 217, 25, -92, 1351, -588, -516, 532, -1310, 232, 717, -971, 900, -26, -1136, 320, -405, -177, 769, -239, 420, -342, -461, 374, -341, 597, 749, -912, 664, 8, -829, 1334, -86, -405, 1059, -764, -358, 229, -450, 530, -10, 77, 203, -1050, 287, 163, -756, 1187, -372, -787, 779, -952, -168, 1078, -480, 475, 289, -837, 276, -196, 344, 685, -208, 393, -541, -548, 660, -665, 253, 1052, -1029, 38, 84, -1504, 670, 270, -385, 646, -603, -326, 59, -369, 722, 94, 76, 580, -1138, 159, 444, -868, 1274, 529, -817, 940, -576, -580, 874, -297, 389, 339, -592, 134, -674, -64, 436, -461, 719, -194, -1108, 557, -600, -297, 1159, -532, -104, 508, -988]
2532i88J277K3m75J017j149J85J76n29J126q68L8J206j900N36R91j655J499n9
2550D51j333J386q94k51R87n19L36j83m85P36q82N37R47j326J322n25j465J848
2568F87p42l84J732j364l2O22j247Q99J82l66N84j268N80p6p16J702o81p60J648
2587A000j744J32J026j471J366N54j310R94o62m65O96j99P04k28o39J008j432
2604f70K66J353j404R01M91j983J227k86p54J619o06l61K88q37N91j31J71Q56
2622G31j150O75N8j292J501l71o89J703j145n77J394j287M35O08o99O00n50k76
2640c31N18p17R55k46p89J164j110l10J825j514M39J034j653P28L44r89J257k94
2658C11l56M51j058Q32k73j5J234j201K04M24j558J109L54j156J396n07j041J056
$$ y = [-988, 289, 312, -163, 854, -295, -110, 66, -463, 663, -205, -167, 1039, -861, -325, 666, -989, 510, 451, -882, 504, -390, -641, 346, -173, 163, -20, -505, 231, -651, -114, 833, -493, 829, 304, -1161, 687, -55, -439, 1293, -71, -103, 519, -728, 171, 353, -13, 571, -697, -117, -193, -909, 793, 112, -648, 1000, -744, -612, 414, -1057, 309, 863, -447, 547, -115, -580, 116, -83, 621, 393, -246, 762, -670, -404, 949, -455, 446, 937, -1046, 181, -105, -859, 760, 154, -207, 81, -756, -165, -296, -125, 731, -419, 256, 314, -978, 523, 152, -537, 1166, 21, -556, 838, -449, -14, 594, -105, 495, -55, -331, 187, -530, 425, 179, -610, 554, -556, -866, 959, -555, -116, 918, -735, -7, 337, -652, 605, 311, -45, 406, -652, 180, -93, -108, 1126, -75, 129, 553, -1005, 104, 458, -698, 698, 191, -850, 206]
2676B06p24L84M77m96N39m98k64M18q47J248K57j270J365r47r12J782r44J90J141
2695A105j320O1J18m92R34l10K27Rr23Q95o24o16J854r73p4J058j744M54P36j216
2715h41J282K00r98O48o05J19M65l49Q53r06q9Q07j221Q14P90j602J050j1j393
2734i87J244m39j58J034q87J30p6m48Q59o07L18O67j290Q86Kj116J621o28m84
2753c59J274j348J74Q26j043P14J05m14L93p06J95M13n51J042p05p98J245j239
2771g82K44J395j374M99M39j347R78k70l6P75n48K52j59m46O43m48J08R33j302
2790d46O65L93j649J480j14q07J334j035m85O95m45L78J92k27M70r45L22M67j068
2809h25J502k47j088J526j071m39J167p40K28Q04j195N18k85k3O50o02P01l80
$$ y = [206, -518, -134, 343, -153, 386, -112, -376, 42, -805, 443, 700, -570, 795, -152, -1064, 718, -226, -36, 1105, -215, -154, -36, -528, 406, 96, 323, 332, -591, 304, -320, -936, 918, -55, -129, 929, -815, -361, 375, -841, 441, 641, -357, 291, -314, -195, 270, -79, 774, -132, -221, 586, -635, 179, 969, -633, 417, 406, -987, 257, -182, -340, 694, -193, -63, -139, -587, 272, -335, -17, 650, -640, 246, 248, -868, 753, 125, -359, 915, -433, -259, 567, -476, 238, 343, -71, 322, -384, -189, 224, -327, 715, 10, -788, 457, -782, -538, 857, -517, -18, 421, -926, 52, -218, -254, 521, -27, 225, 66, -380, 263, -185, -77, 856, -446, 219, 612, -1037, 443, 329, -478, 856, -179, -664, 31, -414, -36, 156, -71, 399, -546, -224, 243, -825, 677, 430, -658, 868, -203, -642, 525, -215, 13, 817, -378, 140, -145, -168, 482, -120, 581, 201]
2827B01r00J198q31k14J461j529L48P92j395Q14N88q76Q06o10k9M57o95N50L9
2846A75k33P40r20J69N98j199J102K76j453J366n69r50J304n03J09M35p29K19
2864f3j22k50Q18q27O57J93j314J314l19q01J668q14o18J160j156R9O94l60O00
2883E59k77l69L75p79P67m3o22J270j008m87J282j552Q58Q19j338P06j81q08R01
2902G3l16P9N96m92M87n12k75R65r69N74N92j460R02J0r54J388m93o63J098j152
2922e22K35K35k17O49n37J28L67j168R75K22j087J309o23o47J372j089o2J282
2940H22j085M99j04l24L93k08J69L20p32O28l27o46J253q50J50R19j500M30N76
2959C83j191J014R9n29N26o61J00K81m16J068o10l32J025j373M10P29j066J069
$$ y = [201, -699, 499, -332, -546, 915, -614, -266, 526, -869, -55, 533, -343, 463, -147, -176, 281, -414, 136, 175, -58, 682, -238, -69, 529, -670, 432, 708, -745, 621, 52, -898, 406, -97, 12, 447, -282, -63, -185, -435, 383, -444, 213, 406, -908, 406, 87, -714, 954, 140, -478, 682, -474, -375, 319, -41, 559, 282, -87, 288, -491, 276, 233, -389, 881, -127, -614, 668, -884, -26, 793, -545, 161, -20, -828, 73, -243, -164, 432, -60, 427, -85, -360, 605, -364, 210, 802, -658, 244, 254, -700, 688, 195, -468, 630, -522, -287, -52, -269, 380, -157, -29, 338, -830, 145, 367, -720, 589, -34, -681, 691, -398, -460, 822, -263, 236, 132, -192, 201, -7, 162, 482, -250, 378, 51, -595, 658, -192, -42, 877, -623, -193, 383, -808, 206, 305, -224, 302, -359, -259, 22, -394, 674, 64, -268, 757, -616, -206, 523, -543, 526]
2977E26m8j202J140m41k71P64o79N54j65n30N17o61K78P85j003Q37l40r28J237
2996C70n27j91J193j127K03M92j041P10K91m97P58o71J65O7p19J125n08m09J005
3015F89j149n1R99j085P48L43j087P44m11j17N58l74N06l4n01O44q19K60J001
3034H64j372P95M04j477J136j18n58R85o26j2K71q55O84O3m15P32r33M56J63j093
3054i06J176j68o75J299r08m55J235j014N09M56p45M83l69l11Q18n55N65p0p76
3073d11Q69q58k15J256r84K95Q12j498P37l9n25R62n03l8M23q44N88q2k29J026
3093G42j032K21O37j357R25M23j108J229m23o30P45p61L29L12m06N06l35k80M69
3112B06q27P64J65p51J052p58o10J427r00O7Q28r78M17nm57P19l40J08L39q20
$$ y = [526, 478, -724, 416, -25, -296, 468, -211, 343, 178, -352, 165, -496, -218, 567, -436, 401, 61, -867, 370, -157, -348, 845, -282, -79, 413, -628, 82, 373, -124, 634, -37, 128, 195, -524, 601, 93, -316, 689, -460, -511, 488, -597, 151, 494, -593, 151, -260, -377, 181, -193, 313, 279, -222, 422, -397, -137, 864, -508, 287, 691, -786, 350, 232, -326, 659, 33, 21, 292, -563, 121, 184, -231, 501, -432, 24, 187, -906, 270, 102, -573, 726, -182, -637, 598, -416, 93, 549, -196, 287, -82, -393, 425, -130, 435, 365, -411, 458, -400, -615, 641, -343, -48, 764, -734, 3, -36, -561, 401, -102, -140, 283, -561, 27, -55, -284, 742, -290, -69, 568, -789, 136, 559, -549, 680, 257, -373, 372, -389, -60, 252, -154, 352, 17, -263, 206, -621, 143, 308, -443, 609, -149, -759, 668, -232, -165, 663, -315, 102, 97, -360, 359, 19, 127, 466, -354]
3132c54P55l24m74J202p53k59R15j391M09Q52j112R01k02o21P72n19o2L55m31
3151c41O84m46m25J116j020M44P46j219P91q7r87J175k53l34Q29q98K22J99n97
3170d01Q65n00M8L43q80N73J38r08J023j57m83R66r67o6Q10r22R40j56m05L74
3190B35o32K50L45m99R92m70p50J079j009K86Q94j184O92K59j051O94k05k13P32
3209D45o47K01M7n56P21n19P3R75j050K93M88j170J095J7q41J168p51k34O79p23
3229b89M91L2m18P00p70P9N37r27P66j11p96J228p53l52J145p62J3O92r50M88
3249D3K9l34P14n02L73l4q10P56j71k27J042j226K96N45j056O10L30q14P95m94
3269a35j05M76p11O52R5o92Q61p05l9O51p04N63M66j300J071l17o55R91n99J18
$$ y = [-354, 401, 77, -397, 805, 52, -207, 708, -683, -274, 578, -534, 367, 165, -456, 316, -203, -265, 90, -341, 343, -103, -528, 588, -432, 12, 758, -461, 330, 243, -744, 431, 178, -156, 673, -225, -3, 196, -401, 464, -36, 12, 355, -525, 48, 186, -722, 301, 144, -339, 627, -340, -406, 404, -518, 422, 266, -139, 235, -397, -147, 198, -301, 691, 221, -529, 550, -459, -173, 721, -463, 229, 488, -563, 131, -74, -287, 445, -202, -1, 46, -510, 211, -308, -235, 740, -310, -17, 471, -699, 396, 413, -428, 740, -11, -245, 434, -289, 202, 234, -184, 516, -254, -175, 362, -565, 201, 90, -706, 522, -231, -583, 562, -200, -187, 505, -445, 43, 72, -262, 452, -50, 323, 289, -521, 235, 64, -163, 879, -347, -51, 494, -562, 48, 378, -436, 359, -135, -240, 236, -475, 177, 272, -420, 441, -264, -303, 348, -356, 207, 673, -627, 444, 127, -528, 463, -136, -18]
3289a8N07p63M10k67l50R80p98L96K67r08P29k10o30J160o89j71R05j072M59J82
3309A19n65Q09l71n5L09n40M85O0o00R96q04j74R94j061M03O83q29L71j75l87
3329c32P22p85K38N20p02N16k93l29R91q29J89N74r28M30N03j153J164l16m71
3348b91Q27p48J65K97m81Q14o96r9N59q19N44K13q18J061o05n33R71q68J01P67
3368C61n40J98K02p12P46n90K40O68p72N54l78p38J109l99j32Q57r05L85L25j106
3388f27Q14o7l73O97o39J73J52n69O45k86j70Q51j262M68N51q69Q65p2p59O30
3408A53l34l9N92m33K31J20o88P89m70P8L45p54O61P5q31R72m45m66J062r29J77
3429a34K54o55O14K19o19P31o23J27K46n65P73k30l24P83p85j06Q52j022R46j48
$$ y = [-18, 489, -274, 136, -131, -481, 499, -299, 97, 364, -544, 185, -25, -655, 505, -184, -355, 550, -522, -63, 119, -446, 363, -8, -63, 246, -294, 191, 251, -349, 647, -157, -331, 663, -398, 5, 688, -141, 230, 55, -332, 390, -395, -157, 363, -339, 177, -116, -445, 546, -283, -94, 480, -448, -18, 485, -668, 496, 180, -291, 536, -212, -47, 250, -231, 583, -113, -212, 347, -472, 72, 285, -533, 528, -77, -610, 361, -507, -406, 361, -179, 19, 221, -491, 255, -335, -95, 573, -199, 355, -23, -761, 348, -51, -183, 674, -231, 154, 479, -627, 187, 120, -253, 444, -195, -22, 130, -439, 206, -80, -250, 601, -661, -193, 358, -511, 354, 282, -477, 153, -181, -220, 372, -61, 170, 290, -398, 391, -79, -1, 344, -410, 251, 326, -505, 467, 22, -444, 618, -311, -134, 120, -535, 79, 298, -321, 410, -213, -86, 160, -405, 368, 138, -186, 597, -188, -294, 558, -464, 482, 334]
3449C34p46O53l83q7O31n72L75j2o46N83m56K3P78q78N64J29q84Q10q2m27Q56
3470E63n40j88N32q37O42K4l96P55q15J88M10q86R22Q9p38P72q21j54R51r22N06
3491E7K37n50N16m17j43L82m53M81Q1n06P67p26k4P96p93L03O59j018O02j6p24
3512d89Q50k41k41M65p27N05M8n24O52o14J92M13q22N79R8n22P68l21m80Q76o00
3533a35QO05o73N41m42j38N20m92L95J89q99Q27j67o89J026p51j44P48p53M59
3553C5K1n01P19l35j44M46n38L25R1m54P49l62l28O33n92K07M21o76N45o4n33
3574c35P61o57J86L37o96O56k06m72N83o19K24O60q74N82j5p17R71l46k27Q71
3594F67r37L04K02o32O99j54l31O32o83K44L29p88P77j53o95R71p95J49N20o96
$$ y = [334, -412, 241, -142, -229, 402, -170, 205, 193, -453, 130, -326, -303, 475, -403, 161, 290, -594, 216, 134, -293, 563, 23, -165, 367, -470, 172, 196, -200, 555, -260, -72, 338, -548, 374, 463, -275, 497, -324, -478, 473, -449, 57, 294, -256, 260, -157, -300, 82, -371, 110, 191, -315, 452, -274, -298, 498, -295, 8, 667, -351, 251, 235, -489, 361, 120, -121, 344, -383, 122, 170, -354, 298, -316, -124, 289, -533, 46, 144, -378, 390, 69, -411, 465, -135, -127, 478, -195, 346, -96, -234, 286, -206, 189, 378, -521, 306, 139, -550, 476, -275, -419, 329, -424, 35, 56, -445, 274, -61, -205, 241, -297, 28, 119, -335, 414, 52, -276, 357, -235, -28, 393, -283, 262, 198, -335, 426, -231, -45, 292, -404, 252, 46, -426, 157, -462, -238, 422, -452, 130, 115, -602, 369, 23, -204, 667, -270, 34, 236, -396, 303, 149, -182, 450, -233, 11, 340, -448, 329, 176, -519, 452, -343, -194, 326, -370]
3614c70M56N1n93O97n32k5N80n36N96k01m88O86m98P2P00q09J74K50m47L69r8
3635C4j35N67n55J01P9l99N40l9o70J065r04J26N13q67P32Kn47O97m98j13L66
3656I5l37M06L8l66M97m05p3M78o09N50M7n99L21n6k30Q01q04K27L74n42J65m7
3678f9j95N83m01j7L20o03O00Pm93Q18n95j81O69p85L94K19n66O73m80j88M39
3699A49m35K95L04o32O86m24k49O34p57L14M96p75N24j51l00O78n64J51K12n63
3719d07N32n5k27N57n36K60J61o47N40k0m04N63k39l72O89n74j4N78q52P49l63
3740h1j50M86n00J79L47n30O19m15k68P39q23K04O32n23L69M2o07P42n34K07K97
3761D32o32K55Q8n93Q38n59M1M10o40L92L3l91P10m07k18N59n52J76K07l56N64
$$ y = [-370, 86, 137, -456, 241, -291, -316, 264, -272, 324, 123, -365, 321, -177, -105, 595, -214, -40, 210, -237, 132, 34, -101, 466, -89, 12, 91, -308, 232, 193, -477, 588, -316, -190, 323, -544, 188, 190, -357, 340, -158, -271, 95, -242, 164, 202, -164, 333, -72, -145, 333, -276, 274, 321, -278, 43, -13, -243, 558, -246, -19, 355, -187, -22, -69, -264, 319, -82, -99, 221, -382, 218, 225, -268, 550, -45, -226, 443, -342, 52, 271, -295, 378, -102, -290, 149, -286, 9, 313, -319, 367, -57, -306, 328, -429, -115, 381, -394, 130, -21, -321, 357, -207, -56, 156, -407, 125, 70, -157, 400, -136, 124, 285, -362, 178, 158, -246, 317, 78, -294, 395, -179, -193, 385, -467, 282, -81, -231, 255, -245, -66, 281, -249, 370, -45, -313, 426, -397, -193, 439, -84, 285, 327, -280, 462, -72, 135, 432, -200, 55, 143, -450, 388, -171, -130, 280, -360, 32, 65, -326, 384, -23, -241, 318, -234, -58, 149, -207, 357]
3782C57k54k03L36l67J29M32p79N70j63l35M95m13J06M31n82L38J23o56O19l43
3802a59m8N69o94L43jm68P84m19m5M73p57K82M07m63M18j39j97M65o07J39L55
3823B38p16P54l01k40M92n31J46N88o80M03m3m84O23l34j00M27m39K54J90m63
3843b16K78n4p0N16n91K16J79o65O64j62m70P72m12m0J88n86N20j08l50Q00n26
3864a17r6L45m38M78o9m00N51m45j21O24p50P26N4n00N72m48n0L32k72J40J73
3885B89p10N17j48k92O97n10K03J43o13N58k6m85O62l76j06K37m67M74M6l84O58
3906C67m20P0J98m25J03M32o59P20l03l46N68n31K70K60n98M84k40k84N87l01
3926d8l7K71k85K00j13k75O66m55j03M26n02K85J84m48N80m16N6N11q08K09K23
$$ y = [357, 103, -100, 236, -131, -2, 430, -349, 221, 58, -277, 218, -195, -89, 342, -240, 98, 221, -435, 184, -159, -207, 362, -332, 11, 10, -458, 326, -93, -138, 335, -422, -140, 267, -196, 222, 83, -114, 351, -256, -117, 238, -478, 276, -25, -265, 227, -304, -158, 430, -250, 153, 110, -374, 249, -85, -185, 242, -197, 57, 247, -216, 62, 8, -62, 454, -137, 79, 258, -407, 257, 95, -375, 397, -15, -55, 133, -453, 67, -41, -391, 409, -117, -213, 132, -306, 172, 103, -297, 254, -191, -312, 312, -438, 288, 342, -158, 414, -34, -84, 248, -24, 116, 289, -421, 96, -52, -344, 353, -157, 46, 189, -424, 134, 108, -377, 285, -91, -197, 40, -427, 47, 93, -291, 367, -53, 17, 215, -210, -107, 325, -334, 386, 83, -263, 305, -226, 44, 304, -294, 190, -50, -334, 253, -48, -85, 186, -99, 101, -12, -287, 379, -76, -179, 247, -255, 30, 214, -234, 346, -70, -14, 497, -311, -102, 121]
3947A21l04M25j27k94L80m44K29K94n57N05j97k63L73l84J76O19q42M04o8l55
3967c09M95m17L15J22l88J76J82n34N56k96J08K37m58J54J56l54M07j02l09N33
3987B74n77L87j98l13N62j52k59M92m99K44L05m81M52p7m22M84l58J39J62l30
4007a65J29M65n47M44k52j14L97n22R4K54n62P63m69j04M98o84L84J02n41M44
4027A4o2m2L33m34R5K53l73M80j22k78M52n10L3M00m31K59Q2l05M08m59lL87m56
4050b79M80p9m54M53j93j20M58n07K51K89o00N90m01r9N98m04K20J85n84M01j64
4071D1j85N16n20O2L03m69L71j10k75N75l99j21L60n96N09K9l13K80J9l90O29
4092C16m84K64K42o63M92n4l14O18n84J85K05l87K74j10j17K76k99o6L94m33L37
$$ y = [121, -183, 242, 115, -179, 201, -243, -14, 280, -277, 228, 31, -232, 141, -243, -67, 552, -290, 114, 46, -309, 186, -231, 84, 206, -182, -6, 176, -358, 198, -98, 10, 247, -211, -57, 99, -255, 152, 50, -259, 274, -303, 84, -114, -427, 135, -17, -276, 216, -283, -39, 266, -215, 237, 160, -262, 222, -136, 3, 165, -165, -36, 429, -118, 326, 74, -40, 357, -165, -71, 183, -379, 384, -85, -189, 309, -375, 9, 111, -430, 14, -48, -90, 243, -191, -96, 157, -216, 264, 142, -136, 316, -194, -161, 239, -192, 67, 149, -156, 252, -207, -210, 177, -279, 201, 122, -332, 121, -72, -192, 266, -241, 10, 299, -301, 289, -112, -211, 387, -17, 203, 388, -196, 205, 41, -144, 372, -148, -86, 217, -252, 119, 9, -266, 309, -90, -211, 149, -447, 62, 91, -222, 58, 77, -313, 316, -168, 96, 338, -325, 167, 113, -201, 417, -167, 18, 223, -164, 110, 0, -117, 159, -140, -206, 188, -245, 92]
4113I2J0m42P90m44j01L48m53K96M3n59P85m92l9M31l74K38J58o81O12j61l01
4134b44M50m55K73J55m26L89j80j73M84l90J18K91n27K67M9m59P07m91Q7L68m32
4155a39J85M0l71O43l82k68N70m37K32K20n43M76l3l79L63l66K15J56k15M2p4
4176f5k08M03k55k9L62n25L63P5k92N66l60j20M86n59K18K01m67N56k06j53M75
4197D66p87L29K80n08N35l41j41M77n15R2K22m93M34O5n02M10o3O4K13m96M19
4218A60k3l75M40k84J54J01m43N70r0m49L61j93j07L97l45J67K24n22M33j84p6
4239h4L46l80R4J21m84N50l0j88M08n59J58K09l90K97J72m51M33l33l3L68m65
4260b41K87J66l39L10k32L4K36k45NJ70k99K44k23r7N68k98r7J92k66K13k7j92
$$ y = [92, 102, -340, 450, 6, -95, 253, -200, 96, 139, -420, 365, -127, -166, 265, -109, 129, 287, -394, 218, 57, -244, 206, -249, 24, 179, -247, 142, -38, -211, 273, -117, 1, 292, -235, 32, 81, -378, 329, -162, -75, 293, -139, 46, 86, -285, 358, -24, -292, 278, -159, 73, 293, -250, 226, 193, -186, 177, -189, 26, 182, -33, 9, -65, -273, 130, -125, -154, 208, -317, 46, 121, -171, 395, 35, -85, 401, -158, 60, 261, -206, 350, 144, -9, 466, -321, 8, 288, -220, 315, -26, -167, 310, -205, -113, 109, -384, 50, 115, -387, 23, -40, 24, 237, -259, 160, 137, -238, 202, -82, 72, 173, -270, 300, 210, -239, 122, -71, -178, 219, -126, 41, 265, -257, 176, -8, -84, 262, -118, -24, 97, -387, 163, 133, -55, 353, -206, -48, 161, -229, 68, 240, -211, 222, -111, -144, 224, -241, 46, 212, -127, 183, -49, -15, 221, -24, -19, 151, -148, 96, -127, -224, 344, 46, -51, 141, -125, 88, 61, -131]
4282a31L38k64Q1K39m43L23J91n08N10l35k57K73l99L70J31j78K34k20j66L38
4302A27l68K42J52l29M64k85j74M36l52K16J51n72L81O9m61M99k98j8M46n34J91
4323a7M5l70N41l48J22L16o22J73L21m51L12j1l05N15n67M14P0l05L54k79j32
4344b24M31k36P7K59m53L25j28k83O94o19J11L70o01M03R6n73N45m37K40J67l77
4365b13K17j0k73M34k64O3L38n35M27jl11L90j35l66M84m34K21J85l16J57K8k53
4387a67L70k80l0L65l75N4Pj90M06j71j7K49n01L47N4l30L33j23m3K64n21L11
4409A2P3k65N12l14m6L98o25K08L77n23L21Lk95M72l66qL66l47L1n0j21K99k15
4432a03j08L88k89K21J79n12M51j36j96N26n82K31J87m35L89k12j32M28m26K24
$$ y = [-131, 207, -57, 24, 263, -180, 143, 334, -174, 336, 1, -256, 17, -382, -12, 119, -59, 175, -45, -211, 127, -241, 1, 153, -176, 288, 3, -171, 265, -87, 129, 280, -292, 89, 158, -303, 196, -102, -120, 326, -208, -17, 28, -342, 199, -149, -27, 289, -333, -160, 161, -290, 22, 11, -294, 221, -346, 68, 138, -167, 187, -92, -224, 207, -29, 48, 307, -146, 179, 51, -232, 462, -157, -46, 324, -277, 126, 222, -351, 194, -243, -3, 164, -213, 4, -6, -279, 155, -109, -46, 292, -243, 184, 183, -128, 262, 127, -239, 245, -189, 32, 217, -99, 58, 86, -167, 203, -77, -107, 258, -117, -63, -56, -246, 160, -11, -28, 221, -280, 67, 121, -209, 124, 1, -42, 222, -299, 12, 85, -180, 332, 18, -28, 370, -255, -47, 330, -193, 128, 131, -164, 308, -58, -66, 300, -47, -16, -66, -187, 112, -103, -211, 177, -112, 109, 288, -224, 227, 91, -105, 421, -161, 70, 257, -178, 211, -1, -133, 295, -131, 93]
4452I3n9k15J99J84l64M70o15J28L04k00K12k9k80K19k29J88M01o30L63k3l06
4473a89M72l48K2M85n57K44M8m16L28p4j86L82l05J34J04l44R4K71l28M08m92
4494b47J25K75l94M71j92j43L53l61O7K35m80L24M7j77K67k60l0L05k86J30J27
4515A56k07J24j32l36N94l72K23J98m93L55j68j45L61j80QK85m36L22k22K1K82
4536B38j46j67K45n14M45q7j82J86M2k88K28j36K58p0p7J66r3k88N64l94OL28
4558B64m34J64Pj89M87l10R8J63k90R6R7k57K96k11rK14l29J66j18j9J74r8m9
4581h7K51k25l0J00k04L64k59o0L58k70Q7Nk90M55l49j08M15l34O1J67k5K5Q6
4604A33k92L87m14R7K76l85J73l0k03L90r7j89L71m46K66L3k16K58p5j94L03j18
$$ y = [93, 34, -181, 18, 202, -162, 308, -307, -179, 125, -75, 137, 108, -172, 47, -182, 6, 407, -223, 140, 117, -189, 283, -65, -43, 442, -115, 129, 177, -239, 89, 15, -171, 211, -94, 40, 144, -200, -106, 165, -163, 245, -247, -122, 153, -241, 230, 38, -105, 248, -113, -46, 189, -291, 33, 80, -97, 170, -90, -120, 185, -101, 29, 156, -51, 73, -59, -395, 199, -173, 50, 248, -245, 110, -58, -203, 158, -22, -14, 271, -165, 157, -65, -44, 238, 92, -75, 170, -344, 101, 14, -168, 18, 60, -228, 0, -136, 122, 52, -25, 141, 48, -240, 324, -70, -64, 264, -170, -6, 1, -188, 299, -11, 87, 250, -40, 56, 153, -104, 192, -19, -28, 186, -143, 23, -95, -114, 60, -38, -87, 164, -61, -91, 9, -195, 169, -90, -150, 208, -62, 25, 30, -260, 195, -154, -262, 153, -181, -120, 47, 22, 47, 133, -159, 228, -186, -89, 187, -198, -25, -55, -258, 132, 35, -154, 217, -229, 37, 70, -146, 112, 37, -157, 146, 28]
4626B8j60K08j52K19k24j38M72l76L1L17k67K03j86j32L35j85j29K40k29J53j3
4647A5k51L80j10k43J57j50K24O9k29L28j06k51L87k07j90M68l91J19J42l24L10
4668A47k65L6K94l73J92m7r0M93n76o1L31j60P1%j00L66l03K8O8j29J97J81l82
4691h2L41k34j32K99j86P3J56l27Q9M5k47L75j99l8J6j04J10K08l76L28j62j2
4713e9J68l93L22pl03N38m13rL32l24K40mk09K29j47j17M91n24K47R8l91L63M7
4736A75k71J47l0L6l6k41K86r0N1J45j08j2k5j6P9K1j64J17q6k4L69m37K07J47
4760B40l03L02m00j17M69l85j3K82k67K14o1j28M88m30P0K55j78P3K5k27J92r8
4782CJ1K13k49k6J5n8L28k69k2L28k89J43j17j38L66l32j07K43p8q6K72l28K41
$$ y = [28, -132, 76, -76, 143, -81, -219, 253, -123, -92, 225, -42, 161, -25, -157, 178, -7, -136, 104, -125, 28, 15, -236, 144, 34, -209, -52, -202, 22, 91, -138, 190, 84, -167, 220, 13, -177, 291, -100, 19, 161, -163, 147, -118, -82, 212, -161, 31, -16, -106, 387, -189, -250, 81, -79, -8, -8, -108, 258, -45, -17, 51, -78, 119, 300, -82, 259, 25, -107, 192, 6, 79, 235, -92, -3, 42, -205, 170, -29, -67, -51, -155, -45, 163, -213, 115, -47, -59, 109, -284, 38, 31, -272, 266, -147, -156, 176, -148, 92, 88, -121, 108, -39, -156, 335, -189, 58, 156, -235, 128, 175, -96, 51, 21, 57, 21, -220, 66, -24, 27, 172, 64, 52, 27, 11, 90, 111, -53, 64, -22, -46, 323, -114, 93, 240, -63, 239, -161, -278, 191, -194, -207, 75, -192, 22, -39, -167, 321, -109, -39, 216, 38, 111, 136, -91, 101, 3, 14, 227, -22, -48, -33, -91, 237, -32, -54, 274, -15, 128, 11, -127, 239, -93, -200, 43, -35, -121, 151, -177, 64]
4805F4Nl24L81j40n2K49l45K44J7k78L17j33j93L83k95J79j48j27L25j70j08K98
4827A49j43j07J20k43L66j53k06M28l66J00J16o2j26R9j69L71l87Q8K61l21M58
4848B73k08r4J77j54j5L07n36L32q2O5K2k08J11O8j07J95q2r0J26O3k40J31k64
4871b10K67L8m07M01j41j25L26j38O1J36l97L64l8k29J72k44J62L0o0Q6j13o8
4893a27K24k01k7L34l66K30j80j24M17j40j90K73j35k4K4j89L27j63j04M29m78
4914a90L36J29k09J9j23l9L32l38J54J69m20L6J87j83K63j47j82L49l42M9J10
4935d0q4K66q0k83K81l0R0l9k66K26J34l41K92j60J9K66l32R8p7j25K90j29n1
4958g5J41k85K74k5k82M63k15j66K80j22j2J67k81L10j64L8J65l04J95o5oJ37
$$ y = [64, 69, -255, 126, -14, -66, 183, -162, 82, 99, -179, 138, 5, -188, 195, -100, 79, -69, -196, 129, -41, -149, 149, 6, -101, 19, -224, 142, -11, -217, 211, -155, -55, 61, -1, -127, -28, -197, 174, -213, -125, 136, -185, 273, 65, -29, 148, -6, -21, 286, -250, 82, 0, 65, 87, -121, -10, 58, -49, 146, 64, -26, 100, 163, -77, 54, -210, 57, 95, -312, 89, -52, -177, 149, 11, 72, 208, -189, 175, 137, -92, 80, -164, -2, 28, -32, 54, -59, -127, 97, -104, -131, 203, -163, 67, -113, -237, 180, 40, -150, 123, -12, -36, -12, -201, 126, -37, -141, 288, -190, 146, 275, 66, 85, -38, -77, 255, -83, 71, 240, -180, -144, 43, -140, 123, -24, -206, 143, -199, -150, -40, -124, 142, 62, -221, 60, 30, 120, 81, -185, 41, 175, -166, 126, -34, -15, 251, -81, 17, -60, -185, 105, -24, -75, 66, -219, 55, 30, -252, 211, -4, -170, 110, -12, -24, 143, -138, 172, 8, 46, 211, -93, 102, 37, 31, 168]
4980A68j86l3K25l39J61K77l44p5K00k10K71mj15L2j45J31o8n6J39j85K33J96
5002B73m27K09M6j89J03Jp9K38m04J57k4Q6p6J51o4Qr0k40M14k20J33o7j22L08
5026A25k15p4K17j36N7M1J1Pj07R8K22m21K12N9k49K49j30j22K77l70K02K65l92
5049a74K61j1j75K14k37J80k03n6K60j19J68P5k61J24J14j51J03pj48J99j40P2
5071H8J42k88Q4K7j94J89j11mJ43o1M4j45p1K91o5k36L75l34J01J61j96J84j70
5094d6Q5K11k39m5K9j28L21j27n9P7j96R8J40k65J93mk26J01K7k3J39m2q3J16
5118E4k06L29j99q3K42j78J8J19k24J87q7k8J37m7k02L99k82J82o7j57J20j05
5140g8J32J9j90J78Q1k71K88j57j97L61l25J81l0j66J25Mj93L07j31J67M6k16
$$ y = [168, -18, -51, 174, -165, -4, 273, -71, -146, 54, -156, 115, 111, -4, 28, -117, 14, -54, -110, 29, -156, 77, 273, -154, 55, 101, -88, 15, 16, -63, 175, -229, -72, -96, -10, -86, 65, 1, 9, -81, -321, 93, -127, 6, -61, -183, 125, -90, -164, 53, -83, -26, 15, 26, 33, -74, 24, 246, -175, 37, 96, -153, 96, -34, -156, 121, -249, -47, 218, -174, 87, 76, -99, 115, -122, 58, -145, -201, 59, -60, 108, 183, -78, 46, 160, 9, 112, 105, -43, 156, 16, 88, 230, -58, 26, 53, -141, 48, -63, -67, 76, 15, 59, -86, -157, 134, 69, -167, 208, -126, -25, 136, -60, 124, -46, 39, 250, 11, -34, -5, -133, 188, 61, 2, 79, -117, -19, 121, -144, 49, 45, -181, -80, -53, -76, 63, 21, -62, 54, -152, 177, -22, -105, 137, -41, -23, 96, -128, 59, -28, -56, 81, 34, -168, 231, -51, 131, 64, -93, 27, -78, 54, 73, -117, 61, 142, -129, 159, 2, -195, 166, -159, 22, -8, -174, -49, -45, -238, 69, -62, 105, 151, -65]
5162f5J24j04l5J11J2K3P2m19L03o8k9K33k22P9P5j52J62l9m4J21m2k38K68k26
5186a00K8K30l09K47j20j2N0K4j00J96l60J90L6QJ04j35j55L68l73K63Kl39M27
5209A70k31q4L28l71K74m1k5L0j76N6J58j93J73P8k70L07j78j44K62k92J32J19
5231H2j68J73J8p5N3k21M7Q5n3N9j05M9J21j15j00K35k99K95j7j13J63q5l38M00
5255I1j78O2J40k61J94nJ41m2k81J6J93j28K22k28p5L37k30n5J30j28K02k56J76
5278C7J5k5J2l8j00J26m7J06r8K4j06K45j58p9M3o6K20j69p5J69r3P6j6j13J49
5303C9m7p6J71j71JK03k55L39j56j99J40q9J03J92k52K4J4J18l4j50J88qk86K29
5327C8P4l50N39l41L9J90j90O7k4k47K43K8J00m1q6n9Nj94M58l65j5K06l7q4K68
$$ y = [-65, 59, -45, -80, 31, 43, 66, 138, -281, 22, -46, -75, 158, -64, 15, 90, -62, 100, 61, 17, 138, 96, -142, 126, -100, -72, 158, -151, 96, -24, -36, 14, 38, -62, 134, -226, -36, 0, 8, 112, -23, -178, 190, -183, 80, 82, -257, 170, -61, -145, 183, -188, 86, 45, 20, 50, -126, -70, 88, -105, 68, 146, -124, 183, 5, -139, 123, -169, -37, 82, -86, 87, 105, 30, 83, -138, -91, -6, -59, 0, -105, -56, 65, -50, -150, 85, -214, 81, 64, -49, 114, 29, -309, 91, -87, -25, 115, -146, 48, 43, 184, 142, -139, -123, 70, -58, 164, -64, -139, 198, -32, -87, 43, -85, 117, -139, 37, 52, 27, 39, 1, -99, 27, -20, 86, -12, 12, -94, 151, -7, -86, -43, -109, 111, -58, -133, 36, -57, 19, 3, -110, 39, -8, -84, 87, -84, -83, 120, -135, 204, 48, -151, -11, -100, 3, 195, -57, -33, -19, 99, 65, -85, 103, 95, -191, 38, 112, -238, 301, -40, -1, 189, -1, 66, 42, -205, 38, 66, 166, 125, 39, -20, -15, -209, 249, -116, -131, 75, 38, -46, 222]
5352B22l40K30o5j15K64j20j59K51j68j09J94l55L29j91K22j10J6Q3M1j31J55
5373A44j26j18L33k34mJ49l24K92k06m6L45k10l8O4j91L86j76j64K89j44m4J1
5395a2j49J8J89q0J02j79j17K22k06K60J13k53J75j0k00K44l1o9J73k10j7O7j75
5418a45J89k08J45J68k08L1o3J3J90r8k19L00l50L07Qj87K39j76j26L03k19Q8
5440a8O6j38K09m6k02K15q4p6J45j39J64j96N4J67k87J70K8J1j0R3j10J60j41
5463C5j51K85k21m8J65k48K94j74J25N4j30R3O4j20n4l7J7J45k24O8K13k49J25
5486B7j31j1K89k69J03J11k78L41l06J94n6K8k11L22k93M56k74o7J20j85K50j91
5508c1m2J66q1k28K40k08K52N9k89N7L40l52J34P4j43J81j43L4O9j45R1l7j21
$$ y = [222, -118, 112, 47, -68, 196, 76, -83, 168, 0, -109, 85, -270, 59, -132, 90, -20, -4, 79, 120, -11, 144, 18, -100, 233, -1, -5, 144, -180, 112, -94, -140, 205, -5, -43, 21, -170, 216, 40, -124, 165, 21, -23, -12, -161, -143, 46, -34, 68, -111, -228, -6, -212, 48, 161, -92, 83, 73, -127, 117, 86, 17, 190, -20, -37, 30, -145, 44, -164, -19, 149, -59, -28, -91, -78, 112, 14, -205, 95, -255, 52, 60, -127, 112, -64, -190, 113, -106, -18, 48, -90, 119, 73, -129, 86, 2, -74, 71, -68, 96, -100, -46, 121, -166, 4, 32, 43, 33, 126, 16, 176, 35, -116, 169, -52, -100, 65, -183, 111, -63, 62, 116, -14, 79, 143, 23, -31, -68, -51, 94, -130, -62, 151, -98, 27, -104, -115, 174, -95, 8, 119, -159, 182, -124, 70, 14, 42, -169, 153, -140, 316, 42, -25, 95, -90, 160, -31, -73, 93, 12, -216, 24, -184, 68, 127, -162, -105, 235, -117, 17, 91, -52, 129, -14, 20, 89, -56, 35, -2, -123]
5531a23J77m8j36K02k10K94k26r4J79N5k43L24k76RK45l21K82N8r6K0m8RP2l6
5555F9j17R9j89J55l6N7k2j28J79K5k69K89j71R1n7j1N4m5N2N3o9l8J34j03l6
5580c4l7L0O2j09R7K01l50J77K5j30J18j04L4j7J46j39J11k62K16N0j83N3Q0p1
5604c6J50j43O0K05k95J23q7j58K91l06K05m2p3K76k06j32K24j62R7M8j60K02
5626H1o6L9rl8j31K97j87J49k8j33J10j91JJ53j22J64J00k55K39j70r7Q9r9K32
5650A28r0p8M6n9K95j12j69J00j40RK48k36J61k9N8r7J13k45J07j19J26J0j18
5673i1J10L6j46L8J53j80K35j40O1kj95J76J5j79K41j65M5J71m24L21j4l9M2l7
5697C2o5J6m3R4R2l39J84J67k60J60k4O2lj39J15r9N3jJ5J29o6j63K43j10k01
$$ y = [-123, 54, 6, -130, 72, -138, 156, -70, -164, 15, 70, -173, 151, -125, -116, 129, -192, 90, 148, 52, 72, 24, 33, 105, 69, -48, 51, -138, 17, -19, 38, 16, -112, 67, 92, -177, 112, -59, 32, -25, -36, 18, -27, 25, 78, 9, -29, 105, 2, -34, -71, -41, 21, -88, 9, 210, -140, 37, 62, -68, 50, -54, -20, -37, 109, -30, 81, -181, 35, 85, -98, -45, 35, -36, 114, -29, 31, 236, -59, 64, -23, -181, 110, -196, 9, -33, -106, 170, -36, -168, 56, -106, -9, 39, -121, 81, 15, 54, 45, 7, -124, 173, -14, 135, 107, -26, 84, -107, -106, 47, -75, 89, 189, -66, 173, 3, -94, -5, -104, 128, 38, -40, 6, -53, 242, 130, -39, 61, -79, -70, 178, -58, 103, 74, 132, 35, 148, -97, 10, -109, 17, 27, -91, 19, 55, -91, -53, 100, -80, 155, 15, 76, 74, -121, 55, 70, -109, 132, -33, 12, 183, -241, 80, 66, 27, 69, 32, -33, -17, -60, 34, 126, -213, -29, 138, -122, 38, 14, 76, 73, -66, 49, -50, 3, 2, 17, 146, 80, -83, 160, 50, -151]
5722a51K18j02R5j8j04n7L11k00P4o0o1J32m6k0k3J1P7J40j33Lj65N8j1j24J77
5747B1J17j28J9j87J89P8o5l9l9l3J02n3k9K80k93J69k6o7M7p7k4J33p1M0Pm7
5773B4%j1n6n0J84j22O4m1m4P7o6MM7L2n6q0P1p7O8K36l63J59K2j14p0K51j80
5800i1M8PK8j1L4O0j7J0K8l11J04K68j46J71j97p2J92j67PK2o6M8Q4L4j1nj93
5827a42K43r7J09q5j40K00m4r8K87m22K51l6j07J01jl8K39j45k14L05k79J20J88
5850A95l74J03J47q7K0N3j01L9p3K39k36J00O2j20J15j07l9O4r1l7K40q7m9R7
5874G3Jj03j19j9K89j72j24K36j18J62J37l38J00O3j36K58k33N1J88k58J82n3
5896F7j32J68q5K42k1l13J05m5K2k1N0j40J68j25P7J57j48k9j8q6N9J35K0P5k38
$$ y = [-151, 67, -35, 60, 42, -62, -119, 192, -8, 66, 6, -55, 77, 31, 11, -12, -1, 76, 216, 83, 86, -79, -21, -32, -156, 21, 138, 10, 29, -158, 31, 109, 44, 5, -34, -67, 35, -18, -47, 233, -60, 109, 83, 16, 63, -14, -38, 95, 24, 64, 71, 24, 24, 13, -43, -93, 91, -31, 33, -8, -52, 25, -41, -37, 10, 42, -14, -94, -23, -100, -32, 204, -159, 0, 22, -92, -162, 89, -91, -43, -36, -8, -19, 15, 75, 58, 68, 96, -215, -111, 157, 11, 182, -15, -87, 105, -62, -55, -33, -99, -51, 33, 67, 56, 51, -142, 101, 4, 113, 28, -112, 88, 44, -54, 233, -189, 62, 26, -81, 20, 19, -19, 220, 75, -139, 166, -113, 7, 195, -179, -76, 71, -16, 4, 57, -44, -5, -78, 161, -75, 25, 87, -33, 82, -25, -64, 0, -91, -128, 112, 25, -24, 73, 74, -29, -148, -167, 122, -50, -174, 62, -56, 106, 243, -95, 5, 68, -68, 190, -43, 8, 196, -62, 120, 67, -65, 103, 18, 260, 239, -74, 31, -14, 8, -13, 37, -103, 65, -60, 17, 174, 26, -3, -21, -107, -48, 87, 107, 182, -56]
5921e6K83q0j17N7j71J64r7O7k8k41j38L57RJ4J29j09q8J21m5rp1J96j34j40K07
5946H0L6j04K7k4Qj44L5m1R1J97j25J02k58J47J50j58J74k63J23P8k02J78k3j22
5970c8L9j0R9j37n6K78j31m0R9j71j2J72k81J45O9q9J39n6J3%j68J71m0o5J71
5995A01j51K6Mk4J17k41J31J87k44Q3j3q0L8J33n4M1j69N9L32k16o5qO7P6j9j17
6021fK64l39Q7k1n3J52j2r1Q0j41J83o3j34J07K77k81J5qj16K7pJ61pLn3lj64
6048a43L51k36o1P7k66L52p6J1Q6k1j38J54k61J11J8n8J40r7K25m4j23Q4j21J83
6072A47p8k23O6K13k27J03P3k38R7j8P3r0J48l8j92O5L2J05j34K48j29pN6k29
6096a77K76m2p6kLL8J40j26J3p8m3K5l4J3Q7p4Q0j50K03k8n0p0M6lLR6j04R3j0
$$ y = [-56, 227, 147, 30, 87, -84, 80, -17, 50, 22, -219, -357, 0, 9, 23, 152, 43, -45, 76, 31, 22, -49, 147, 13, -127, 80, 116, 12, 39, 15, 23, -121, -86, -127, -36, 161, 36, 138, -120, 27, 177, 19, 193, -70, 53, 131, -71, 107, 84, -38, 1, -9, 90, -47, -103, 175, 44, 4, 103, -68, -80, 92, -189, -44, 25, -64, 75, 19, 32, 32, -136, 35, -5, -70, 101, -50, -24, -20, -44, 73, -168, -37, 150, -94, -11, -24, -104, -66, 67, 13, 54, -115, -56, 276, 60, -5, -13, 54, 130, 111, -6, 258, -81, 6, -15, -68, 84, 72, -19, 61, -80, 103, 40, -94, 13, 290, 9, 24, 16, -100, -73, -80, 81, 74, 77, 24, 21, -143, 208, -28, -89, -12, -278, 74, -2, 9, 95, 74, -64, 90, -171, -60, -42, -100, 40, -57, 168, 124, 1, 85, -36, 147, 69, -154, -88, 125, -102, 1, 74, -164, -67, -85, -12, -102, 46, 8, -184, -119, -87, 18, -116, 132, 3, -4, 52, -177, 99, 57, -19, -21, -18, 20, 160, 34, 47, -31, -74, -49, -83, -70, 17, -57, 23, -127, 76, 48, -2, -72, -26, -29, -26, 70, -34, 59, 49]
6125D9k20J50m8J24N6j11j00K21p0j0J7k9j39O2J34Mj87J1Q4j02J80j52J4K70
6149B08j60J6j73J21J34k08L0n6j0J56O2k77N4O2O2N5o0q0J05p3j0p3M7K70j76
6174B6J41j88o7L18k38j52L05j75L5M5j65J54m2N4j20j35M13n9k03J49k03mJ01
6197a0o2P6P4k47K05j4JJ50j48q5m8QJ96O5k10J50j46k7J16j29Q9M7j60J28k17
6222a98J33J03j16K12k18o5K92j26j29J26j35k8J68j18R1N0j00J7o7J57k0j32
6244a03P5J7l6L7j05L6K27j67lP6p3J63j32KM2j25j6K33k00K5M9j3pl5q0K06j63
6271g0P9k24J57J67j85K49k08K8k0m2M6N4j76J93j14o6K64On5p4j09J90j16l1
6295e7J76kj55o7L3J72j51k3L36k53K5Nj39J18J20j49qn3j7J25j61Q8J73j22N1
$$ y = [49, -171, -21, -69, 55, 111, 0, -100, 121, 51, 41, 58, 29, -110, -48, 86, 90, -97, -86, -2, -104, 76, -76, -62, 208, 48, 64, -109, 12, 146, -62, -32, -88, -98, 58, 120, -157, -103, -41, 21, 76, 16, -64, 41, -32, -42, -115, -68, 202, 26, 167, -21, -88, 230, -8, -160, 145, -30, 5, 50, -115, 39, -3, 51, -69, -204, 209, 150, -53, 96, -107, -111, -10, -72, 4, 78, -169, 36, 22, 23, 173, 25, -60, -108, -100, 96, 161, -49, 101, -45, -72, 44, -85, 4, 51, -109, 19, -198, -65, 38, -78, 134, -84, -149, 143, 17, -112, 14, -121, -149, 19, -99, -8, 42, -58, -41, -108, 49, 29, -103, -28, -11, -47, -10, -115, -79, 148, -19, -22, 54, -19, 144, 12, 14, 56, -69, -85, 148, -52, -27, 22, 9, 2, -33, -113, 93, -70, 9, -215, -58, 109, -76, 173, -35, -7, -27, -69, -23, 31, -145, 48, -66, -132, 132, 138, 83, 9, -100, 90, -26, -57, 119, 117, -38, -105, -72, 100, -51, -74, 262, 9, 34, 39, -100, 18, 138, -11, -19, -72, -89, 36, -125, -37, 136, 14, 65]
6320F5m9L6kj14J2P0p8Q4m1M3J4k2Ml9N3k29K45j5N5o5j6M1k23J2L02j0j59P5
6348D9k91K90Ok1l5Q3k3J5r7J4L9j44K39k42J7K46j01l4Q8n7M2j57R7L6r2K1R9
6375H7j72k8R8o4R8j9k5Q6j92J26l4OQ0L5k6M9j21j38J97k52K41R3l6j68KJ9L0
6402b8P1l8PL4K5j27J4j13J07J30m5N8J1j80n3K91l61K10K8K2n9n2P5j4j95J63
6428a9L2n7O2LK6R4j98J04k07nJ36J13mjl16K49J45j48K4q5k28L25j77O8n2J2
6454a04N1o6R7J37q0ok2q3Pr3M9K42o4l41K65m5LP2j09J25J6o4Q0m3j29J32j6
6481A1j0j0m8K03k03J05N6m08L86K0j52J17k07J76k9k90K89k5jrmk8M3Q6j54K49
6507A63k53L8J48m5P0j12R9rk38K5J11K9J19j68j8J93k69P7R2j39NK31k33J60
$$ y = [65, 16, 52, 50, -64, -52, 18, -60, 24, -17, 26, 40, 18, 22, -17, 36, -193, 52, 37, 92, 27, 11, 52, -171, -159, 143, 133, -26, 49, -242, 48, 54, 33, -2, 81, 58, 73, -24, -10, 29, -115, 124, -118, -101, 145, 44, 10, 98, 41, 83, -74, 23, 59, -33, -12, 87, -85, -113, -15, -79, 19, 0, -25, 61, -131, -5, -39, -33, 47, 82, 56, 105, -16, -154, 43, -209, 32, 125, 89, -79, -77, -58, -28, 43, 5, 12, 46, 71, -56, -42, -155, -48, 82, 37, 95, 106, -74, -127, 164, -197, 13, 41, 63, 4, -48, 27, 13, -182, -19, 13, -44, 18, 21, 47, 141, -57, 47, -160, -165, -29, 84, 80, 79, -237, 12, 157, 9, 33, -52, -280, 45, -132, -64, -116, -104, -53, -119, -22, 115, 35, 29, 7, -76, -69, -162, -113, 129, 65, -276, -11, -56, -53, 19, -90, 35, 51, -13, 67, 24, -105, 27, 11, 1, -9, -57, 146, -57, 48, 104, -304, 82, 102, -50, 67, -140, 36, 7, -283, 6, -19, -20, -29, -33, -61, -18, 68, -86, 163, -90, -52, 96, 51, 121, 9, 108, 99, -139, -114, -3, 26, 145, -23, -41, 152, -117, -40, 52, -87, -82, 149, -84, 76]
6531G6j14jL5J45j22j52M5K02m5j9P2p7J14j76j1J81l34J01P9R0J19k17q4K51
6555A58j62J19j51J25k05O7p3J42J31j09N6j03J94M2l11J27j92J85M4r1j19jJ57
6578C0M4K2k06Q9r1J4J19Rm0L3J8J07l11Q5o0P7j6R7K2j3j78J41K6j37O3%PN2
6606CO2O5j26k4Q0K6j33K38q5j19K8j47Q2mR6m2R9r7J28k52J25J06k66L54j57
6631D0l2J20l30N8K59k17J45J5j27J29lp2J45k82Q2Jj13K49j36J7R9k61J94M3
6655B3j88J76P8j72l7J65j5m8j09J84M8j20J40k54J23J81j43jj18j2K21j15r6
6678h9J28q9pO0R9Qj69j1O0n0O9Q3j58J38l5j44J38L3j78J56j01J5%P4mj76J08
6705d2J98k41J43q9N2o6K1Q9j73J61o0ql1P7j45Q6J94j13j10N2j9J8J30m2j40
$$ y = [76, -38, -39, -4, 141, 19, -133, -88, 114, 69, 50, 122, 45, 159, -17, -28, 153, -181, -80, -1, 89, 208, -9, -93, 158, -4, 115, -36, 89, -116, -49, -122, 20, 151, 42, 98, -5, 189, 231, -80, 47, -145, 40, 84, -7, -126, -127, 30, 74, 96, -110, -21, -112, -98, 21, 30, -10, 23, 41, 148, -163, -78, -138, -61, -77, 20, 42, 29, -149, -8, 18, -119, -56, -56, -49, 3, 65, 130, 4, -20, 60, 86, -47, 191, 106, -13, 15, -132, -50, -54, 42, 0, 99, 2, 130, -122, 3, 109, -157, 197, 40, 8, 128, -202, -144, 115, -102, 43, 58, -69, 60, 57, -15, 130, -152, -70, -69, -182, 67, -69, -52, 47, -214, -20, 23, -165, 11, 89, -83, -120, 45, 30, -18, -127, 57, 105, -15, 125, -129, -6, 175, 32, 31, -87, -99, 122, 7, -89, 39, -50, -57, 3, 102, 110, -59, -70, -10, -60, 9, 92, -66, 72, 37, -107, 31, 64, -114, 42, -59, -44, -44, 30, 26, -150, -42, 156, -85, 58, -31, 21, -45, -24, 65, -108, 53, -7, -15, -46, 31, -114, -28, 166, 53, -57, -5, -24, -6, 124, 82, -58]
6730e8N2K3J06k29J10j33J21j4Q2j31J53k13N5J17k08L30k46J65r2L7j7O5k09
6753a34J65j00L4J06k32J73N1q7J99r9j29J56k00O6r6J34j02J69j6O3j15O5q8
6776a7K5k4Q6j03J15o6l3R1j27K41k47l8K44j64j09J82o1O8j54R9Q3j04N5n7N
6801a0J44j55NKR2j03mlq2J37j64P3J57j51Q7k5k01K18j5Q6l9M1q3r9J55M7J91
6828C01j77j67P1J84k54R7O3l17K39m2r0J34j59J28m0m5J16n9oO8l8R1j0j82J36
6853D2L2k82K74p8q7L04k35lJ16j30N5o2j28L01j22j94K50m4N1j20J21r5m9O5
6877a8K03o4j51rl3J34m9K3O1j21o4J42J6N1j46K7q6J61j42K31k38K1P2J0l9Q7
6903G9j21R2k29J29K3QP7P3J53k49K5l6N4m4P6j31Q2L8j68J00l0K5n0J40k03K10
$$ y = [-58, -6, 17, 123, -106, 4, -129, -8, -22, 60, -71, 82, -131, -76, 41, -167, 163, -83, 82, -10, 27, 10, 75, -134, 31, -69, -35, 71, -161, 12, 63, -24, 175, 76, -53, 103, -97, -31, -127, 7, -95, 74, 58, 121, 6, 71, -17, 8, -16, 70, -33, 82, 16, -17, 74, -53, 188, -59, -97, 147, -17, -126, 56, -5, 63, -91, 8, 91, -13, 42, -15, -10, 134, -21, -16, -14, 78, -25, -29, -32, -114, 23, -141, -68, 89, -62, 25, 0, -201, 17, 2, 88, 49, 90, 7, -92, 63, 110, 301, 124, -43, 28, 212, -42, 55, 118, -199, 40, -2, -92, 42, -117, 11, -29, -74, 42, -17, -23, 45, 7, 98, 88, -94, 42, 74, -208, 66, -12, -99, 205, -30, -33, 83, -47, 8, -54, -182, 119, -3, -197, 53, 9, 60, -60, 61, -34, -83, -18, 185, 121, -30, -39, -72, 62, 13, 36, 97, -24, -88, 54, 70, 121, -25, 2, -84, 77, -65, 166, -72, -51, 21, 31, -8, 79, -42, 50, -179, -50, -27, -19, 58, 131, 284, 35, 60, 24, 78, 34, 110, -21, 61, 99, -69, 31, 1, 26, -24, 116, -87, 123]
6929A23j09k29J57pJ40Kj30P5m5P4j39J6O4J77k87K42k50J10p4R6M0K1j27r2J61
6954Im8J78n2j9k07J88j15N5m7l7J89k51J77j00QM1mK00k21R0k5j39J18K3N8J8
6980H7j42J11q1M6j5M9j68K02k40J16J46k49P6Q1L2K1k99J59Q1Q5j95N5l2J49
7004G5R2k99R4M2q2J17j14J08l6M5k08L4k2K21kj01J15j26O5q4M2J24o2k6J3L0
7030E5m5j41J71Po6K1O1l8O7L2k08N4L7r7J93n0r8J0J40j01j67K05j1rr8J26j08
7057e8K7QL7L0j04J22l8j30R4J39j28j1M9j52K23j73M4J34o9Lj26j3J22q4J90
7082A36j22p5R9j9o9J27j90P4J65k18Q6O2q8jrj2R4J0j96J85l6j8q2J97j11j50
7108a61K49j50q4J18j63L27k67Q7O0j7Q2k20Q1l6J36r3K1R6l7Q7k13p1L36k66
$$ y = [123, 14, -215, -58, -65, 75, 77, -53, 22, -23, 51, -88, -72, -8, 169, -118, 124, -126, -16, -90, 6, 46, 67, -60, -152, 9, -39, 139, 87, 68, -139, 49, -66, -11, -58, -95, 94, -157, 20, -80, -72, -31, -35, 165, -56, 34, 9, -130, -12, 11, 69, 87, -55, 56, -25, 21, 6, 55, -113, 89, -151, -35, 111, -138, -62, 19, 51, 72, -227, -68, 13, 98, -97, -42, -74, 75, 167, -132, -38, 4, -78, 39, -75, 33, -3, 42, -166, -132, -154, 67, 65, -36, 79, -47, 18, -66, -24, 100, 38, 12, 25, 55, 10, -131, 40, 47, -19, 2, 63, 25, 92, 124, -84, -30, 7, -90, 103, 53, -45, -35, 105, 4, -163, 42, 31, 22, -76, 50, -58, -31, -23, 14, 44, -60, 62, 24, -106, -12, 127, -1, -12, 37, -115, 108, -65, -21, 113, 44, 47, -79, -92, 30, -54, 136, 14, -61, 38, 19, -50, 77, -113, -39, 126, -92, -6, 56, -32, -33, -42, -54, 40, 50, -146, 39, 3, -15, -97, 100, -11, -161, 88, -62, -146, -28, -191, 136, -131, -44, 16, -1, 81, -139, -58, -94, 42, -51, -30, 66, 29, 116, -97, -168, 168, -98]
7132i8Q2J36OM8j11j07L00j17L2j68l1J63l27R7R3q1J10pL8o4LJ7%r8J6L0M1O6
7160F9q0J16j75P7q4L13k85J88p7n5k4J5j16K00Mk20J72k6P7p6l2m6J35j62N1
7185d1k37K15J06M4lj25K50j71k9k8K1O3m3j9k12K89n6K0Q7j67J07j48J12j01
7209f6j7K0q3K1P7l1O5K95k91n7M9k2K6l9j6K64o1j77M4j9j8O0N7j04kk6J29j20
7237d2jK2p4R6M2K0qj21nJ06q3K14k72P3J97k79J44k8p9J81J6j00J25q7j01J71
7263A27j97J10j4j23J43J25k76M4l4J39q6j2N7j7OJ26j44O2j1r7J31j6%k0J6r4
7289e5K5J40k03J33j7J58l87L17j81j50K36P5j82J57l6L8M6j66N9J09j07q8L2
7312d7M9Q5j08N6k3M4P7k45J4K07j45Q0J6j08j3L1N5O4j98k6K42K1j63QP8K5n8
$$ y = [-98, -16, 120, 126, 174, 63, -44, 256, 139, 171, 3, -28, 135, -192, -95, -2, -83, 27, 20, 58, -6, -3, 14, 14, -84, -68, -38, 3, 69, -11, 105, -70, 7, -77, 236, -49, 139, 62, 7, -17, -2, -118, 82, 86, -134, 38, 12, 89, 13, -19, -65, 70, -92, -41, -278, -63, 43, 87, 84, -41, 209, 38, 9, -19, 2, 65, 22, 3, -209, 80, 24, 44, 131, -36, 71, -77, 35, -66, -83, -63, -146, -125, -48, -79, -14, 281, -10, -67, -18, -40, -14, -53, -69, 195, 134, -43, 1, -18, -36, 24, 81, -23, -25, -51, 78, -42, -43, -21, -95, 1, 43, 63, 55, -66, -71, 35, -48, 166, -106, -33, 164, -115, 29, 1, -78, 103, 119, 19, 144, 57, -44, 127, -70, 40, 26, -97, 46, 171, -105, -61, -95, 44, -42, -54, 3, -14, -8, 118, -26, 36, 25, -72, 59, 43, 43, 23, 39, -55, -30, 110, -93, 40, 23, 181, -206, 111, -70, -220, 16, 91, -91, 66, 30, 68, 114, -52, 7, 116, 9, -79, -47, 2, 87, -21, 35, 12, 56, 133, -112, -98, 109, -36, 44, 60, -48, -61, -30, 25, 89, -109, -135, 107, 128, -35, -27, 51, 76, 18]
7339A8j28K58j47j24K18j10J35j6j22Q2o5K4L3k23K11N1o6r6J22j89J69j44J40
7362C1m4j10L25l38J75L9j73J48M3r8N7q0J5P1j69N6q0J33No2J2L8L2J4k1j34
7388a15J31o7O2J06k16P7p3M2O4j45J07K5l8m7J06j91J69nJ26j83J31j38K36k24
7412f0R3R1k16J89n7j3Nk1r6J27j22J95pj49P8j15j5p0J69j08M3Q4n0J29M9j87
7438c4N9J1P9j61J33k09Q4K01k43k5K65k24k5N6r2K27k81J24q0KK76j27j16L28
7462B28l48N2n5J2J89p0k09J24l8K11j31l7J41o3j2k5J14%Pj41J91j75l5m2K76
7487A64j93J96k64J57p1n7l9K35j35m5q1J00po5R4J44j46m8l1J71j54J07K9k03
7511a42O6R6J72j74l6K00k08n6J00mj5N9P8j69O9p1K0L04k89j01m3J16p2M2J43
$$ y = [18, -110, 148, 1, -123, 95, -15, 120, 104, -18, 64, -1, 23, 56, -167, 44, 95, 29, -67, 55, -134, 35, -109, 31, -13, -123, 202, -136, 39, 78, -95, 53, 96, -2, 55, -25, -10, 61, -108, -52, -132, 1, 6, -56, -44, -6, 26, 40, 19, -115, 16, -51, 11, 117, -99, -22, -95, -53, 11, -134, -27, -2, -40, -87, 19, -172, -3, -8, 118, -65, 66, -72, 164, -60, 33, 124, -92, 97, 40, 27, 32, 11, -85, 42, -80, 115, 108, -41, 37, -78, -93, -163, 6, -102, -59, 25, -25, 104, 153, -34, 25, 36, 115, -46, 87, -122, -38, 163, -80, -105, 160, -64, -89, -33, -125, 102, -179, -55, -135, -133, 143, 16, -100, 228, -120, -68, -123, -111, 78, 8, -201, -77, -115, 96, -35, -72, 69, 6, -6, -31, 83, 83, 90, -51, 140, -35, -70, -112, 164, -29, 167, -97, 60, -11, -68, -107, 128, -7, -52, -133, -33, -40, -105, -11, 133, -13, -61, -92, 79, -75, 32, 61, -142, -76, 20, 192, 18, -18, 182, -26, -82, 18, 14, -1, 58, 136, -33, 36, -35, -15, 289, 0, -101, -144, -28, -100, -58, 85]
7536H5j16J72j89J18pn5j6QM5L8j85Q1j15K77j32p7K7Q9j73K15n7j9N9k56K41
7561E8l0o8J19j12J05j02m7J0J74k33J58J9L7q0lMml7J46k7Kl5p2L8L9j55m7J78
7589C5r1Q4p0LL1r3K66p6o5m4j0Q5N7r6j56J76n0j8K42l11J04q9J74k4j18K02
7615A48k24n4K32j27L6J29j45j98L46k46J28o5K0J44r4m8k8P2P6m6n9O8K0j13
7639b8J36j84J33L3k34M8J0n2J72r1L6N3o9K46l12j7Q3o0K46o5K2j62L3o0J05
7664B2k9J42j55m1J13j81J42J73j14j27K06j31j61K36j57K07l47J06K55j06j35
7685h2o1J86l4o6M4J25k29M3J06l4j6J04M5j45K08Jo2j58Q9R1n6M9k10P8o3j14
7711a61K25l9KN7k69L3K33j37m8L7J0J10j26Q3J05j63J54r7P4J12k36M1m5j9N8
$$ y = [85, -31, 141, -48, 70, 63, 8, -8, 0, 45, 83, -102, -21, -136, 141, 9, -68, -41, 48, -125, 90, 33, 14, 73, -183, 58, 28, -40, 79, -33, 72, -30, -77, -67, 107, -126, 32, 51, 88, 8, 5, 9, 5, -32, 114, 87, 89, 54, -18, 20, 59, -96, -143, 35, -56, 28, -42, -39, -8, -101, 165, 89, 24, -20, -30, 55, 112, 16, -140, 36, -14, -32, 210, -101, 3, -86, 88, 64, -54, 148, -76, -130, 102, -25, 11, 140, -5, -203, 143, -103, 25, -40, -20, 124, 30, -18, -46, 26, 102, 56, -3, 65, 85, -28, 108, -76, 57, 90, -144, -96, -86, -138, 34, -57, -21, 32, -37, 209, -103, -120, -37, -97, 149, 84, 106, -56, -23, -83, 22, -7, 135, -20, -61, 52, -129, 13, 186, 72, -55, 151, 20, -141, 95, -62, 145, -202, -96, 159, 53, -82, -143, 43, 9, -57, -13, 112, -117, -74, 32, -2, -18, 86, 131, -14, 194, 195, 133, -25, 64, 155, 99, 148, -62, 16, -47, -161, 64, 25, 27, 84, -185, -152, 81, -56, -104, -67, -57, 53, -73, 10, 115, -48, 106, 9, 83, 195, -41, 0, -45, -64, -6]
7736fK39l25K02j92L04p2l25J43Rn6j07K28L4n6R4k31J30j69L80k30J32j08j91
7759a73J71J14m1o3L8j61J49K6oK0o7K01j06j33L3L6p8N0J7j39P6Q7K9p0j7J4
7785Goml2p1Q3J15j38P2J63m08L11n2p9j8k7R1n1M2k3L6M5p0L7r8R2j51K33j08
7813iJ37j8j22o9Q2L0j07N7R0k28LJ79L1j65J56J5j95K21j96J51l5j56L30l48
7837a66rJ76K5Q8l9Qo2m4j10J61l9N7J5k16K91j88J05j1p0J57rj87J88j54J9J09
7863I5j70N1J51k12J05p9P8%J37j85O7k02J14J00q8J62p3j35R4L1Q1k66Q1K15
7887A52j94N0j09J25N4R6l02K13k5j52R8J09L3j42o8n6J9N9P9k49J30J01n6Rq4
7912a10K93k34J62j29J24j15Lo5M8k5P3o4K49j94k10K44k29R7J69n1j29J79r2
$$ y = [-6, 233, -92, 110, -82, 222, 150, -175, -32, -23, -79, -186, 42, 76, 20, 114, -117, 13, -156, 224, -6, 126, 18, -173, -2, 112, 71, 8, 46, -115, 34, 60, 54, 74, 7, 208, 102, -31, 2, 38, -40, 10, 27, -112, -36, 51, 80, 10, -7, 7, 1, -3, -35, -106, -23, 92, -46, 26, 189, -219, 92, 40, -39, -57, -84, 7, -44, -2, -25, 11, 56, -14, 23, -75, 17, -134, 99, -9, 128, 110, -12, -81, 1, 31, -76, -19, 71, -157, -154, 25, 56, -109, 47, 62, -133, 88, -108, 43, 8, -148, 182, -166, -175, 1, 26, 114, 75, 83, 21, -23, -133, 28, -11, 46, 61, -155, 136, -52, 53, 42, -28, 129, 120, -67, 121, -33, -14, 95, -75, -24, 127, -85, 20, -59, 19, 19, 156, -29, 38, -164, -50, 50, -38, 124, 51, -84, 10, 41, 122, -144, -63, 152, -42, 8, -101, 24, 78, 174, -128, 85, 60, -92, 6, 115, 148, 6, -62, -118, -99, -40, 39, -210, -80, 21, -35, -26, -110, 183, -51, 111, -18, 106, -9, -6, -71, -23, -48, 25, -39, 210, 16, -194, 50, -179, -82, 87, 36, -93, 86, -6]
7935fL3j92J00j7j24K43j43Q0LJ6kk9pN4K5qJ6l5k9mO6p3J85l36K50j93J45N5
7963G3k51J73k6j40J88mk3N4j48J95j24J6O5l4N6J4j04K7J9M1m8M3o5N7j03QK2
7990a9j40J68k2j0L9j02K3Q7p4o6J94q5r9J06j57K28j88M8K15o7J7Jj14K01m31
8015b47J46J7j7J17l9J5j61J40R2n1j95Q8R7j21J49K8J9k6r4J76p1o5J03k05L5
8040g0R4N3q6R4k02J66j83J20J49j79J83Jk21L46k39k38K20j8Q7oj7pJ49k60J79
8065A15j78Q5J3j8J9O4k01J32K2p7J56j96Q5P6j65J69l6j34P6mO1j10O2J60j61
8090A5O0O6k10J19l9l1R1N0j02k2m4K9J18j01j57L43j17K4o7O5j30J63j99j15
8114a91J14P4p9n8J83k16L23k61L7L3J09j93J93j99J69j16K7j1K09m11M20p8j26
$$ y = [-6, 27, -165, -65, -82, -206, 37, -106, -26, -23, -7, -9, -38, -45, 9, 34, 26, 42, 7, -22, -26, 40, -33, 152, -184, 66, -127, 18, 73, -178, -5, -31, -171, 17, 13, -10, 44, -104, 91, -33, -17, 48, 14, 70, 84, -20, 7, 26, 67, 19, 62, -3, 54, -49, -41, -19, -159, 9, -13, -23, 16, -86, -63, 24, -50, -116, 78, -7, -106, 0, -157, 71, -117, -69, 146, 79, 96, 97, -17, 184, -247, -101, -84, -101, 16, -23, -8, -169, -29, 63, 12, -183, -95, 2, -119, 30, 58, 77, 51, -43, 133, 62, -3, 100, -105, -70, 24, 77, -9, 85, -117, 49, -134, -14, 135, -44, 139, 140, -81, 265, 26, -212, 8, -10, 77, 71, 54, 47, 196, -64, 115, -63, 22, 35, 17, 36, 100, -101, 31, 53, -24, 132, -64, 21, 97, -68, 101, 65, -69, 7, 3, 64, -46, 16, 176, 15, 75, 141, -69, 50, 11, -20, 71, 121, 19, -3, -47, -18, 100, -1, -158, 185, 68, 92, 25, 90, -40, 123, -76, -191, -77, -3, -82, -140, 43, -173, 150, -111, -74, -41, 68, -125, 68, -131, 38, -78, -51, -62, 147, -264, 156, 78, -48]
8137d8Q9n1J35j0j61K18o8q3L5L7o0n4J3k6p4J53K1j07L2R2o8Q2j95J35qr4J26
8164F1M1j36N1K3p1Q5l8J05m6j55J34j67L5J33l5l2j05jO7kp0J89k74R3P0J09
$$ y = [-48, 41, -10, 125, 115, -46, 172, 104, 21, 56, 93, 33, -21, -8, -34, -108, 45, 66, -41, -9, 83, 15, 97, -98, 37, 29, -65, 61, 102, -34, 17, 40, -31, 54, 16, 121, 75, -80, 54, -113, -78, 55, 20, -12, -117, -118, -51, -53, -123, 66, -208, -115, -45, 64]
8190F4J
8191F5
$$ Imaginary data points
##PAGE= N=2
##DATA TABLE= (X++(I..I)), XYDATA
0@%%%%%%%%%%%qJ6j6J6k0K8l2M0m8N6p2Q5r5J08j27J49j72J96k22K56k94L31l72
34a97M20m71N28n92O59p33Q14r03J001j106J222j348J486j640J805j985K186k410
52a264K659k936L247l599M005m476N025n681O480p473Q745j0435J2793j6305K2046
67A2831l2907N9868k34769k95277Q01779j88420m71979N78818P5242o78686K81752
78i1748M56120n23471j49157N94332j32850l70907L16899K0348l92230J99517
88g3147L16080k13695j60778K04627k949k38368J34324J99443k50233j1033L01716
99B05987j94360k27094K93965K6090k86969K11056K01180l72533J0615L66910
109B34847l03821j62380M80504j56072l77622M00445O2343m29254K60261K55489
$$ y = [0, 0, 0, 0, 0, 0, 0, 0, 0, 0, 0, 0, -8, 8, -8, 8, -12, 16, -16, 24, -24, 32, -40, 45, -50, 58, -69, 80, -92, 104, -118, 138, -156, 175, -197, 223, -248, 280, -312, 347, -386, 428, -475, 526, -580, 642, -706, 780, -860, 945, -1040, 1146, -1264, 1395, -1541, 1706, -1893, 2112, -2364, 2661, -3020, 3460, -4013, 4732, -5703, 7090, -9215, 12831, -20076, 39792, -194977, -490254, 311525, 123105, -348874, 229944, 305186, -373500, -91748, 364372, -159099, -308256, 286076, 153226, -217681, 99218, 119566, -272664, -73147, 242933, 29238, -131540, 73087, 70138, -168230, -33906, 165537, -84696, -95729, 205987, 11627, -215467, 78498, 104588, -182381, 28675, 229855, -142678, -132063, 234847, -68974, -231354, 249150, 93078, -284544, 115901, 178244, -251010, 9251, 264740]
119B64740m48291M115M49822k50977k62186L97601m1856l64957L02011J62843
129B12865l92977O3117L26739j74533j84840J96583J8308k19988J45445K30951
139B21670k51775j41511K71175k9955k29476J72448J41066k41384J8085K67766
149A98109k21140k25940L39554M1846k81213K21658R7301l64001R1961K78719
159A76854k31011p1367K95584j05933k27588K16871K1490k59913J90506J87961
169A93454k52433K630J70281j78416o3726K10157j3572j31053R6112N3436j72400
180h5530l303J66389o6382p7038J38890q497j51857M9572J00916j01471l6047
191g4358J79184l3730j90438J25657P4492j96150R4323J72042j95657n2149K04081
$$ y = [264740, -183551, -179436, 270386, 19409, -242777, 154824, 112968, -251989, 50022, 212865, -180112, -116995, 209744, 35211, -149629, 46954, 65262, -154726, -9281, 221670, -30105, -171616, 99559, 69604, -159872, 12576, 153642, -87742, -69657, 198109, -23031, -248971, 90583, 132429, -148784, 72874, 170175, -193826, -101865, 176854, -54157, -125524, 170060, 64127, -163461, 53410, 74900, -185013, 5493, 193454, -58979, -56349, 113932, -64484, -128210, 81947, 68375, -62678, 33434, 86870, -85530, -88833, 77556, 11174, -65864, 73026, 64529, -87328, -37756, 63160, -38311, -74358, 104826, 71096, -119342, 6315, 80807, -115343, -21020, 151022, -44635, -96784, 107297]
202A07297q4037j51762J73686M5495j96728J03942J39099k16605j0868K05476
212A14995j18714q8375J65424l9456j29538J13192O7605j36381k754J19180p2131
223f953o1605J25034j4890j07218P3142M3553r4959o69R3479j9707p0663O8970
235B7514K1473j27979M3396J12907r6659j4624J16569p4861r5685R9269K7871
246C9191j00719O6370R7346j32790l7983J26053q1537o1869J56938j0909j14689
257e4598O9987K2733j10767K8039J10949m8562m9400Q7487l5770j06731P9631
268g002M9394p1516L9995N4492p3197m5148N2785J0838m7295M9453N6101q6509
280a7609k1200O7746n1724k8881R0322M197o8241K2569L3264o7542p667R5390
$$ y = [107297, 23260, -128502, 45184, 90679, -106049, -2107, 136992, -79613, -90481, 114995, -3719, -92094, 73330, 33874, -95664, 17528, 85133, -51248, -54002, 65178, -6953, -68558, 56476, 41586, -65632, 7510, 51063, -43896, -44565, 48914, 29207, -41456, 27514, 48987, -78992, -35596, 77311, -19348, -33972, 82597, 7736, -87949, 11320, 39191, -61528, 4842, 102188, -30602, -68585, 57468, -24069, -85938, 71000, 60091, -54598, 15389, 38122, -72645, -44606, 66343, 17781, -31619, 55868, 20098, -86633, -7002, 42392, -29124, 10871, 65363, -7834, -52982, -197, 10641, -36654, 12799, 68900, -17609, -38809, 28937, -22787, -51668, 38654, 42851, -25390, -2821, 30443, -37099, -44766, 50624]
292E0624l3656n9393Q4494j4776r0853O4733L8193p0016K3086N8204n4979m1056
304d5395O8200p83o8181N7402L2241q3471K6328N5996n9758q452N2556k1186l7733
317c2236L4068K8693m6492K621N0594m8593k7697O1633j1620l1748M0399Q333
329B7955m6178p239L8025j2846k4009N8111J141p0153K9152K0566n2899K9411
341h963N1352l3335k3713K7249j4548m6036M1586M6794m6701R736L5702o7209
353b8086j5009N7300j1193r374L7858l993m7633o322L0603j6681J81N5549k0002
366B3198m5391K2649p974k3692L0379K7612j1338j9299Q372p856l5851L2293L6700
379B9802l3204R110J9521m3859r416L3465J051j2780J9941J3074m2590n125L8003
$$ y = [50624, 16968, -42425, 42069, 27293, -63560, 1173, 39366, -30650, -7564, 50640, -4339, -45395, 22805, 22022, -46159, 11243, 43484, -39987, -13659, 42337, -17421, -25873, 26683, 5497, -32236, 1832, 30525, -15967, -13346, 37248, -11345, -39042, 22591, 10971, -20777, 19622, 27955, -18223, -25462, 12563, -283, -24292, 33819, 34960, -35193, -6041, 14525, -38374, -8963, 42389, 9054, -14659, 12590, -1958, -47994, -6408, 40386, -6315, 3421, 39123, -28086, -43095, 14205, 3012, -6362, 31496, 27503, -20130, -26452, 4151, -12530, -12349, 43200, 23198, -22193, 456, -7518, -31210, -831, 26781, 15443, -3856, 4516, -3340, -39191, -6898, 29802, -3402, 5708, 25229, -18630, -28046, 5419, 6470, -6310, 13631, 26705, -15885, -21010, 16993]
392A6993k8381m108M8925k6270k6689K9928r212k0715J9939J6948j8300j0908
404a1850K2960j1781k0203L4016j865l0704K0245O866j4317P333O660m010j3870
417a0520P510J5576k4856N086L1990k2001j0647J5002j9012p056K8406J4861k1721
430B618j1866J6656k0488j0617M1840j1438j9251L7266j4689l7298J5377Q015
442c875j742J9887J3465k4037k7650J5894N163j0918L0460O148k4499O374q036
455c366j8038J0093J4808J6435l765j5345M80k0605n432L2865L103n415J0627
468A6445j2907k3500m83K2272K965o360K4395j2631l5031K6166p8k6330L5982
481A0905J5179k6567K347j926j9052O494K9049N91k3955Q744K652j9998J8756
$$ y = [16993, -11388, -15496, 33429, 7159, -19530, 10398, 1186, -19529, 410, 17358, -942, -11850, 11110, -671, -20874, 13142, 11277, -19427, 818, 7684, -6633, 700, 7360, 3350, -10520, -3010, 12566, -12290, -7204, 24786, 2785, -7862, 7140, -11872, -18928, 9478, 24339, 2618, -9248, 7408, -13080, -23697, 18143, 6705, -12546, 24720, 10031, -27267, -11890, -3875, -5617, 14270, 27735, 3698, -23952, -8058, -2895, -13813, 16647, 22795, -1704, 4670, -3366, -21404, -11311, 3497, 19932, 16167, 822, 1302, -19303, -24735, 8130, 11233, 5818, 16445, 3538, -19962, -20445, 1827, 4792, -1568, 22827, 10196, -24835, 1331, 1253, -25077, 10905, 26084, -483, 1864, -62, -19114, -12620, 16429, 17020, -6935, 1809, 4461, -15537, 3219]
494C219M173k2404J9143Q708j3567j014r582M482J3997k846J527j0760r435J9365
508E006N881r652n444m47L984j488J1629J77k4185J8087J2411l3326J2704J6186
522A1523k2757J8828J5361l2999q872J8243O3m196J9253J572l0828P752J1455
535D398k4979J9111K3532k1215L549Q03k0726N323Q220N410J0204l023m461j1920
549e774j2493P789J3136J2994k226j1654k787j5709L410K3703j4408M084K4478
562B4543k6330j0653J1462j8426Q847L3370m419k1613k164M29j1881J6028K1315
575B0508k4091J207K2424k8282o365J9760j4420J0063K1175j7397j2943J012J391
588e958N501M819K460q411k178O200p732L264K996o620J3963m332j4067J6265
$$ y = [3219, 7392, -15012, 4131, 12839, -728, -1742, -11324, -6842, 7155, 4309, 5836, -4924, -14359, 5006, 10887, 1235, -4209, -4656, -672, -2160, 9469, 9646, -14539, 3548, 15959, -17367, -4663, 11523, -11234, 7594, 22955, -10044, -18916, -673, -610, -4806, 14447, 16019, -14809, -7057, 4398, -20581, -1470, 22062, 847, 4396, 5199, -15527, -10204, -1984, 3426, 13630, 10607, 6146, -5774, -18267, -10478, 2658, 15652, 13426, 1772, -1015, -16724, -13314, 10389, -4019, 65, 24543, -1787, -12440, -978, -19404, -10557, 22813, 18394, -3219, -5383, -4954, -16835, -807, 20508, -3583, -2376, 20048, -8234, -14599, 5161, -9259, 804, 21979, 4582, -8361, -7349, -5958, -457, 4362, 6822, -1589, -3767, 2433, -5299, -2035, 961, -5659, 8304, 3972, -10095, 6170]
602F170p318q395K2119j0734j2874J7062k795q715J0562L702j4411k820J5329
615F882r977l821K5533j6210j7250K2080j3052q124K6167o772r129J0720q073
628a026j0382L650R032L058K100O244j5708j1339J1917l061P626J4746j4684j59
642B014N14j8636J1148Q839n458J5554j560j9588k257J688N84P538J4175m056
656A0499j7843O828m496j5165K5693P300j5935J5732p952k2829J3180N603k682
669b067J1366K581j0468r087M179k40l035J7205p52j3321Q778r592q472J7015
683D090l488n91R630j2445k392N041n452N266M160k476j488n16K127o295L813
698a016Q744j2229M703P623j7537R844J1090j6343N594L415j2697P577P907m108
$$ y = [6170, -1148, -9543, 12576, 1842, -11032, 6030, 3235, -5480, 5082, 8784, -5627, -8447, 6882, -3095, -6916, 18617, 2407, -14843, 7237, -5815, -13939, 12228, 5456, -3673, 7047, -1026, -11408, -7758, 1274, 4332, 6432, 12676, -3032, -14371, -2454, -5515, 2111, 16857, 2173, 2014, 2528, -16108, -4960, 3879, -1579, 13975, 12415, -7173, -9430, -7742, -7158, 380, 14555, 10499, -7344, -516, -5012, -20177, 5516, 12816, -3119, 12613, 4661, -18168, -4988, 615, -2067, 9299, 11880, 1412, -7675, -3496, -3736, -6771, 10434, 9682, -3639, 5139, -4453, -12925, 4090, 602, 11, 9641, -2804, -5196, -155, -5607, -341, 3819, 1343, -145, -661, 1466, -4829, -1016, 7728, -4501, 202, 7825, -9712, 132, 11222, -5121, 473, 3888, -8809, -1232, 6675, 2567]
712B567l256J103p55q039O725O726r909J0666L954j9054N128J000o286J7743K552
727A0865j0048M97p531j808O528L782M575j355m77m936j1100O509K025K417J5887
742A5830j0069j1038M341j1839M285J6933m205J444N89j1843l816K418O541L714
756C285K921M726j3528n944P751q494Q294J5720j1092p27o78j4483O353Q915M16
771C435L387m024l390l839j093N796l270M675P541j0783P2p31q660J3373L846
786F335o867M759p289k568Q922k991o4Q35j480K810l248J606p6m161R568l909
802B182q570Q843m716N8J1675r851m605M423m859M829M487j206p64m881J538k618
818d035j787J1333k008j893N887j2944k299Q124l694Q359N013q395j332o067k041
$$ y = [2567, -689, 414, -341, -8380, -1655, 5071, -4838, 5828, 9782, -9272, -4144, -3144, -9430, 8313, 10865, 817, 1314, -6217, -8025, -1497, 2285, 6860, 5505, 5028, 92, -11008, -4499, -2474, -57, 15830, 5761, -5277, -936, -12775, -8490, 8443, 4238, 5682, 6271, -5572, -9388, -6970, -429, 3285, 6206, 10932, -2596, -8540, -789, -9283, -989, 14731, 3639, 2912, 2234, -12249, -5896, 3019, 3435, 6822, 2798, -592, -4431, -5524, 272, -2998, 1677, 9218, -1565, -1493, -2224, -10884, 2489, 6335, -532, 4227, -3062, -5630, 3292, 301, 237, 1072, -408, 2402, -846, 760, 684, -3477, 6091, 2182, -6388, 2455, -2261, -2203, 9472, -379, -4984, -561, -5420, -591, 3896, 2690, 1926, -2955, -1417, -4035, -5822, 5511, 3503, 1610, 7497, -5447, -7746, 378, -3316, 5043, 10056, 1661, 329, -5738, -7779]
833g779P184K664N859k124p114l21p111K847Q717k507P696p33j3579K227k806
848f880p04J4715L22l286j495q701k35K354M673O221l624K378l978j1709P124
863b825J708o76J2568n741q022K242o378K726O853m57K810l985k701l27m532O974
879B37K673l017O074o553m478O666n219M052N446p163K873n79n281O217q05p53
895C90J726l862K030j660L57N394o440J624K765r355O414M160n927O921k797p486
911e746M316j121K642L883j713J445o192j465L634m099P741M840p665K405n953
926c048o156R967L70K090M416q588j585j016k963O368K037K879J161q205j078
941c351l560N31J2314j752p65K323j2107P74N819m037P724L665n128j007n744
$$ y = [-7779, -595, 2069, 7928, 5804, -1310, -1631, -8742, -5895, 2822, 315, 8011, 7278, -6301, -4074, -6880, -7584, 7131, 7453, 4167, 2672, -6029, -6264, -3910, 763, 6984, 3360, 5738, 1760, -9949, -2825, -1117, -1793, 10775, 5034, -2988, -746, -7124, -4398, 2455, 1998, 4808, 823, -1878, -2205, -6737, 237, 2910, -107, 5967, -586, -5064, 1602, -3617, 435, 5881, -1282, 1591, 1012, -4269, 1948, 1143, 390, 2116, -1746, 284, -1376, -1019, 4375, -2065, -441, 2324, -7031, -617, 3543, -2384, 4537, 1740, -5746, -1430, -2551, 91, 3974, 2261, 3706, -2486, -3951, -317, -4416, 3325, 8165, 500, 2905, -3048, -9204, 763, 1133, 3223, 7639, -949, -2534, -3550, -6513, -145, 1892, 4771, 5932, -2273, -3351, -6911, -6380, 5934, 4182, 3417, 5740, -6367, -5593, 226, -3811, 3913, 7578, 2450, 1443, -4301]
956d301q64K423K936P923m547m533J910q752L481P852m646N461Mq524K496k015
972c696K76O703j861J025r01m506K292k076K378M742m353L016k361o304Q022j518
988H78k183O506p231j127O104m384J650P68k442J913k201J666m36k214P562l400
1004A429n166M728n698K368R513o033l06Q2o180M635J154o7L780k459J59k704
1020g65m797M291K00L849N137q799j107m58n716R347K689l549N301n856n131K681
1036b683j323M539L670K15m12p720j1J856k611R972J080o794M005p358m023Q568
1052I70p18K830K686o243j131j936n58M520n27M079m40o329K149m084M25R109
1068D802l777N81J970q693L563K826l645N259n18k547J642l218J231k34N82M629
$$ y = [-4301, -5165, -2742, 194, 8117, 3570, -963, 947, -7805, -4324, 3528, -1118, 4343, 4347, -4177, -1681, -3696, -3420, 3283, 1422, 2447, 1546, -2960, -668, -2744, -366, 4376, 23, 3039, 678, -5626, 2396, 878, -1305, 5201, -2030, -3157, 2947, -1437, 213, 981, -1461, 452, -1749, -83, -519, -2733, 4829, 1429, -3737, 991, -4707, -2339, 7174, 1141, 835, 917, -5263, -628, 526, 459, 4239, 1780, 1939, -765, -5562, -1271, -1071, 2778, 7915, -884, -1991, -2449, -8165, 1182, 3871, 322, 5623, -233, -5364, -2683, -4006, 533, 4203, 4418, 4006, -3714, -3725, -1869, -4480, 5492, 6572, -222, 3783, -3575, -7598, 970, 252, 3082, 5768, -475, -1606, -3542, -4100, 420, -107, 3972, 3532, -2797, -648, -4732, -4307, 4802, 1025, 1606, 3576, -5117, -1554, 1272, -2373, 2886, 2368, -179, 1463, -1755, -524, -758, -176, 4453]
1084D453n644q4L229o412N416K600o985M654j569l767O031j719k93K111l688R98
1100f69j067L97M379k904K212m28o712M734l23j662Q334m162l073K818o954K053
1116c027N012j489L727j959l738j001k957M995K012n21N159o991l984M250m898
1131e410M741O872m873J825k262o391K968J164L261L673l167n55m920k075N361
1146B12j457L901L492p326J104j641n091P347J116k41L563o267k223J281r61M961
1162A770K92j74N96n720K334O16k927P487j507l541M236n985o70N589k851K378
1178A923J97l763J653j733J169K314l302L288k061l201N342k816K47M468n838
1193b113J306J892m526N001L92k083K921m047n79J389r67M942j032k224J104n931
$$ y = [4453, -1191, -1275, 1954, -4458, 958, 3558, -3427, 1227, -342, -4109, 1922, 203, -90, 2021, -1667, -669, -1736, -1339, 3040, 136, 2348, 1920, -4792, -58, -381, -2043, 6291, 2129, -944, 1874, -5080, -3027, 1985, 496, 4223, 2264, -1474, -2475, -5432, -437, 1575, 1054, 6213, -778, -4762, -512, -5410, -669, 6203, 1330, 3155, 893, -5498, -2530, -1366, 1895, 5568, 2401, 1846, -3074, -5149, 212, -1245, 2656, 6148, -1178, -74, -1715, -6806, 541, 1657, 1416, 4979, -1288, -3511, -2230, -3191, 1770, 2062, 1888, 2484, -3236, -902, -286, -3213, 4274, 2767, -774, 3462, -2523, -3193, 2396, -455, 1923, 2120, -1643, 10, -1723, -554, 1760, -1542, 1746, -315, -3516, 1826, -990, -743, 3725, -2113, -807, 1085, -3441, 1560, 1952, -131, 2790, -1257, -1836, -447, -1414, 3528, 2496, 272, 1376, -4555]
1209d555K410M333l379M965j134n841L491l232j041N797o76K080r19n449N00j478
1225d128L535N397l502J601k150n755M579r06K56O651l267j144p18o027L199K613
1241B34J122L954m365k149p23l132N056J074n30M136n436j938K186l970M836L275
1257C630l249K590l441k937K816j017L402J471k759J399l781p16M274k723K533
1272A492J404n042K624r06k520M499j933M29J834m324J591L53o28L736k744o98
1288h33J339l496M153O67k697L461l433j166L735l499K494K223l249J983l046
1303a364j832L473r65L210M17m929J790k427q81N708j810J010J712n884J148L
1319a621j092N641p38l48J35n344J540Q76n9N433k174j717N98n466K407K651j239
$$ y = [-4555, -2145, 2188, -1191, 3774, 2640, -3201, 290, -2942, -3983, 1814, 1138, 3218, 2299, -3150, -2650, -4128, -593, 4804, 1302, 2903, 753, -5002, -423, -1329, -1073, 5578, 2311, 1167, 449, -5578, -2379, 234, 1356, 5310, 945, -1204, -1927, -5059, -3, 1071, 541, 4677, -759, -2697, -511, -4481, 355, 3630, 381, 2971, -470, -3407, -591, -1608, 1794, 3265, 506, 1905, -1876, -2592, 1682, -1041, 1492, 2896, -2146, 478, -428, -2948, 1551, -382, 47, 1881, -2443, -852, -499, -1127, 2609, -135, -833, 506, -2990, 1163, 1830, -867, 2594, -839, -2005, 1730, -1769, 725, 2948, -301, 1682, -1364, -3196, 277, -688, 2522, 2939, -1990, -200, -2627, -3508, 2200, 390, 1400, 3112, -2772, -1624, -1621, -2713, 2928, 2190, 1842, 1977, -3367, -1827, -951, -1010, 4423, 2249, 532, 1130, -4336, -1929, 722, -517]
1336e17M713k291l559J448l905K028L824j340K837k382l531J653k334L036L367
1351C047k870K524k214l970L702j741J563L980l613M86p84l050L354o89P28K153
1367B606l710R38k8k776M063r25p81K896m113M07K004k573L567o51k367K526k611
1384a528R59K529k722K274r36k546K969k083R81L099l567J513r78l381M009o48
1400e6J66K986l911n8m83j894M202j69q2K211m803J64J265k398M867K28j761J918
1418B392m314n07K087j240M835P2l329Q56l835K96L758j485K878k54l630J542
1434A22l057K6M305j222K394l10n226J728q21P93M332k043K06j97l715K588o41
1451g38k74M376k347k02J66m139K495J138n54L097l216j062J306k684K920P30
$$ y = [-517, 4196, 1905, -1654, -206, -4111, -2083, 1741, 401, 3238, 856, -2675, -1022, -3356, -320, 3047, 177, 2701, 487, -3483, 219, -1522, 41, 4021, 408, 894, 110, -2940, 414, -275, 453, 2606, -1104, -166, -194, -2970, 1093, 168, -613, 2283, -1830, -1423, 581, -1992, 1575, 924, -1443, 1083, -1528, -569, 1960, -762, 1512, 576, -1970, 999, -1084, -103, 2996, -571, 942, -36, -3417, 592, -56, 110, 3096, -815, -873, -1356, -3250, 952, 783, 701, 2912, -1891, -1727, -462, -2860, 2007, 2235, 474, 2392, -1922, -2429, -342, -1582, 3253, 3325, -4, 852, -2983, -2687, 1071, -414, 2464, 2210, -1420, 122, -2935, -2909, 1396, 174, 2568, 2258, -2968, -1240, -2061, -1268, 3064, 1021, 1227, 1030, -2685, -97, -738, -1012, 3364, 1017, 815, 981, -3158, -663, 475, -79, 3018, -198, -1260, 46, -2638, 282, 1012]
1467A012k298L180k666j002K537k380K099J171k640K263j988r48L390k310J599
1482A019R63l766J859m52m56L438k317r3K15l064K663M58j226K998k275q57J227
1499C34l204K207J519n89K654l211j915J717j815L379J947k908J574k249j983
1514b543K723j438K368K153k973Q70k721j819L820o88J889J455m379L82q00j248
1530b949M119o80P66R79l951O74m05j060M578m59n22P64m098P25J316o76L844
1547B965j323j804J483l812J427K142j651K501p39k398J493k276R96K092j634
1562e38K440j712k395K561j640R01K597k937R82J59k292K933p42j85J741k757
1578h84R32K22j935L362j134n29J348l350J236J173j634L196j214k244J861k655
$$ y = [1012, -1286, 1894, -772, -1774, 763, -1617, 482, 1653, -987, 1276, -712, -1660, 1730, -580, 1019, 1982, -1784, 75, -377, -833, 2605, 288, 195, 410, -2654, 9, 467, -759, 2239, -36, -893, 334, -2870, -663, 856, 267, 2921, -290, -2205, -488, -2303, 1076, 3023, 115, 1689, -560, -2543, 180, -1258, 1110, 3263, 290, 1160, -1561, -3380, 440, -248, 1641, 3096, -1283, -901, -1701, -2949, 1170, 490, 1256, 2235, -1716, -1042, -1447, -2507, 2071, 1612, 1090, 1854, -2244, -1519, -203, -879, 2965, 1642, -162, 1321, -2491, -1064, 1078, -573, 1928, 1189, -1209, 284, -1992, -996, 1096, -538, 1902, 190, -2205, 356, -1284, -383, 2214, -723, 259, 418, -1874, 1059, 317, 132, 1873, -884, 48, 270, -1665, 1697, 563, 34, 1382, -1968, -732, 441, -1193, 2003, 789, -1455, 406, -2249]
1594b249Q57K770j608J833p58k637J566j551J595K214j816J826j751l021K867
1609A37r46P25L536l115j85l25k714K531L98P47J901l092j26n52k108L617P4j31
1627C72K268l644o36J145j889L638P36j690J713k885j007J739p68K473M47j781
1643B31Q33k759N2K587j808K579L7l344K011j649j085L578j289O11N92k772J083
1660e12m18J25K425j912P82L42k891K617k18j180L065k268n72J662k502J804R86
1677A335j866J852j955q26K001j406J656J26k045J731k015l08L119k026J376R83
1693A732l610J668k65r81L129o54n81O25k569J037l2L11K782k090l42L42l288
1710b786K254J188j345L036j702j830J049k149J400J807p82J782j999j465J108
$$ y = [-2249, -1392, 1378, -230, 1603, 845, -1792, -226, -1777, -182, 2032, 216, 2042, 291, -2730, 137, -809, -84, 3452, 337, 152, -173, -2887, -356, 42, 789, 2690, -402, -528, -1080, -3188, 429, 503, 372, 2640, -1004, -1640, -495, -2384, 1254, 1990, 300, 2013, -872, -1879, -140, -908, 1565, 2012, 231, 1064, -1695, -1643, 944, -864, 1715, 1752, -1592, 419, -1230, -2315, 1263, -26, 585, 1177, -1595, -512, -930, -805, 1620, -292, 490, 832, -2059, 558, 340, -840, 2225, -43, -615, 1047, -1455, 349, 1335, -531, 1321, -634, -1460, 541, -865, 791, 917, -1128, 603, -1412, -1720, 1399, -627, 749, 1732, -1878, -210, -475, -1456, 1673, 1019, 438, 1063, -1506, -469, -501, -190, 2592, 502, 160, 502, -2786, -532, 656, -689, 2347, 645, -1185, -136, -2285, -885, 922, 140, 1922, -77, -1542, -434]
1725d34j518K479J319j673J766k215j868K853j828J330K449k689N26o58k134K471
1741A76j30P11Q97k348Q15j056r63L094j471K84K001l661J025R61k055K812j7
1758A075j431J163j642K48J319j190J880j040j002J650k359J333J399k448K130
1773A085r64k120K842j192j41K150k194K86J3j302K003o39N79Q60k566J327k37
1790b10j392L604j111j092K042l302L44J674j352K237R1j784O29j925N14J410
1806C77p48K225j264j803J625k546R87K870k014J542j74k995J563n99K97K449
1822A792j253L98n50k109J667o38R26K142k509Q27l18k903K771K93r71K682k367
1839a20j022J093j542J638M89m86J267k114J45P62j823K732k7j751K358k351o88
$$ y = [-434, -1952, 527, 1846, 173, 1939, -276, -2144, 709, -1119, 211, 2660, -29, 497, -161, -2295, 176, 46, 757, 1654, -694, 121, -935, -1898, 1196, -275, 9, 2010, -1651, -626, 335, -1720, 1092, 1075, -356, 807, -835, -587, 732, -458, 1422, 382, -620, 1030, -1329, 4, 1403, -1045, 1085, 121, -1999, 843, -349, -490, 1660, -534, -248, -235, -1537, 466, -173, 406, 1266, -1300, 27, -210, -1602, 2002, 891, -201, 1841, -1461, -1117, 557, -795, 1442, 1533, -251, 378, -1547, -1033, 377, -371, 1854, 590, -1213, 412, -2134, -1147, 1723, -291, 1251, 1077, -1918, -355, -954, -657, 1792, 539, 937, 387, -1722, -55, -693, 233, 2375, -134, 693, 375, -2528, 243, 536, -435, 2247, -120, -1142, -49, -1591, 47, 536, 50, 1317, -797, -652, 110, -1713, 1019, 992, -759, 1599, -752, -1440]
1856a440K756j760J077Q67k233J071o22k42J477j223Q44k21j772J946j342J19
1872f98K282k286L33J010l016K321P83j200J894j558q88J171j080J363L85p66
1888E0J362k130j20J509j973K433Q09k723J730j723j228K786q26P01R13k216K05
1905d41j004K91J919r04J339l0k904J787q33p85L504j404n6P42l030J092R78p00
1923d39K281q39j038K04j798J428L93p92K715k136q23J493k944J858J750j959
1939f46J773r79j904J681m45P06Q69j431J172j023p65J879j773J223J534k957
1955a086J538m19j637K701p13o82J300k013M84P47q17J517q94n45J029j874J236
1972a28N23j399K662j356j470K218k270P54K313j843P76k13j815J332n03R27P98
$$ y = [-1440, 1316, -444, 633, 1500, -733, 338, -284, -526, 951, -272, 572, 351, -1421, 525, -817, -698, 1584, -702, -369, 641, -2375, -54, 729, -471, 1423, -135, -1023, 148, -932, 431, 816, 50, 1412, -718, -838, 671, -1302, 1131, 1940, -783, 947, -776, -2004, 782, -44, 657, 1570, -646, -441, -1445, -1154, 765, -139, 1200, 1170, -1734, 53, -780, -1565, 1939, 535, 479, 1221, -1809, -717, 261, -439, 1842, 1003, -35, 169, -1629, -201, 192, -600, 2115, -21, -844, 649, -2295, -437, 1313, -646, 1127, 148, -1756, -75, -520, 186, 1055, -376, 796, -227, -992, 887, -886, 337, 1871, -1086, 452, 33, -1604, 1097, 384, -298, 1002, -1011, -527, 220, -597, 920, 26, -519, 510, -1364, -128, 395, -1004, 1658, 302, -1168, 1050, -1220, -466, 1847, 4, 780, 567, -1248, 84, -419, 508, 1306]
1989A306j777J281j339j212K412j265O21K175l411Q20L24j993K177N35n29J228
2005A353k106j23N15o23K190n17k87J009k707P18J111j661K866l23k004J469j944
2022a064k95K119j004J241k17j442O81j240O28J480j601K002o24k479K314j211
2038g12l69K907j709J33O63k333J423L59l18J188j379L95j56j420K071o08p16
2055e81K212k532M1J692k289J772P03j936J291q16o08J670q33P20J9j194J224
2072E55j374N28J756k045J378K96k819K274m56j061K548j398n10O36j629J174
2088a47K77k27J300j668L81P8j905K477K5j005J995k010j001J954j762J393J401
2105A556j799R18q55q29J215p81J675R9j556J188j787k94K345j777J010J228k709
$$ y = [1306, -471, 810, -529, -1741, 671, -594, 27, 2202, -1209, -389, -65, -2058, 119, 654, 125, 1353, -753, -876, -361, -984, 1206, 689, 402, 1411, -1296, -578, 533, -1128, 1738, 1415, -589, 880, -1064, -1359, 760, -244, 997, 780, -662, 19, -1221, -593, 887, -714, 1288, 664, -1815, 499, -712, -1081, 1826, 117, 250, 913, -1420, 3, 362, 44, 1232, -147, 248, 92, -1328, 743, 135, -581, 1631, -901, -860, 832, -1457, 315, 1018, -918, 373, -443, -1051, 619, -214, 506, 525, -669, 555, -819, -291, 1465, -580, 798, 1094, -1725, 549, 93, -968, 1580, 182, -328, 308, -1321, -147, 130, -97, 1203, -465, -84, -6, -1911, 566, 591, -414, 1581, -429, -1430, 524, -1238, 155, 1556, -243, 675, -180, -1009, 206, -575, 1100, 1199, -357, 831, -956, -1250, 1095, -682, 328, 1556, -1153]
2122a153Q84M0j320K239l52j94O95j804P96l81j12J902j440N84P24k654J665M32
2140E51j627K495q41j391J479j322J57J068q90J045p96n19Q70j461J419O00j851
2157a014K028j352j088K563j564J50J724k278O62N67j162J378l89o2N82j516J084
2174C13n68l55K267j807j49J320k746J358J336j859J780k64j857J052p32N28R15
2191E32o03J043j070p89J401j920J628J451k251J558o61k036K307p38j74J812
2207A490j626J3J93j137J182k06L93Q55j994R89l76j423K778r17p47K095k527
2224i65J2J664j688J440O73j383O99r10J43M58o92J761r72o83J525k146L85K132
2242A453k272J305L82k209J515k59o90J439q66L81k29q21J264j030O18J287k313
$$ y = [-1153, -269, -229, -1549, 690, 338, 144, 839, -965, -169, -550, -662, 1240, -200, 384, 1108, -1546, 119, 551, -1076, 1419, 578, -813, 666, -656, -499, 569, -321, 724, -72, -591, 279, -1182, 237, 837, -1014, 1014, -338, -1426, 1137, -427, -277, 1447, -831, -169, 398, -764, 614, 225, 163, 745, -771, 313, -255, -610, 1657, -150, -299, 1021, -1725, -367, 969, -890, 890, 626, -1231, -179, -911, -383, 532, -71, 972, -98, -887, 514, -1406, 222, 1673, -578, 980, 319, -1717, 590, -148, -322, 1490, -136, -123, 70, -1067, 115, -91, 302, 1157, -837, 152, -224, -1647, 1131, 214, -533, 1562, -965, -953, 711, -977, 463, 1136, -247, 452, -458, -315, 143, -549, 1212, 240, -443, 1082, -1064, -679, 1453, -819, 486, 868, -1341, 174, -85, -775, 664, -202, 179, -50, -871, 393, -637, -19, 1268, -1045]
2259a045J229M06k193K414j57j466K097j538o34J580j105O54N46p67M60j363N23
2276c59O80j151K069o93j654J742j371l42K320j557O38P91k145P30J90j46J279
2293A021q75M61m16j391J573q16K38K078k244L21P83k420J556Q25j542J922q42
2310B32j011O77q86P44O01k43Q84j845L18R44j669J982N51k012J692r14j368K108
2328G85q59J26J057j381L26l62n30J295r64J040N2j627J286n93r08K661j560m18
2346e74J604k019O96Q48j292J544o14m14N05r60R00jn10J623j698l37J639j899
2364i59J092J225k335J254J1j576J681o42K71N90j087O70q29j70J523j167P65
2381C17P79k348J438p7j373K481p09q35J327j650J4R03n39J107n32l75L93j441
$$ y = [-1045, 184, 590, -1603, 811, 654, -812, 1285, -253, -887, 693, -412, 242, 788, 21, 481, -882, -359, 321, -830, 1239, 546, -1108, 634, -737, -1079, 1241, -316, 322, 1113, -1032, -302, -112, -258, 1021, 146, 607, 191, -1200, 373, -443, -205, 1873, -371, -50, 733, -1687, -131, 694, -848, 1074, 232, -779, -102, -988, -244, 357, 114, 998, -847, -529, 415, -1254, 728, 1279, -733, 959, 45, -1323, 785, -74, 52, 1109, -272, 54, -308, -838, 457, -507, 533, 585, -1042, 244, -349, -1257, 1404, -156, -574, 1030, -989, -293, 555, -737, 807, 193, -221, 284, -676, 224, 223, -287, 1336, -362, -699, 940, -959, 133, 1358, -977, 277, 288, -1288, 393, -249, 22, 612, -475, 195, -634, -804, 719, -448, 317, 1096, -1252, 186, 109, -1264, 1217, 508, -327, 1000, -650, -636, 267, -272, 835, 303, -72, 321, -1120]
2399a120J150K44j018J931j103j143J622j621L50J807j464P85K08j393P03m74
2415e36N43P87j059J113r96r31J764j225M89J568j988O58M13j911J542O7q65J249
2433F82j011oR9m22J347q04J4Q27j762J038N41j676J970j56j451J683j157n04
2451g48J574q99L14K09p88P60j002Q07N50j318J143m94j637K172j005k61J912
2468A289j903K99Q67j644J303J30n47R92j221L12J93p77J708o38o45J676k129
2485g35P5J598j780J327O15j782J052o68m81J152m38M18j12o68N96r88L24J310
$$ y = [-1120, 30, 274, -744, 1187, 84, -1059, 563, -1058, -708, 1099, -365, 420, 628, -765, -62, -536, 7, 794, -265, 848, -148, -1079, 685, -540, -51, 1517, -471, 187, 600, -1311, 231, 298, -567, 682, -329, -335, -236, -658, 689, -115, -101, 726, -1036, 2, 543, -1133, 837, 681, -770, 913, -244, -748, 826, -73, 241, 450, -338, 422, -580, 227, 777, -541, 602, 108, -1529, 643, -362, -623, 1289, -614, -315, 552, -1092, 211, 341, -206, 786, -435, -123, 70, -707, 1001, 363, -282, 1394, -735, -660, 938, -842, 485, 1100, -682, 370, -298, -779, 373, -65, 353, 241, -427, 169, -819, -495, 815]
$$ [...]
8191A22
##END NTUPLES=NMR FID
##END=
