##TITLE=1H_17-2025
 200.13MHz, CDCl3,
 8 sc
 
 28.1.2025
##JCAMPDX= 6.0         $$ Bruker NMR JCAMP-DX V2.0
##DATA TYPE= NMR FID
##DATA CLASS= NTUPLES
##ORIGIN= UXNMR, Bruker Analytische Messtechnik GmbH
##OWNER= pz
$$ XWIN-NMR		Version 3.5
$$ Tue Jan 28 14:33:00 2025 Russian Standard Time (UT+4h)  she@DPX200
##.OBSERVE FREQUENCY= 200.1313
##.OBSERVE NUCLEUS= ^1H
##.DELAY= (6, 6)
##.ACQUISITION MODE= SIMULTANEOUS
##.ACQUISITION SCHEME= undefined
##.AVERAGES= 8
##.DIGITISER RES= 18
##SPECTROMETER/DATA SYSTEM= spect
##.PULSE SEQUENCE= zg30
##.SOLVENT NAME= D2O
##.SHIFT REFERENCE= (INTERNAL, D2O, 0, 14.3821)
##AUDIT TRAIL= $$ (NUMBER, WHEN, WHO, WHERE, WHAT)
$$ ##TITLE= Audit trail, XWIN-NMR		Version 3.5
$$ ##JCAMPDX= 5.01
$$ ##ORIGIN= Bruker BioSpin GmbH
$$ ##OWNER= she
$$ F:/spectra/data/she/nmr/H-C/1/audita.txt
$$ ##AUDIT TRAIL=  $$ (NUMBER, WHEN, WHO, WHERE, WHAT)
(   1,<2025-01-28 14:31:59.89 +0400>,<she>,<DPX200>,
      <created by zg, POWCHK disabled, PULCHK disabled
       configuration hash MD5:
       00 E9 B6 7A A2 85 ED C7 34 08 36 98 17 FE 4E 26
       data hash MD5: 16K
       E1 A3 B5 61 15 3F 0F 71 68 54 DA 11 26 E3 AE 5D>)
$$ ##END=
$$ 
$$ hash MD5
$$ A1 38 6A B3 9F E4 41 B5 24 6C DA 90 89 6C 53 55
##$RELAX= 
##$RELAX= 
##$RELAX= 
##$RELAX= 
##$RELAX= 
##$RELAX= 
$$ Bruker specific parameters
$$ --------------------------
##$DU= <F:/spectra>
##$EXPNO= 1
##$NAME= <H-C>
##$PROCNO= 1
##$TYPE= <nmr>
##$USER= <she>
##$AMP= (0..31)
100 100 100 100 100 100 100 100 100 100 100 100 100 100 100 100 100 100 
100 100 100 100 100 100 100 100 100 100 100 100 100 100 
##$AQSEQ= 0
##$AQ_mod= 1
##$AUNM= <au_zg>
##$AUTOPOS= <>
##$BF1= 200.13
##$BF2= 200.13
##$BF3= 200.13
##$BF4= 200.13
##$BF5= 200.13
##$BF6= 200.13
##$BF7= 200.13
##$BF8= 200.13
##$BYTORDA= 1
##$CFDGTYP= 0
##$CFRGTYP= 5
##$CHEMSTR= <none>
##$CNST= (0..31)
1 1 145 1 1 1 1 1 1 1 1 1 1 1 1 1 1 1 1 1 1 1 1 1 1 1 1 1 1 1 1 1 
##$CPDPRG= <>
##$CPDPRG1= <>
##$CPDPRG2= <>
##$CPDPRG3= <>
##$CPDPRG4= <mlev>
##$CPDPRG5= <mlev>
##$CPDPRG6= <mlev>
##$CPDPRG7= <mlev>
##$CPDPRG8= <mlev>
##$CPDPRGB= <>
##$CPDPRGT= <>
##$D= (0..31)
0 0.7 0 0 0 0 0 0 0 0 0 0.03 0 0 0 0 0 0 0 0 0 0 0 0 0 0 0 0 0 0 0 0 
##$DATE= 1738060319
##$DBL= (0..7)
120 120 120 120 120 120 120 120 
##$DBP= (0..7)
150 150 150 150 150 150 150 150 
##$DBP07= 0
##$DBPNAM0= <>
##$DBPNAM1= <>
##$DBPNAM2= <>
##$DBPNAM3= <>
##$DBPNAM4= <>
##$DBPNAM5= <>
##$DBPNAM6= <>
##$DBPNAM7= <>
##$DBPOAL= (0..7)
0.5 0.5 0.5 0.5 0.5 0.5 0.5 0.5 
##$DBPOFFS= (0..7)
0 0 0 0 0 0 0 0 
##$DE= 6
##$DECBNUC= <off>
##$DECIM= 32
##$DECNUC= <off>
##$DECSTAT= 4
##$DIGMOD= 1
##$DIGTYP= 9
##$DL= (0..7)
0 120 120 120 120 120 120 120 
##$DP= (0..7)
150 150 150 150 150 150 150 150 
##$DP07= 0
##$DPNAME0= <>
##$DPNAME1= <>
##$DPNAME2= <>
##$DPNAME3= <>
##$DPNAME4= <>
##$DPNAME5= <>
##$DPNAME6= <>
##$DPNAME7= <>
##$DPOAL= (0..7)
0.5 0.5 0.5 0.5 0.5 0.5 0.5 0.5 
##$DPOFFS= (0..7)
0 0 0 0 0 0 0 0 
##$DQDMODE= 0
##$DR= 18
##$DS= 0
##$DSLIST= <SSSSSSSSSSSSSSS>
##$DSPFIRM= 0
$$ [...]
##$SUBNAM0= <"">
##$SUBNAM1= <"">
##$SUBNAM2= <"">
##$SUBNAM3= <"">
##$SUBNAM4= <"">
##$SUBNAM5= <"">
##$SUBNAM6= <"">
##$SUBNAM7= <"">
##$SUBNAM8= <"">
##$SUBNAM9= <"">
##$SW= 18.0517328524113
##$SWIBOX= (0..15)
0 0 2 0 0 0 0 0 0 0 0 0 0 0 0 0 
##$SW_h= 3612.71676300578
##$TD= 16384
##$TD0= 1
##$TE= 0
##$TE2= 300
##$TE3= 300
##$TEG= 300
##$TL= (0..7)
0 120 120 120 120 120 120 120 
##$TP= (0..7)
150 150 150 150 150 150 150 150 
##$TP07= 0
##$TPNAME0= <>
##$TPNAME1= <>
##$TPNAME2= <>
##$TPNAME3= <>
##$TPNAME4= <>
##$TPNAME5= <>
##$TPNAME6= <>
##$TPNAME7= <>
##$TPOAL= (0..7)
0.5 0.5 0.5 0.5 0.5 0.5 0.5 0.5 
##$TPOFFS= (0..7)
0 0 0 0 0 0 0 0 
##$TUNHIN= 0
##$TUNHOUT= 0
##$TUNXOUT= 0
##$USERA1= <user>
##$USERA2= <user>
##$USERA3= <user>
##$USERA4= <user>
##$USERA5= <user>
##$V9= 5
##$VALIST= <valist>
##$VCLIST= <CCCCCCCCCCCCCCC>
##$VD= 0
##$VDLIST= <DDDDDDDDDDDDDDD>
##$VPLIST= <PPPPPPPPPPPPPPP>
##$VTLIST= <TTTTTTTTTTTTTTT>
##$WBST= 1024
##$WBSW= 4
##$XGAIN= (0..3)
0 0 0 0 
##$XL= 0
##$YL= 0
##$YMAX_a= 349334
##$YMIN_a= -392506
##$ZGOPTNS= <>
##$ZL1= 120
##$ZL2= 120
##$ZL3= 120
##$ZL4= 120
##$ABSF1= 10
##$ABSF2= 0
##$ABSG= 5
##$ABSL= 3
##$ALPHA= 0
##$AQORDER= 0
##$ASSFAC= 0
##$ASSFACI= 0
##$ASSFACX= 0
##$ASSWID= 0
##$AUNMP= <proc_1d>
##$AZFE= 0.1
##$AZFW= 0.1
##$BCFW= 1
##$BC_mod= 2
##$BYTORDP= 1
##$COROFFS= 0
##$CY= -3
##$DATMOD= 1
##$DC= 2
##$DFILT= <>
##$DTYPP= 0
##$F1P= 0
##$F2P= 0
##$FCOR= 0.5
##$FTSIZE= 0
##$FT_mod= 4
##$GAMMA= 1
##$GB= 0.15
##$INTBC= 1
##$INTSCL= 1
##$ISEN= 128
##$LB= 0.25
##$LEV0= 0
##$LPBIN= 0
##$MAXI= 10000
##$MC2= 0
##$MEAN= 0
##$ME_mod= 0
##$MI= 1.114404
##$NCOEF= 0
##$NC_proc= 0
##$NLEV= 6
##$NOISF1= 3.799351
##$NOISF2= 2.8
##$NSP= 1
##$NTH_PI= 0
##$NZP= 0
##$OFFSET= 14.38212
##$PC= 1
##$PHC0= 259.4529
##$PHC1= 2.592224
##$PH_mod= 1
##$PKNL= yes
##$PPARMOD= 0
##$PSCAL= 0
##$PSIGN= 0
##$REVERSE= no
##$SF= 200.129724274929
##$SI= 16384
##$SIGF1= 3
##$SIGF2= 2
##$SINO= 400
##$SIOLD= 16384
##$SREGLST= <1H.CDCl3>
##$SSB= 0
##$STSI= 0
##$STSR= 0
##$SW_p= 3205.1282051282
##$SYMM= 0
##$S_DEV= 0
##$TDeff= 0
##$TDoff= 0
##$TI= <>
##$TILT= no
##$TM1= 0
##$TM2= 0
##$TOPLEV= 0
##$USERP1= <user>
##$USERP2= <user>
##$USERP3= <user>
##$USERP4= <user>
##$USERP5= <user>
##$WDW= 1
##$XDIM= 8192
##$YMAX_p= 0
##$YMIN_p= 0
$$ End of Bruker specific parameters
$$ ---------------------------------
##NTUPLES= NMR FID
##VAR_NAME=  TIME,          FID/REAL,        FID/IMAG
##SYMBOL=    X,             R,               I
##VAR_TYPE=  INDEPENDENT,   DEPENDENT,       DEPENDENT
##VAR_FORM=  AFFN,          ASDF,            ASDF
##VAR_DIM=   8192,          8192,            8192
##UNITS=     SECONDS,       ARBITRARY UNITS, ARBITRARY UNITS
##FACTOR=    0.0002768,     1,               1
##FIRST=     0,             0,               0
##LAST=      2.2672688,     0,               0
##MIN=       0,             -392506,         0
##MAX=       2.2672688,     349334,          0
$$ Real data points
##PAGE= N=1
##DATA TABLE= (X++(R..R)), XYDATA
$$ [...]
$$ plain form
1905 -435 707 -763 -429 609 -537 287 823 -614 171 174 -408 591 -159 161 657 -331 64 299 -1215
1924 -1215 138 -12 -732 577 49 -765 568 -325 -492 758 -100 446 853 61 546 352 -510 564
1942 564 -210 -197 691 -765 -564 609 -972 -567 220 -765 259 401 -281 463 141 -184 874 -178
1960 -178 522 905 -384 571 288 -880 257 -333 -995 423 -291 -833 572 -403 -560 513 -22 377
1978 377 641 -338 735 94 -165 761 -452 -209 555 -807 -433 245 -1350 -240 30 -901 104 307
1996 307 -446 520 -32 -117 639 -247 868 704 -597 757 118 -924 491 -347 -873 694 -363 -221
2014 -221 387 -635 -93 251 -367 537 524 23 571 -315 -222 1030 -381 161 871 -723 36 223 -1072
2033 -1072 -29 59 -666 260 -126 -268 589 -527 39 653 -274 698 511 -471 602 -81 -615 693 -365
$$ packed form
1905d35J142j470L34J038j146Q24N36j437P85Ln82R99p50L20M96r88L95K35j514
1924a215J353j50p20J309n28q14J333q93j67J250q58N46M07p92M85j94q62J074
1942E64p74J3Q88j456K01J173j581M05P87r85J024J42o82P44l22l25J058j052
1960a78P00L83j289R55k83j168J137n90o62J418p14n42J405r75j57J073n35L99
1978C77K64r79J073o41k59R26j213K43P64j362L74O78j595J110K70r31J005K03
1996C07p53R66n52q5P56q86J115j64j301J354o39j042J415q38n26J567j057J42
2014b21O08j022N42L44o18R04j3n01N48q86R3J252j411N42P10j594P59J87j295
2033a072J043Q8p25R26l86j42Q57j116N66O14r27R72j87r82J073o83n34J308j058
$$ plain form
2052 -365 -326 435 -406 -323 114 -750 -221 33 -105 419 89 -46 631 -630 -245 783 -589 233 866 -680
2072 -680 445 267 -838 497 86 -359 519 -395 -50 -10 -646 34 111 -692 648 206 -656 531 -384
2091 -384 -648 690 -198 -92 945 -249 123 368 -746 331 -89 -448 562 -292 -279 597 -929 -415
2109 -415 626 -640 203 562 -511 489 197 -586 609 49 -54 520 -285 -65 220 -824 248 -169
2127 -169 -710 633 -243 -385 629 -493 -150 704 -350 479 900 -195 252 224 -369 460 -61 -411 695
2146 695 -453 -266 316 -1301 -148 224 -963 490 47 -568 724 25 -335 517 39 143 737 -128
2164 -128 365 23 -667 134 -281 -542 840 -271 -462 495 -827 -314 632 -267 183 673 -81 597 321
2183 321 -188 500 -16 86 631 -729 -87 83 -924 -134 56 -967 393 -74 -521 368 -92 -388 727
$$ packed form
2052c65L9P61q41Q3M37q64N29K54j38N24l30j35O77j261L85J028j372Q22O33j546
2072f80J125j78j105J335m11m45Q78r14L45M0o36O80P7q03J340m42q62J187r15
2091c84k64J338q88J06J037j194L72K45j114J077m20l59J010q54J3Q76j526N14
2109d15J041j266Q43L59j073J000k92p83J195n60j03N74q05K20K85j044J072m17
2127a69n41J343q76j42J014j122L43Q54j054Q29M21j095M47k8n93Q29n21l50J106
2146F95j148J87N82j617J153L72j187J453m43o15J292o99l60Q52m78J04N94q65
2164a28M93l42o90Q01m15k61J382j111j91R57j322N13R46q99M50M90p54O78k76
2183C21n09O88n16J02N45j360O42J70j007P90J90j023J360m67m47Q89m60k96J115
$$ plain form
2202 727 -130 436 758 -42 528 -1 -499 584 -639 -375 758 -583 -191 225 -793 -165 468 -549
2220 -549 449 433 -174 518 -34 125 473 -238 210 405 -493 179 212 -933 230 -7 -668 461 -237 -334
2240 -334 344 -495 -287 292 -198 466 276 -389 501 -20 -532 470 -528 -157 616 -618 18 192 -914
2259 -914 -95 18 -675 337 41 -528 344 -322 -44 470 -269 154 434 -561 453 235 -407 338 -261
2278 -261 -461 776 -220 -372 474 -531 -89 7 -163 406 49 -253 345 -279 -247 878 -351 120 721
2297 721 -623 404 284 -527 249 54 -388 347 -89 -405 182 -658 -94 31 -503 330 311 -558 712
2316 712 26 -495 519 -6 -78 760 -153 -44 324 -321 38 -258 -318 446 -435 -163 394 -588 -58 406
2336 406 -594 375 689 -283 425 238 -458 405 43 -568 266 -286 -263 -229 -592 19 -17 -637 597 82
$$ packed form
2202G27q57N66L22q00N70n29m98J083j223K64J133j341L92M16j018O28O33j017
2220e49R98j6o07O92n52J59L48p11M48J95q98O72L3j145J163k37o61J129o98r7
2240c34O78q39K08N79m90O64j90o65Q90n21n12J002r98L71P73j234O36J74j106
2259i14Q19J13o93J012k96n69Q72o66K78N14p39M23K80r95J014k18o42P45n99
2278b61k00J237r96j52Q46j005M42R6j70N69l57l02N98o24L2J125j229M71O01
2297G21j344J027j20q11P76j95m42P35m36l16N87q40N64J25n34Q33j9q69J270
2316G12o86n21J014n25p2Q38r13J09L68o45L59k96o0P64q81K72N57r82N30M64
2336D06j000R69L14r72P08j87o96Q63l62o11Q34n52K3L4l63O11l6o20J234n15
$$ plain form
2356 82 -321 860 -226 -338 620 -239 66 773 -277 211 94 -375 189 -290 -428 71 -514 -226 372
2375 372 -452 -108 291 -463 437 503 -511 796 210 -444 569 -25 10 449 -289 153 112 -720 271 -96
2395 -96 -611 572 -80 -43 486 -231 -285 611 -191 86 505 -251 358 -63 -432 293 -295 36 372 -425 -199
2416 -199 147 -790 -99 136 -697 468 284 -432 470 55 -171 508 -107 147 503 -229 306 -101 -593 228
2436 228 -210 -612 501 -273 -29 487 -439 148 236 -467 208 362 -139 484 187 -291 336 -393 -25 528
2456 528 -326 62 248 -511 46 273 -661 542 -46 -292 443 -133 -183 132 -521 83 52 -234 341 25
2476 25 -365 200 -164 -159 617 -289 -185 409 -552 -88 135 -427 495 6 -433 368 -130 -9 640 -411 342
2497 342 650 -179 436 243 -569 415 -94 -512 264 -113 -354 -54 -332 -57 53 -419 270 132 -271 465
$$ packed form
2356H2m03J181j086j12R58q59L05P07j050M88j17m69N64m79j38M99n85K88N98
2375C72q24L44L99p54R00O6j014J307n86o54J013n94L5M39p38M42m1q32R91l67
2395i6n15J183o52L7N29p17n4Q96q02K77M19p56O09m21l69P25n88L31L36p97K26
2416a99L46r37O91K35q33J165j84p16R02m15k26O79o15K54L56p32N35m07m92Q21
2436B28m38m02J113p74K44N16r26N87Q8p03O75J54n01O23k97m78O27p29L68N53
2456E28q54L88J86p59N57K27r34J203n88k46P35n76n0L15o53O04l1k86N75l16
2476B5l90N65l64NP76r06J04N94r61M64K23n62R22m89m39Q01m98J21O49j051P53
2497C42L08q29O15j93q12R84n09m18P76l77k41L00k78K75J10m72O89j38m03P36
$$ plain form
2517 465 55 -149 810 -112 59 735 -256 320 244 -506 41 -213 -469 180 -133 -71 183 -382 -83 281 -293
2538 -293 558 430 -197 579 242 -234 425 -124 -219 372 -359 -103 78 -684 -148 -306 -341 310 -41 -7 672
2559 672 113 -61 566 -203 325 530 -164 368 442 -435 312 -65 -514 322 -527 -196 338 -635 1 162
2579 162 -271 565 220 -181 675 94 -139 562 -29 59 299 -329 -47 147 -457 80 -252 -425 246 -270
2599 -270 -260 210 -512 -127 467 -420 98 400 -160 343 182 -370 464 -119 -143 126 -396 72 156 -880 88
2620 88 140 -391 313 -103 -295 322 -142 -119 403 -123 124 431 -290 44 -13 -312 140 -155 -140 342 -24 -246
2642 -246 463 -350 -38 184 -284 248 225 -351 220 62 -100 266 -135 9 404 -276 80 77 -441 204 -36
2663 -36 -265 269 -26 -313 210 -286 -231 332 -359 141 249 -336 304 128 -237 397 63 -75 310 -185 -63
$$ packed form
2517D65m10k04R59r22J71O76r91N76p6p50N47k54k56O49l13O2K54n65K99L64n74
2538b93Q51j28o27P76l37m76O59n49r5N91p31K56J81p62N36j58l5O51l51L4O79
2559F72n59j74O27p69N28K05o94N32P4q77P47l77m49Q36q49L31N34r73O36J61
2579A62m33Q36l45m01Q56n81k33P01n91Q8K40o28K82J94o04N37l32j73O71n16
2599b70J0M70p22L85N94q87N18L02n60N03j61n52Q34n83k4K69n22M68Q4j036R68
2620H8N2n31P04m16j92O17m64K3N22n26K47L07p21L34n7k99M52k95J5M82l66k22
2642b46P09q13L12K22m68N32k3n76N71j58j62L66m01J44L95o80L56ln18O45k40
2663c6k29N34k95k87N23m96N5N63o91N00J08n85O40j76l65O34l34j38L85m95J22
$$ plain form
2684 -63 119 -489 60 34 -463 85 -32 -230 234 -283 -89 107 -36 234 205 -201 211 180 -344 394 -221
2705 -221 -419 296 -108 -260 236 -617 -138 168 -513 145 142 -170 287 253 57 477 -226 413 528 -339 250
2726 250 202 -462 -6 -128 -393 215 -57 -392 127 -363 -287 96 -115 242 234 -224 541 350 -110 222 -32
2747 -32 -136 526 -115 6 11 -641 -153 -182 -327 245 79 -404 413 -105 66 267 -4 122 360 -126 294
2768 294 290 -252 18 -99 -218 146 -311 -197 62 -377 168 64 -107 327 122 -30 525 25 -116 492 -119
2789 -119 52 417 -229 146 245 -574 -24 -65 -441 239 -362 12 443 -302 149 397 -188 489 328 -231 207
2810 207 31 -404 258 -137 -95 230 -181 -34 98 -211 -34 -35 -425 333 -83 -116 359 -135 -81 185 -164 61
2832 61 309 -2 211 143 -176 149 15 -293 376 -108 144 264 -378 63 79 -329 169 126 -373 265 33
$$ packed form
2684f3J82o08N49k6m97N48j17j98M64n17J94J96j43K70k9m06M12l1n24P38o15
2705b21j98P15m04j52M96q53M79L06o81O58ll12M57l4j96M20p03O39J15q67N89
2726B50m8o64M56j22k65O08k72l35N19m90P6L83k11L57qm58P65j91m60L32k54
2747c2j04O62o41J21No52M88k9j45N72j66m83Q17n18J71K01k71J26K38m86M20
2768B94mn42K70j17j19L64m57J14K59m39N45j04j71M34k05j52N55n00j41O08o11
2789a19J71L65o46L75R9q19N50m1l76O80o01L74M31p45M51K48n85O77j61n59M38
2810B07j76m35O62l95M2L25m11J47J32l09J77jl90P58m16l3M75m94N4K66l49K25
2832F1K48l11K13o8l19L25j34l08O69m84K52J20o42M41J6m08M98m3m99O38k32
$$ plain form
2853 33 -246 58 -234 -21 422 -141 189 33 -348 78 -29 -367 423 -212 -164 199 -367 -196 232 -274 75
2874 75 342 -161 331 140 -125 480 -122 -239 232 -72 4 216 -190 35 -54 -435 365 -15 -355 209 -228
2895 -228 -307 455 89 132 485 -122 336 86 -282 397 -229 -12 414 -160 -289 247 -563 34 309 -402 14
2916 14 57 -244 313 -17 -103 282 -63 470 395 -341 125 56 -305 162 92 -207 223 -100 -150 125 -242 -58
2938 -58 335 -199 259 176 22 293 189 52 372 -377 -152 253 -75 18 -258 -577 -192 -1 -441 260 -168
2959 -168 -36 173 -134 109 322 -271 27 394 -64 281 -23 -402 219 -93 -151 299 -253 -172 167 -441 -143
2980 -143 58 -411 128 267 62 332 96 -81 432 -127 -32 278 -475 48 210 -344 201 -116 -315 327
3000 327 -39 -52 463 -185 40 156 -245 191 207 -252 279 143 -416 272 -29 -451 188 -235 -74 106 -318
$$ packed form
2853C3k79L04k92K13M43n63L30j56l81M26j07l38P90o35M8L63n66J71M28n06L49
2874G5K67n03M92j91k65O05o02j17M71l04P6K12m06K25q9l81Q00l80l40N64m37
2895b28p9P62l66M3L53o07M58k50l68O79o26K17M26n74j29N36q10N97K75p11M16
2916A4M3l01N57l30q6L85l45N33p5p36M66o9l61M67p0k99M30l23n0K75l67J84
2938e8L93n34M58q3j54K71j04j37L20p49K25M05l28R3k76l19L85J91m40P01m28
2959a68J32K09l07K43K13n93K98L67m58L45l04l79O21l12n8M50n52Q1L39o08K98
2980a43K01m69N39J39k05K70k36j77N13n59R5L10p53N23J62n54N45l17j99O42
3000C27l66j3N15o48K25J16m01M36J6m59N31j36n59O88l01m22O39m23J61J80m24
$$ plain form
3021 -318 58 90 -27 59 -81 -133 313 -123 -92 269 -254 4 255 -182 80 -65 -222 99 -220 -146 177 -176
3043 -176 -8 218 -212 -101 128 -346 263 225 -225 393 -219 -162 153 -160 37 113 -46 147 134 -195 244
3064 244 -138 -300 291 -199 -127 325 -428 -95 137 -336 211 267 -180 211 -170 -179 267 -36 111 194 -400 66
3086 66 240 -369 22 -47 -381 40 28 -281 161 -259 -187 344 -108 115 234 -310 279 118 -23 449 -12
3107 -12 17 61 -371 -316 217 -277 182 29 -396 20 56 -124 295 -182 -180 443 -49 -142 155 -276 19 6 -392
3130 -392 142 -120 -214 77 -320 -100 186 -546 94 300 -198 358 218 -103 330 160 152 85 -142 -88 103 -255
3152 -255 -60 -10 -467 -21 -107 -69 228 -57 -324 237 -285 12 349 -281 169 252 22 291 32 -151 257
3173 257 -187 -113 58 -172 -280 2 -332 -35 301 -190 252 101 -14 296 -153 -39 303 -88 -229 32
$$ packed form
3021c18L76L2j17Q6j40n2M46m36L1L61n23K58K51m37K62j45j57L21l19P4L23l53
3043a76J68K26m30J11K29m74O09l8m50O18o12N7L15l13J97P6j59J93j3l29M39
3064B44l82j62N91m90P2M52p53L33K32m73N47N6m47L91l81rM46l03J47Q3n94M66
3086F6J74o09L91o9l34M21j2l09M42m20P2N31m52K23J19n44N89j61j41M72m61
3107a2K9M4m32N5N33m94M59j53m25M16L6j80M19m77KO23m92r3K97m31K95j3l98
3130c92N34k62r4K91l97K20K86p32O40K06m98N56j40l21M33j70qo7k27N4J91l58
3152b55J95N0m57M46q6L8K97k85k67N61n22K97L37o30M50Q3k30K69k59j83M08
3173B57m44P4J71k30j08K82l34K97L36m91M42j51j15L10m49J14L42l91j41K61
$$ plain form
3193 32 -332 -59 -21 -292 45 -182 -194 212 20 -128 245 39 304 274 -220 140 98 -253 302 184 -247 321
3215 321 -533 31 280 -148 -30 190 -372 245 218 -344 296 11 -154 104 -65 13 112 26 193 200 -378 399
3237 399 264 -119 201 -321 -101 273 -204 83 37 -93 190 -109 58 114 5 -439 -20 -40 -20 112 -122
3258 -122 295 343 -159 164 328 -198 282 -152 -191 217 -183 -344 208 -300 -80 164 -208 322 111 -118 223
3279 223 4 2 297 77 -64 383 -252 128 302 -130 174 -91 -353 -19 -95 -489 268 -261 24 312 -119
3300 -119 256 334 -51 313 134 -301 457 -152 -193 170 -267 -21 217 -281 -38 89 -368 203 89 -27 182
3321 182 48 133 321 -27 64 237 40 0 92 -147 23 105 -257 226 -369 -210 37 -417 -42 64 -130 -12
3343 -12 168 -111 161 54 20 47 -82 -128 135 -279 115 314 -287 76 -7 -253 193 -122 -344 281 226 -14
$$ packed form
3193C2l64K73L8k71L37k27j2M06j92j48L73k06K65l0m94L60m2l51N55j18m31N68
3215C21q54N64K49m28J18K20n62O17k7n62O40k85j65K58j69P8R9q6J67Pn78P77
3237C99j35l83L20n22K20L74m77K87m6j30K83k99J67N6j09m44M19k0K0J32k34
3258a22M17M8n02L23J64n26M80m34l9M08m00j61N52n08K20K44l72N30k11k29L41
3279B23k19kK95k20j41M47o35L80J74m32L04k65k62L34p6l94P57n29K85K88m31
3300a19L75P8l85L64j79m35P58o09m1L63m37K46K38m98K43J27m57N71j14j16K09
3321A82j34Q5J88l48R1J73j97m0R2k39J70Q2l62M83n95J59K47m54L75J06j94J18
3343a2J80k79K72j07l4K7j29m6K63m14L94J99o01L63q3k46M46l15k22O25n5k40
$$ plain form
3365 -14 297 23 43 75 13 -186 152 -303 40 -200 -118 163 -141 -237 150 -222 9 288 -209 162 -101 16
3387 16 397 -73 105 140 -142 -258 253 12 -15 231 -421 175 -92 -202 188 -73 -127 344 -264 215 194 -98
3409 -98 196 212 -317 -1 309 -293 196 -127 -213 378 -108 -62 -86 -4 129 40 -191 162 -42 -55 306 -59 -4
3432 -4 151 -201 81 111 -99 106 -30 -286 267 -59 -2 303 -8 75 -52 -68 28 -111 -467 45 -60 -334
3454 -334 -3 87 -128 97 -148 136 203 -149 164 152 -241 17 157 -115 118 96 -82 151 -32 -181 218
3475 218 -344 21 234 -346 390 -31 43 91 -166 -127 199 -29 5 160 -399 98 18 32 202 -308 -187 46
3497 46 -255 -74 272 -49 85 39 -110 82 56 -188 224 48 -189 165 -41 -119 21 -420 -31 27 -222 -6
3519 -6 53 -49 25 -221 -149 265 -177 -11 33 28 181 93 6 30 -64 -149 143 -203 -158 138 -298 -238 38 -136 74
$$ packed form
3365a4L11k74K0L2o2j99L38m55L43k40Q2K81l04r6L87l72K31K79m97L71k63J17
3387A6L81m70J78L5k82j16N11k41k7K46o52N96k67j10L90k61n4M71o08M79k1k92
3409i8K94J6n29L16L10o02M89l23q6N91m86M6k4Q2J33q9k31L53k04j3L61l65N5
3432dJ55l52K82L0k10K05j36k56N53l26N7L05l11Q3j27j6R6j39l56N12j05k74
3454c34L31R0k15K25k45K84O7l52L13j2l93K58J40k72K33k2j78K33j83j49L99
3475B18n62L65K13n80P36m21P4M8k57L9L26k28L4J55n59M97q0J4J70n10J21K33
3497D6l01J81L46l21J34m6j49J92k6k44M12j76k37L54k06p8J40m41L89N8k49K16
3519fN9j02P4k46P2M14m42J66M4nJ53q8q7K4r4q5K92l46M5K96m36O0K76j74K10
$$ plain form
3544 74 86 -215 242 31 -154 137 128 11 73 -115 -43 3 -248 -35 46 -152 178 1 -90 -154 -45 -188 166
3567 166 -151 -19 58 -35 78 171 -143 131 -112 87 335 -48 -86 53 -81 -110 120 -298 147 22 -180 148
3589 148 -93 -103 272 -251 189 18 -114 -8 189 -166 219 103 -232 303 -106 17 148 -344 -100 169
3609 169 -290 107 -65 -159 201 14 -358 77 -87 29 287 -37 -39 -32 -235 153 116 -181 83 -74 -82 -156 -253
3632 -253 -240 -105 -175 26 170 -205 47 116 -161 -110 -28 -88 59 -74 -25 99 -85 -173 5 -66 164 32 -202
3655 -202 81 -118 -37 18 -144 -10 204 -201 184 189 -5 57 27 -224 87 96 -144 -58 -277 -40 45 -100 -54 125
3679 125 -146 151 81 85 211 -1 -31 274 -235 -22 26 -297 -60 226 -231 -79 -202 -195 223 -118 52 188
3701 188 0 -23 59 -137 164 -122 -128 73 111 -331 109 -206 23 199 -173 119 83 -163 171 -65 -199 -7
$$ packed form
3544G4J2l01M57k11j85K91rj17O2j88P2M6k51K13Q1j98L30j77r1o4J09j43L54
3567A66l17J32P7r3J13R3l14K74k43J99K48l83l8J39j34k9K30m18M45j25k02L28
3589A48k41j0L75n23M40j71j32J06J97l55L85j16l35N35m09J23J31m92K44K69
3609A69m59L97j72r4L60j87l72M35j64J16K58l24kPk03L88l7k97K64j57qp4r7
3632b53J3J35p0K01J44l75K52O9k77N1Q2o0J47j33M9J24j84q8J78p1K30j32k34
3655b02K83j99Q1N5j62J34K14m05L85Nj94O2l0k51L11Rk40Q6k19K37Q5j45M6J79
3679A25k71K97p0MJ26k12l0L05n09K13M8l23K37K86m57J52j23PM18l41J70J36
3701A88j88k3Q2j96L01k86oK01L8m42M40l15K29J76l72K92l6k46L34k36j34J92
$$ plain form
3723 -7 108 -72 -2 -17 198 237 -147 85 -46 -88 -71 -41 -114 13 -45 -122 161 -165 -118 -66 -458 44 -14 38 225
3748 225 32 -96 91 -97 -69 14 28 -80 204 -85 37 -22 -121 63 57 26 281 138 54 135 151 -21 157 -169
3772 -169 172 137 -161 -148 -27 -124 20 -35 -171 -112 -244 -130 -14 28 107 8 14 23 -281 -253 99 -120 -239 35
3796 35 -396 157 -56 -75 67 -121 -181 208 54 22 -66 -46 -126 44 -164 125 -20 -126 259 51 -122 114
3818 114 -205 9 86 -121 -130 -42 -46 104 117 -215 274 -62 106 340 7 -258 48 -89 71 47 -269 -66 84
3841 84 -107 -4 -56 -183 127 -128 27 233 -173 -204 126 -107 3 -22 -130 100 -66 -87 108 -67 182 297
3863 297 22 173 -3 -151 -72 246 -227 101 -26 -453 34 38 -194 114 19 125 66 -378 -75 -87 46 52 22
3886 22 -26 11 -32 -109 41 -122 -130 144 123 126 -87 -141 -29 -94 246 -61 -12 59 -37 107 70 126 27 -106 67 -167
$$ packed form
3723gJ15j80P0j5K15L9l84K32j31m2J7L0p3J27n8p7K83l26M7N2l92N02n8N2J87
3748B25j93j28J87j88K8Q3J4j08K84k89J22n9r9J84ol1K55j43q4Q1J6j72J78l26
3772a69L41l5k98J3J21r7J44n5j36N9j32J14J16M2P9r9ORl04K8L52k19j19K74
3796C5m31N53k13j9J42j88o0L89j54l2q8K0q0J70k08K89j45j06L85k08j73K36
3818A14l19K14P7k07rQ8mJ50J3l32M89l36J68K34l33k65L06j37J60k4l16K03J50
3841H4j91J03n2j27L10k55J55K06m06l1L30k33J10k5j08K30j66k1J95j75K49J15
3863B97k75J51j76j48P9L18m73L28j27m27M87Mk32L08r5J06n9m44L03j2J33Ol0
3886B2m8L7m3p7J50j63qK74k1Lk13n4J12o5L40l07M9P1r6J44l7N6r9j33J73k34
$$ plain form
3912 -167 93 57 -124 0 -74 -254 56 -94 171 -65 -11 229 -17 -227 171 170 -139 107 188 111 37 -93 89
3935 89 -30 -190 56 -85 -252 94 -17 85 -116 -143 -158 -38 -238 117 49 -197 187 102 2 24 -354 -35
3957 -35 15 -160 33 -41 -93 -104 -23 -265 116 16 12 233 -53 -165 108 3 -106 64 -40 85 -122 76 83
3980 83 87 -46 -34 -115 -75 202 -266 93 75 77 77 27 -313 97 -152 -139 205 -214 -18 193 -87 -38 -174 -121 -55
4005 -55 -154 -185 166 -171 47 174 -211 -12 28 -65 69 7 -20 -1 -80 -39 248 97 -123 136 -73 141 161 -56
4029 -56 25 -30 -77 260 84 -276 -53 -278 6 89 91 0 -48 -63 174 -33 3 119 30 95 -92 -83 -108 -128 -27 -44
4055 -44 198 -10 -171 -117 69 110 0 -25 70 -138 17 173 -109 201 61 -96 155 -65 -35 -32 -24 -258 194
4078 194 21 73 46 -49 216 -54 72 4 213 -150 260 -20 35 173 -20 -12 -24 -204 -18 62 -220 -78 153
$$ packed form
3912a67K60l6j81J24p4j80L10j50K65k36N4K40k46k10L98jl09K46Q1p7p4j30J82
3935H9j19j60K46j41j67L46j11J02k01k7j5J20k00L55o8k46L84q5j00K2l78L19
3957c5N0j75J93p4n2j1Q1k42L81j00mK21k86j12K73j05j09J70j04J25k07J98P
3980H3Mj33J2q1M0K77m68L59j8K%n0l40M10k49J3L44m19J96K11k80M9j36N3O6
4005e5r9l1L51l37K18J27l85J99M0r3J34o2k7J9p9M1K87j51k20K59k09K14K0k17
4029e6Q1n5m7L37j76l60K23k25K84Q3Kr1m8j5K37k07L6J16q9O5j87Rk5k0J01j7
4055d4K42k08j61N4J86M1j10k5R5k08J55J56k82L10j40j57K51k20L0LQk34M52
4078A94j73N2k7r5K65k70J26o8K09l63M10k80N5J38j93Qj2j80J86Q0k82J42K31
$$ plain form
4101 153 -39 280 -76 16 125 -86 117 -26 -63 -122 -238 100 45 114 -143 94 -207 -103 24 25 -32 113 25
4124 25 -3 -49 65 113 27 -53 -27 -103 -29 91 -361 116 231 20 -131 -58 -114 125 -174 -14 -29 97 201 -21
4148 -21 -53 198 176 106 89 -94 -155 14 71 51 -41 -321 -97 23 -184 181 -27 -177 52 -133 -65 152 -174
4171 -174 -94 100 -167 -78 74 -97 175 39 -153 82 -35 -237 -93 149 85 -83 20 39 -23 -111 -29 94
4193 94 125 -27 28 -53 85 -54 52 60 -67 -67 362 139 32 40 -107 97 103 234 -23 -94 61 120 -84 108 -11
4218 -11 -67 27 -107 143 200 -125 -102 141 -82 -28 53 -139 43 -17 173 -51 -236 -199 21 44 -127 24 -122
4241 -122 43 55 -47 37 83 -49 -5 64 -116 343 -159 170 83 -177 -154 120 -95 140 97 43 131 -54 -39 61
4265 61 4 117 30 122 86 -143 -14 -160 36 47 24 -213 -177 73 -100 -72 -215 42 67 -50 70 -55 -6 -166
$$ packed form
4101A53j92L19l56R2J09k11K03j43l7n9j16L38n5O9k57K37l01J04J27Jn7J45q8
4124B5k8m6J14M8q6q0K6p6P4J20m52M77J15k11j51P3n6K39k99J60j5J26J04k22
4148b1l2K51k2p0j7j83o1J69N7k0r2k80K24J20k07L65k08j50K29j85O8K17l26
4171a74Q0J94k67Q9J52j71K72j36j92K35j17k02J44K42o4j68J03J9o2q8Q2J23
4193I4L1j52N5q1J38j39J06Qj27%M29k23j07Qj47K04OJ31k57p1J55N9k04J92j19
4218a1n6R4j34K50N7l25K3K43k23N4Q1j92J82o0J90k24j85L7K20K3j71J51j46
4241a22J65J2j02Q4M6j32M4O9j80M59n02L29q7k60K3K74k15K35m3n4Q8j85J5J00
4265F1n7J13q7R2l6k29J29j46J96J1k3k37L6K50j73K8j43K57K5j17J20j25M9j60
$$ plain form
4289 -166 267 138 -128 9 -1 31 36 -226 116 -157 -245 182 -29 -93 -30 -151 132 -40 133 77 41 -53 74
4312 74 -365 -28 15 9 -101 -91 -39 -81 -40 -131 -278 163 -250 37 40 -17 88 -126 91 110 -45 -6 54 -164 -67
4337 -67 16 -90 56 -212 -74 -21 -262 167 141 -164 21 254 -54 230 4 41 177 85 -196 -47 -200 -29
4359 -29 56 81 23 291 -12 61 79 43 -70 125 49 -29 41 -12 -148 -2 60 274 -173 32 -36 -126 150 -6 16
4384 16 160 55 -44 287 -141 188 55 -177 -51 296 -126 -84 -160 -27 111 -180 -179 -82 121 7 -4 -11 13 10
4408 10 -43 111 -80 -186 55 -132 2 82 -87 105 122 5 -95 11 91 115 -123 -148 7 -210 -5 -187
4430 -187 9 -62 -103 -72 147 -287 -136 -42 18 7 245 -124 101 252 -117 -178 110 -226 18 -139 -73 -93 -148
4453 -148 -54 -45 -40 59 210 -80 127 278 -144 222 -24 -93 -41 77 14 -156 26 -31 -159 -242 11 -62 -145 123
$$ packed form
4289a66M33j29k66J37j0L2Nk62L42k73q8M27k11o4O3j21K83j72J73n6l6r4J27
4312G4m39L37M3oj10J0N2m2M1r1j47M41m13K87Ln7J05k14K17J9j55L9O0k18R7
4337f7Q3j06J46k68J38N3k41M29k6l05J85K33l08K84k26L7J36r2k81J49j53J71
4359b9Q5K5n8K68l03P3J8l6j13J95p6p8P0n3j36J46O2K14m47K05o8r0K76j56K2
4384A6J44j05r9L31m28L29j33k32J26L47m22M2p6J33J38k91JR7K03j14j1pK4l
4408A0n3J54j91j06K41j87J34Q0j69J92J7j17j00J06Q0K4k38k5J55k17K05j82
4430a87J96p1m1L1K19m34J51R4O0j1K38l69K25J51l69o1K88l36K44j57O6k0n5
4453a48R4RNR9J51k90K07J51m22L66k46o9N2J18o3j70J82n7j28q3K53p3q3K68
$$ plain form
4477 123 95 -158 65 -238 -75 30 -159 -44 134 -34 138 97 -52 127 6 60 -88 -54 -82 108 -224 165
4499 165 111 -30 -99 22 -161 93 -96 -141 125 12 -211 317 121 152 216 26 -55 125 -22 -41 -76 -113 63
4522 63 48 41 91 -9 -88 59 0 255 50 -135 -168 120 -109 -59 -225 -48 -5 -110 292 38 -30 247 -99 -9
4546 -9 157 52 -13 85 -90 -93 241 -68 57 -144 -91 13 -20 -105 -88 -53 33 55 -10 -203 -39 -178 19 -10 -122
4571 -122 81 -111 -107 -8 136 -25 226 -42 3 110 -183 141 108 -125 -210 5 -39 -91 -247 155 119 -101 -75
4594 -75 -16 139 82 -205 -6 228 120 18 43 -41 -249 -18 -107 44 46 -155 57 -151 93 78 -220 104 24
4617 24 -128 275 -50 35 248 -115 -140 14 145 -10 141 -88 207 136 -81 99 157 -115 204 -7 -18 109
4639 109 77 93 31 116 106 28 14 75 7 -188 -139 89 94 90 51 -106 32 37 158 24 -12 55 29 -71 170 152 -25
$$ packed form
4477A23k8k53K23l03J63J05j89J15J78j68J72m1j49J79j21N4j48L4k8J90l32L89
4499A65n4j41o9J21j83K54j89m5K66j13k23N28j96L1O4j90q1J80j47j9l5l7J76
4522F3j5pN0j00p9J47n9K55k05j85l3K88k29N0j66J77M3j05M02k54o8K77l46R0
4546iJ66j05o5R8j75lL34l09J25k01N3J04l3q5J7L5Q6K2o5j93J64j39J97k9j12
4571a22K03j92MR9J44j61K51k68M5J07k93L24l3k33q5K15m4n2j56M02l6k20K6
4594g5N9J55n7k87J99K34j08j02K5q4k08K31q9J51Kk01K12k08K44j5k98L24q0
4617B4j52M03l25Q5K13l63k5J54J31j55J51k29K95p1k17J80N8k72L19k11j1J27
4639A09l2J6o2Q5j0p8j4O1o8j95M9K28Nml9j57J38NJ21j34l6O7k6j00K41j8j77
$$ plain form
4666 -25 57 -135 91 -10 -17 -17 -168 -125 -239 18 69 -88 94 -69 88 -24 45 226 72 -21 -235 0 136
4689 136 14 71 182 -15 112 -44 -25 -1 97 -183 115 94 -201 -176 56 21 -129 -200 -91 80 3 6 48 -140
4713 -140 -32 57 -7 15 -224 128 93 -66 65 -66 -57 -58 -251 6 126 78 233 15 107 142 -90 176 -200 242
4737 242 -30 -27 34 -26 51 -123 190 150 -149 -106 126 63 169 182 101 -83 -165 41 -135 139 -147 -2 159 -24
4761 -24 -1 -206 128 144 -160 114 24 -121 -47 -143 148 195 -112 89 57 -265 -48 217 -48 -6 -2 60 -191 72
4785 72 14 193 -119 10 84 -18 54 -60 -149 179 -67 -338 255 143 -109 72 -17 -40 40 1 85 18 -5 -31
4809 -31 -134 -247 20 -66 -26 127 -84 -19 163 127 9 106 -63 169 125 114 70 -304 -217 -137 150 91 148 77 209
4834 209 -9 -71 -209 284 213 -18 -80 11 48 33 242 29 -4 63 51 66 52 -69 174 0 -192 -6 -131 -51
$$ packed form
4666b5Q2j92K26j01p%j51M3j14K57N1j57J82j63J57j12O9J81j54r3k14K35J36
4689A36j22N7J11j97J27j56J9K4R8k80K98k1k95K5K32l5j50p1J09J71p7LM2j88
4713a40J08Q9o4K2k39L52l5j59J31j31Rjj93K57J20m8J55k18R2L5k32K66l76M42
4737B42k72LO1o0P7j74L13m0k99M3K32o3J06J3q1j84q2K06j76K74k86J45J61j83
4761b4K3k05L34J6l04K74r0j45P4r6K91M7l07K01l2l22K17K65k65M2MO2k51K63
4785G2n8J79l12J29P4j02P2j14q9L28k46k71N93j12k52J81q9k3Q0l9Q4o7k3k6
4809c1j03j13K67q6M0J53k11O5J82l6j18R7j69K32m4j1m4l74Q7Q0K87n9N7p1J32
4834B09k18o2j38M93p1k31o2R1L7j5K09k13l3O7j2J5j4j21K43j74j92J86j25Q0
$$ plain form
4858 -51 52 244 26 -7 108 -34 35 -48 41 200 -66 -89 63 -35 -165 89 131 -46 71 -47 -40 -98 38 9
4882 9 52 80 121 -3 99 10 -44 149 27 -96 141 58 -26 -62 -176 119 -187 38 -58 60 111 120 182 -183 11
4907 11 22 96 -136 -42 -24 182 32 -7 27 -18 -153 65 102 113 22 -37 -277 49 -115 -130 113 -144 92 -144
4931 -144 194 51 -10 -62 45 -207 53 -108 68 132 326 187 -179 18 27 -198 -144 21 122 9 -82 -41 45
4954 45 -111 -38 -24 106 129 75 -111 -42 49 -23 223 170 -140 -27 -251 218 -29 -215 -131 -154 -1 -139 22 7
4978 7 -100 51 -220 -57 115 -134 226 33 -73 60 32 5 15 -58 -154 28 17 215 1 -19 -103 -33 -70 -1
5002 -1 -164 235 137 -14 3 113 5 146 124 72 -90 -139 -154 -249 108 7 129 66 -128 246 -53 109 169 44
5026 44 -9 105 111 133 136 72 86 -19 -123 -59 -42 -53 137 -75 -11 -89 119 17 -24 134 -72 -79 93 267 -93 189
$$ packed form
4858e1J03J92k18l3J15j42O9q3Q9J59k66k3J52r8j30K54M2j77J17j18Pn8J36k9
4882IM3K8M1j24J02q9n4J93j22j23K37q3q4l6j14K95l06K25r6J18N1RO2l65J94
4907A1J1P4k32R4J8K06j50l9L4m5j35K18L7J1r1n9k40L26j64j5K43k57K36k36
4931a44L38j43o1n2J07k52K60j61J76O4J94j39l66J97Rk25N4J65J01j13r1M1Q6
4954D5j56P3J4J30K3n4j86O9R1p2K46n3l10J13k24M69k47j86Q4k3J53j38J61j5
4978Gj07J51k71J63J72k49L60j93j06J33k8k7J0p3r6J82j1J98k14k0q4P0l7O9
5002aj63L99r8j51J7J10j08J41k2n2j62m9j5r5L57j01J22o3j94L74k99J62O0j25
5026D4n3J14OK2Lo4J4j05j04O4J7j1J90k12O4p8K08j02m1J58k06pJ72J74l60K82
$$ plain form
5052 189 -115 -131 65 -68 81 -25 -169 -106 20 -145 23 -46 -50 -100 -10 80 -88 -201 70 -71 -72 19 75 -133
5076 -133 -190 62 85 92 46 -94 -47 49 125 -63 79 47 -101 55 113 22 -156 12 -25 -4 1 -37 -6 -140 -186 -109
5102 -109 -2 -77 -25 -30 -159 -52 86 33 27 44 54 -98 3 99 128 -79 -264 -79 53 -2 186 -8 -80 -4 -228
5127 -228 -108 95 -45 259 -62 115 -63 5 -131 -259 -203 -113 -3 -185 39 -172 192 3 9 213 28 15
5149 15 128 -128 -111 -175 -67 -162 -48 -216 116 -14 227 -44 11 102 156 -29 180 -132 -29 -7 70 18 5 -66
5173 -66 101 -16 -108 215 38 64 0 100 239 -256 -58 -39 -67 6 -18 -107 0 -44 2 -21 14 55 -90 14 34
5198 34 6 -81 -133 -121 -318 106 -160 -269 -32 51 -212 18 79 -178 182 -29 -48 77 -82 -93 -164 -186 -45 29
5222 29 -12 -335 -144 -278 -10 116 -80 3 40 -131 -152 -64 5 -113 -175 -42 0 -141 -25 197 -79 72 -143
$$ packed form
5052A89l04j6J96j33J49j06j44O3J26j65J68o9mn0R0R0j68j13K71j41jR1N6k08
5076a33n7K52K3Pm6j40M7R6P6j88J42l2j48J56N8r1j78J68l7K1Nl8L1j34m6P7
5102a09J07p5N2nj29J07J38n3oJ7J0j52J01R6K9k07j85J85J32n5J88j94p2P6k24
5127b28J20K03j40L04l21J77j78O8j36j28N6R0J10j82K24k11L64j89OK04j85j3
5149A5J13k56J7o4J08r5J14j68L32j30K41k71N5R1N4j85K09l12J03K2P7n2j3p1
5173f6J67j17r2L23j77K6o4J00J39m95J98J9k8P3k4q9J07m4M6k3L5M1j45J04K0
5198C4k8q7n2J2j97M24k66j09K37Q3k63K30O1k57L60k11j9J25j59j1p1k2J41P4
5222B9m1l23J91j34K68J26j96Q3L7j71k1Q8O9j18o2J33M2j41J16K22k76J51k15
$$ plain form
5245 -143 -10 -6 103 33 157 85 237 179 -280 -43 372 -87 18 -65 -15 175 -35 14 157 117 42 -72 -132 71
5269 71 73 -77 5 -19 -53 154 111 -209 -65 120 94 83 21 234 -162 221 24 -125 -53 44 121 26 28 92 39 -21
5295 -21 160 -141 -30 65 -41 -60 -174 -89 160 174 -110 -124 -122 -25 185 -44 -58 151 -131 141 257 -7 -239
5318 -239 -127 132 -71 99 76 -95 -89 254 9 -5 -245 -110 -12 -37 198 95 -5 -172 -23 141 -5 100
5340 100 34 18 -6 -261 -101 -233 -155 -17 -61 -85 34 5 -247 162 192 -2 -38 -114 -120 36 -69 -61 227 236 146 -35
5366 -35 19 -87 -172 202 -16 57 17 -47 140 -172 -41 107 -132 -63 -37 -261 -94 89 -100 -98 138 66 -28 26
5390 26 -103 103 -188 -48 -130 21 -34 119 -72 212 167 79 51 -107 -151 28 164 225 9 -70 -37 -60 -3 268
5414 268 -85 11 -192 -158 -62 -87 55 62 -114 130 -14 -5 74 -3 -105 -67 -7 -133 -13 192 134 -48 -179 191
$$ packed form
5245a43J33MJ09p0J24p2J52n8m59K37M15m59J05q3N0J90k10M9J43m0p5j14o0K03
5269G1Kj50Q2k4l4K07m3l20J44J85k6j1o2K13l96L83j97j49P2R7P7r5KO4n3o0
5295b1J81l01J11R5j06j9j14Q5K49J4k84j4KR7K10k29j4K09k82K72J16k64k32
5318b39J12K59k03J70k3j71OL43k45j4k40J35R8k5K35j03j00j67J49J64j46J05
5340A00o6j6k4k55J60j32P8J38m4k4J19k9k52M09L0j94l6p6oJ56j05QK88Rr0j81
5366c5N4j06q5L74k18P3m0o4J87l12J31J48k39O9K6k24J67J83j89KK36p2r4N4
5390B6j29K06k91J40q2J51n5J53j91K84m5q8k8j58m4J79J36O1k16p9L3k3N7K71
5414B68l53R6k03L4R6k5J42Pj76K44j44RP9p7j02L8O0j26J20K05n8j82j31L70
$$ plain form
5438 191 -75 21 152 -81 -16 -58 -160 -19 -46 -66 -44 -38 16 204 20 -100 -92 70 60 226 -3 -187 51 98
5462 98 90 93 15 -49 -35 -9 -108 -167 5 242 265 135 164 -48 -49 -20 -30 -157 0 24 323 -10 -7 72 -50 -185 18
5489 18 -92 -23 208 244 131 -75 117 197 23 -23 -44 -9 115 54 -37 57 -7 -19 -11 -111 -10 -328 -219 157 198
5514 198 -23 104 91 35 35 -156 -84 103 -97 -4 -8 -19 7 93 105 3 133 20 73 127 95 255 -119 -105 141
5539 141 81 -92 143 -27 -101 -203 -197 11 -7 -92 83 126 26 94 238 -126 21 -49 -49 -103 -97 103 -102 12 -3
5564 -3 97 42 110 -18 41 -56 -12 319 73 0 63 105 -58 34 3 60 -17 -88 221 -118 135 6 241 47 95
5589 95 141 -17 70 -89 118 -192 -102 -192 -13 8 -166 -100 -124 131 55 -156 -40 72 23 13 119 45 23 87 43
5614 43 56 -108 20 -108 -217 -17 8 -26 185 -22 5 -54 -247 -140 -17 -203 75 111 65 -53 99 61 12
$$ packed form
5438A91k66R6J31k33O5m2j02J41k7k0K2ON4J88j84j20QJ62j0J66k29j84K38M7
5462I8qLp8o4J4K6r9n9J72K37K3j30K9k12jK9j0j27J57K4K99l33LP9j22j35K03
5489A8j10O9K31L6j13k06J92Q0j74m6k1L5J24o1r1R4o4j2Qj00J01l18J09L76M1
5514A98k21J27j3n6%j91P2J87k00R3mj1K6Q6J2j02J30j13N3N4l2J60l74J4K46
5539A41o0j73K35j70p4j02OK08j8q5J75M3j00O8J44l64J47p0%n4OK00k05J14j5
5564cJ00n5O8j28N9r7M4L31k46p3O3M2j63R2l1N7p7p1L09l39K53j29K35j94M8
5589I5M6j58Q7j59K07l10R0r0J79K1j74O6k4K55p6k11J16J12m9j0J06p4k2O4m4
5614D3J3j64J28j28j09K00K5l4K11k07K7n9j93J07J23j86K78L6m6j18J52l8m9
$$ plain form
5637 12 24 -133 -65 54 118 -63 16 -99 -236 133 112 -13 -32 82 236 148 13 88 5 -223 35 -58 -7 -194
5661 -194 4 -258 -74 130 -103 188 -98 68 -32 48 36 120 110 -184 101 -113 23 65 -112 -29 -53 2 190
5684 190 -77 -65 136 94 95 3 -53 -63 45 211 147 15 -95 23 -40 43 190 -11 30 20 205 37 -108 74
5708 74 -70 213 -57 24 -65 -36 34 -83 131 125 -119 100 -3 -20 39 110 -205 80 -3 -59 90 75 -99 -33 -126
5733 -126 337 63 173 6 -11 -186 -46 140 70 -44 -445 -110 -53 69 -110 42 -182 -243 213 188 -61 -33
5755 -33 78 99 36 196 52 0 55 -94 68 79 54 217 13 -29 -121 3 20 13 121 38 -15 -32 -133 107 226
5780 226 -126 96 -74 144 12 104 -80 -128 -7 15 -114 -258 161 207 56 -256 85 177 -102 39 -22 -193
5802 -193 237 -66 -148 -13 103 -64 -78 213 66 -78 -40 -161 -90 -129 119 -34 -87 -51 69 -94 -93 -108 11
$$ packed form
5637A2J2j57O8J19O4j81P9j15j37L69k1j25j9J14J54q8j35P5q3k28K58r3N1j87
5661a94J98k62J84K04k33K91k86J66j00Q0j2Q4j0k94K85k14J36M2j77Q3k4N5J88
5684A90k67J2K01m2Jr2n6j0J08J66o4j32j10J18o3Q3J47k01M1j0J85j68j45J82
5708G4j44K83k70Q1q9K9P0j17K14ok44K19j03j7N9P1l15K85q3n6J49j5j74O6r3
5733a26M63k74J10j67j7j75J40J86p0j14m01L35N7J22j79J52k24o1M56k5k49K8
5755c3J11K1o3J60j44n2N5j49J62J1k5J63k04m2r2J24J7pJ08q3n3j7j01K40J19
5780B26l52K22j70K18j32R2j84m8J21K2j29j44M19M6j51l12L41R2k79J41o1j71
5802a93M30l03q2J35J16j67j4K91j47j44L8j21P1l9K48j53n3L6J20j63Jj5J19
$$ plain form
5825 11 128 112 211 171 31 -115 195 -5 -87 7 -67 50 -113 -104 -156 -45 -105 -117 11 -22 -236 -84 185 -86
5849 -86 -64 155 10 -134 -69 169 3 -64 -107 -147 2 -107 -118 -82 -104 -17 -42 -123 11 -67 -123 157 107 -59 184
5874 184 -182 145 -67 10 -8 -83 -15 101 -163 -70 -52 -159 0 30 30 59 -123 40 -27 18 59 -85 -9 -60 132
5899 132 -132 -102 306 -99 -25 144 -19 -60 -82 143 122 93 242 53 -75 132 -118 -77 0 170 22 -161 -57
5922 -57 159 104 154 -23 62 -94 -297 241 -20 -51 -164 88 109 40 31 124 113 -81 54 184 38 194 -168 123
5946 123 87 22 -215 -5 101 55 17 -100 177 70 24 88 -119 39 -91 -218 -41 22 -223 58 81 37 -96
5969 -96 -138 -186 -46 -252 179 90 -274 16 25 -64 -5 -59 -4 81 36 54 -54 -101 -80 174 -29 28 -207 75 -113
5994 -113 -14 -165 121 -74 -46 -148 -57 -47 122 -187 17 -178 -43 -33 -48 169 -133 30 -149 182 236 0
$$ packed form
5825A1J17j6R9m0j40j46L10k00q2R4p4J17j63Rn2J11o0j2J28l3k14J52K69k71
5849h6K2K19j45j44O5K38j66o7m3m0J49j09j1L6k2Q7k5q1J34p8n6K80n0j66K43
5874A84l66L27k12P7j8p5O8J16k64R3J8j07J59L0%K9j82J63o7M5M1j44P6n1J92
5899A32k64L0M08m05P4J69j63m1k2K25k1k9J49j89j28K07k50M1P7J70j48j83J04
5922e7K16n5N0j77Q5j56k03N38k61l1j13K52K1o9rR3j1j94J35J30j46J56l62K91
5946A23l6o5k37K10J06m6l8j17K77j07m6O4k07J58j30j27J77O3k45K81K3m4j33
5969i6m2m8J40k06M31q9l64K90Rq9N9n4N5Q5m5J8j08m7K1K54k03N7k35K82j88
5994a13R9j51K86j95K8j02R1J0J69l09K04j95J35J0j5K17l02J63j79L31N4k36
$$ plain form
6016 0 -197 137 69 -8 -76 83 -78 63 -144 -23 101 -103 -108 126 7 -47 -144 -217 -138 -110 -86 51 41 -51 29
6041 29 -47 -163 -86 284 -86 -77 168 -74 203 -147 228 22 -134 -165 42 103 155 38 130 95 -170 83 105 -14
6065 -14 59 21 -222 -70 15 36 106 -35 8 -151 -66 -34 272 96 -11 58 -122 125 186 -151 -65 -66 75 50 235
6090 235 25 215 -48 60 -149 86 261 -165 71 -69 -7 77 153 88 24 51 -12 32 -307 -96 132 -137 34
6113 34 -36 204 -164 -53 210 -3 -54 -109 -122 86 -162 -142 -12 -70 -67 -112 102 -4 28 31 284 -40 -282 -50
6137 -50 -50 -202 -109 -18 121 -193 3 244 -111 -100 -9 -22 -135 -2 -147 122 5 -110 94 104 11 -24 -16 23 14
6162 14 -204 252 -38 -147 9 -89 4 -146 -49 107 88 40 80 69 -58 -37 -68 137 224 -28 -81 -79 219 113 149
6187 149 10 -2 80 129 -37 -13 -88 10 -121 26 -156 -23 -133 -14 -104 69 62 124 164 -47 31 -9 -65 26 -79
$$ packed form
6016@j97L34o8p7o8J59j61J41k07J21J24k04nK34j19n4r7p3P9K8K4J37j0r2Q0
6041B9p6j16P7L70l70RK45k42K77l50L75k06j56l1K07O1N2j17R2l5k65K53K2j19
6065a4P3l8k43J52Q5K1P0j41M3j59Q5L2L06j76j07O9j80K47O1l37Q6jJ41k5J85
6090B35k10J90k63J08k09K35J75m26K36j40O2Q4P6o5o4K7o3M4l39K11K28k69J71
6113C4p0K40l68J11K63k13n1n5j3K08k48K0J30n8Lm5K14j06L2LK53l24k42K32
6137e0%j52R3R1J39l14J96K41l55J1R1j3j13J33j45K69j17j15K04J0r3l5QL9r
6162A4k18M56k90j09J56r8R3j50R7J56j9m8M0j1j27K1l1K05Q7k52n3KK98j06L6
6187A49j39j2Q2M9j66K4p5R8j31J47j82J33j10J19r0J73pO2M0k11P8m0n6R1j05
$$ plain form
6212 -79 32 133 -2 91 -5 -19 113 119 -212 108 116 -53 -57 -109 12 150 -176 -184 -120 -30 -51 -190 61 -35 134 81
6238 81 234 -369 39 10 -78 106 -157 192 -109 -139 -174 -155 110 3 52 8 49 -105 -144 -6 93 25 15 60 -55
6263 -55 56 90 51 -124 -79 -83 -154 -7 -65 -4 -75 -18 -118 -50 -97 12 47 140 82 -138 -137 136 -68 -40 192 -145
6289 -145 178 44 -6 -55 84 85 -137 -118 187 39 -95 -54 -154 14 28 263 -12 90 136 -255 91 -155 -60
6312 -60 193 56 -72 74 132 -33 -76 -29 -67 -156 -34 42 -25 19 -2 -73 42 39 11 25 -198 -70 40 75 31 121
6338 121 -1 -273 7 67 -18 -96 115 -29 -90 -45 -88 -47 -68 24 154 -102 -181 318 -93 11 27 117 8 -17
6362 -17 -83 -120 38 -169 -168 29 -184 -14 122 -55 128 -62 128 -39 41 65 356 -27 -41 -60 -16 231 114
6385 114 324 -99 21 150 47 -61 98 95 305 -42 -9 -151 0 -239 16 67 -29 -6 36 20 -104 92 121
$$ packed form
6212g9J11J01j35R3r6j4J32Ol31L20Qj69mn2J21J38l26qO4R0k1j39K51r6J69n3
6238H1J53o03M08k9q8J84k63L49l01l0l5J9K65j07M9m4M1j54l9J38R9o8j0M5j15
6263e5J11L4l9j75M5mp1J47n8O1p1N7j00O8m7J09L5R3n8k20JK73k04K8K32l37
6289a45L23j34n0m9J39Jk22J9L05j48j34M1j00J68J4K35k75J02M6l91L46k46R5
6312f0K53j37j28J46N8j65m3M7l8q9J22P6o7M4k1p1J15lk8J4k23J28J10L5m4R0
6338A21j22k72K80O0q5p8K11j44o1M5m3M1k1R2J30k56p9M99m11J04J6R0j09k5
6362a7o6l7J58k07JJ97k13J70J36j77J83j90J90j67Q0K4K91l83j4j9M4K47j17
6385A14K10m23J20J29j03j08J59lK10l47L3j42J51k39K55N1r6K3M2j6j24J96K9
$$ plain form
6408 121 -8 99 156 72 -18 156 180 9 30 61 0 -201 34 -141 -20 -148 22 268 66 -58 -64 -93 -144 133
6432 133 196 -53 89 -4 101 59 86 -3 45 -67 -54 41 54 -67 106 205 -39 202 -33 106 -193 -277 82 -143
6456 -143 -75 -35 42 -64 -87 36 -239 2 -11 101 -10 123 -126 94 -114 -64 240 -31 78 -54 -54 -21 129
6479 129 33 -120 -111 165 44 86 32 104 -13 0 -62 196 143 164 49 196 -93 -47 -24 -60 125 98 71 -29 -21 -110
6505 -110 354 137 102 -62 95 64 -59 110 -113 32 223 -56 -187 85 -21 175 60 0 -47 66 -185
6526 -185 -9 -22 -125 3 19 -21 -60 -123 67 -26 20 -16 -111 -62 -199 -106 68 -48 74 -19 224 -67 -186 -103
6550 -103 -8 -156 43 138 67 -18 100 53 -29 155 -93 -148 -24 5 91 216 97 -111 127 234 -306 -66 -65 82
6574 82 204 -71 -30 44 -15 -171 -123 -50 -52 83 267 91 -150 216 10 -22 137 11 -223 51 -109 101 31
$$ packed form
6408A21j29J07N7q4r0J74K4j71K1L1o1k01K35j75J21j28J70K46k02j24ok9n1K77
6432A33O3k49J42r3J05m2K7q9M8j12J3R5J3j21J73R9k44K41k35J39k99q4L59k25
6456a43O8M0P7j06k3J23k75K41j3J12j11J33k49K20k08N0L04k71J09j32%L3J50
6479A29r6j53RK76j21M2n4P2j17J3o2K58n3K1j15J47k89M6K3l6J85k7k7j00Qq9
6505a10M64k17l5j64J57l1j23J69k23J45J91k79j31K72j06J96j15o0m7J13k51
6526a85J76j3j03J28J6m0l9o3J90r3M6l6r5M9j37R3J74j16J22r3K43k91j19Q3
6550a03R5j48J99R5p1q5J18m7q2J84k48n5J24K9Q6J25j19k08K38J07n40K40JJ47
6574H2J22k75M1P4n9j56M8P3kJ35J84j76k41L66k06l2J59j26k34K74j60K10p0
$$ plain form
6597 31 0 -30 74 -98 83 77 -65 74 -76 70 -104 -131 -98 82 52 235 -85 -85 -177 -127 9 18 -32 23 64 -83
6623 -83 186 -35 37 232 -177 15 85 -189 106 45 -31 -202 -95 132 -80 102 -32 -118 -16 61 85 44 -38
6646 -38 63 58 124 -154 103 -95 -94 42 -94 118 -34 -80 161 8 44 105 -118 277 82 114 1 24 115 -133
6670 -133 -66 29 132 38 -202 -14 139 102 -152 3 96 -170 51 85 -22 -120 -57 -48 0 -113 -19 -160 -203 148
6694 148 -131 -125 218 -24 -26 35 53 -262 -233 -93 211 186 80 29 -69 44 63 11 -178 122 -107 79 35 4 -145
6719 -145 -126 -77 3 -224 71 23 -197 38 -6 28 -248 263 -108 42 -59 145 56 37 30 143 -61 -5 133 57
6743 57 123 17 97 -142 131 80 -125 -144 -43 2 143 197 77 47 -81 -47 -44 -50 25 -109 54 11 47 2 -29 41
6769 41 141 50 -4 -6 -49 -85 -100 -185 64 89 28 -128 -40 -167 85 52 -76 101 -151 175 -10 -29 132 96 56
$$ packed form
6597C1l1l0J04j72J81oj42J39j50J46j74k7L3J80l0J83l20%r2N0J36Rn0N5M1j47
6623h3K69k21P2J95m09J92P0k74K95o1p6j71J07K27k12J82j34q6J02P7K4m1q2
6646c8J01nO6k78K57j98JJ36j36K12j52m6K41j53L6O1k23L95j95L2j13K3R1k48
6670a33O7R5J03r4k40J88J53l7k54J55R3k66K21L4j07r8O3RM8j13R4j41m3L51
6694A48k79OL43k42kO1J8l15K9J40L04k5j06n1r8J13J9n2j89L00k29J86m4l1j49
6719a45J9M9Q0k27K95m8k20K35m4L4k76N11l71J50j01K04q9j9pJ13k04N6J38p6
6743E7O6j06Q0k39K73n1k05j9J01M5J41N4j20l0j28L4LoP5j34J63m3L6m5l1P0
6769D1J00r1n4km3l6j5q5K49K5o1j56Q8j27K52l3j28J77k52L26j85j9J61l6m0
$$ plain form
6794 56 -2 138 -92 60 -50 42 69 -191 3 41 -86 163 -139 -59 41 -191 -175 184 -104 60 39 111 -62
6817 -62 -46 -179 -155 2 4 92 86 -308 113 35 255 6 -86 50 17 170 87 -171 -36 -81 55 51 3 -53 139 150
6843 150 81 -91 107 -44 -107 14 -100 -94 -9 -148 -89 106 141 133 -77 230 55 -47 19 -31 -52 61 -51 -74
6867 -74 6 48 -2 128 -37 128 148 -82 -1 33 71 212 -48 84 64 -21 103 -120 260 123 114 180 -69 23 -106
6892 -106 -126 62 -64 150 -238 36 71 -139 17 119 195 -48 -36 16 202 23 222 65 -8 178 116 -19
6914 -19 26 -23 103 22 -38 -129 -2 -46 25 97 93 -3 -52 -48 -127 71 171 68 165 -29 172 -155 127 71 -185 101
6940 101 36 108 12 -191 -70 38 -135 136 96 -45 198 -110 -16 -409 -69 46 17 119 -158 134 24 -43
6962 -43 -21 -142 -29 145 -5 30 -113 -85 44 162 129 -86 83 -11 -65 -68 -197 101 28 64 -75 120 219 -11
$$ packed form
6794E6n8J40k30J52j10R2K7k60J94L8j27K49l02Q0J00k32J6L59k88J64k1P2j73
6817f2J6j33K4J57KQ8ol94M21p8K20k49r2J36l3J53q3k58J35m5J36mm8n6J92J1
6843A50o9j72J98j51o3J21j14OQ5j39N9J95L5qk10L07j75j02O6n0k1J13j12k3
6867g4Q0M2n0J30j65J65K0k30Q1L4L8J41k60J32k0q5J24k23L80j37rO6k49R2j29
6892a06k0J88j26K14l88K74L5k10J56J02P6k43J2N2J86j79J99j57p3J86o2j35
6914a9M5m9J26q1o0r1J27m4P1P2mr6m9Mp9J98J00j03R7j94K01l27K82n6k56K86
6940A01o5P2r6k03J21J08j73K71m0j41K43l08R4l93L40J15k9J02k77K92j10o7
6962d3K2j21J13J74j50L5j43K8J29J18l3k15J69r4n4lj29K98p3L6j39J95R9k30
$$ plain form
6986 -11 65 -13 -108 58 284 16 -38 -146 -10 -126 114 -27 -36 -106 -37 -53 24 20 -18 -73 6 70 -2 -82 -39 206 144
7013 144 -34 325 -38 89 -120 -173 -27 -38 53 48 -114 -4 -52 -236 39 -90 49 17 -304 41 -22 151 -30
7036 -30 57 -13 -128 -45 208 33 80 -141 -155 111 58 131 155 -54 -93 247 -255 -91 -60 72 -85 215 -21 -83
7060 -83 154 -303 40 98 44 -13 146 57 -194 -55 -125 90 -15 134 72 -21 5 1 6 -30 -23 -82 -178 -6 107 66
7086 66 -26 199 -59 -83 15 -188 240 -25 -47 -19 -94 -67 168 -49 36 134 127 105 -106 -191 54 94 5 147 -108
7111 -108 56 67 -39 -111 158 -24 -25 154 30 53 129 84 34 -63 36 108 -84 -38 -44 25 -132 56 -58 126 133 -2
7137 -2 0 228 -161 -64 -84 149 86 -148 -115 48 -224 -43 55 90 380 -64 -66 -142 -13 -104 158 -45 11 19 -105 147
7163 147 54 51 -44 -115 59 200 98 -191 -160 -86 15 78 -134 90 -104 -253 86 42 47 95 -129 -119 -76 -54 -94
$$ packed form
6986a1P6p8r5J66K26k68n4j08J36j16K40j41rp0O9j6P7ml8n5P9O4p2q0M3K45o2
7013A44j78L59l63J27k09n3J46j1R1nj62J10m8j84K75j29J39l2l21L45o3J73j81
7036c0Q7p0j15Q3K53j75M7k21j4K66n3P3K4k09l9L40n02J64L1J32j57L00k36o2
7060h3K37m57L43N8n4n7J59q9k51J39p0K15j05J49o2r3K6mNl6Pn9r6J72J13m1
7086F6r2K25k58k4R8k03M28k65k2K8p5K7K35k17Q5R8pk2k11q5K45M0q9J42k55
7111a08J64J1j06p2K69j82jJ79j24K3P6m5n0r7R9P2j92M6oO9j57J88j14J84Pj35
7137bKK28l89R7k0K33o3k34L3J63k72J81R8L5K90m44kp6J29r1K62k03N6Qj24K52
7163A47r3lr5p1J74J41j02k89L1P4J01O3k12K24j94j49L39m4NM8k24J0M3K2m0
$$ plain form
7188 -94 126 78 107 43 158 55 84 27 10 151 163 -49 3 -29 -137 -58 -98 224 6 -38 30 47 -148 -24 -59
7213 -59 23 -111 -82 -112 63 90 13 -115 -20 15 39 7 -47 131 144 82 49 -2 80 143 84 -48 13 -122 110 -93
7239 -93 135 43 -34 74 -16 -35 -92 -94 -32 -81 -57 127 50 82 5 157 77 -31 -14 -156 70 241 96 -81 -109 28
7265 28 -124 131 -23 -69 -159 148 37 -159 -64 -230 -250 17 13 -241 161 164 -82 141 -316 -57 -256 144 196
7288 196 120 -217 -121 -39 -265 -103 -2 -38 25 64 -149 49 -55 30 -150 -41 88 -31 20 -57 -68 -14 -42 -124
7312 -124 101 133 22 30 -81 101 -65 -146 -251 1 67 98 124 45 207 -117 -142 -59 63 140 118 -111 -204 259
7336 259 -175 -135 208 -120 -166 -140 -125 203 45 -125 21 67 -159 26 -174 -65 -67 -261 142 -22 -132 102
7358 102 72 -79 4 -157 137 39 -36 124 49 171 -27 25 -56 71 -71 -33 152 -283 -129 -49 52 110 89 -199
$$ packed form
7188i4K20m8K9o4J15j03K9n7j7J41J2k12N2l2j08P9m0L22k18m4O8J7j95J24l5
7213e9Q2j34K9l0J75K7p7j28R5L5K4l2n4J78J3o2l3n1Q2O3n9j32O1j35K32k03
7239i3K28r2p7J08r0j9n7kO2m9K4J84p7L2p7J52q0j08J7j42K26J71j45j77k8J37
7265B8j52K55j54m6r0L07j11j96R5j66k0K67mk54M02Lk46K23m57K59j99M00N2
7288A96p6l37R6Q2k26J62J01l6O3L9k13J98j04Q5j80J09J29j19N1p7j1N4k8q2
7312a24K25L2j11Qj11J82j66q1j05K52O6L1K6p9J62l24k5Q3J22P7k2k29r3M63
7336B59m34M0L43l28m6K6J5L28j58j70J46M6k26J85k00J09kj94M03j64j10K34
7358A02l0j51Q3j61K94r8p5J60p5J22j98N2q1J27j42L8J85m35J54Q0J01N8k1k88
$$ plain form
7382 -199 20 -40 -58 65 -180 135 206 -76 -65 -4 33 -138 -13 -61 0 -23 6 37 -64 -192 53 -41 152 -30
7406 -30 4 101 -5 49 -64 115 81 12 144 219 127 245 -79 -273 -66 51 -44 -19 22 22 33 -35 22 -102 -212
7431 -212 7 -98 -19 -182 77 35 -129 -117 1 147 244 -24 -4 -5 52 100 -89 41 -18 -28 40 89 120 -83 -244
7456 -244 182 81 13 150 85 27 -105 174 30 59 -14 -48 -154 8 -174 -12 70 76 207 -146 -100 -52 -151 36
7480 36 -127 23 -169 1 70 -118 30 -95 -9 0 -192 129 -65 -4 82 -131 -50 -26 135 -2 -30 -218 -90
7503 -90 159 -218 -129 72 -114 150 171 -52 75 27 -73 -17 -190 -9 37 -103 103 -108 -47 -97 65 -35 -52
7526 -52 146 6 -137 78 221 -96 -14 165 104 34 137 167 -98 148 21 124 125 111 -6 44 205 -71 -109
7549 -109 49 41 209 47 -38 -73 -62 89 -18 -75 -150 -157 5 277 -23 79 -6 8 -30 38 -66 73 103 89 72
$$ packed form
7382a99K19o0j8J23k45L15P1k82J1O1L7j71J25m8O1k3K9L1j01j28K45r4J93j82
7406c0L4R7j06N4j13J79l4o9J32P5r2J18l24j94K07J17r5K5M1%J1o8N7j24j10
7431b12K19j05P9j63K59m2j64J2J18J46R7k68K0jN7M8j89J30n9j0O8M9L1k03j61
7456b44M26j01o8J37o5n8j32K79j44K9p3l4j06J62j82J62Q2OJ31l53M6M8r9J87
7480C6j63J50j92J70O9j88J48j25Q6Rj92L21j94O1Q6k13Q1K4J61j37k8j88J28
7503i0K49l77Q9K01j86K64K1k23J27m8j00N6j73J81M6j40K06k11O1n0J62j00j7
7526e2J98j40j43K15J43l17Q2J79o1p0J03L0k65K46j27J03Jj4j17N0J61k76l8
7549a09J58qJ68j62q5l5J1J51j07n7p5pJ62K72l00J02q5J4l8O8j04J39L0j4j7
$$ plain form
7574 72 -21 -73 -53 -117 -128 -36 44 -164 -90 -30 6 -75 -261 -36 -82 -211 72 -47 -50 -83 -182 147 2 74 126 136 -99
7601 -99 61 65 -169 -143 -40 -41 126 24 -1 -25 29 -237 100 -116 64 -61 -279 65 33 108 -15 -68 20 -170
7625 -170 -127 130 -88 187 56 9 -140 -12 -27 42 -50 -14 114 -239 -199 81 76 -116 -42 8 9 -116 -127 230 173
7650 173 82 -100 -59 -66 21 38 21 79 191 -129 -200 -94 254 107 4 -61 -22 131 105 -39 -46 -6 27 100 39 -1
7676 -1 227 50 -5 -71 123 57 58 -11 -64 -58 53 -7 148 -58 -72 -38 57 -92 75 -39 -143 -27 46 76 -103 117
7702 117 -69 -39 -148 -47 -33 -22 -53 -94 20 45 -73 -60 -140 163 -28 120 102 -6 -147 68 78 -41 115
7725 115 -222 -35 -98 -47 239 -51 -222 117 -126 -135 24 -314 -217 -214 138 -89 83 102 42 -10 74 211 52 -181
7749 -181 -13 -104 152 257 -222 -163 -40 -4 -47 -38 28 221 182 -20 -205 -139 -141 53 -30 -31 -211 -46 -116 114 -40
$$ packed form
7574G2r3n2K0o4j1R2Q0k08P4O0L6q1j86K25m6j29K83j19ll3r9L29j45P2N2J0k35
7601i9J60Mk34K6J03jJ67j02k5k4N4k66L37k16J80j25k18L44l2P5j23n3Q8j90
7625a70M3K57k18K75j31m7j49J28j5O9r2L6J28l53M0K80nj92P4N0Jj25j1L57n7
7650A73r1j82M1pQ7J7j7N8J12l20p1J06L48j47j03o5L9J53k6j44pM0L3P3o1m0
7676aK28j77n5o6J94o6Jo9n3OJ11o0J55k06j4L4R5j49J67j14j04J16P3L0j79K20
7702A17j86L0j09J01J4J1l1m1J14K5j18J3q0L03j91J48j8j08j41K15J0j19J56
7725A15l37J87o3N1K86k90j71L39k43rJ59l38R7LL52k27J72J9o0n2Q4J37j59k33
7749a81J68r1K56J05m79N9J23L6m3RO6J93l9k02j85O6kJ94q3jj80J65p0K30j54
$$ plain form
7774 -40 -57 98 114 -82 -190 4 36 -73 243 -88 -27 -194 9 73 -138 227 -214 -88 -38 -134 16 122 -181
7797 -181 81 -32 -60 -154 7 -11 -95 -47 -7 16 348 41 -45 -28 -65 -11 282 80 -37 18 -320 -74 -95 -239
7821 -239 -41 65 -55 172 53 -229 -133 116 158 -107 -55 -29 -23 -8 265 -93 -50 -203 -113 -33 79 107 150 201
7845 201 -83 -169 -68 2 -13 211 41 53 105 144 -132 -50 -59 7 21 52 -71 -194 101 -63 -48 77 -14 -15 -208
7870 -208 49 74 -166 -147 -179 -65 85 -75 -184 -76 -143 -152 -40 92 -118 -41 -175 -71 -85 -82 -52 72 -136 50
7894 50 -78 -102 -124 41 155 17 132 19 28 123 -75 -63 105 -129 23 163 79 -104 -64 66 17 -52 51 28
7918 28 -14 42 -68 -85 -136 -175 56 52 32 55 120 31 157 -80 -75 -62 288 -92 -126 -118 -37 63 107 26 -44 -21 27 83
7946 83 113 294 42 83 -52 14 -44 -24 -105 31 61 68 -184 107 -3 88 -38 180 -47 55 49 -66 -144 -24 -32
$$ packed form
7774d0j7J55J6j96j08J94L2j09L16l31O1j67K03O4k11L65m41J26N0r6J50J06l03
7797a81K62j13k8r4J61j8q4M8M0K3L32l07q6J7l7N4K93k02j17N5l38K46k1j44
7821b39J98J06j20K27j19k82R6K49M2k65N2K6OJ5K73l58M3j53R0Q0J12K8M3N1
7845B01k84q6J01P0j5K24j70J2N2L9k76Q2rO6J4L1j23j23K95j64J5J25r1jj93
7870b08K57K5k40J9l2J14J50j60j09J08o7rJ12J32k10P7j34J04j4LL0J24k08J86
7894E0j28k4k2J65J14j38J15j13RR5j98J2J68k34J52J40q4j83M0J30m9o9J03k3
7918B8m2N6j10j7n1l9K31mk0K3O5q9J26k37NJ3L50l80l4QQ1J00M4q1p0K3M8N6
7946H3L0J81k52M1j35O6n8K0q1J36L0Pk52K91j10R1j26K18k27J02oj15p8J20q
$$ plain form
7971 -32 -64 116 -55 -127 282 177 126 133 -17 24 7 -45 -259 -16 -20 134 -1 -92 -95 133 99 -22 -60 74 -75
7996 -75 -214 52 88 -64 66 171 148 7 -41 -4 -4 184 -51 -21 -112 -130 85 -8 -169 -69 146 244 -32 130
8020 130 32 -294 14 -10 -40 -23 -62 -122 -177 -41 178 -38 -120 -102 31 -47 -55 -39 -25 27 -160 63 -32 226 -6
8045 -6 42 104 -28 89 -145 -191 -160 -6 76 14 52 -10 195 2 -55 -21 -18 -29 121 227 -201 48 106 46 113 60
8071 60 181 154 -313 -49 -88 -86 -45 51 83 -72 25 -232 -145 43 124 -4 178 21 -90 92 123 -14 2 46 126
8096 126 -29 134 200 59 66 13 -31 -178 33 -58 -3 -166 101 151 -132 154 15 -91 -67 166 125 86 -110 82
8120 82 -23 308 -224 -80 18 -122 -5 -2 77 -162 -77 -70 48 -46 -23 -79 -243 3 -18 -101 -25 20 149 64 28 -61
8146 -61 157 61 80 -62 108 -16 -169 -51 92 217 95 -75 -52 12 89 110 44 31 -3 290 202 -85 22 -57
$$ packed form
7971c2l2J80j71p2M09j05n1Pj50M1j7n2k14K43mJ54j35r1lK28l4j21l8J34j49
7996g5j39K66L6j52J30J05k3j41m8L7%J88k35L0r1j8K15r3j61J00K15R8k76J62
8020A30r8l26L08k4l0J7l9o0n5J36K19k16q2J8J33p8qJ6J4N2j87K23r5K58k32
8045fM8O2j32J17k34m6L1J54Q2o2L8o2K05j93n7L4Lj1J50J06m28K49N8o0O7n3
8071F0J21k7m67K64l9KM1R6L2j55R7k57Q7J88Q1j28J82j57j11J82L1j37J6M4Q0
8096A26j55J63O6j41Pn3m4j47K11r1N5j63K67N0k83K86j39j06K4K33m1l9j96J92
8120H2j05L31n32J44R8j40J17LP9k39Q5PJ18r4K3n6j64K46k1q3P6M5J29q5l6q9
8146f1K18r6J9j42J70j24j53J18J43J25j22j70K3O4P7K1o6j3l4K93q8k87J07p9
$$ plain form
8170 -57 -246 156 -61 33 19 46 -64 -258 117 -274 214 85 -111 189 39 -80 157 23 -31 -220 17
$$ packed form
8170e7j89M02k17R4j4K7j10j94L75l91M88j29j96L00j50j19K37j34n4j89K37
8191A7
$$ Imaginary data points
##PAGE= N=2
##DATA TABLE= (X++(I..I)), XYDATA
$$ plain form
0 0 0 0 0 0 0 0 0 0 0 0 8 -8 8 -16 16 -17 24 -32 40 -48 56 -64 80 -89 105 -128 145 -169 193 -225 257 -293
32 -293 332 -375 424 -479 536 -601 672 -751 838 -930 1030 -1141 1262 -1395 1539 -1697 1872
49 1872 -2062 2270 -2502 2756 -3040 3360 -3719 4127 -4594 5139 -5779 6545 -7484 8661
63 8661 -10192 12267 -15253 19938 -28379 48262 -194728 35805 349334 -233352 -112171
74 -112171 270193 -26669 -285053 155788 207495 -213885 -121368 257344 17802 -168260
84 -168260 120503 98951 -207641 -58700 167423 28885 -113704 16130 77541 -85314
94 -85314 -81388 130244 15739 -171319 53260 175739 -73310 -84898 106078 -10081 -145726
105 -145726 89405 163474 -134278 -84715 184700 -47508 -190486 143751 80322 -215724
$$ packed form
0@%%%%%%%%%%Qj6J6k4L2l3M1n6P2q8J04j20J44j69J94k33K73l14L62m18M82n50
32b93O25p07P99r03J015j137J273j423J589j768J960k171K403k657K934l236L569
49A872l934M332m772N258n796O400p079P846q721R733j0918J2324j4029J6145
63H661j8853K2459k7520L5191m8317P6641k42990K30533L13529n82686J21181
74a12171L82364k96862k58384M40841N1707m21380R2517L78712k39542j86062
84a68260K88763k1552l06592J48941K26123j38538j42589J29834O1411j62855
94h5314L926K11632j14505j87058K24579J22479k49049j1588J90976j16159j35645
105a45726K35131P4069k97752M9563K69415k32208j42978L34237o3429k96046
$$ plain form
115 -215724 37509 206726 -113415 -124599 152276 4124 -188310 96186 189523 -145931
125 -145931 -87872 192313 -25135 -176859 97966 94452 -131867 -15156 142373 -18351
135 -18351 -136015 30571 93762 -93207 -64549 141421 31721 -128641 28499 98403 -84642
146 -84642 -81667 117467 59245 -129174 20228 149262 -105664 -123551 150257 22815 -160979
157 -160979 78302 133763 -122145 -66874 124936 -28066 -135249 94373 112514 -127049
167 -127049 -28218 139724 -59167 -105317 99847 27853 -98677 43982 95115 -53436 -67640
178 -67640 50062 18205 -75314 20630 87335 -46489 -56673 61202 8841 -72018 2929
189 2929 55152 -18515 -39646 66644 46123 -99945 -22999 96514 -36193 -57714 98417
$$ packed form
115b15724K53233J69217l20141j1184K76875j48152j92434K84496R3337l35454
125a45931N8059K80185k17448j51724K74825l514k26319J16711J57529j60724
135a8351j17664J66586O3191j86969K8658K05970j09700j60362J57140O9904j83045
146h4642K975J99134n8222j88419J49402J29034k54926j7887K73808j27442j83794
157a60979K39281N5461k55908N5271J91810j53002j07183K29622J8141k39563
167a27049R8831J67942j98891m6150K05164p1994j26530J42659N1133j48551j4204
178f7640J17702l1857r3519R5944O6705j33824j0184J17875n2361q0859P4947
189B929N2223p3667k1131J06290k0521j46068P6946J19513j32707k1521J56131
$$ plain form
200 98417 22723 -101972 20831 77669 -71548 -68711 88883 27344 -95294 42851 82753
211 82753 -105555 -50111 105768 -12109 -67009 73056 47186 -73839 -12982 69811 -21945
222 -21945 -71079 49996 54447 -60697 -5909 55891 -48635 -58213 42530 28476 -36117 -3327
234 -3327 50560 -5277 -57815 27548 43997 -54996 -2470 79910 -14061 -49682 36910 14465
246 14465 -63930 -9353 63600 -13091 -56548 48352 27349 -84153 1782 65555 -44296
257 -44296 -24757 75423 10470 -54589 15750 39475 -39802 -29166 61809 13631 -56745 25738
269 25738 33277 -63552 -21521 44513 -10807 -29294 28191 29090 -31352 -25404 35795 2286 -40436
282 -40436 35105 45308 -35551 -8478 35957 -19269 -39183 17912 29202 -24377 -15767 41443
$$ packed form
200I8417p5694j24695J22803N6838j49217K837J57594o1539j22638J38145L9902
211H2753j88308N5444J55879j17877n4900J40065k5870j21025O0857Q2793r1756
222b1945m9134J21075M451j15144N4788O1800j04526r578J00743j4054o4593L2790
234c327N3887n5837n2538Q5363J6449r8993N2526Q2380r3971l5621Q6592k2445
246A4465p8395N4577P2953p6691m3457J04900k1003j11502Q5935O3773j09851
257d4296J9539J00180o4953o5059P0339K3725p9277J0636R0975m8178p0376Q2483
269B5738P539r6829M2031O6034n5320j8487N7485Q99o0442N948O1199l3509m2722
282d0436P5541J0203q0859K7073M4435n5226j9914N7095J1290n3579Q610N7210
$$ plain form
294 41443 -9891 -57956 23686 27933 -44764 8538 53882 -16004 -29012 25926 11954 -37614
306 -37614 -732 49313 -8933 -33001 38112 6064 -57733 7162 31713 -27282 -8778 34360
318 34360 3034 -32336 -1081 24502 -20599 -19501 44105 13197 -32230 17539 18049 -33367 -11244
331 -11244 25256 5146 -17209 8123 24470 -24132 -28424 27512 -927 -32530 26338 27404
343 27404 -26103 -7492 19636 -9127 -24941 14517 29647 -17559 -9104 35315 -12588 -37892
355 -37892 23001 12531 -27205 11176 27320 -12722 -21007 8910 6656 -25815 -974 34755
367 34755 -8813 -18630 25701 -2210 -30956 7946 17861 -5830 -2174 16849 8531 -22828 -7036
380 -7036 20495 -14963 -15985 29879 5739 -23080 5409 6236 -19692 -11717 17329 13052 -15531
$$ packed form
294D1443n1334m8065Q1642M247p2697N3302M5344o9886j3008N4938j3972m9568
306c7614L6882N0045n8246k4068P1113l2048o3797O4895K4551n8995J8504M3138
318C4360l1326l5370L1255K5583m5101J098O3606l0908m5427M9769N10n1416K2123
331a1244L6500k0110k2355K5332J6347m8602m292N5936k8439l1603N8868J066
343B7404n3507J8611K7128k8763j5814L9458J5130m7206Q455M4419m7903k5304
355c7892O0893j0470l9736L8381J6144m0042q285K9917k254l2471K4841L5729
367C4755m3568r817M4331k7911k8746L8902R915k3691L656J9023q318l1359J5792
380g036K7531l5458j022M5864k4140k8819K8489Q27k5928P975K9046m277k8583
$$ plain form
393 -15531 5241 24193 -21122 -16576 27224 -3576 -18240 23605 15802 -16634 -7429 7199 -7982
406 -7982 -19241 11186 19285 -19002 -5338 21303 -15449 -18427 15542 3647 -6994 10745 16027
419 16027 159 -14737 2032 9731 -15639 774 24326 -8633 -15123 10447 -3974 -18807
431 -18807 -3377 10388 1433 -8171 14078 11887 -24934 -2593 23066 -11529 -4701 27529 2193
444 2193 -14386 4531 3582 -14337 -10604 13950 5112 -17145 7307 10781 -24364 -6978 14716
457 14716 -5832 -472 15749 6237 -3845 -4340 4298 1115 -10389 9710 15348 -11881 -4405 8022
471 8022 -10453 -12395 572 3170 -1565 -903 13006 343 -22217 5467 14902 -13907 5993
484 5993 22279 -8135 -7386 11825 -1629 -15174 -2080 11854 -3152 -8037 15506 -1816 -27781
$$ packed form
393a5531K0772J8952m5315M546M3800l0800j4664M1845p803l2436R205J4628j5181
406g982j1259L0427Q099l8287J3664K6641l6752k978L3969j1895j0641J7739N282
419A6027j5868j4896J6769P699k5370J6413K3552l2959o490K5570j4421j4833
431a8807J5430J3765q955r604K2249k191l6821K2341K5659l4595O828L2230k5336
444B193j6579J8917r49j7919L733K4554q838k2257K4452L474l5145J7386K1694
457A4716k0548N360J6221r512j0082m95Q638l183j1504K0099N638k7229P476J2427
471H022j8475j942J2967K598m735O62J3909j2663k2560K7684R435k8809J9900
484E993J6286l0414P49J9211j3454j3545J3094J3934j5006m885K3543j7322k5965
$$ plain form
497 -27781 3164 11671 -9846 5751 11816 -5626 -2482 5345 3233 -6398 -8042 11681 10363 -5243
511 -5243 4025 1 -15573 -4382 5351 3373 -672 -3200 6124 -1423 -12599 8304 2865 -17913
525 -17913 9612 19773 -5448 -2327 3830 -9994 -7903 9833 11890 -7791 -6044 14035 -4174
538 -4174 -15071 9806 -2366 -15282 13211 12193 -7737 -845 -179 -7124 -3865 5520 11090 -1946
552 -1946 -5490 8339 -677 -7027 3381 -2583 -3431 6698 5408 3948 -7042 -12445 5494 179
566 179 -9009 11285 5723 -11261 3262 5740 -8693 -5490 6981 6099 -4543 5179 14583 -11091
580 -11091 -13225 12620 -2505 -9351 14277 2405 -12553 2836 2329 -8910 -6268 3629 6460
593 6460 -1658 2543 7780 -7292 -4488 7176 -2673 675 9387 999 474 -2767 -6964 2387 -3832
$$ packed form
497b7781L0945Q507k1517J5597O065j7442L144P827k112r631j644J9723j318j5606
511e243R268m024j5574J1191R733j978m045k528R324p547j1176K0903n439k0778
525a7913K7525J0161k5221L121O157j3824K091J7736K057j9681J747K0079j8209
538d174j0897K4877j2172j2916K8493j018j9930O892O66o945L259R385N570j3036
552a946l544J3829r016o350J0408n964q48J0129j290j460j0990n403J7939n315
566A79r188K0294n562j6984J4523K478j4433L203J2471q82j0642R722R404k5674
580a1091k134K5845j5125o846K3628j1872j4958J5389n07j1239K642R897K831
593F460q118M201N237j5072K804J1664r849L348Q712q388n25l241m197R351o219
$$ plain form
608 -3832 -6272 8261 874 -6333 3777 -2347 -8457 27 5601 3691 -1023 6736 9472 -10251
622 -10251 -4718 11093 -7149 -4055 14775 -3326 -9536 5823 -2020 -11539 -3595 4559 2117 -3168
636 -3168 5416 4672 -10355 294 8238 -5420 3261 11222 -1245 -102 392 -4216 -855 -4438 -2181
651 -2181 5779 -2008 -2318 2180 -7047 -5768 1854 2278 2675 939 5411 5433 -7512 -19 7176 -7798
667 -7798 1499 12871 -5424 -4772 5576 -5826 -9433 -21 3692 -498 -2624 6129 1278 -10249
681 -10249 3455 5230 -7514 5780 10724 -3189 463 2249 -3862 -2289 -2014 1483 3399 -2823
695 -2823 1558 374 -8492 -1808 1945 -1296 2669 1822 2736 2534 -5314 1206 2945 -6613 4560 9275
711 9275 -5216 33 4103 -7300 -4957 2245 2155 -1057 -920 5092 -1811 -8548 4358 438 -8229
$$ packed form
608c832k440J4533p387p207J0110o124o110Q484N574j910m714P759K736j9723
622a0251N533J5811j8242L094J8830j8101o210J5359p843r519P944Q154k442n285
636c168Q584p44j5027J0649P944j3658Q681P961j2467J143M94m608L361l583K257
651b181P960p787l10M498r227J279P622M24L97j736M472K2j2945P493P195j4974
667g798R297J1372j8295O52J0348j1402l607R412L713m190k126Q753m851j1527
681a0249J3704J775j2744J3294M944j3913L652J786o111J573K75L497J916o222
695b823M381j184q866O684L753l241L965q47R14k02p848O520J739r558J1173M715
711I275j4491N249M070j1403K343P202r0l212J37O012o903o737J2906l920q667
$$ plain form
726 -8229 7459 7355 -5095 2207 1811 -5196 -1634 1045 3599 1134 -1461 4451 -1207 -7359 1824
741 1824 -455 -3957 4339 2290 -110 82 -4381 -169 -347 -4036 6521 4601 -4571 3673 1962
756 1962 -6232 -418 2482 632 764 1188 4221 -3533 -6681 3817 -2733 -6101 7683 2842 -5972
771 -5972 2858 234 -5113 -147 2063 3019 804 856 5807 -2170 -5068 3907 -2325 -3142 6095 885
787 885 -2416 -728 -4306 -1546 -1584 -2132 4960 506 -2410 5739 -377 -4299 2686 731 751 3599 2523
804 2523 2539 -4001 -4729 3191 -3596 -3969 6142 -1781 -4666 4063 -1450 -5033 -82 1255 2783 2044
820 2044 2822 4382 -3931 -2586 5044 -2654 -1098 5936 -1664 -2124 942 -3459 -2864 -3292 -1694 4121
836 4121 -153 -77 3691 -3875 -2176 4450 238 1394 3875 1149 2126 -1758 -2146 1369 -4899 -1635
$$ packed form
726h229J5688j04j2450P302l96p007L562K679K554k465k595N912n658o152R183
741A824k279l502Q296k049k400J92m463M212j78l689J0557j920r172Q244j711
756A962q194N814K900j850J32M24L033p754l148J0498o550l368J3784m841q814
771e972Q830k624n347M966K210R56k215N2M951p977k898Q975o232q17R237n210
787H85l301J688l578K760l8n48P092m454k916Q149o116l922O985j955K0K848j076
804B523J6o540p28P920o787l73J0111p923k885Q729n513l583M951J337J528p39
820B044P78J560q313J345P630p698J556P034p600m60L066m401N95m28J598N815
836D121m274P6L768p566J699O626m212J156K481k726R77l884l88L515o268L264
$$ plain form
852 -1635 5571 -2555 -2474 2656 -4661 -3821 1451 661 1730 874 2530 3591 -3285 23 3734 -4161
868 -4161 1277 6298 -2274 -825 1011 -4397 -2443 -1603 -229 2432 -1619 909 2559 -4621 -684
883 -684 2879 -2134 2176 4383 473 1647 -1481 -1659 898 -3468 842 4310 -3109 30 2015 -5367
899 -5367 -2080 995 -959 1437 1001 1960 1527 -3970 398 2203 -3851 2967 4893 -2929 1227 1402
915 1402 -3868 -1007 -785 200 1719 -1379 1794 645 -5205 375 1144 -3296 3058 2743 -1266 1352
931 1352 -1394 -1158 665 -2426 2290 3430 -2054 2029 1226 -5071 125 591 -1427 1275 5 826
947 826 68 -3914 541 55 -3830 3764 3370 -2274 2822 711 -3602 876 871 1091 1807 -904 2036
964 2036 -162 -4319 865 -1474 -3687 3535 1117 -1792 1130 -2090 -1587 600 -1158 3082 2634 -1298
$$ packed form
852a635P206q126Q1N130p317Q40N272p90J069q56J656J061o876L308L711p895
868d161N438N021q572J449J836n408J954Q40J374K661m051K528J650p180L937
883f84L563n013M310K207l910J174l128j78K557m366M310L468p419L139J985p382
899e367L287L075j954K396m36R59m33n497M368J805o054O818J926p822M156J75
915A402n270K861K22R85J519l098L173j149n850N580P69m440O354l15m009K618
931A352k746K36J823l091M716J140n484M083q03o297N196M66k018K702j270Q21
947H26p58l982M455m86l885P594l94n644N096k111m313M478nK20P16k711K940
964B036k198m157N184k339k213P222k418k909K922l220N03K187j758M240m48l932
$$ plain form
980 -1298 3556 681 -3418 1591 -750 -1732 2375 317 351 -1156 -4669 95 -756 -2957 3655 534
996 534 -2348 3648 195 -2713 1579 336 1607 2559 667 2330 -1182 -3787 1169 -1988 -2425 3200
1012 3200 -1118 -2476 1517 -1834 -1422 -61 -1581 3054 2599 126 3142 -806 -1861 2459 -524
1027 -524 -597 2340 -856 237 -993 -3869 -288 -2040 -2651 3104 -294 -1204 2958 -1833 -2038 2332
1043 2332 495 1743 1864 404 2349 -861 -1824 1248 -2968 -1138 3256 -1913 -1449 1197 -2906 -1213
1059 -1213 112 -1290 2777 1056 204 2796 -1476 -766 2680 -1477 181 3001 -402 701 -689
1074 -689 -3022 137 -1962 -1444 2726 -1085 -519 2567 -2944 -1394 1749 -458 1718 1761 332 2276
1090 2276 -1326 -1306 1184 -2701 170 3384 -1819 -69 1167 -2975 -562 -429 -1345 2259 120 124 2123
$$ packed form
980a298M854k875m099N009k341r82M107k058L4j507l513M764q51k201O612l121
996E34k882N996l453k908M292j243J271R52j892J663l512k605M956l157m37N625
1012C200m318j358L993l351M12J361j520M635m55k473L016l948j055M320k983
1027e24p3K937l196J093j230k876L581j752o11N755l398r10M162m791k05M370
1043B332j837J248J21j460J945l210r63L072m216J830M394n169M64K646m103J693
1059a213J325j402M067j721q52K592m272P10L446m157J658K820l403J103j390
1074f89k333L159k099N18M170l811N66L086n511J550L143k207K176M3j429J944
1090B276l602K0K490l885K871L214n203J750J236m142K413J33r16L604k139MJ999
$$ plain form
1107 2123 -2351 -290 1644 -2268 1331 2520 -541 1360 -479 -2080 697 -1358 -108 2647 -1556
1122 -1556 493 1615 -3366 -896 740 -1613 1609 787 -187 1680 -1618 -760 1236 -2215 1661 2927
1138 2927 -1536 1301 1074 -2445 274 -493 -1084 1913 -293 82 792 -2821 -108 382 -2547 1796
1154 1796 1921 -748 1771 -444 -1378 1431 -725 891 2176 -1028 1288 1005 -3328 -135 -417 -2135
1170 -2135 1342 184 -703 733 -2016 -578 759 -1548 2286 2250 -1262 2584 984 -2045 941 -766
1186 -766 -791 1926 -569 -180 -165 -3411 -272 -527 -2562 1574 1016 -766 2041 -591 -635 1394 -710
1203 -710 1624 2274 -549 2012 128 -3041 532 -1014 -2006 1463 -719 -717 533 -2081 -401 152 -1199
1220 -1199 2425 1491 -557 2870 -75 -1336 1682 -685 124 2041 -910 284 -330 -2849 -34 -1095
$$ packed form
1107B123m474K061J934l912L599J189l061J901j839j601K777k055J250K755m203
1122a556K049J122m981K470J636k353L222q22r74J867l298Q58J996l451L876J266
1138B927m463K837k27l519K719p67n91K997k206L75P10l613K713M90k929M343
1154A796J25k669K519k215r34K809k156J616J285l204K316k83m333L193k82j718
1170b135L477j158q87J436k749J438J337k307L834l6l512L846j600l029K986j707
1186g66k5K717k495L89J5l246L139k55k035M136n58j782K807k632m4K029k104
1203g10K334O50k823K561j884l169L573j546r92L469k182KJ250k614J680N53j351
1220a199L624r34k048L427k945j261L018k367Q09J917k951J194o14k519K815j061
$$ plain form
1236 -1095 -2108 1845 -80 -581 1803 -1163 -490 968 -766 1895 1658 -453 2087 -336 -1990 1140
1252 1140 -1160 -1310 1368 -928 -412 514 -2059 -213 -578 -1384 2334 882 -79 2510 -959 -803 1785
1269 1785 -837 466 1770 -714 988 36 -2275 59 -1449 -1109 1897 -528 -359 1297 -1658 -256
1285 -256 588 -1200 1444 797 -253 2188 -600 -1264 1053 -1698 -199 2058 -690 -30 191 -1956
1301 -1956 221 -528 -995 1650 -347 202 1969 -1627 -683 1049 -1316 644 1737 -524 1130 116
1317 116 -1199 971 -848 -523 1690 -942 284 942 -2040 -194 -220 -1597 1362 222 -633 1414
1333 1414 -1075 -610 1173 -1183 569 1940 -369 1137 344 -1464 548 -757 -657 1492 -741 -29
1349 -29 968 -2477 -576 468 -1923 898 1047 -283 1341 -125 -683 1027 -753 958 1865 -585
$$ packed form
1236a095j013L953j925n01K384k966O73J458j734K661k37k111K540k423j654L130
1252A140k300j50K678k296N16R26k573J846l65q06L718j452r61K589l469J56K588
1269A785k622J303J304k484J702r52k311K334j508L40L006k425J69J656k955J402
1285b56Q44j788K644o47j050K441k788o64K317k751J499K257k748O60K21k147
1301a956K177p49m67K645j997N49J767l596R44J732k365J960J093k261J654j014
1317A16j315K170j819L25K213k632J226O58k982J846k6j377K959j140q55K047
1333A414k489M65J783k356J752J371k309J506p93j808K012j305J00K149k233P12
1349b9R97l445J901J044k391K821J49j330J624j466n58J710j780J711R07k450
$$ plain form
1365 -585 974 609 -2213 -9 -841 -1784 1270 -636 -659 1150 -1412 -574 679 -1150 1328 1847 -128
1382 -128 1553 618 -816 1107 -711 -236 1412 -924 64 576 -2572 -270 -196 -1855 873 566 -335
1399 -335 1205 -433 -214 1106 -445 1421 1682 -268 1570 246 -2167 438 -1054 -1493 1146 -847
1415 -847 -587 384 -1668 -310 315 -912 1531 1024 -86 2156 82 -377 1173 -966 271 1502
1431 1502 -735 429 -167 -2356 -85 -504 -1674 951 -51 -403 1282 -569 -188 566 -621 1529
1447 1529 1012 -258 1665 -336 -1458 842 -1065 -731 1031 -1144 -10 574 -1562 -284 -223 -1078
1463 -1078 1417 527 63 1338 -434 -346 1015 -1153 887 1228 -977 1247 73 -1608 330 -816
1479 -816 -1214 1366 -278 -274 669 -1077 -170 194 -773 1151 527 -133 1753 -690 -785 1027 -917 -121
$$ packed form
1365e85J559l65k822K204q32r43L054j906k3J809k562Q38J253j829K478N19j975
1382a28J681r35j434J923j818M75J648k336R88N12l148K302P4j659K728l07r01
1399c35J540j638K19J320j551J866K61j950J838j324k413K605j492m39K639j993
1415h47K60R71k052J358O25j227K443n07j110K242k074m59J550k139J237J231
1431A502k237J164n96k189K271m19j170K625j002l52J685j851L81P54j187K150
1447A529n17j270J923k001j122K300j907L34J762k175J134N84k136J278O1q55
1463a078K495q90m64J275j772Q8J361k168K040L41k205K224j174j681J938j146
1479h16l98K580j644MR43j746R07L64r67J924o24o60J886k443r5J812j944P96
$$ plain form
1497 -121 1416 -504 351 644 -1374 24 -353 -502 1200 -469 -33 1118 -1055 -229 838 -1148 983
1514 983 973 -509 1429 -112 -940 1012 -590 -487 1307 -351 102 250 -1076 2 -582 -1103 1029
1531 1029 -79 -385 1078 -1029 -753 945 -1327 468 1375 -446 865 537 -1014 363 -221 -640
1547 -640 767 -832 162 604 -1642 -352 -149 -1490 907 520 -786 1385 -18 -765 1042 -196
1563 -196 73 1400 -194 431 341 -1013 -125 -1038 -1211 729 -687 -542 799 -1590 -529 889 -1132
1580 -1132 441 1344 -120 1529 490 -742 415 -284 -54 490 -808 221 -37 -1840 1 -739
1596 -739 -1569 909 -219 -507 1348 -25 -285 1025 -558 710 1458 -78 779 -120 -752 270 -842
1613 -842 -865 856 -872 -186 647 -1748 -32 481 -989 869 1114 -176 1206 506 -320 620 -200 441
$$ packed form
1497a21J537j920Q55K93k018J398l77j49J702j669M36J151k173Q26J067j986K131
1514I83j0j482J938j541q28J952j602J03J794j658M53J48j326J078n84n21K132
1531A029j108l06J463k107K76J698k272J795R07j821J311l28j551J377n84m19
1547f40J407j599R94M42k246J290K03j341K397l87j306K171j403p47J807j238
1563a96K69J327j594O25r0j354Q88r13j73J940j416J45J341k389J061J418k021
1580a132J573R03j464J649j039j232J157o99K30N44j298J029k58j803J841p40
1596g39q30K478j128k88J855j373k60J310j583J268P48j536Q57q99o32J022j112
1613h42k3J721j728O86Q33k395J716N13j470J858K45j290J382p00q26R40q20O41
$$ plain form
1631 441 546 -630 801 -67 -1543 82 -923 -1432 1345 -20 -601 1216 -687 -254 685 -358 735
1648 735 789 -50 823 -106 -430 545 -1110 -299 742 -1083 88 710 -1741 205 8 -1363 683 412
1666 412 -267 950 -32 -272 369 -576 664 482 -470 1100 -184 -1203 639 -710 -960 1183 -301
1683 -301 -404 969 -960 -398 326 -652 741 588 -50 899 -409 -254 540 -882 284 978 -781 641
1701 641 394 -1411 297 -234 -1071 919 61 -173 466 -611 -315 380 -759 550 273 -96 1439 -286
1719 -286 -724 1040 -473 -227 1469 -408 84 750 -908 -280 -136 -1007 437 -137 -283 762 -683
1736 -683 -174 561 -921 747 1167 -632 1070 348 -843 674 -212 -755 664 -398 -488 180 -964
1753 -964 -435 -240 -948 814 122 -144 1036 -237 -285 1247 -488 273 1412 -595 440 431 -778 -311
$$ packed form
1631D41J05j176J431q68j476J625j005n09K777j365n81J817j903M33R39j043J093
1648G35N4q39Q73r29l24R75j655Q11J041j825J171O22k451J946j97j371K046k71
1666D12o79J217r82k40O41r45J240j82r52J570j284j019J842j349k50K143j484
1683c01j03J373j929N62P24r78J393j53o38R49j308J55P94j422J166O94j759J422
1701F41k47j805J708n31q37J990q58k34O39j077K96O95j139J309k77l69J535j725
1719b86m38J764j513K46J696j877M92O66j658O28J44q71J444n74j46J045j445
1736f83N09P35j482J668M20j799J702p22j191J517q86n43J419j062r0O68j144
1753i64N29J95p08J762o92k66J180j273m8J532j735P61J139k007J035rj209M67
$$ plain form
1771 -311 -588 -1067 304 -567 -158 374 -1110 -29 185 -1039 901 791 -304 1572 545 -608 654
1788 654 -204 -210 688 -365 -103 28 -1063 -111 -445 -777 907 -220 -125 1169 -468 -116 1089 -465
1806 -465 490 1143 -390 493 238 -471 85 -657 -613 441 -521 -9 141 -1011 -18 143 -1005 798 585
1825 585 -334 1320 42 -398 725 -369 31 502 -533 358 49 -1051 96 -588 -592 1023 -395 -103
1843 -103 845 -600 167 698 -687 499 907 -285 825 173 -342 239 -544 -252 350 -466 46 254
1861 254 -1134 336 -363 -1063 981 18 -222 850 -145 -383 452 -319 380 626 -296 760 30 -606
1879 -606 517 -697 -239 876 -622 -60 739 -883 -127 136 -1000 411 468 -433 877 -211 -265 531
1897 531 -647 -92 337 -544 708 218 -953 524 -347 -894 929 -238 -375 692 -761 -410 -46
$$ packed form
1771c11k77m79J371q71M09N32j484J081K14j224J940j10j095J876j027j153J262
1788F54q58oQ98j053K62J31j091R52l34l32J684j127R5J294j637L52J205j554
1806d65R55O53j533Q83k55p09N56p42M4J054r62N12J50j152R93J61j148J803k13
1825E85r19J654j278m40J123j094M00M71j035Q91l09j100J147o84mJ615j418K92
1843a03R48j445P67N31j385J186M08j192J110o52n15N81p83K92O02q16N12K08
1861B54j388J470o99p00K044r63k40J072r95k38Q35p71O99K46r22J056p30o36
1879f06J123j214M58J115j498N62P99j622P56K63j136J411N7r01J310j088n4P96
1897E31j178N55M29q81J252m90j171J477q71n47J823j167j37J067j453L51L64
$$ plain form
1914 -46 -760 215 340 -321 856 -79 -107 648 -553 192 970 -528 208 454 -1229 86 -58 -989 300
1933 300 -200 -457 489 -416 -349 345 -384 600 853 -422 988 240 -399 636 -358 -472 601 -554 -364
1952 -364 493 -876 -309 -136 -786 498 21 -32 837 -306 -21 780 -607 350 963 -583 539 467 -831
1971 -831 276 -265 -837 378 -518 -441 137 -702 -106 204 -406 800 434 -293 1141 204 -144 880 -433
1990 -433 -252 697 -470 -232 115 -858 -175 -357 -626 107 -375 -128 708 -373 139 542 -635 519 897
2009 897 -296 734 288 -943 210 -325 -588 310 -382 -260 176 -753 185 -338 -675 611 106 -253
2027 -253 1097 -115 -280 897 -566 -101 526 -482 151 109 -696 158 -406 -740 365 -335 70 589
2045 589 -737 99 407 -458 810 462 -160 897 -65 -640 458 -227 -321 517 -264 386 43 -571 306
$$ packed form
1914d6p14R75J25o61J177r35k8P55j201P45P78j498P36K46j683J315j44r31J289
1933C00n00k57R46r05O7O94p29R84K53j275J410p48o39J035r94j14J073j155J90
1952c64Q57j369N67J73o50J284m77n3Q69j143K85Q01j387R57O13j546J122p2j298
1971h31J107n41n72J215q96P7N78q39N96L10o10J206l66p27J434r37l48J024j313
1990d33J81R49j167K38L47r73O83j82k69P33m82K47Q36j081N12M03j177J154L78
2009H97j193J030m46j231J153n35k63Q98o92J22M36r29R38n23l37J286n05l59
2027b53J350j212j65J177j463M65O27j008O33m2q05Q54n64l34J105p00M05N19
2045E89j326Q36L08q65J268l48o22J057r62n75J098o85r4Q38p81O50l43o14Q77
$$ plain form
2064 306 -543 -413 788 -155 -228 727 -533 -128 762 -734 157 817 -356 435 -35 -524 461 -205 -232
2083 -232 317 -561 265 9 -869 -44 63 -832 573 -105 -554 693 -11 -513 623 -412 144 755 -240
2102 -240 240 25 -333 465 -418 -632 751 -552 -171 365 -683 -24 372 -715 161 199 -153 336 161
2121 161 -50 477 -404 45 669 -349 582 323 -954 325 -196 -886 246 -310 -326 642 -487 -533 309
2140 309 -351 670 234 89 818 143 2 694 -659 -335 563 -733 -210 213 -989 -139 -64 -756 359
2159 359 11 -113 653 -62 59 467 -468 513 347 -269 484 221 -598 303 -496 -703 470 -218 -456 437
2179 437 -614 -214 223 -409 480 412 -119 864 56 -36 582 -465 193 467 -692 4 157 -941 100
2198 100 -337 -830 317 -24 -101 531 -76 247 351 -337 465 448 -345 773 169 -571 640 -674 -370
$$ packed form
2064C06q49J30J201r43p3R55j260M05Q90j496Q91O60j173P91m70m89R85o66k7
2083b32N49q78Q26k56q78Q25J07q95J405o78m49J247p04n02J136j035N56O11r95
2102b40M80k15l58P98q83k14J383j303L81N36j048O59L96j087Q76L8l52M89j75
2121A61k11N27q81M49O24j018R31k59j277J279n21o90J132n56j6R68j129m6Q42
2140C09o60J021m36j45P29o75j41O92j353L24Q98j296N23M23j202Q50P5o92J115
2159C59l48j24P66p15J21M08r35R81j66o16P53k63q19R01p99k07J173o88k38Q93
2179D37j051M00M37o32Q89o8n31R83q08r2O18j047O58K74j159O96J53j098J041
2198A00m37m93J147l41p7O32o07L23J04o88Q02j7p93J118o04p40J211j314L04
$$ plain form
2217 -370 558 -378 -354 106 -658 -99 52 -446 326 39 41 789 -293 20 638 -337 320 611 -683 297
2237 297 357 -740 155 -356 -231 152 -56 -159 285 -551 154 -65 -512 451 127 -141 819 -244 -343 686
2257 686 -390 -139 674 -597 155 565 -655 17 -69 -521 391 -305 -215 549 -584 215 285 -610 279 397
2277 397 -407 463 31 -497 517 -226 -255 463 -248 223 225 -500 137 -67 -532 350 -96 -339 744 -235
2297 -235 -228 646 -589 210 544 -225 309 409 -275 337 3 -169 527 -682 153 232 -760 441 -25 -792
2317 -792 579 438 -280 767 165 -153 460 -152 -175 368 -203 403 137 -313 174 -325 -559 460 -383
2336 -383 -51 476 -423 -291 330 -515 201 764 -167 516 561 -35 549 -91 -79 395 -557 -72 97 -722 36
2357 36 -254 -1018 360 297 -641 632 31 -39 620 -450 305 511 -41 430 242 -272 225 -487 -441 393
$$ packed form
2217c70R28r36K4M60p64N59J51m98P72k87KP48j082L13O18r75O57K91j294R80
2237B97O0j097Q95n11J25L83k08j03M44q36P05k19m47R63l24k68R60j063r9J029
2257F86j076K51Q13j271P52M10j220O72q6m52R12o96R0P64j133P99P0q95Q89J18
2277C97q04Q70m32n28J014p43k9P18p11M71Kp25O37k04m65Q82m46k43J083r79
2297b35PQ74j235P99L34p69N34J00o84O12l34j72O96j209Q35P9r92J201m66p67
2317g92J371j41p18J047o02l18O13o12k3N43n71O06k66m50M87m99k34J019q43
2336c83L32N27q99J32O21q45P16N63r31O83M5n96N84o40J2M74r52M85J69q19P58
2357C6k90p64J378o3r38J273o01p0O59j070P55K06n52M71j88n14M97p12M6Q34
$$ plain form
2377 393 -404 -386 438 -569 5 166 -358 352 303 -178 509 4 -136 527 -220 90 379 -533 125 27 -863
2398 -863 306 -123 -484 171 -213 -375 676 -297 -81 308 -407 373 319 11 546 -194 -192 286 -422 -439 522
2419 522 -380 -53 579 -692 64 139 -299 297 107 -229 447 -266 -38 394 -485 259 364 -395 277 118
2439 118 -745 355 -138 -621 175 -196 -124 451 10 -15 -40 -462 246 18 -77 484 -208 -236 436 -403 10
2460 10 572 -461 237 234 -584 116 -90 -488 297 -204 -278 444 -638 -113 139 -513 352 267 -247 412 17
2481 17 -497 615 -175 -115 531 -335 31 318 -483 254 -183 -685 145 -175 -140 348 -287 -16 571 -418 215
2502 215 300 -354 401 344 -419 363 -71 -106 420 -276 39 195 -660 44 -122 -853 362 -63 -365 738
2522 738 94 -158 569 -330 -198 479 -180 336 -30 -355 216 -162 -606 205 -369 -87 235 -485 -125 261
$$ packed form
2377C93p97J8Q24j007N74J61n24P10m9m81O87n05j40O63p47L10K89r12O58r8q90
2398h63J169m29l61O55l84j62J051r73K16L89p15P80n4l08N35p40KM78p08j7R61
2419E22r02L27O32j271P56P5m38N96j90l36O76p13K28M32q79P44J05p59O72j59
2439A18q63J100m93m83P96l71P2N75m41k5k5m22P08k28r5N61o92k8O72q39M13
2460A0N62j033O98lq18P00k06l98P85n01p4P22j082N25K52o52Q65q5n14O59l95
2481A7n14J112p90O0O46q66L66K87q01P37m37n02Q30l20L5M88o35K71N87r89O33
2502B15Q5o54P55n7p63P82m34l5N26o96L15J56q55P04j66p31J215m25l02J103
2522G38o44k52P27q99J32O77o59N16l66l25N71l78m44Q11n74K82L22p20L60L86
$$ plain form
2542 261 -515 314 512 -471 612 82 -227 379 110 -192 335 -336 -187 106 -516 38 -349 -534 247 -173
2562 -173 -338 439 -143 55 367 -143 206 423 -408 160 88 -393 125 -405 -97 184 -335 -233 205 -452
2582 -452 -46 278 -309 488 139 -139 536 31 -255 391 -124 142 164 -288 291 66 -555 240 -29 -601
2602 -601 236 -199 -242 473 -191 -60 422 -238 276 435 -187 435 95 -278 214 -272 -93 379 -509 25
2622 25 199 -685 274 -16 -552 391 -172 87 243 -129 155 377 -219 241 149 -295 291 22 -326 319 -345
2643 -345 -351 356 -232 -231 61 -518 129 102 -298 171 85 -139 415 -145 36 393 -624 -75 308 -128 341 192
2665 192 -312 173 -92 -170 321 74 -116 475 -423 94 118 -443 179 222 -277 538 168 -43 348 -219 -139
2686 -139 446 -302 -121 213 -482 239 -128 -361 421 -23 91 290 -353 -39 287 -458 379 229 -327 351
$$ packed form
2542B61p76Q29J98r83J083n30l09O06k69l02N27o71J49K93o22N54l87j85P81m20
2562a73j65P77n82J98L12n10L49K17q31N68p2m81N18n30L08K81n19J02M38o57
2582d52M06L24n87P97l49k78O75n05k86O46n15K66K2m52N79k25o21P95k69n72
2602f01Q37m35m3P15o64J31M82o60N14J59o22O22l40l73M92m86J79M72q88N34
2622B5J74q84R59k90n36R43n63K59J56l72K84K22n96M60r2m44N86k69l48O45o64
2643c45oP07n88JK92n79O47k7m00M69q6k24N54n60J81L57j017N49L83m36M69j49
2665A92n04M85k65p8M91k47j90N91q98N17K4n61O22M3m99Q15l70k11L91n67Q0
2686a39N85p48J81L34o95P21l67k33P82m44J14J99o43L14L26p45Q37j50n56O78
$$ plain form
2706 351 192 -112 531 -84 -306 199 -247 -192 9 -316 -55 -80 -356 219 -100 -311 377 -78 -32 522 -337
2727 -337 213 365 -329 250 233 -513 -185 -108 -230 56 -494 -200 335 -390 119 260 -347 353 194 -90 582
2748 582 196 43 596 -196 -273 264 -255 86 -6 -566 119 -290 -448 86 -125 -157 434 -298 -7 425 -113
2769 -113 291 296 -63 235 128 -295 307 94 -469 -4 -365 -210 60 -541 41 -30 -396 396 107 62 370
2790 370 10 3 362 -180 283 434 -385 112 -114 -425 27 -289 -234 230 -282 -24 428 -342 277 165 -480
2811 -480 303 87 -141 554 -21 -60 222 -414 -67 317 -254 147 213 -413 167 93 -338 223 -15 59 683
2832 683 -308 77 40 -192 97 229 -366 303 -18 -145 19 -95 -150 308 -272 -82 70 -576 308 154 -228
2853 -228 203 192 -294 209 59 -236 28 -73 68 265 -149 176 115 -195 204 -102 -218 188 -210 -124 366
$$ packed form
2706C51j59l04O43o15k22N05m46N5K01l25K61k5k76N75l19k11O88m55M6N54q59
2727c37N50J52o94N79j7p46L28P7j22K86n50K94N35p25N09J41o07P00j59k84O72
2748E82l86j53N53p92p7N37n19L41r2n60O85m09j58N34k11l2N91p32K91M32n38
2769a13M04Nl59K98j07m23O02k13n63M65l61J55K70o01N82p1l66P92k89m5L08
2790C70l60pL59n42M63J51q19M97k26l11M52l16N5M64n12K58M52p70O19j12o45
2811d80P83k16k28O95n75l9K82o36L47L84n71M01O6o26N80p4m31N61k38P4O24
2832F83r91L85l7k32K89J32n95O69l21j27J64j14n5M58n80J90J52o46Q84j54l82
2853b28M31j1m86N03j50k95K64j01J41J97m14L25o1l10L99l06j16M06l98Q6M90
$$ plain form
2874 366 -460 -69 31 -322 240 116 -255 287 206 -85 419 -191 -66 378 -87 128 309 -438 430 -13
2894 -13 -451 237 -257 -322 220 -190 -84 291 -167 64 295 -238 374 226 -107 404 -48 -402 140 -248 -327
2915 -327 98 -302 -23 25 -478 44 -75 -40 455 -174 -44 262 -39 383 198 -289 498 186 -436 25 -39
2936 -39 -274 179 -378 -312 497 -328 -31 297 -372 236 8 -261 589 -8 11 592 -29 -6 412 -275 5
2957 5 131 -375 1 -289 -193 203 -59 38 351 -124 -102 197 -394 64 481 -83 344 38 -339 216 -101 -282
2979 -282 56 -318 225 257 -550 -128 -246 -436 372 -8 10 289 -10 154 215 -54 116 142 -298 258 165 -384
3001 -384 42 145 -189 283 -185 -36 123 -138 -19 40 -309 242 -32 -270 51 -10 -160 233 -172 -4 398
3022 398 -180 -146 -20 -471 102 -19 -69 240 -29 -176 257 3 126 144 -383 70 143 -192 41 208 -230
$$ packed form
2874C66q26L91J00l53N62j24l71N42q1k91N04o10J25M44m65K15J81p47Q68m43
2894a3m38O88m94o5N42m10J06L75m58K31K31n33O12j48l33N11m52l54N42l88p9
2915c27M25m00K79M8n03N22j19L5M95o29J30L06l01M22j85m87P87l12o22M61o4
2936c9k35M53n57O6Q09q25K97L28o69O08k28k69Q50n97J9N81o21K3M18o87K80
2957EJ26n06L76k90R6L96k62R7L13m75K2K99n91M58M17n64M27l06l77N55l17j81
2979b82L38l74N43L2q07M22j18j90Q08l80J8K79k99J64O1k69J70K6m40N56r3n49
3001c84M26J03l34M72m68J49J59k61J19N9l49N51k74k38L21o1j50L93m05J68M02
3022C98n78L4J26m51N73j21n0L09k69j47M33k54J23J8n27M53P3l35K33J67m38
$$ plain form
3043 -230 271 -231 -70 242 -171 145 379 -51 58 248 -392 -39 -79 -92 173 -132 -176 232 -95 -54 313
3064 313 -234 211 85 -116 147 -10 -409 159 -107 -150 265 -183 46 -73 -502 293 113 -123 263 95
3084 95 31 179 30 -71 178 -233 -8 197 -247 -91 12 -371 206 -373 -246 116 -122 -67 96 0 43 121
3106 121 -143 370 54 -155 374 -102 -168 342 -190 -168 84 -285 -291 -117 -291 174 53 -93 285 -96 180
3127 180 296 -62 184 360 -42 229 -41 -223 291 -176 -351 194 -213 -248 -22 -230 14 -106 -410 296
3147 296 146 -170 248 98 -254 292 65 -86 295 -134 91 8 -291 218 -136 -378 104 -325 -237 219 2
3168 2 204 155 -345 68 228 -291 87 -72 -101 89 -118 -152 315 -150 -185 45 -65 70 85 -458 180 -116
3190 -116 -13 322 -230 -209 174 -3 -21 164 -266 -42 53 -157 -26 -261 -184 187 -408 -293 114 -265 117
$$ packed form
3043b30N01n02J61L12m13L16K34m30J09J90o40L53m0j3K65l05m4M08l27M1L67
3064C13n47M45j26k01K63j57l99N68k66m3M15m48K29j19m29P95j80k36L86j68
3084I5o4J48j49j01K49m11K25K05m44J56J03l83N77n79J27L62k38N5J63r6M3P8
3106A21k64N13l16k09N29m76o6N10n32K2K52l69oJ74j74M65j21j46L78l81K76
3127A80J16l58K46J76m02K71k70j82N14m67j75N45m07l5K26k08K44j20l04P06
3147B96j50l16M18j50l52N46k27j51L81m29K25q3k99N09l54k42M82m29Q8M56k17
3168BK02m9n00M13J60n19L78j59k9J90k07l4M67m65l5K30j10J35J5n43O38k96
3190a16J03L35n52K1L83j77j8J85m30K24R5k10J31k35P7L71n95J15M07l79L82
$$ plain form
3211 117 50 -182 40 13 -68 42 -5 -132 102 49 -190 331 -80 80 -17 -187 150 258 -156 131 -135 9
3233 9 302 -288 -62 -9 -256 120 137 -110 209 16 -25 129 -194 19 270 -250 10 29 -376 16 -117 -196
3255 -196 213 76 -297 250 -91 -29 46 -102 103 284 -203 153 240 -287 164 -250 -146 185 -227 -177 15
3276 15 -264 19 122 -233 126 71 -179 180 18 -81 299 -40 112 394 -170 180 -69 -318 122 -39 -406
3297 -406 -73 -168 -235 109 -178 -266 -7 -472 -39 357 -159 211 -48 -193 320 14 -176 17 -49 -165 51
3318 51 -397 203 -91 -333 74 -34 -213 234 57 73 469 -64 -47 355 -16 362 174 -315 378 -228 -26
3339 -26 26 -319 10 81 -177 153 180 -235 247 -10 -16 325 132 104 188 -118 -104 -4 -319 2 51 -180 -39
3362 -39 -96 -243 78 -58 -59 108 -65 70 122 24 205 133 -94 319 37 -304 116 -103 -179 209 -109 -136 -183
$$ packed form
3211A17o7k32K22k7q1J10m7j27K34n3k39N21m11J60r7j70L37J08m14K87k66J44
3233IK93n90K26N3k47L76J7k47L19j93m1J54l23K13K51n20K60J9m05L92j33p9
3255a96M09j37l73N47l41O2P5j48K05J81m87L56Q7n27M51m14J04L31m12N0J92
3276A5k79K83J03l55L59n5k50L59j62r9L80l39J52K82n64L50k49k49M40j61l67
3297d06L33r5o7L44k87q8K59m65M33L96n16L70k59j45N13l06j90J93o6j16K16
3318E1m48O00k94k42M07j08j79M47j77J6L96n33J7M02l71L78j88m89O93o06K02
3339b6N2l45L29P1k58L30K7m15M82k57oL41j93k8Q4l06J4J00l15L21M9k31J41
3362c9n7j47L21j36jJ67j73J35N2r8J81p2k27M13k82l41M20k19p6L88l18k7m7
$$ plain form
3385 -183 -335 -89 16 -191 37 -55 -7 138 117 102 254 -12 -33 451 -338 191 171 -219 123 -36 -260 364
3407 364 -24 -98 36 -276 22 123 -22 41 40 -192 469 54 -262 283 -214 186 35 -51 -77 293 -56 181
3429 181 91 -189 183 -164 -74 355 -42 19 108 -303 46 157 73 121 106 -128 69 -26 -187 132 -199 238 49
3452 49 -216 -135 -31 -531 108 -80 43 -71 -150 -67 167 -148 56 65 -408 248 97 -86 209 -98 -23 -17 -185
3475 -185 -39 25 -311 -127 -111 -437 50 242 -28 245 83 71 331 69 -165 325 -241 16 263 -196 119
3496 119 -76 -185 35 -252 -182 227 -296 -46 327 -48 114 25 -52 75 152 -10 190 -99 -157 271 36 -57
3518 -57 138 -178 48 -310 -89 158 36 -216 199 145 252 192 7 106 285 -10 139 49 -160 -157 -101 -325 55
3541 55 -153 -187 -18 -147 -176 271 -35 -40 114 -169 235 32 -9 76 -128 -100 137 -209 -78 -61 -71 -116 -61 -248
$$ packed form
3385a83j52K46J05k07K28r2M8J45k1j5J52k66k1M84p89N29k0l90L42j59k24O24
3407C64l88p4J34l12K98J01j45O3jk32O61m15l16N45m97M00j51q6k6L70l49K37
3429A81r0k80L72l47R0M29l97O1Q9m11L49J11q4M8j5k34J97r5j61L19l31M37j89
3452D9k65Q1J04n00O39j88J23j14p9Q3K34l15K04Rm73O56j51j83K95l07P5Oj68
3475a85J46O4l36J84J6l26M87J92k70K73j62j2K60k62k34M90n66K57K47m59L15
3496A19j95j09K20k87P0M09n23K50L73l75J62q9p7J27P7j62K00k89n8M28k35r3
3518e7J95l16K26l58K21K47j22k52M15n4J07o0j85R9J79k95J49r0k09LN6k24L80
3541E5k08l4J69j29k9M47l06nJ54k83M04k03m1Q5k04K8K37l46J31J7j0m5N5j87
$$ plain form
3565 -248 172 -91 -4 105 -137 24 348 34 228 327 -580 168 48 -160 145 -37 -39 264 36 -5 85 1
3587 1 40 32 6 167 100 165 295 -88 -37 152 -57 353 100 -47 245 8 -123 5 140 -238 210 -124 95
3610 95 133 -43 -238 67 -66 168 84 -218 182 19 -36 222 -101 -41 266 4 50 -156 -11 299 -56 -88
3632 -88 82 -164 -130 115 -310 207 115 -159 -64 80 11 15 97 28 258 -77 -28 85 -41 -162 107 -218 75
3655 75 114 -20 10 -33 -169 89 -195 111 128 28 -166 16 -81 227 101 -118 105 -48 -250 227 -14 -25
3677 -25 29 -2 -90 56 -187 87 179 7 195 2 25 -35 234 -57 437 -102 15 45 -139 477 28 63 -76
3700 -76 -185 -144 218 -261 -37 64 -179 125 -74 -240 188 61 -126 140 -132 -137 -46 -238 89 79 -166 37
3722 37 41 -123 -128 -90 -100 177 -64 66 16 -150 72 106 92 122 -52 -63 10 -49 50 -147 -353 -97 214 -190 44
$$ packed form
3565b48M20k63Q7J09k42J61L24l14J94R9r07P48j20k08L05j82kL03k28m1R0q4
3587AL9qk6J61o7O5J30l83N1J89k09M10k53j47K92k37j31J28J35l78M48l34K19
3610I5L8j76j95L05j33K34q4l02M00j63n5K58l23O0L07k62M6k06J45L10l55l2
3632h8J70k46L4K45m25N17r2k74R5J44o9MQ2o9K30l35M9J13j26j21K69l25K93
3655G5L9j34L0m3j36K58k84L06J7j00j94J82r7L08j26k19K23j53k02M77k41j1
3677b5N4l1q8J46k43K74R2j72J88j93K3o0K69k91M94n39J17L0j84O16m49L5j39
3700g6j09M1L62m79K24J01k43L04j99j66M28j27j87K66k72nR1j92L27j0k45K03
3722C7Mj64nL8j0K77k41J30n0j66K22L4j4L0j74j1P3n9R9j97k06K56L11m04K34
$$ plain form
3747 44 -61 -114 -36 70 140 305 -41 -157 176 -127 -79 -34 -153 78 -67 -237 -91 -185 -109 211 142 27 214
3770 214 -199 -117 103 106 311 189 4 142 -79 -235 35 -33 -284 183 -249 -143 -84 -213 148 33 -201 84
3792 84 -62 -56 177 106 2 181 -180 -38 161 -171 78 -105 -179 -77 -47 -122 29 -117 -109 20 -183 5 257
3815 257 -30 115 11 16 -31 -239 145 140 -72 53 -1 -175 -121 173 4 120 80 -307 175 -72 32 102 -176
3838 -176 134 19 -55 -50 126 -123 156 -94 -157 81 -163 8 40 -326 -348 127 -21 -148 -25 13 -160 53
3860 53 -72 94 -165 -79 119 -8 18 74 -290 135 114 -295 8 8 208 95 -61 -121 -114 -20 202 208 -121 99
3884 99 26 -4 225 -101 -70 107 49 19 135 -55 78 113 -253 -51 -196 -45 94 -171 97 149 5 -153 -36
3907 -36 -327 -13 -100 -136 128 -61 -253 -121 155 -40 -27 99 -95 103 -67 -33 -92 18 -169 -254 111 215
$$ packed form
3747D4j05n3P8J06P0J65l46j16L33l03M8M5j19K31j45j70J46r4P6L20o9j15J87
3770B14m13Q2K20LK05j22j85J38k21j56K70o8k51M67m32J06N9j29L61j15k34K85
3792H4j46OK33p1j04J79l61J42J99l32K49j83p4J02L0p5J51j46QJ29k03J88K52
3815B57k87J45j04Nm7k08L84nk12J25n4j74N4K94j69J16m0l87M82k47J04P0k78
3838a76L10j15p4NJ76k49K79k50o3K38k44J71L2l66k2M75j48j27J23L8j73K13
3860E3j25J66k59Q6J98j27K6N6l64M25k1m09L03%K00j13j56o0PR4K22Ol29K20
3884I9p3l0K29l26L1J77n8l0J16j90J33L5l66K02j45J51J39k65K68N2j44j58J17
3907c6k91L14q7l6K64j89j92J32K76j95J3J26j94J98j70L4n9J10j87q5L65J04
$$ plain form
3929 215 20 19 40 -202 110 33 59 -34 9 -409 87 -120 -29 -131 -100 -125 294 -118 242 105 -86 249 -59
3952 -59 -88 132 107 -23 59 -75 -133 -185 -97 -57 33 -134 101 -88 -125 -61 -176 -95 284 -159 -197 109 80 340 18
3977 18 -38 -247 226 -366 167 -109 -214 -52 -179 -11 15 42 32 17 -139 37 -145 21 22 167 -81 104 54
4000 54 148 176 -200 -56 -184 -105 157 33 -131 -7 -130 -147 -103 -185 223 173 -278 -69 152 -94 253 -13 -105
4023 -105 240 -82 -88 -77 -144 67 -70 25 79 287 -47 2 -13 101 72 88 147 58 -244 -131 208 -157 196 170
4047 170 -153 138 -148 -14 30 -14 -196 -68 -98 -107 21 -146 116 -45 -57 -103 236 -185 75 44 -71 -47 -40 -62
4071 -62 49 12 104 -39 86 57 -180 -73 -7 52 -254 129 230 -12 -205 133 118 -70 101 202 22 -31 205
4094 205 -144 -68 -67 -139 16 99 -42 279 -150 39 71 -96 -132 108 -207 271 129 -173 24 233 216 169 88
$$ packed form
3929B15j95jK1k42L12p7K6r3M3m18M96k07R1j02L1k5M19m12L60j37j91L35l08
3952e9k9K20k5j30Q2j34n8n2Q8M0R0j67K35j89l7O4j15Q1L79m43l8L06k9K60l22
3977A8n6k09M73n92N33k76j05J62j27J68K6K7j0j5j56J76j82J66JJ45k48J85n0
4000E4R4K8l76J44j28P9K62j24j64J24j23j7M4q2M08n0m51K09K21k46L47k66r2
4023a05L45l22oJ1o7K11j37R5N4K08l34M9j5J14k9J6N9q9l02J13L39l65L53k6
4047A70l23K91k86J34M4m4j82J28l0rJ28j67K62j61j2m6L39m21K60l1j15K4Pk2
4071f2J11l7R2j43J25k9k37J07O6N9l06L83J01k42j93L38j5j88J71J01j80n3K36
4094B05l49P6Jp2J55Q3j41L21m29J89L2j67l6K40l15M78j42l02J97K09j7m7q1
$$ plain form
4117 88 -55 137 -114 20 -35 -61 52 -188 -75 207 77 67 -176 -28 90 202 -14 7 261 -200 195 161
4139 161 -175 -221 107 -397 -21 99 -2 149 -72 68 130 -125 -128 122 -118 58 179 83 158 -50 -118 -79 -57
4162 -57 -44 -127 -43 163 92 22 -50 -75 -62 38 -100 24 191 63 -112 -66 64 -43 137 -8 75 -95 112 210
4186 210 -110 -107 163 -113 -85 -79 -110 -141 -35 -173 208 -57 -76 -54 71 -21 141 47 202 37 -205 208 54 -163
4210 -163 -121 -50 -206 40 -10 -34 170 -65 -63 57 -107 171 -20 57 254 98 -73 -140 -86 -180 11 -62 -51 145
4234 145 -74 90 -150 43 213 -170 -130 49 -111 74 19 -65 13 -32 -31 189 -15 -156 -89 -182 -6 3 87 -13
4258 -13 -28 -67 -83 -150 -16 -59 80 158 13 152 -163 -22 148 -38 -14 -35 -10 -147 -394 1 -95 77 -107 -16
4282 -16 -167 9 -54 171 258 260 209 123 15 125 -140 -75 172 -133 116 150 -389 -106 130 -143 1 -69 -266
$$ packed form
4117H8j43J92k51J34n5k6J13k40J13K82j30j0k43J48J18J12k16K1K54m61L95l4
4139A61l36m6L28n04L76J20j01J51k21J40O2k55lK50k40J76J21r6P5k08o8L9K2
4162e7J3q3Q4K06p1p0p2k5J3J00j38J24J67j28j75M6J30j07J80j45Q3j70K07R8
4186B10l20LK70k76K8Ol1l1J06j38L81k65j9K2J25r2J62r4J55j65k42M13j54k17
4210a63M2P1j56K46n0k4K04k35KJ20j64K78j91P7J97j56j71o7N4r4J91p3J1J96
4234A45k19J64k40J93J70l83M0J79j60J85n5q4P8m5JK20k04j41O7r3J76RQ4j00
4258a3j5l9j6o7J34m3J39P8j45J39l15J41J70j86K4k1K5j37k47L95r6J72j84R1
4282a6j51J76o3K25Q7Kn1q6j08J10k65O5K47l05K49L4n39K83K36k73J44p0j97
$$ plain form
4305 -266 22 27 94 144 -105 64 -23 -45 166 59 -288 330 -55 67 133 -54 80 30 -99 -19 48 -37 -7 -195
4329 -195 -186 196 48 -48 -68 -97 -28 222 -136 -135 -22 18 -127 -166 -211 -246 -39 -46 -18 -69 -250 58 -286 69 165 -189
4355 -189 -14 69 -40 -95 120 -4 -91 35 -221 73 -146 -20 3 -119 -73 -188 -47 126 60 -23 78 -41
4377 -41 -44 -109 -201 100 24 140 -47 151 15 -78 -10 32 58 -32 -111 -62 167 -141 -106 -179 -28 -20 -90 -25 -56 67 176
4404 176 -106 68 80 -263 136 5 -11 28 49 -129 31 9 -168 11 -152 97 176 111 -15 57 -60 96 -27
4427 -27 54 141 18 -19 -32 -88 -52 91 200 -44 -81 -154 38 84 -2 270 -186 -46 132 -92 86 50 43 78 382
4452 382 -203 -126 17 66 155 173 84 147 82 -282 75 134 60 -129 112 -21 -239 -182 162 10 136 9 -149
4475 -149 138 -57 -127 -2 47 -187 -107 77 71 41 51 -80 45 48 -123 -17 89 282 -50 126 116 4 84 17
$$ packed form
4305b66K88NO7N0k49J69q7k2K11j07l47O18l85J22O6j87J34n0j29Q0O7q5L0j88
4329a95RL82j48r6k0k9O9K50l58JJ13M0j45l9m5l5K07pK8n1j81L08l44L55R6l54
4355a89J75Q3j09n5K15j24q7J26k56K94k19J26K3j22M6j15J41J73o6q3J01j19
4377d1lo5r2L01p6J16j87J98j36r3O8M2K6r0p9M9K29l08L5p3J51Qp0O5l1J23J09
4404A76k82J74J2l43L99j31j6L9K1j78J60k2j77J79j63K49P9o5j26P2j17J56j23
4427b7Q1Q7j23l7j3n6L6J43J09k44l7p3J92M6q6K72m56J40J78k24J78l6pL5L04
4452C82n85P7J43M9Q9J8q9O3o5l64L57N9p4j89K41j33k18N7L44j52J26j27j58
4475a49K87j95p0J25M9k34Q0J84ol0J0j31J25Lj71J06J06J93l32J76j0j12Q0o7
$$ plain form
4499 17 -173 -185 241 -14 29 -107 -155 93 -33 182 -86 156 98 98 -102 -52 52 -47 -19 -136 -2 -86 -84 -66 -34
4524 -34 -175 -82 27 -92 -16 -88 -54 151 121 76 59 -117 -57 167 -234 -233 176 -140 -135 -56 -137 125 150 -154 -264
4549 -264 -39 -105 120 -189 16 58 16 89 81 -49 126 179 -33 -109 -104 51 155 115 -14 121 204 -94 131 -14
4573 -14 21 -220 39 145 -128 -98 110 -156 -19 142 -120 50 53 -22 -8 110 -31 97 -92 -156 205 37 146
4596 146 41 27 116 -21 -75 148 -115 -92 62 -71 120 28 -175 180 155 -72 -55 -30 -7 -126 -91 -73 37 -251
4620 -251 1 155 -237 -280 -55 -67 -25 89 -142 331 -37 50 235 -137 101 -33 39 49 -59 204 61 24
4642 24 42 -111 -248 -27 55 105 48 177 -1 -31 94 52 -44 36 56 106 -72 180 9 125 -210 -87 -51 66
4666 66 27 -208 289 -25 115 -28 -21 -40 129 76 83 -76 183 157 -176 -274 -218 -48 81 234 -112 104 -38 169
$$ packed form
4499A7j90j2M26k55M3j36m8K48j26K15k68K42n8%k00N0J04r9K8j17J34q4KJ8L2
4524c4j41R3J09j19P6p2L4K05l0m5j7j76O0K24m01JM09l16NP9q1K62K5l04j10
4549b64K25o6K25l09K05M2m2P3qj30J75N3k12p6NJ55J04m0j29J35Q3k98K25j45
4573a4L5k41K59J06k73L0K08k66J37J61k62J70Lp5J4J18j41J28j89o4L61j68J09
4596A46j05j4Q9j37n4K23k63K3J54j33J91r2k03L55k5k27J7K5K3j19L5J8J10k88
4620b51K52J54l92m3K25j2M2J14k31M73l68Q7J85l72K38j34P2J0j08K63j43l7
4642B4J8j53j37K21Q2N0n7J29j78l0J25m2r6Q0K0N0j78K52j71J16l35J23L6J17
4666F6l9k35M97l14J40j43Pj9J69n3Pj59K59k6l33r8N6J70J29J53l46K16j42K07
$$ plain form
4690 169 44 16 274 74 197 -137 -23 -266 8 128 23 -47 26 237 63 110 137 36 -3 -144 -65 33 -146
4713 -146 241 -65 147 -96 86 120 36 119 147 -171 -46 69 25 -102 -96 -57 -188 43 6 350 -82 -79 77 -51
4737 -51 -26 39 100 153 182 -220 35 -70 86 -10 42 93 49 -55 -31 117 -18 127 -74 -15 11 12 -50 251 9
4762 9 -117 -165 90 -27 -92 -27 -132 -193 -5 -130 3 -229 -34 -24 -108 104 9 -57 -94 44 -33 172 2 -27
4786 -27 32 -83 -111 147 -54 -41 -55 -41 47 67 9 -76 -154 -134 -24 206 11 75 -28 123 -84 -160 224 -111 1
4811 1 -92 15 -84 -2 -224 81 105 -124 63 -110 -69 23 -32 86 38 -79 48 39 4 97 7 -214 178 102 -341
4836 -341 36 55 -2 -152 -29 -224 17 -118 -92 -113 158 -33 -37 197 -21 149 27 -249 -108 -54 -57 84 -91
4859 -91 133 -56 170 33 69 28 30 -140 -67 -58 66 85 -20 -175 -78 -121 -104 75 -133 146 -121 -58 72 -107
$$ packed form
4690A69j25k8K58k00J23l34J14k43K74J20j05p0P3K11j74M7K7j01l9j41P9R8j79
4713a46L87l06K12k43J82L4q4Q3K8l18J25J15m4j27OL9j31K31l7L44m32LJ56j28
4737e1K5O5O1N3K9m02K55j05J56r6N2N1m4j04K4J48j35J45k01N9K6Jo2L01k42
4762Ij26m8K55j17o5O5j05o1J88j25J33k32J95J0q4K12r5o6l7J38p7K05j70k9
4786b7N9j15k8K58k01J3j4J4Q8K0n8q5p8K0J10K30j95O4j03J51k07p6L84l35J12
4811Ar3J07r9Q2k22L05K4k29J87j73M1R2n5J18m8j17J27rl5R3r0k21L92p6m43
4836c41L77J9n7j50J23j95K41j35K6k1K71j91mK34k18J70j22k76J41N4lJ41j75
4859i1K24j89K26j37L6m1Kj70P3RJ24J9j05j55R7m3J7J79k08K79k67O3J30j79
$$ plain form
4883 -107 -18 -152 -65 -163 66 -124 -59 -55 -61 -28 48 109 -15 -31 178 -81 242 147 -16 52 33 -156 -23 -100 138
4908 138 -188 -63 -46 114 56 -73 19 -75 83 -31 57 -31 10 92 -140 -222 73 111 -5 -166 106 -34 -40 119
4932 119 25 -146 -70 16 280 166 -104 165 -201 -6 -136 -80 47 221 -238 207 89 136 -134 171 -253 -37
4954 -37 -142 60 216 -147 -52 75 34 0 63 113 84 1 -81 151 51 43 -72 -63 83 0 3 -14 11 -222 139 167
4980 167 74 80 -11 45 50 26 69 -53 32 196 -49 121 80 47 8 -47 -34 -12 -92 -1 47 16 75 89 56 -43 210 -15
5008 -15 10 17 -85 -91 151 -77 -92 -78 -82 3 231 82 63 -133 -89 26 76 169 -30 -58 -17 177 7 36 -111 -77
5034 -77 113 -75 77 -62 -3 101 -31 -25 -11 -30 217 -15 43 -61 65 -46 104 290 89 174 24 15 167
5057 167 -22 167 -61 99 -55 -49 -88 4 1 52 -183 -152 58 51 -146 -15 96 -85 2 15 -1 195 130 31 -81
$$ packed form
4883a07Q9j34Q7r8K29j90O5MoL3P6O1j24j6K09k59L23r5j63O8j9j89J33p7K38
4908A38l26J25J7J60n8j29R2r4J58j14Q8q8M1Q2k32q2K95L8j16j61K72j40oJ59
4932A19r4j71P6Q6K64j14k70K69l66J95j30N6J27J74m59M45j18M7k70L05m24K16
4954c7j05K02J56l63R5J27m1l4O3N0k9q3q2K32j00qj15RJ46q3Lj7K5k33L61K8
4980A67r3Or1N6Nk4M3j22Q5J64k45J70m1l3l9n5J3K2q0R1M8l1N9J4l3r9K53k25
5008a5K5Pj02oK42k28j5J4mQ5K28j49j9j96M4J15N0R3j99k8M1J94j70K9j47L4
5034g7J90j88J52j39N9J04j32OJ4j9K47k32N8j04J26j11J50J86k01Q5j50rJ52
5057A67j89J89k28J60j54Ol9R2lN1k35L1K10pj97J31J11j81Q7J3j6J96o5r9j12
$$ plain form
5082 -81 34 -7 33 3 -221 8 -14 -83 15 109 172 127 -81 100 -120 -165 -15 -69 -87 82 -44 94 -106 2
5106 2 -83 -68 16 20 44 -139 126 146 74 -200 29 -150 -155 -177 41 45 -358 72 163 34 -29 156 -20 0 -21 102
5132 102 -203 79 -68 -43 -62 25 178 -61 -30 -55 -150 201 -10 -171 156 -58 -63 28 128 -78 -105 -97 117 -37
5156 -37 -70 4 -167 70 83 43 24 -63 0 40 -94 -13 193 82 -80 16 -9 -90 -96 -99 -58 -20 33 29 0 46 152 -2
5184 -2 20 129 159 19 -33 30 -127 202 23 118 -149 -17 35 -188 70 -179 55 -88 -4 -15 -33 117 89 107
5208 107 14 -106 -26 46 53 33 -59 36 33 -215 4 -79 -161 -15 36 13 -7 17 27 111 -21 181 -63 29 159 22
5234 22 213 211 -59 166 -46 -90 -103 -186 -220 223 94 56 36 103 83 -49 -9 -93 22 -75 -178 31 -56 23 -54 -103
5260 -103 105 255 -8 40 -38 -112 -7 -58 -65 87 78 -176 41 4 237 -8 64 244 26 112 -14 73 -81 -9
$$ packed form
5082h1J15m1M0l0k24K29k2o9R8R4O3m5k08J81k20m5J50n4j8J69j26J38k00J08
5106Bq5J5Q4MK4j83K65K0p2k74K29j79nk2K18Mm03M30R1j29o3J85j76K0k1J23
5132A02l05K82j47K5j9Q7J53k39L1k5r5L51k11j61L27k14nR1J00k06k7QK14j54
5156c7l3P4j71K37J3m0j9q7O3M0j34Q1K06j11j62R6k5q1olM1L8N3mk9M6J06j54
5184bK2J09L0j40n2O3j57L29j79R5k67J32N2k23K58k49K34j43Q4j1j8J50k8J8
5208A07r3j20Q0P2Pk0r2R5lk48K19q3q2J46N1k3k0K4J0Q4j32K02k44R2J30j37
5234B2J91kk70K25k12m4j3q3l4M43j29l8k0O7k0j32M0q4J15r7j03K09q7P9p7m9
5260a03K08J50k63M8p8p4J05n1pJ52rk54K17l7K33k45P2J80k18Q6j26Q7j54P2
$$ plain form
5284 -9 -20 150 33 79 -35 34 -65 149 151 -41 96 -221 89 108 57 66 -152 0 -46 -120 64 -38 -27 61 -53
5309 -53 46 42 -78 -159 59 210 -67 106 85 -60 148 216 118 79 97 -26 208 117 287 -42 -254 32 201 76
5333 76 227 24 -53 -63 -46 -157 134 145 -49 91 -23 67 -179 -64 -25 -71 -30 -14 60 -166 222 -31 -59 -51 178
5358 178 -9 45 48 108 -61 -132 19 4 -162 -43 102 -92 -9 -142 274 21 28 -143 76 -71 -66 31 -80 -15
5382 -15 -17 70 123 -179 88 -12 42 -199 -143 -59 38 96 -186 89 -229 -78 70 105 139 4 49 62 3 92 -9
5407 -9 -7 -7 22 68 151 6 -70 193 10 -24 -51 -17 -147 -66 186 136 -49 71 46 -49 -69 47 -162 318 71 -19
5433 -19 -22 58 -15 -171 108 42 31 -137 109 -12 43 -87 -67 -103 -19 -169 -20 -30 -139 69 -73 43 66 -143
5457 -143 245 -9 -84 -125 -167 3 159 106 178 -271 -10 -57 -103 59 -201 -146 -89 -71 -78 -166 81 -66 254 7
$$ packed form
5284ij1J70j17M6j14O9r9K14Kj92J37l17L10J9n1Rk18J52m6p4J84j02J1Q8j14
5309e3R9mj20q1K18J51k77J73k1j45K08O8r8l9J8j23K34r1J70l29k12K86J69j25
5333G6J51k03p7j0J7j11K91J1j94J40j14R0k46J15L9m6M1J6P4k26L88k53k8QK29
5358A78j87N4LO0j69p1J51j5j66J19J45j94Q3j33M16k53Pj71K19j47NR7j11O5
5382a5kQ7N3l02K67j00N4k41N6Q4R7N8k82K75l18J51J48L5L4j35M5J3n9Q9j01
5407iK%K9M6Q3j45p6K63j83l4k7L4j30Q1K52n0j85J20k5r5k0J16k09M80k47r0
5433a9lQ0p3j56K79o6j1j68K46j21N5j30K0l6Q4j50J49j0j09K08j42J16K3k09
5457a43L88k54p5m1m2J70J56n3P2m49K61m7m6J62k60N5N7J8pq8K47j47L20k47
$$ plain form
5481 7 -45 54 -36 -81 -160 21 24 -49 31 22 -110 32 -61 -28 87 -126 91 108 179 9 41 98 -12 117 -183 62
5507 62 85 -340 28 -181 -27 68 -168 -167 -30 67 137 -106 -70 -128 -170 -169 -106 -63 60 203 -161 -112 -213 19 38
5532 38 76 70 -190 -98 -46 228 79 -36 -15 -47 62 -83 54 -54 153 -78 108 69 -108 -78 10 201 -12 184
5556 184 114 -67 -274 149 -25 -12 -130 -230 44 60 88 22 3 -122 59 -98 -16 162 -47 -78 -69 -270 35
5579 35 -1 -196 52 -131 59 67 -58 50 -55 -196 -217 205 134 111 268 -140 -95 9 -159 -138 118 -36 -21
5602 -21 -140 57 -45 93 33 -157 -8 -98 120 167 197 -56 -148 124 170 -34 118 41 -95 -9 -68 -41 -35 -59 -204
5627 -204 38 39 77 -150 -24 -243 -126 -2 53 50 213 -141 42 248 -126 50 116 -84 40 117 -83 24 -17
$$ packed form
5481Gn2R9r0m5p9J81Lp3Q0rj32J42r3L3J15k13K17J7P1j70L2N7j10J29l00K45
5507F2K3m25L68k09J54R5k36JJ37R7P0k43L6n8m2JO3M3J23J43l64M9j01K32J9
5532C8L8ok60R2N2K74j49j15K1l2J09j45J37j08K07k31J86l9j77L0Q8J91k13J96
5556A84p0j81k07M23j74J3j18j00K74J6K8o6j9j25J81j57Q2J78k09l1Rk01L05
5579C5l6j95K48j83J90Qj25J08j05j41k1M22p1k3J57m08M5J04j68K1K56j54J5
5602b1j19J97j02J38o0j90J49r0K18M7L0k53r2K72M6k04J52p7j36Q6n9K7Ok4j45
5627b04K42JL8k27J26k19J17J24N5lJ63l54J83K06l74J76O6k00J24P7k00J07m1
$$ [...]
8191a22
##END NTUPLES=NMR FID
##END=
