##TITLE=1H_17-2023
 CDCl3
 8 sc, 
 10.4.2023
##JCAMPDX= 6.0         $$ Bruker NMR JCAMP-DX V2.0
##DATA TYPE= NMR FID
##DATA CLASS= NTUPLES
##ORIGIN= UXNMR, Bruker Analytische Messtechnik GmbH
##OWNER= root
$$ XWIN-NMR		Version 3.5
$$ Mon Apr 10 14:15:12 2023 Russian Standard Time (UT+4h)  she@DPX200
##.OBSERVE FREQUENCY= 200.13135
##.OBSERVE NUCLEUS= ^1H
##.DELAY= (6, 6)
##.ACQUISITION MODE= SIMULTANEOUS
##.ACQUISITION SCHEME= undefined
##.AVERAGES= 8
##.DIGITISER RES= 18
##SPECTROMETER/DATA SYSTEM= spect
##.PULSE SEQUENCE= zg30
##.SOLVENT NAME= CDCl3
##.SHIFT REFERENCE= (INTERNAL, CDCl3, 0, 15.7039)
##AUDIT TRAIL= $$ (NUMBER, WHEN, WHO, WHERE, WHAT)
$$ ##TITLE= Audit trail, XWIN-NMR		Version 3.5
$$ ##JCAMPDX= 5.01
$$ ##ORIGIN= Bruker BioSpin GmbH
$$ ##OWNER= she
$$ F:/spectra/data/she/nmr/H-F/1/audita.txt
$$ ##AUDIT TRAIL=  $$ (NUMBER, WHEN, WHO, WHERE, WHAT)
(   1,<2023-04-10 14:14:02.37 +0400>,<she>,<DPX200>,
      <created by zg, POWCHK disabled, PULCHK disabled
       configuration hash MD5:
       00 E9 B6 7A A2 85 ED C7 34 08 36 98 17 FE 4E 26
       data hash MD5: 16K
       7C B5 24 F5 19 F2 1F E3 80 AA 28 60 72 B5 3F 22>)
$$ ##END=
$$ 
$$ hash MD5
$$ 9E 88 F8 89 8E 1F 34 EF F8 99 E5 22 09 E3 BA 99
##$RELAX= 
##$RELAX= 
##$RELAX= 
##$RELAX= 
##$RELAX= 
##$RELAX= 
$$ Bruker specific parameters
$$ --------------------------
##$DU= <F:/spectra>
##$EXPNO= 1
##$NAME= <H-F>
##$PROCNO= 1
##$TYPE= <nmr>
##$USER= <she>
##$AMP= (0..31)
100 100 100 100 100 100 100 100 100 100 100 100 100 100 100 100 100 100 
100 100 100 100 100 100 100 100 100 100 100 100 100 100 
##$AQSEQ= 0
##$AQ_mod= 1
##$AUNM= <au_zg>
##$AUTOPOS= <>
##$BF1= 200.13
##$BF2= 200.13
##$BF3= 200.13
##$BF4= 200.13
##$BF5= 200.13
##$BF6= 200.13
##$BF7= 200.13
##$BF8= 200.13
##$BYTORDA= 1
##$CFDGTYP= 0
##$CFRGTYP= 5
##$CHEMSTR= <none>
##$CNST= (0..31)
1 1 145 1 1 1 1 1 1 1 1 1 1 1 1 1 1 1 1 1 1 1 1 1 1 1 1 1 1 1 1 1 
##$CPDPRG= <>
##$CPDPRG1= <>
##$CPDPRG2= <>
##$CPDPRG3= <>
##$CPDPRG4= <mlev>
##$CPDPRG5= <mlev>
##$CPDPRG6= <mlev>
##$CPDPRG7= <mlev>
##$CPDPRG8= <mlev>
##$CPDPRGB= <>
##$CPDPRGT= <>
##$D= (0..31)
0 1.2 0 0 0 0 0 0 0 0.06 0 0.03 0 0 0 0 0.0002 0 0 0 0 0 0 0 0 0 0 0 0 
0 0 0 
##$DATE= 1681121641
##$DBL= (0..7)
120 120 120 120 120 120 120 120 
##$DBP= (0..7)
150 150 150 150 150 150 150 150 
##$DBP07= 0
##$DBPNAM0= <>
##$DBPNAM1= <>
##$DBPNAM2= <>
##$DBPNAM3= <>
##$DBPNAM4= <>
##$DBPNAM5= <>
##$DBPNAM6= <>
##$DBPNAM7= <>
##$DBPOAL= (0..7)
0.5 0.5 0.5 0.5 0.5 0.5 0.5 0.5 
##$DBPOFFS= (0..7)
0 0 0 0 0 0 0 0 
##$DE= 6
##$DECBNUC= <off>
##$DECIM= 32
##$DECNUC= <off>
##$DECSTAT= 4
##$DIGMOD= 1
##$DIGTYP= 9
##$DL= (0..7)
0 120 120 120 120 120 120 120 
##$DP= (0..7)
150 150 150 150 150 150 150 150 
##$DP07= 0
##$DPNAME0= <>
##$DPNAME1= <>
##$DPNAME2= <>
##$DPNAME3= <>
##$DPNAME4= <>
##$DPNAME5= <>
##$DPNAME6= <>
##$DPNAME7= <>
##$DPOAL= (0..7)
0.5 0.5 0.5 0.5 0.5 0.5 0.5 0.5 
##$DPOFFS= (0..7)
0 0 0 0 0 0 0 0 
##$DQDMODE= 0
##$DR= 18
##$DS= 0
##$DSLIST= <SSSSSSSSSSSSSSS>
$$ [...]
##$SUBNAM2= <"">
##$SUBNAM3= <"">
##$SUBNAM4= <"">
##$SUBNAM5= <"">
##$SUBNAM6= <"">
##$SUBNAM7= <"">
##$SUBNAM8= <"">
##$SUBNAM9= <"">
##$SW= 18.05172834244
##$SWIBOX= (0..15)
0 0 2 0 0 0 0 0 0 0 0 0 0 0 0 0 
##$SW_h= 3612.71676300578
##$TD= 16384
##$TD0= 1
##$TE= 0
##$TE2= 300
##$TE3= 300
##$TEG= 300
##$TL= (0..7)
0 120 120 120 120 120 120 120 
##$TP= (0..7)
150 150 150 150 150 150 150 150 
##$TP07= 0
##$TPNAME0= <>
##$TPNAME1= <>
##$TPNAME2= <>
##$TPNAME3= <>
##$TPNAME4= <>
##$TPNAME5= <>
##$TPNAME6= <>
##$TPNAME7= <>
##$TPOAL= (0..7)
0.5 0.5 0.5 0.5 0.5 0.5 0.5 0.5 
##$TPOFFS= (0..7)
0 0 0 0 0 0 0 0 
##$TUNHIN= 0
##$TUNHOUT= 0
##$TUNXOUT= 0
##$USERA1= <user>
##$USERA2= <user>
##$USERA3= <user>
##$USERA4= <user>
##$USERA5= <user>
##$V9= 5
##$VALIST= <valist>
##$VCLIST= <CCCCCCCCCCCCCCC>
##$VD= 0
##$VDLIST= <DDDDDDDDDDDDDDD>
##$VPLIST= <PPPPPPPPPPPPPPP>
##$VTLIST= <TTTTTTTTTTTTTTT>
##$WBST= 1024
##$WBSW= 4
##$XGAIN= (0..3)
0 0 0 0 
##$XL= 0
##$YL= 0
##$YMAX_a= 225805
##$YMIN_a= -143599
##$ZGOPTNS= <>
##$ZL1= 120
##$ZL2= 120
##$ZL3= 120
##$ZL4= 120
##$ABSF1= 10
##$ABSF2= 0
##$ABSG= 5
##$ABSL= 3
##$ALPHA= 0
##$AQORDER= 0
##$ASSFAC= 0
##$ASSFACI= 0
##$ASSFACX= 0
##$ASSWID= 0
##$AUNMP= <proc_1d>
##$AZFE= 0.1
##$AZFW= 0.1
##$BCFW= 1
##$BC_mod= 2
##$BYTORDP= 1
##$COROFFS= 0
##$CY= 11.3945322036743
##$DATMOD= 1
##$DC= 2
##$DFILT= <>
##$DTYPP= 0
##$F1P= 2.36226072786647
##$F2P= -0.459571619588291
##$FCOR= 0.5
##$FTSIZE= 0
##$FT_mod= 4
##$GAMMA= 1
##$GB= 0.15
##$INTBC= 1
##$INTSCL= 1
##$ISEN= 128
##$LB= 0.24
##$LEV0= 0
##$LPBIN= 0
##$MAXI= 10000
##$MC2= 0
##$MEAN= 0
##$ME_mod= 0
##$MI= 1.114404
##$NCOEF= 0
##$NC_proc= 0
##$NLEV= 6
##$NOISF1= 3.799351
##$NOISF2= 2.8
##$NSP= 1
##$NTH_PI= 0
##$NZP= 0
##$OFFSET= 15.70392
##$PC= 1
##$PHC0= -19470.02
##$PHC1= 9.6008
##$PH_mod= 1
##$PKNL= yes
##$PPARMOD= 0
##$PSCAL= 0
##$PSIGN= 0
##$REVERSE= no
##$SF= 200.130013532006
##$SI= 16384
##$SIGF1= 3
##$SIGF2= 2
##$SINO= 400
##$SIOLD= 16384
##$SREGLST= <1H.CDCl3>
##$SSB= 0
##$STSI= 0
##$STSR= 0
##$SW_p= 3612.71676300578
##$SYMM= 0
##$S_DEV= 0
##$TDeff= 0
##$TDoff= 0
##$TI= <>
##$TILT= no
##$TM1= 0
##$TM2= 0
##$TOPLEV= 0
##$USERP1= <user>
##$USERP2= <user>
##$USERP3= <user>
##$USERP4= <user>
##$USERP5= <user>
##$WDW= 1
##$XDIM= 8192
##$YMAX_p= 0
##$YMIN_p= 0
$$ End of Bruker specific parameters
$$ ---------------------------------
##NTUPLES= NMR FID
##VAR_NAME=  TIME,          FID/REAL,        FID/IMAG
##SYMBOL=    X,             R,               I
##VAR_TYPE=  INDEPENDENT,   DEPENDENT,       DEPENDENT
##VAR_FORM=  AFFN,          ASDF,            ASDF
##VAR_DIM=   8192,          8192,            8192
##UNITS=     SECONDS,       ARBITRARY UNITS, ARBITRARY UNITS
##FACTOR=    0.0002768,     1,               1
##FIRST=     0,             0,               0
##LAST=      2.2672688,     0,               0
##MIN=       0,             -143599,         0
##MAX=       2.2672688,     225805,          0
$$ Real data points
##PAGE= N=1
##DATA TABLE= (X++(R..R)), XYDATA
$$ [...]
$$ plain form
1761 579 1309 1011 1281 142 -386 154 45 820 1339 370 78 -1686 -2412 -1871 -1970 -406 126 -5 829
1780 829 341 -233 520 -392 608 1316 986 1591 1191 521 968 -13 607 1680 1245 1761 914 -948 -1767
1799 -1767 -2850 -2651 -1332 -876 381 -91 -1030 -1403 -2115 -1243 503 701 1512 690 -1090 -887 -1101 -169
1817 -169 2036 2221 2973 1793 -300 -436 -1079 -890 488 17 451 -304 -1620 -1192 -1118 -411 993 880
1835 880 999 688 -939 -672 -812 -707 868 849 1447 1635 478 725 66 -783 239 -279 -37 234 -1066
1854 -1066 -1041 -1411 -2058 -295 38 865 1152 -257 -720 -1291 -1949 -663 79 1130 2015 654 277 -251
1872 -251 -690 972 1267 1540 1717 -52 -936 -1254 -1624 58 839 1273 1673 7 -604 -774 -1240 -34
1890 -34 213 -84 499 -813 -974 -332 -856 405 710 502 892 -90 -488 -473 -1168 -253 -5 -132 752 263
$$ packed form
1761E79P30k98K70j139n28N40j09P75N19r69k92j764p26N41r9J564N32j31Q34
1780H29m88n74P53r12J000P08l30O05m00o70M47r81O20J073m35N16q47j862q19
1799a767j083J99J319M56J257m72r39l73p12Q72J746J98Q11q22j780K03k14R32
1817a69K205J85P52j180k093j36o43J89J378m71M34p55j316M28P4P07J404j13
1835H80J19l11j627K67j40J05J575j9N98J88j157K47o59q49J022n18K42K71j300
1854a066K5l70o47J763L33Q27K87j409m63n71o58J286P42J051Q85j361l77n28
1872b51m39J662K95K73J77j769q84l18l70J682P81M34M00j666o11j70m66J206
1890c4K47k97N83j312j61O42n24J261L05k08L90r82l98J5o95R15K48j27Q84m89
$$ plain form
1910 263 182 416 -319 -121 -5 -135 641 257 -26 13 -856 -586 -189 -215 1058 793 279 270 -1160 -1001 -544
1931 -544 -212 887 690 -58 69 -889 -439 442 352 1270 660 -253 -232 -1000 -706 407 36 793 495 -414
1951 -414 -58 -403 -536 284 -422 17 -50 -837 214 -77 -154 678 -208 188 353 -59 801 415 -114 -18 -822
1972 -822 -368 168 275 1007 400 -240 20 -1007 -454 533 115 906 98 -681 -457 -900 -217 867 533
1991 533 863 412 -813 -594 -573 -86 701 197 286 -6 -961 -218 -348 183 728 88 -124 178 -392 255
2011 255 -103 69 414 -76 346 636 27 781 0 -810 3 -239 143 507 79 248 -704 -1174 -394 -506
2031 -506 285 1026 282 -51 -435 -1169 39 289 988 1323 368 23 -527 -688 269 512 1093 1267 -272
2050 -272 -512 -785 -1014 -68 186 399 508 -765 -703 -667 -921 282 290 72 319 -380 -258 73 -350 346 100
$$ packed form
1910B63q1K34p35J98J16j30P76l84k83L9q69K70L97k6J273k65n14rj430J59M57
1931e44L32J099j97p48J27r58M50Q81r0R18o10r13K1p68K94J113l71P57k98r09
1951d14L56l45j33Q20p06M39o7p87J051k91p7Q32q86L96J65m12Q60l86n29R6q04
1972h22M54N36J07P32o07o40K60j027N53R87m18P91q08p79K24m43O83J084l34
1991E33L30m51j225K19K1M87P87n04Q9k92r55P43j30N31N45o40k12L02n70O47
2011B55l58J72L45m90M22K90o09P54p81q10Q13k42L82L64m28J69r52m70P80j12
2031e06P91P41p44l33l84p34J208K50O99L35r55l45n50j61R57K43N81J74j539
2050b72k40k73k29R46K54K13J09j273O2L6k54J203Qk18K47o99J22L31m23O96k46
$$ plain form
2071 100 120 781 108 605 668 -366 66 -197 -380 633 129 199 -135 -963 -448 -588 -294 928 601 148
2091 148 -73 -1152 -734 -247 84 1293 823 306 -12 -628 -58 385 694 1304 464 -259 -424 -1040 -436
2110 -436 332 292 593 206 -486 -213 -775 -30 164 -227 169 -361 -716 -59 -307 42 428 -2 262 364
2130 364 14 669 -324 -218 291 -304 294 493 133 674 9 -420 -160 -638 199 240 -25 -30 -808 -856 -109
2151 -109 -303 756 1010 226 250 -491 -694 -138 -165 515 606 -281 87 -342 -495 391 220 572 429 -557 -396
2172 -396 -448 -163 237 43 437 403 -158 113 192 -200 498 -74 -115 77 -471 98 125 -87 174 -52 111 150
2194 150 -275 196 58 -803 -213 -461 -405 328 -83 333 413 -249 306 19 128 718 37 50 30 -598 -70
2215 -70 63 173 375 -151 -148 -236 -784 -81 -88 -414 -140 -522 -261 53 -312 160 464 341 369 -10 64 369 54
$$ packed form
2071A00K0O61o73M97O3j034M32k63j83J013n04P0l34q28N15j40K94J222l27m53
2091A48k21j079M18M87L31J209m70n17l18o16N70M43L09O10q40p23j65o16O04
2110d36P68m0L01l87o92K73n62P45J94l91L96n30l55O57k48L49L86m30K64J02
2130C64l50O55r93J06N09n95N98J99l60N41o65m29K60m78Q37M1k65np78m8P47
2151a09j94J059K54p84K4p41k03N56k7O80R1q87L68m29j53Q86j71L52j43r86J61
2172c96n2K85M00j94L94l4n61K71P9l92O98n72m1J92n48N69K7k12K61k26J63L9
2194A50m25M71j38q61N90k48N6P33m11M16Q0o62N55k87J09N90o81J3k0o28N28
2215g0J33J10K02n26Lq8n48P03pl26K74l82K61L14l65M72L04j23K8l79P4L05l15
$$ plain form
2238 54 227 445 -305 289 -132 -31 308 -31 170 -130 -513 -305 -565 -502 -191 -591 -235 65 -332 598 249
2259 249 307 378 -48 105 517 -123 404 373 -4 358 -313 105 499 -123 281 -321 -551 -394 -703 -410 29
2280 29 -315 79 -39 -553 216 59 280 813 92 194 31 -310 411 130 469 670 31 260 74 -471
2300 -471 136 -250 -374 -5 -478 -128 75 -399 157 -86 -309 264 -152 -103 242 -115 280 -64 -483 254
2320 254 94 379 607 10 56 -121 -433 286 -114 156 191 -396 -140 -283 -266 595 333 352 475 -536 -216
2341 -216 87 -122 500 375 130 301 -343 -174 -141 -152 197 -168 -449 -13 -518 -300 -60 -432 143 -313 -74
2362 -74 426 -45 192 33 -138 -18 -118 149 406 77 -47 -30 -503 -83 24 210 481 -153 -436 -538 -856
2383 -856 -458 157 246 691 25 -364 -98 -676 92 648 443 870 268 -166 -143 -260 331 455 149 455 88
$$ packed form
2238E4J73K18p50N94m21J01L39l39K01l00l83K08k60O3L11m00L56L00l97R30l49
2259B49N8P1m26J53M12o40N27l1l77L62o71M18L94o22M04o02k30J57l09K93M39
2280B9l44L94j18n14P69j57K21N33p21J02j63l41P21k81L39K01o39K29j86n45
2300d71O07l86j24L69m73L50K03m74N56k43k23N73m16M9L45l57L95l44m19P37
2320B54j60K85K28n97M6j77l12P19m00K70L5n87K56j43J7Q61k62J9J23j011L20
2341b16L03k09O22j25k45J71o44J69L3j1L49l65k81M36n05K18K40l72N75m56K39
2362g4N00m71K37j59j71J20j00K67K57l29j24J7m73M20J07J86K71o34k83j02l18
2383h56L98O15Q9M45o66l89K66n78P68N56k05M27o02m34K3j17N91J24l06L06l67
$$ plain form
2404 88 -539 -370 -562 -182 147 -235 7 -383 -471 15 -316 -55 102 -238 25 117 82 249 -153 -241 311 144
2426 144 467 413 193 315 -189 -601 71 62 340 444 -61 -220 -512 -450 -129 101 373 257 -227 -194 -620 -361
2448 -361 300 108 484 312 -219 -261 -446 -229 374 190 423 253 -268 -178 -450 -261 188 139 182 240 -324 -77
2470 -77 -219 -50 168 -62 -26 23 -117 246 1 -472 139 -343 -32 277 51 269 -92 -284 -4 -133 143
2491 143 226 81 70 -132 -535 -157 55 162 559 50 -267 -427 -872 -273 -73 216 543 105 -354 -276 -579
2512 -579 -111 73 268 479 214 -379 -193 -465 235 345 219 296 37 49 39 -134 83 262 -216 138 -303
2533 -303 -232 -12 -416 -3 75 -211 201 66 -174 145 -157 -254 21 -442 209 250 -20 233 -420 -366 -360 -136
2555 -136 167 466 268 210 -178 -255 -6 187 585 308 32 -90 -191 -429 113 69 326 409 -273 -202 -251 -99
$$ packed form
2404H8o27J69j92L80L29l82K42l90q8M86l31K61J57l40K63R2l5J67m02q8N52j67
2426A44L23n4k20J22n04m12O72rK78J04n05j59k92O2L21K30K72j16m84L3m26K59
2448c61O61j92L76j72n31m2j85K17O03j84K33j70n21R0k72J89M49m9M3N8n64K47
2470g7j42J69K18k30L6M9j40L63k45m73O11m82L11L09k26K18l61j92K80j29K76
2491A43Q3j45j1k02m03L78K12J07L97n09l17j60m45N99K00K89L27m38m59P8l03
2512e79M68J84J95K11k65n93J86k72P00J10j26P7k59J2j0j73K17J79m78L54m41
2533c03P1K20m04M13P8k86M12j35k40L19l02r7K75m63O51M1k70K53o53N4OK24
2555a36L03K99j98n8l88p7K49J93L98k77k76j22j01k38N42m4K57Q3o82P1m9J52
$$ plain form
2577 -99 299 137 25 160 -313 24 -195 -258 231 -110 274 102 -107 161 61 198 132 -136 99 43 -51 320
2599 320 136 52 120 -303 -99 59 -20 220 -115 -291 -56 -474 -175 79 97 370 205 -311 -169 -296 -83
2620 -83 460 152 277 -117 -59 9 -187 315 288 121 180 -162 -141 -122 -151 -271 -77 -214 73 13 -313 238 8
2643 8 85 81 -271 -155 138 2 186 257 -161 191 133 143 357 270 232 -6 -437 -80 -260 -144 110 -52 -1 -475
2667 -475 -521 -65 -50 22 472 -129 -65 -117 -320 -83 57 311 480 156 -27 27 -72 217 -74 161 129 -188 11
2690 11 31 -290 -15 88 -32 276 -404 -71 82 -207 11 -429 -184 166 -148 -151 329 -166 126 -312 105
2711 105 258 -36 16 300 -327 -98 125 -179 486 313 231 187 -260 -326 -219 173 156 105 56 -164 -304 145
2733 145 141 -66 241 195 -42 -100 -219 -89 -54 -53 97 150 67 81 -297 -164 158 -68 50 -148 -102 157 81 -234
$$ packed form
2577i9L98j62j12J35m73L37k19o3M89l41L84j72k09K68j00J37o6k68K35n6r4L71
2599C20j84q4O8m23K04J58p9K40l35j76K35m18K99K54J8K73j65n16J42j27K13
2620h3N43l08J25l94N8O8j96N02k7j67N9l42K1J9k9j20J94j37K87o0l26N51k30
2643HP7ml52J16K93j36J84P1m18L52n8J0K14q7l8k38m31L57j80J16K54j62N1m74
2667d75m6M56J5P2M50o01O4n2k03K37J40K54J69l24j83N4r9K89k91K35l2l17J99
2690A1K0l21K75J03j20L08o80L33J53k89K18m40K45L50l14lM80m95K92m38M17
2711A05J53k94N2K84o27K29K23l04O65j73q2m4m47o6J07L92j7n1m9k20j40M49
2733A45mk07L07m6k37n8j19J30L5JJ50N3q3J4l78J33L22k26J18j98M6K59p6l15
$$ plain form
2757 -234 36 -285 170 160 91 317 -52 14 -204 -272 -138 270 -69 219 17 -111 -126 -331 20 266 337 251
2779 251 39 -130 99 -107 335 459 171 75 -262 -243 -217 -103 119 47 -262 -298 -170 -373 -133 -188 18 41
2801 41 -307 -101 -49 -269 -26 83 149 92 -72 -80 327 -27 316 285 207 146 36 130 6 -171 46 10 40 171
2825 171 34 128 -117 -143 -184 -371 -198 -3 -35 185 88 -294 -41 -272 -54 249 201 -59 34 -326 -63 1 275
2848 275 505 14 113 216 -140 -1 -65 104 284 -35 -84 100 -192 -22 153 51 215 -148 -273 44 -311
2869 -311 76 -79 -179 -11 61 -181 67 82 -46 50 -193 147 24 -10 179 81 93 25 -220 63 90 -132 132
2892 132 86 -60 52 -141 -35 193 48 118 -150 -112 33 -156 261 226 109 283 -180 -196 141 225 57 339
2914 339 -151 -15 -14 -71 -30 -165 -110 45 -280 -109 -134 -221 165 -133 -38 19 -139 -36 10 -196 102 -288 -98
$$ packed form
2757b34K70l21M55j0o9K26l69O6k18o8J34M08l39K88k02j28j5k05L51K46P1q6
2779B51k12j69K29k06M42J24k88r6l37J9K6J14K22p2l09l6J28k03K40n5K06K3
2801D1l48K06N2k20K43J09O6n7j64qM07l54L43l1p8o1j10R4j24j77K17l6L0J31
2825A71j37R4k45k6m1j87J73J95l2K20r7l82K53k31K18L03m8k60R3l60K63O4K74
2848B75K30m91R9J03l56J39o4J69J80l19m9J84k92J70J75j02J64l63j25L17l55
2869c11L87j55j00J68P2k42K48J5j28R6k43L40j23l4J89r8J2o8k45K83K7k22K64
2892A32m6j46J12j93J06K28j45P0k68L8J45j89M17l5j17J74m63j6L37Q4j68K82
2914C39m90J36Jn7M1j35N5J55l25J71k5q7L86k98R5N7j58J03M6k06K98l90J90
$$ plain form
2937 -98 21 -95 166 18 -207 80 -9 -10 204 -46 289 158 15 86 -77 6 88 40 63 93 -237 -81 -47 125
2961 125 -14 154 -42 -138 -255 -28 -204 -120 8 82 2 20 -198 302 172 202 52 46 -88 217 -274 150 -83
2984 -83 -1 119 -30 -94 38 -141 44 1 -262 53 -105 77 -47 -166 -50 61 -119 177 -121 159 179 -78
3006 -78 48 85 -135 130 27 23 217 -39 -283 23 -48 285 -156 0 -72 -195 -201 -175 -46 88 196 4 19
3029 19 -11 -311 177 -189 132 29 -56 -48 -15 -67 103 59 53 186 -65 -38 66 -44 62 -37 -127 88 36 177 -58
3054 -58 17 87 -166 -82 -339 -75 72 -57 -84 -42 -236 1 253 -132 151 -106 61 70 46 50 79 -155 189 -35
3078 -35 -20 -31 -231 30 22 -172 -105 -161 -279 -122 104 -30 -46 24 116 -7 51 136 124 90 122 -12 -38 17 9 183
3104 183 85 56 172 -100 -143 96 7 282 -18 -31 136 -119 -9 -110 67 9 -30 -140 172 -140 216 -43
$$ packed form
2937i8J19j16K61j48k25K87q9jK14k50L35j31j43P1j63Q3Q2m8K3L0l30J56L4J72
2961A25j39J68j96r6j17K27j76Q4J28P4q0J8k18N00j30L0j50oj34L05m91M24k33
2984h3Q2J20j49o4J32j79J85m3k63L15j58J82j24j19J16J11j80K96k98K80K0k57
3006g8J26L7k20K65j03mJ94k56k44L06p1L33m41J56p2j23oK6J29J34J08j92J5
3029A9l0l00M88l66L21j03q5QL3n2J70m4oJ33k51K7J04j10J06r9r0K15n2J41k35
3054e8P5P0k53Q4k57K64J47j29k7M2j94K37K52l85K83k57J67Rk4MK9k34L44k24
3078c5J5j1k00K61qj94O7n6j18J57K26j34j6P0R2j23N8Q5j2l4L2j34k6N5qJ74
3104A83r8k9J16k72m3K39q9K75l00j3J67k55J10j01J77n8l9j10L12l12L56k59
$$ plain form
3126 -43 -37 80 -5 -203 70 23 23 15 58 -140 -182 -157 161 90 -20 115 -111 -234 -94 138 206 8 -314 -52 -65
3151 -65 -114 353 -191 187 11 -242 7 -117 -106 149 33 -19 -36 -150 -27 -362 25 89 -67 -4 98 -92
3173 -92 53 2 150 157 -145 190 -95 0 245 -5 171 -61 -23 -142 44 -151 52 -44 -72 15 -169 -39 206
3196 206 34 141 -102 -226 111 88 19 282 -122 291 182 38 270 18 181 145 -67 -171 -105 -222 -30
3217 -30 29 -31 -141 -395 -204 -244 -95 31 -73 -18 107 4 -92 128 180 336 165 204 75 -22 47 -23 84 106
3241 106 -10 -174 -193 -248 -132 -12 -227 19 -109 -293 -173 -221 -58 42 -2 83 162 -103 264 131 169 118 -17
3264 -17 204 225 92 139 137 -202 43 -214 -81 33 143 -175 -5 -112 -66 -168 -97 73 -43 -112 -31 -158 134
3287 134 176 59 299 -153 -51 -44 11 64 -66 187 134 16 -165 -123 -234 -85 111 93 25 -138 10 65 -257
$$ packed form
3126d3OJ17q5j98K73m7%qM3j98m2K5L18p1j10J35k26j23J40K32O8j98l22K62j3
3151f5m9M67n44L78j76k53K49j24J1K55j16n2j7j14J23l35L87O4j56O3J02j90
3173i2J45n1J48Pl02L35k85R5K45k50J76k32L8j19J86j95K03r6k8Q7j84J30K45
3196B06j72J07k43j24L37k3o9K63m04M13j09j44K32k52J63l6k12j04O6j17J92
3217c0N9o0j10k54J91m0J49J26j04N5J25j03r6K20N2J56j71L9j29r7O9p0J07K2
3241A06j16j64j9n5J16J20k15K46j28j84J20m8J63J00m4Q5P9k65L67j33L8n1j35
3264a7K21K1j33M7kl39K45k57J33J14J10l18J70j07M6j02P1J70j16o9Q1j27K92
3287A34M2j17K40m52J02PN5N3j30K53n3j18j81M2j11J49J96j8o8j63J48N5l22
$$ plain form
3310 -257 289 172 57 271 -249 -81 -8 45 253 42 -82 -48 -186 -52 -132 -43 32 -66 -67 41 207 199 -18 -276
3334 -276 223 -42 4 345 -93 207 179 -241 -254 53 190 167 -33 -213 -213 -264 -35 43 -65 207 32 -2 50
3357 50 -257 52 213 40 340 90 -89 -52 -78 176 211 43 26 21 -145 -167 -90 -270 -155 -156 137 -250 -64 95
3381 95 7 -214 -2 0 26 -180 64 -6 -136 -15 -53 -206 141 322 4 180 193 -160 10 -158 267 -37 -52
3404 -52 228 -79 -228 -17 -11 65 9 -18 -43 -155 6 139 -72 23 198 -149 90 -27 72 83 224 309 61 -73
3428 -73 164 -58 -11 130 296 165 -24 -200 166 164 -52 84 -131 -45 91 -171 48 90 45 -104 -118 -105 236
3451 236 -106 45 96 -178 27 -110 149 218 138 188 123 -54 -53 -193 -30 90 34 48 168 -165 104 -16 -40
3474 -40 68 76 -27 -77 -204 -119 -44 -343 -73 -39 115 217 119 289 21 167 37 -189 43 20 -220 6 -101
$$ packed form
3310b57N46j17j15K14n20J68P3N3K08k11j24L4j38J34q0Q9P5r8jJ08J66qk17k58
3334b76M99k65M6L41m38L00k8m20j3L07J37k3k00j80%n1K29P8j08K72j75l4N2
3357E0l07L09J61j73L00k50j79L7k6K54L5j68j7nj66k2P7j80J15jK93l87J86J59
3381I5q8k21K12KK6k06K44p0j30J21l8j53L47J81l18J76J3l53J70j68M25l04j5
3404e2K80l07j49K11OP6n6k7k5j12J61J33k11R5J75l47K39j17R9J1J41Q5k48j34
3428g3K37k22M7J41J66j31j89j76L66kk16J36k15Q6J36k62K19M2m5j49j4J3L41
3451B36l42J51N1k74K05j37K59O9q0N0o5j77Jj40J63J20n6J4J20l33K69j20k4
3474d0J08Qj03n0j27Q5P5k99K70L4J54J02r8J70k68J46j30k26K32k3k40K26j07
$$ plain form
3497 -101 -121 -144 19 63 10 132 -233 -182 -176 -209 -53 -93 187 -4 -111 -104 -140 47 -102 238 169 -38 103 -98
3521 -98 -223 55 144 -126 142 -26 168 149 -34 132 -54 71 20 -48 -60 31 -164 277 -40 -74 124 170 68
3544 68 16 -248 -185 -34 64 74 60 111 87 -101 22 11 -73 -84 63 -23 75 -84 -108 193 263 208 -74 -68 -31 -234
3570 -234 -215 -53 -90 103 -100 -294 137 119 -177 46 -133 -19 -75 -6 -12 -103 -185 84 -16 175 37 20 274
3593 274 86 141 76 -133 -74 -79 -142 43 138 -99 69 -38 86 24 3 78 -182 -79 -97 -184 -98 186 221 354 311
3618 311 -5 77 -82 1 19 -95 75 43 -92 -68 36 137 69 -154 178 -178 -315 29 -150 -82 8 46 -79
3641 -79 57 -80 -141 -180 166 58 99 221 95 -32 -30 97 -131 271 68 242 198 60 126 1 -108 122 32
3664 32 76 26 -269 -183 39 -191 56 155 187 233 -175 -233 -199 -189 -133 177 12 98 -70 72 292 0 152 37
$$ packed form
3497a01k0k3J63M4n3J22l65N1Ol3J56m0K80j91j07Pl6J87j49L40o9k07J41k01
3521i8j25K78Q9k70K68j68J94j9j83J66j86J25n1o8j2R1j95M41l17l4J98M6j02
3544F8n2k64O3J51R8J0j4N1k4j88J23j1q4j1J47q6R8j59k4L01P0n5k82OL7k03
3570b34J9J62l7J93k03j94M31j8k96K23j79J14n6O9or1q2K69j00J91j38j7K54
3593B74j88N5o5k09N9no3J85R5k37J68j07J24o2k1P5k60J03j8q7Q6K84L5J33m3
3618C11l16Q2j59Q3J8j14J70l2j35K4J04J01o8k23L32l56j37L44j79O8R0L8j25
3641g9J36j37o1l9L46j08M1J22j26j27KJ27k28M02k03J74m4j38O6j25j09K30r0
3664C2M4n0k95Q6K22k30K47R9L2M6m08n8L4J0N6L10j65Q6j68J42K20k92J52j15
$$ plain form
3688 37 -155 -23 -202 -89 -10 -98 113 -4 17 226 81 2 -89 -142 -118 -96 -148 42 45 -51 -104 -162 -154 51 20 171
3714 171 -2 72 9 -172 -103 99 -203 246 86 -225 42 -211 -176 182 221 -13 -58 -146 86 -117 125 61 -58
3737 -58 138 -63 -91 -125 -72 185 207 214 29 59 -82 211 -79 131 59 43 231 206 43 -90 -99 53 96 -30 -31
3762 -31 -248 -198 -109 36 -13 105 89 -54 -17 -32 8 -42 -96 -42 -96 177 185 70 110 -150 -245 73 -246 224 -7
3787 -7 -52 57 -150 -210 70 79 47 38 -322 -30 -260 -353 61 -27 -174 -12 -88 131 -1 -70 57 50 1 214 -284
3812 -284 10 -264 14 43 -44 -135 128 -24 -27 93 -72 121 -30 50 -7 28 261 90 -185 6 -125 109 212
3835 212 158 121 -111 -125 -5 -83 -121 10 154 158 59 -124 57 245 53 134 -15 -19 -47 -254 -77 -24 11 156 152
3860 152 125 135 -81 320 156 -62 -147 -268 -85 -184 41 63 91 16 184 72 -102 56 -43 -106 -166 -164 1 -62
$$ packed form
3688C7j92J32j79J13P9q8K11j17K1K09j45p9r1n3K4K2n2J90Lr6n3n8QK05l1J51
3714A71j73P4o3j81O9K02l02M49j60l11K67k53L5L58L9k34m5q8K32k03K42o4j19
3737e8J96k01k8l4N3K57K2Pj85L0j41K93k90K10p2j6J88k5j63j33rJ52M3j26j
3762c1k17N0Q9J45m9J18j6j43L7j5M0n0n4N4n4K73Qj15M0k60r5L18l19M70k31
3787gm5J09k07o0K80Rl2rl60K92k30r3M14q8j47J62p6K19j32o9J27pm9K13m98
3812b84K94k74K78K9q7r1K63j52lJ20j65J93j51Q0n7L5K33j71k75J91j31K34J03
3835B12n4l7k32j4J20p8l8J31J44Mr9j83J81J88j92Q1j49mk8k07J77N3L5J45m
3860A52k7J0k16M01j64k18q5j21J83r9K25K2K8p5J68j12j74J58r9o3o0KJ65o3
$$ plain form
3884 -62 122 6 -112 -180 37 27 115 -216 -143 13 -135 -125 -218 62 29 163 76 -80 5 149 -52 -134 172 -183
3908 -183 -62 87 18 95 397 223 75 -39 -25 171 -121 -31 4 -4 -136 -4 -196 -112 31 -56 129 -47 -108
3931 -108 -171 -266 -89 88 -136 163 -190 125 121 -72 162 168 13 -29 207 135 -74 -135 169 210 -81 81 30 -103
3955 -103 37 -149 15 -216 -161 -242 7 -122 -47 22 -56 26 -65 50 36 105 54 46 22 78 181 345 204 90 223
3980 223 91 -1 31 -97 70 -216 -262 -382 -254 -20 72 10 109 154 71 162 -208 -29 72 -5 35 89 33 139
4004 139 184 238 165 -205 -78 -213 -225 -22 -326 -26 6 16 127 -116 -137 9 -115 -130 -102 58 -12 71 120 203
4028 203 -24 225 124 316 54 207 77 -26 -49 -284 -138 -148 -258 -22 -18 129 -66 -170 -85 -97 67 65 -31
4051 -31 66 -29 -88 293 311 228 233 -110 297 36 -87 179 -234 34 -306 -89 -92 98 -28 118 -40 38 47 78 123
$$ packed form
3884f2J84j16j18o8K17j0Q8l31P3J56j48J0r3K80l3J34q7j56Q5J44k01q2L06l55
3908a83J21J49o9P7L02j74j48j14J4J96k92R0L5qj32J32j92Q4J43q7J85j76o1
3931a08o3r5J77J77k24K99l53L15mj93K34Oj55m2K36p2k09o1L04M1k91J62n1j33
3955a03J40j86J64k31N5q1K49j29P5O9p8Q2r1J15j4O9n1qk4N6J03J64j41j14J33
3980B23j32r2L2j28J67k86m6j20J28K34R2o2R9M5q3R1l70J79J01p7M0N4n6J06
4004A39M5N4p3l70J27j35j2K03l04L00L2J0J11k43k1J46j24j5K8J60p0Q3M9Q3
4028B03k27K49j01J92k62J53j30j03k3k35J46j0j10K36MJ47j95j04Q5j2J64kr6
4051c1R7r5n9L81J8q3Nl43M07k61j23K66m13K68l40K17lJ90j26J46j58P8RL1M5
$$ plain form
4076 123 146 -71 -49 -152 -3 -87 227 373 547 192 141 -98 -44 -88 -103 -114 -132 -135 -287 -89 -74 -55 -11 55 -103
4101 -103 64 -10 -54 -113 325 -96 123 65 -42 232 244 91 -40 21 -61 -158 -56 105 -78 -162 -136 62 115 68
4125 68 53 -36 -40 -251 -27 -76 -23 306 68 52 188 258 -4 132 122 162 157 -2 -110 -213 -75 108 -24 62 170
4150 170 -48 17 -150 -251 5 26 23 136 -106 31 126 76 95 34 117 396 129 185 -85 114 10 126 -49
4173 -49 32 118 199 -397 -296 -230 -140 77 57 283 -43 -202 63 30 -49 141 153 35 131 -32 -201 -127 -18 14
4197 14 -25 14 -246 -251 -125 15 -83 232 98 -252 -45 -231 -279 28 -63 -9 48 -238 39 80 -33 73 -245 -151
4221 -151 197 135 106 71 103 111 -33 -185 -67 -48 141 39 -254 -22 -103 -131 27 -106 154 81 182 -139 -154 59
4245 59 167 145 365 235 -18 -149 -60 -6 76 -162 -100 83 -134 -218 -122 -53 -46 -41 8 -31 -148 -153 -106 -127 37 181
$$ packed form
4076A23K3k17K2j03J49q4L14J46J74l55n1k39N4m4j5j1j8lj52J98J5J9M4O6j58
4101a03J67p4m4n9M38m21K19n8j07K74J2j53j31O1q2r7J02J61j83q4K6J98N3m7
4125F8j5q9mk11K24m9N3L29k38j6J36P0k62J36j0M0nj59j08j03J38J83j32Q6J08
4150A70k18O5j67j01K56K1lJ13k42J37R5n0J9o1Q3K79k67N6k70J99j04J16j75
4173d9Q1Q6Q1n96J01O6R0K17k0K26l26j59K65l3p9J90J2j18R6j63j69P4J09L2
4197A4l9L9k60nJ26J40r8L15j34l50K07j86m8L07r1N4N7k86K77M1j13J06l18R4
4221a51L48o2k9l5L2Qj44j52J18J9J89j02k93K32q1k8J58j33K60p3J01l21j5K13
4245E9J08k2K20j30k53j31Q9N4Q2k38O2J83k17q4R6O9PNM9l9j17nM7k1J64J44
$$ plain form
4271 181 199 69 49 -7 153 6 82 16 228 63 86 -81 59 -231 173 84 229 2 -171 -94 -495 -319 -169
4294 -169 13 74 174 71 112 -31 -33 210 124 153 387 16 24 66 -122 12 157 1 93 23 -97 -21 -227 -28
4318 -28 111 -59 52 -203 -109 57 -219 371 485 275 294 118 247 126 -131 -102 -89 96 312 -115 186 -51
4340 -51 -324 -378 -125 -234 34 -216 -221 -44 -203 -113 133 76 239 60 58 156 -76 -18 145 13 148 14 198
4363 198 306 -60 43 -64 -95 234 -55 -363 90 -308 -163 -260 -41 0 127 132 74 80 -137 33 81 -98 83
4386 83 -172 297 -92 278 265 110 166 378 23 -19 -150 -302 -7 -135 -120 -12 -292 35 -92 25 -27 -53
4408 -53 -41 80 79 -48 -101 139 204 211 183 165 129 140 88 -290 -28 -145 -153 -124 -99 32 -176 -124 135 -98 81 112
4434 112 -66 40 9 -319 -107 -172 -19 37 148 368 181 7 123 -258 -105 99 -8 -42 178 135 46 24
$$ packed form
4271A81J8j30k0n6J60j47P6o6K12j65K3j67J40k90M04q9J45k27j73P7m01J76J50
4294a69J82O1J00j03M1j43kK43q6K9K34l71QM2j88J34J45j56R2p0j20P6k06J99
4318b8J39j70J11k55R4J66k76N90J14k10J9j76J29j21k57K9J3J85K16m27L01k37
4340e1k73n4K53j09K68k50nJ77j59R0K46n7J63j79kR8k32N8J63j32J35j34J84
4363A98J08l66J03j07l1L29k89l08M53l98J45r7K19M1J27Nn8Ok17J70M8j79J81
4386H3k55M69l89L70j3j55N6K12l55m2j31j52K95j28J5J08k80L27j27J17n2k6
4408e3J2J21jj27n3K40O5Pk8j8l6J1n2l78K62j17qK9K5J31k08N2K59k33J79L1
4434A12j78J06l1l28K12o5J53N6J11K20j87j74J16l81J53K04j07l4K20m3q9k2
$$ plain form
4456 24 -63 15 55 128 240 -33 -94 -142 -175 207 -95 312 160 -40 154 88 52 4 30 -21 98 -420 -63 -191
4480 -191 -173 119 69 60 83 -113 -64 -68 -114 132 -278 102 164 -128 136 272 -21 -83 50 106 246 -176 -67 35
4504 35 -81 -18 60 146 146 -60 -199 60 -343 -18 60 -149 105 -76 -75 -179 -282 31 -9 153 329 62 -51
4527 -51 59 -37 124 -26 -25 30 -32 12 161 -274 -5 -130 -221 9 18 -126 -61 -29 -111 -209 -113 66 234 58 67 -22
4553 -22 -206 96 98 110 55 96 139 -155 5 20 69 54 -22 -63 60 -279 -175 -134 -81 114 -59 -9 133 -143 -281
4578 -281 97 24 97 215 46 253 -27 74 190 -37 204 140 6 -51 -107 -141 -51 -251 -76 -27 -219 -187 -17
4601 -17 -167 131 -179 23 114 -53 113 145 -118 26 -24 151 134 -27 226 14 -56 168 104 122 218 -258 6
4624 6 77 -128 -3 -173 84 75 -90 55 -54 -85 58 -100 92 193 20 181 9 -40 -67 -74 -45 211 67 -36
$$ packed form
4456B4q7P8M0P3J12k73o1m8l3L82l02M07j52k00J94o6l6m8K6n1J19n18L57j28
4480a91J8K92n0rK3j96M9mm6K46m10L80O2k92K64J36k93o2J33N6J40m22J09J02
4504C5j16O3P8Q6%k06j39K59m03L25P8k09K54j81Jj04j03L13m0J62J76k67j13
4527e1J10r6J61j50JN5o2M4J49m35K69j25r1K30Rj44O5L2q2r8R6J79J68j76Rq9
4553b2j84L02KJ2n5M1M3k94J60J5M9j5p6m1J23l39J04M1N3J95j73N0J42k76j38
4578b81L78p3P3J18j69K07k80J01J16k27K41o4j34n7n6l4R0k00J75M9j92L2J70
4601a7j50K98l10K02R1j67J66L2k63J44n0J75j7j61K53k12p0K24o4J8R6m76K64
4624FP1k05J25j70K57rj65J45j09l1J43j58J92J01j73J61j72m9k7pK9K56j44j03
$$ plain form
4648 -36 -78 -38 -33 -198 -89 21 -36 24 225 19 -51 -13 -44 86 -40 91 -56 -35 105 75 83 -45 38 -6 80 -31
4674 -31 -131 -399 -121 -223 -15 16 -79 -221 -185 -31 -6 38 -18 35 47 -264 141 -64 153 221 36 313 162
4697 162 204 177 -12 -158 61 87 -25 -88 -185 -163 -36 64 60 37 -211 -124 -67 -31 147 -4 -57 -153 -89 53 69
4722 69 91 158 32 91 169 78 -116 -106 -35 -25 -122 -184 -18 -29 -36 -206 -106 16 42 -86 63 56 -83 6 173 170 273
4749 273 85 22 74 38 29 -96 61 35 61 208 2 -60 -57 -83 -162 -77 150 -20 -181 60 -57 107 18 -93 -220
4774 -220 55 -129 173 -38 49 164 -107 97 13 10 110 118 -19 87 -44 34 17 -208 86 -83 -227 39 -114
4797 -114 -210 -40 -175 68 95 57 362 35 84 -92 72 -8 71 -164 75 -126 -222 -177 -193 101 56 -36 -11 42
4821 42 -17 -1 -238 -184 258 -45 -69 -43 17 157 159 48 6 -7 -34 143 130 -22 -61 111 -40 -73 -117 -124 -113 -36 -84
$$ packed form
4648c6m2M0Nj65J09J10n7O0K01k06p0L8l1J30j26J31j47K1J40l0Qj28Q3m4Q6j11
4674c1j00k68K78j02K08L1r5j42L6J54K5M4n6N3J2l11M05k05K17O8j85K77j51
4697A62M2k7j89j46K19K6j12o3r7K2J27J00mk3k48Q7N7L6J78j51n3r6O4J42J6
4722F9K2O7j26N9P8r1j94J0P1J0r7o2J66j1pj70J00J22K6j28J49pj39Q9J67lJ03
4749B73j88o3N2l6rj25J57k6K6J47k06o2Lk6p9Q5K27j70j61K41j17J64q9j11j27
4774b20K75j84L02k11Q7J15k71K04q4lJ00Qj37J06j31P8j7k25K94j69j44K66j53
4797a14r6J70j35K43K7l8L05l27M9j76J64q0P9k35K39k01r6M5j6K94m5r2K5N3
4821D2n9J6k37N4M42l03k4K6O0J40Kj11m2j3k7J77j3j52l9J72j51l3m4pJ1P7m8
$$ plain form
4848 -84 28 17 -6 -129 27 -117 -121 146 51 55 48 -59 83 -107 11 -167 72 139 -56 112 -103 173 -24 110
4872 110 -190 164 19 -227 -72 8 33 162 -136 105 87 -117 88 142 -70 -1 -9 176 31 22 95 -29 49 116
4896 116 8 191 159 -53 -9 -5 -127 64 -155 75 -190 -48 -66 19 -70 134 -109 148 -147 -41 205 -110
4918 -110 224 391 -10 175 16 152 -5 15 28 -69 77 11 -129 -229 75 -198 -19 18 -114 23 -217 -147
4940 -147 2 -3 78 -50 56 7 295 -45 117 -73 80 247 -26 104 81 -205 -49 -36 -95 140 -145 -139 -78
4963 -78 -176 -111 -75 -19 -28 -59 -162 28 -75 106 -12 -5 217 185 30 47 2 -7 33 40 -12 -119 -33 30 -76 -6 -182
4990 -182 -23 -41 -71 -155 -82 -180 248 -99 -72 -46 -3 74 30 145 158 1 -168 94 -197 96 106 16 60 -4 -1 161
5016 161 13 -94 57 -212 14 -65 -217 65 7 67 183 -145 -99 133 -33 7 300 -37 54 113 109 78 -29
$$ packed form
4848h4J12j1k3j23J56j44mK67r5Mpj07J42j90J18j78K39O7j95J68k15K76j97J34
4872A10l00L54j45k46J55Q0K5J29k98K41j8k04K05N4k12O9qJ85j45rP3j24P8O7
4896A16j08J83l2k12M4Mj22J91k19K30k65J42j8Q5q9K04k43K57k95J06K46l15
4918a10L34J67m01J85j59J36j57K0J3r7J46o6j40j00L04k73J79L7j32J37k40P0
4940a47J49nQ1j28J06m9K88l40J62j90J53J67k73J30k3k86J56J3n9K35k85OO1
4963g8r8O5L6N6rl1j03J90j03J81j18PK22l2j55J7m5rM0Pn2j07Q6O3j06P0j76
4990a82J59j8l0q4P3r8M28l47K7K6M3P7m4J15J3j57j69K62k91K93J0r0M4o4LJ62
5016A61j48j07J51k69K26p9j52K82n8O0J16l28M6K32j66M0K93l37R1N9ml1j07
$$ plain form
5039 -29 -82 -1 -66 58 55 -106 118 58 18 -19 -80 14 159 22 -12 180 -162 122 -85 -39 46 80 266 -134 112
5064 112 72 -186 -130 86 -92 -37 -185 -20 -113 -80 89 -47 37 -12 -52 164 -28 140 -87 13 -9 15 32 -123
5088 -123 105 5 23 81 -193 32 -31 -215 45 7 88 -40 53 -102 -20 -32 145 -24 -70 -126 -26 17 54 -73
5112 -73 -170 -6 168 134 -130 -48 59 97 55 115 45 126 -185 138 -153 -134 -71 7 97 -242 -17 -108 26 -279 -102
5137 -102 14 25 61 -53 27 19 -222 108 139 129 -67 -10 -108 -24 14 -70 -35 -83 188 -87 63 -8 -162 34 117
5162 117 -83 51 -92 29 131 129 40 -41 49 176 -123 -52 199 61 -103 -69 4 182 -85 -181 63 -200 13
5185 13 22 -161 134 -77 -137 51 25 -31 151 87 18 152 93 6 267 24 -23 11 -217 217 -89 69 4 -20 207
5210 207 -204 -47 -4 -73 57 18 5 98 -101 151 -45 -91 126 0 -53 52 -63 62 111 -11 -90 18 175
$$ packed form
5039b9n3Q1o5J24lj61K24o0m0l7o1R4J45j37l4J92l42K84k07M6Q5L4J86m00K46
5064A12m0k58N6K16j78N5j48J65r3L3J69j36Q4m9m0K16j92J68k27J00k2K4J7j55
5088a23K28j00J8N8k74K25o3j84K60l8Q1j28R3j55Q2j2J77j69m6n6J00M3L7j27
5112g3r7J64J74l4k64Q2J07L8m2O0p0Q1l11L23k91J9O3P8R0l39K25r1J34l05J77
5137a02J16J1L6j14Q0qk41L30L1j0j96N7r8Q4L8q4L5m8K71k75J50p1j54J96Q3
5162A17k00J34j43J21J02kq9q1R0J27k99P1K51j38j64L4P3J78k67r6K44k63K13
5185A3Rj83K95k11o0J88k6n6J82o4o9J34n9q7K61k43m7L4k28M34l06J58o5k4K27
5210B07m11J57M3o9J30l9j3R3j99K52j96m6K17j26n3J05j15J25M9j22p9J08J57
$$ plain form
5233 175 21 -136 -28 29 31 -152 5 22 -100 -63 -173 -11 -28 -75 -50 -27 -11 -19 -80 256 66 20 10 137 139 41
5259 41 7 23 -153 -43 173 -202 57 -90 59 -25 -77 -56 -86 -36 56 38 -192 -3 -26 -90 -75 -13 267 129 -54
5284 -54 31 -4 21 140 71 190 -47 -121 -24 -52 -71 -109 -282 -119 -54 138 68 20 54 107 40 52 57 51 -49 12 -99
5311 -99 46 72 -48 54 -94 -69 -158 66 -62 -266 -154 64 1 86 -72 -130 117 10 152 34 41 241 51
5334 51 41 12 126 128 21 136 -42 -24 -107 7 -73 12 -78 -178 -75 -38 -1 -25 -186 -43 9 -14 179 283 39
5359 39 81 -116 -24 -77 -8 183 32 109 43 -62 103 -2 24 -63 12 -84 -105 -60 -183 -47 7 -64 -7 69 -146 189
5385 189 -17 156 105 105 -6 223 -4 -46 170 -30 57 -15 33 -22 -140 43 -113 -40 37 -182 -56 1 70 -15
5409 -15 28 -79 -94 78 106 -84 17 -24 -51 41 -10 -84 -29 15 179 145 -180 -109 -42 163 94 -143 60 -155 -117
$$ packed form
5233A75j54j57J08N7Kj83J57J7j22L7j10J62j7m7K5K3J6qo1L36j90m6j0J27Kr8
5259D1l4J6j76J10K16l75K59j47J49q4n2K1l0N0R2j8k30J89k3o4J5O2K80j38j83
5284e4Q5l5K5J19o9J19k37p4R7k8j9l8j73J63O5J92p0m8L4N3o7J2Noj00O1j11
5311i9J45K6j20J02j48K5q9K24j28k04J12K18o3Q5j58n8K47j07J42j18PK00j90
5334E1j0k9J14Kj07J15j78J8q3J14q0Q5r0j00J03L7L7k4j61J43N2k3J93J04k44
5359C9M2j97R2n3O9J91j51P7o6j05J65j05K6q7P5r6k1M5j23J36N4p1N7P6k15L35
5385A89k06J73n1%j11K29k27m2K16k00Q7p2M8n5j18J83j56P3P7k19J26N7O9q5
5409a5M3j07j5J72K8j90J01m1k7R2n1p4N5M4J64l4l25P1O7K05o9k37K03k15L8
$$ plain form
5434 -117 9 58 211 34 -17 -78 -81 -119 104 -25 -31 -15 -158 190 -48 -179 -57 -107 -216 138 -173 -60 50
5457 50 -115 93 -116 63 89 -128 22 136 140 -102 -79 69 114 -100 58 46 -110 148 35 57 91 -35 16
5480 16 -3 -66 -5 -197 36 190 103 20 100 140 -92 67 -152 188 116 68 -39 32 3 17 52 174 -11 -55 183
5505 183 -219 -20 112 72 -121 134 -155 -120 -148 52 -26 76 7 154 79 94 -30 -70 135 -292 -39 46 15
5528 15 -32 -5 -50 -155 21 -22 158 30 95 5 70 -105 -48 -69 -165 -152 -48 -138 -67 119 34 142 21 -71 -106 284
5554 284 -118 -48 93 130 -36 -103 105 49 15 -123 41 -119 -114 8 -59 -290 -104 -97 -247 -2 70 -221 -22 -129
5578 -129 -224 3 68 155 -19 75 28 215 -21 39 59 43 -20 67 -95 113 -38 -54 54 -70 -96 -46 84 -34
5602 -34 -72 20 26 -197 48 -117 94 -37 -49 232 144 202 185 -2 -38 -119 -107 92 21 -138 -32 -93 -28 84 -168
$$ packed form
5434a17J26M9J53j77n1o1ll8K23j29oJ6j43L48k38j31J22n0j09L54l11J13J10
5457E0j65K08k09J79K6k17J50J14Mk42K3J48M5k14J58j2j56K58j13K2L4j26N1
5480A6j9o3O1j92K33J54q7q3Q0M0k32J59k19L40p2m8j07P1k9J4L5J22j85m4K38
5505A83m02J99J32m0j93K55k89L5k8K00p8J02o9J47p5J5j24m0K05m27K53Q5l1
5528A5m7K7m5j05J76m3J80j28O5r0O5j75N7k1r6J3J04r0P1J86q5J08j21r2l5L90
5554B84m02P0J41L7j66o7K08n6l4j38J64j60NJ22o7k31J86Pj50K45P2k91J99j07
5578a29r5K27O5Q7j74R4m7J87k36O0K0j6o3Q7j62K08j51j6J08j24k6N0J30j18
5602c4l8R2Ok23K45j65K11j31j2K81q8N8j7j87l6q1J2J99p1j59J06o1O5J12k52
$$ plain form
5627 -168 -86 -102 -90 -112 -30 22 58 -140 -39 126 45 -123 -46 -174 -31 40 61 211 -62 -6 110 134 159 -90 -211
5652 -211 47 -53 99 0 -17 -105 -218 -119 -3 83 -10 156 24 -5 -118 28 -317 -81 213 28 -83 -104 -154
5675 -154 55 8 -251 57 -124 16 -160 -65 -88 -81 36 -143 17 58 67 -58 -148 -42 -34 62 -76 -155 90 -16
5699 -16 41 117 -122 13 76 89 -37 -33 19 -45 -162 -135 -41 -103 92 -12 -68 -36 -37 196 248 29 162 -66 22 -19
5725 -19 18 22 175 -92 98 -149 -85 54 -156 -160 196 -157 178 128 -99 -128 -169 -22 40 -185 -106 66 35 214
5749 214 14 -1 144 81 -68 113 -137 56 -6 -113 -130 -69 -91 -40 -37 58 57 -223 162 -76 -89 79 -42 116
5773 116 32 -10 -57 12 6 40 18 37 -34 192 -44 -161 21 124 -138 29 19 -10 -199 -72 -178 -41 -72 -5 54
5798 54 -76 -67 109 10 -38 -164 -223 44 -129 207 85 194 -102 -233 -94 82 -202 -51 -29 -150 -121 -18 -75
$$ packed form
5627a68Q2j6J2k2Q2N2L6j98J01J65q1j68P7j28J43P1K1J50k73N6J16K4K5k49j21
5652b11K58j00J52r9j7q8j13R9J16Q6r3J66j32k9j13J46l45K36K94j85j11k1n0
5675a54K09m7k59L08j81J40j76R5k3PJ17j79J60M1Rj25r0J06QR6j38p9K45j06
5699a6N7P6k39J35O3J3j26MN2o4j17K7R4o2J95j04n6L2jK33N2k19J33k28Q8m1
5725a9L7MJ53k67J90k47O4J39k10mL56l53L35n0k27k9m1J47O2k25P9J72l1J79
5749B14k00j5J45o3j49J81k50J93o2j07j7O1k2N1LR5jk80L85k38j3J68j21J58
5773A16q4m2m7O9oL4k2J9p1K26k36j17J82J03k62J67j0k9j89J27j06J37l1O7N9
5798E4j30RJ76r9m8j26n9K67j73L36j22J09k96j31J39J76k84J51K2j21K9J03n7
$$ plain form
5821 -75 50 30 57 7 -30 240 27 39 -51 15 -75 241 134 175 -73 -39 171 -55 -38 198 22 101 -30 -9 -41
5846 -41 -85 -32 170 -141 240 -46 67 215 -144 144 -37 -207 204 30 123 7 -83 9 192 -14 2 -246
5868 -246 -23 -17 -215 -128 -109 2 115 149 -180 -156 -274 44 357 -117 -87 13 45 -22 30 7 -91 73 73 -52 79
5893 79 72 53 -44 -88 2 75 38 -10 165 59 -31 83 -144 -109 -136 -85 101 -97 -72 94 26 82 56 -45 -95 -77 66
5920 66 -175 29 132 26 -69 -6 69 30 142 -99 -117 -36 -224 42 -89 18 3 -153 22 56 -20 -191 108
5943 108 -26 22 160 124 -118 54 102 165 46 -219 -40 124 -105 10 17 -97 -57 -124 149 97 -61 2 63 -67
5967 -67 -154 -58 -30 -39 -85 -23 147 -60 -285 67 -196 -70 -176 181 38 55 -108 -68 -158 -27 -10 -208 -7 -58
5991 -58 -93 -69 7 16 -45 107 -47 1 -57 -100 207 -117 42 78 152 65 15 38 83 -69 179 -83 5 27 70 96 89
$$ packed form
5821g5J25k0K7n0l7K70k13J2r0O6r0L16j07M1k48L4K10k26J7K36j76P9j31K1l2
5846d1m4N3K02l11L81k86J13J48l59K88j81j70M11j74R3j16r0R2J83k06J6k48
5868b46K23Oj98Q7J9J11J13L4l29K4j18L18L13m74L0J00L2o7N2k3r8J64%j25J31
5893G9pj9r7m4R0P3l7m8J75j06r0J14k27L5k7N1J86j98K5J66o8N6k6j01n0J8J43
5920F6k41K04J03j06r5O3P5l9J12k41j8Q1j88K66j31J07j5j56J75L4p6j71K99
5943A08j34M8J38l6k42J72M8O3j19k65J79J64k29J15Pj14M0o7K73n2j58O3O1j30
5967f7q7R6K8rm6O2J70k07k25L52k63J26j06L57j43J7j63M0r0J31J7j98K01n1
5991e8l5K4P6Ro1J52j54M8n8m3L07l24J59L6P4q7n0K3M5j52K48k62Q8K2M3K6p
$$ plain form
6018 89 -8 -155 -111 129 94 192 -118 -112 -112 -97 83 -113 158 98 26 136 30 29 108 -45 272 -105 -139 -19 41 156
6044 156 48 55 266 -119 -106 -129 67 102 28 80 52 -53 -91 86 -39 -98 -70 -201 -16 -142 -93 -134 27 129
6068 129 -49 31 -76 -17 7 -24 10 56 131 -128 -4 116 32 -91 -164 -95 162 -144 -20 145 143 6 -62 -100 201
6093 201 70 -13 -80 184 -10 -101 -197 134 -84 59 -83 -31 -143 -64 -137 6 -46 183 159 18 -87 45 88
6116 88 10 69 -106 60 -65 -247 125 -60 -70 23 11 111 -3 235 81 31 -35 28 123 36 -39 -183 -163 66
6140 66 42 -170 237 91 -137 -84 74 -171 191 113 124 -152 100 -143 -84 -45 -119 -151 -19 -22 -170 195 -202 -30
6164 -30 -7 -50 159 104 39 1 -85 98 54 -33 -73 167 107 8 48 111 -26 57 -109 125 -118 170 -6 118 -325
6189 -325 117 124 94 -11 -175 7 -173 -42 -7 17 155 -54 53 119 168 -35 58 -72 -77 -87 127 -28 -88 -148
$$ packed form
6018H9r7j47M4K40l5R8l10O%J5J80j96K71o0p2J10j06jP9j53L17l77l4J20O0J15
6044A56j08PK11l85J3k3J96L5p4N2k8j05l8J77j25n9K8j31J85j26M9m1J61J02
6068A29j78Q0j07N9K4l1L4M6P5k59J24J20q4j23p3O9K57l06J24J65kj37o8l8L01
6093B01j31q3o7K64j94r1r6L31k18J43j42N2j12P9p3J43n2K29k4j41j05J32M3
6116H8p8N9j75J66j25j82L72j85j0R3j2J00j14K38j54n0o6O3R5q7p5j44K0K29
6140F6k4k12M07j46k28N3J58k45L62p8J1k76K52k43N9L9p4l2J32lj48L65l97J72
6164c0K3m3K09n5o5l8q6J83m4q7m0K40o0r9M0O3j37Q3j66K34k43K88j76J24m43
6189c25M42Pl0j05j64J82j80J31L5K4J38k09J07O6M9k03R3j30nj0K14j55o0o0
$$ plain form
6213 -148 -138 29 -1 136 77 160 91 -43 -43 -15 39 -41 -163 198 106 -115 -44 -14 63 -87 213 63 -184 -195 -97
6238 -97 -107 126 93 14 -128 99 180 86 -11 22 115 -8 2 -148 87 -113 -29 -145 65 119 71 2 -72 73 -21
6263 -21 -30 21 115 21 -63 -80 -6 -5 14 -97 -63 18 -50 -31 17 -169 -22 -162 85 -42 110 -180 -18 128 -96 -292
6289 -292 -134 114 -31 49 68 2 -66 -50 87 186 189 10 -16 110 216 -55 -34 10 -37 -111 -39 41 14 -36 47 -74
6315 -74 38 8 28 -98 55 112 -18 -197 -187 -15 -8 -7 -22 -72 173 172 -91 -84 -35 -15 -60 17 -112 -128 -79 -96 -58 60
6343 60 -92 92 135 -128 40 132 101 -71 93 106 -63 -30 307 45 -134 -157 -134 121 -86 -61 124 -70 172
6366 172 -161 83 27 -69 22 -99 -34 -297 -62 -142 -72 20 -136 38 -34 107 -22 -66 -35 190 4 69 28 54
6390 54 27 -21 -105 83 -41 -9 58 -28 -87 -104 28 -6 -1 100 -58 -193 35 12 33 50 -143 80 42 27 128 -5
$$ packed form
6213a48J0J67l0J37n9Q3o9j34%K8N4q0j22L61r2k21P1L0P7j50L00j50k47j1R8
6238i7j0K33l3p9j42K27Q1r4r7L3R3j23J0j50K35k00Q4j16K10N4m8o9p4J45r4
6263b1rN1R4r4q4j7P4JJ9j11L4Q1o8J9M8j86J47j40K47j27J52k90J62J46k24j96
6289b92J58K48j45Q0J9o6o8J6J37R9Lj79k6J26J06k71K1M4m7p4P2Q0k7n0Q3j21
6315g4J12l0K0j26J53N7j30j79J0J72PJj5n0K45jk63PM9K0m5P7j29j6M9j7L8J18
6343F0j52J84M3k63J68R2l1j72J64J3j69L3L37k62j79k3K3K55k07K5J85j94K42
6366A72l33K44n6r6R1j21O5k63K35q0P0R2j56J74p2J41j29m4L1K25j86O5m1K6
6390E4k7m8q4J88j24L2O7q6n9j7J32l4NJ01j58j35K28k3K1J7j93K23l8j5J01j33
$$ plain form
6416 -5 7 67 -117 -67 0 -76 44 -90 71 -73 122 -58 35 60 13 136 94 -55 -89 58 -53 1 -43 -105 -118
6441 -118 101 83 -34 121 -14 131 150 23 151 46 -173 86 -97 -6 43 -93 32 -10 -108 -101 -26 -5 -71 19
6465 19 181 -33 91 130 -7 182 41 131 74 -75 -284 78 -179 41 -3 22 98 23 -45 -197 -58 -5 64 7
6489 7 101 144 42 -96 105 29 -49 128 -90 32 -186 -33 83 -111 -44 -8 -32 -52 -91 38 170 37 -15 -50
6513 -50 140 62 6 189 118 -105 -128 210 222 -78 -75 -9 51 -7 -35 -18 -14 47 -85 35 118 -20 -97 210 -116 28
6539 28 -5 16 -94 -142 13 15 -76 -8 131 29 68 143 5 -37 26 -108 -286 42 158 62 28 -254 -48 61 -69
6564 -69 127 166 27 -74 20 161 -91 -22 -121 -134 -107 158 -74 50 24 9 14 95 -13 120 21 208 75 -94
6588 -94 -88 107 56 134 4 180 2 -75 163 -54 32 -6 187 -44 -103 -137 174 -26 -48 57 -145 123 27 -62
$$ packed form
6416eJ2O0j84N0O7p6J20j34J61j44J95j80R3K5m7J23m2j49l4J47j11N4m4o2j3
6441a18K19j8j17J55j35J45J9j27J28j05k19K59j83R1M9j36J25m2r8PP5K1o6R0
6465A9J62k14J24L9j37J89j41R0n7j49k09L62k57K20m4K5P6p5o8j52J39N3O9n7
6489GR4M3j02j38K01p6p8J77k18J22k18J53J16j94O7L6k4k0l9J29J32j33n2l5
6513e0J90p8n6J83p1k23k3L38J2l00LO6O0n8k8J7MO1j32J20Q3j38p7L07l26J44
6539B8l3K1j10m8J55Kr1O8J39j02L9P5j38m2O3j34j78L28J16r6l4k82K06J09j30
6564f9J96L9j39j01R4J41k52O9r9j3K7K65k32J24k6j5NQ1j08J33r9J87j33j69
6588i4OJ95n1P8j30J76j78p7K38k17Q6l8J93k31n9l4L11k00k2J05k02K68r6q9
$$ plain form
6612 -62 -110 -53 -11 11 -47 116 -126 94 -212 -86 27 -18 -6 -18 -171 -85 -57 -107 18 166 160 28 -73 61 160
6637 160 231 77 40 103 110 -134 81 -62 -166 42 -54 23 20 128 -97 -35 99 -111 -81 -63 18 14 -89 -24 56 -57
6663 -57 -10 -53 -158 22 6 150 2 -159 71 87 78 -19 -55 -4 -93 -41 25 55 21 -17 -27 91 110 -123 -101 -124 -76
6690 -76 26 63 -110 201 -76 6 5 -90 -20 -13 -126 78 -38 -195 110 -6 -78 -75 -50 -27 -67 10 127 -43 -78 -68
6716 -68 17 187 -16 10 75 -182 48 45 -29 175 78 116 79 -8 64 -17 -17 70 43 -55 -82 79 15 151 -83 242 52
6743 52 -56 260 -109 -36 -143 7 133 27 -144 7 -103 -80 79 -2 -119 -96 57 129 -42 -21 168 -37
6765 -37 14 49 -354 120 110 -42 22 -35 15 183 -43 31 -13 60 78 -90 64 -141 -143 -57 -12 82 88 87 -123 -98 -212
6792 -212 51 215 118 -157 106 -81 64 13 12 183 -40 75 79 -105 69 -45 -9 3 39 -105 48 -46 193
$$ packed form
6612f2m8N7M2K2n8J63k42K20l06J26J13m5J2j2j53Q6K8n0J25J48oj32j01J34R9
6637A60P1j54l7O3Pk44K15j43j04K08r6P7lJ08k25O2J34k10L0J8Q1mj03O5Q0j13
6663e7M7m3j05J80j6J44j48j61K30J6rr7l6N1q9N2O6L0l4l8j0J18J9k33K2k3M8
6690g6J02L7j73L11k77Q2jr5P0Pj13K04j16j57L05j16p2LK5K3m0P7J17j70l5J0
6716f8Q5J70k03K6O5k57K30lp4K04r7L8l7q7P2q1%Q7k7r8k7J61o4J36k34L25j90
6743E2j08L16l69P3j07J50J26j06j71J51j10K3J59q1j17K3J53P2j71K1J89k05
6765c7N1L5m03M74j0j52O4n7N0J68k26P4m4P3J8j68J54k05kQ6M5R4Ojk10K5j14
6792b12K63J64r7k75K63j87J45n1jJ71k23J15Mj84J74j14L6J2L6j44J53r4K39
$$ plain form
6815 193 109 10 -48 42 -72 204 -140 166 -64 -88 255 -50 -119 154 55 84 16 90 198 115 -10 87 53 -7 158
6840 158 96 -62 -46 5 -16 -5 -54 120 -36 -166 75 162 -102 264 -150 59 109 -159 -162 77 148 -126 -150 -13
6864 -13 -106 -214 75 -24 62 -48 71 73 -170 88 77 181 -71 211 76 89 -97 -31 -251 154 -1 46 164
6887 164 -61 -59 75 -42 8 -48 53 6 -26 -14 103 43 18 -147 -165 -132 -32 -228 70 153 120 -23 -73 43 119
6912 119 -62 -208 -154 32 -49 59 -104 57 296 61 82 -78 113 42 26 -126 -44 -23 -113 68 47 -75 -61
6935 -61 -151 -98 -20 150 -63 44 -121 188 56 36 -18 -122 18 -109 -73 -26 0 -121 -158 84 -26 160 -1
6958 -1 -52 22 53 1 -111 -50 48 -97 -245 -36 -45 -30 100 -107 -65 207 9 -107 64 -8 -146 57 77 -29 -56
6983 -56 53 -24 154 -70 -2 -156 73 62 -22 -93 23 15 91 81 82 176 -5 63 -104 -58 -28 67 72 -108 34 51 86
$$ packed form
6815A93q4r9n8R0j14K76l44L06k30k4L43l05o9K73r9K9o8P4J08q3j25R7l4o0J65
6840A58o2j58J6N1k1J1m9J74j56j30K41Q7k64L66m14K09N0k68lK39P1k74k4J37
6864a3r3j08K89r9Q6j10J19Kk43K58j1J04k52K82j35J3j86O6k20M05j55M7J18
6887A64k25KJ34j17N0n6J01m7l2J2J17o0k5j65j8L3J00j96K98Q3l3j43n0J16P6
6912A19j81j46N4J86q1J08j63J61K39k35K1j60J91p1j6j52Q2K1r0J81k1j22J4
6935f1r0N3P8J70k13J07j65L09j32k0n4j04J40j27L6M7K6j21l7K42j10J86j61
6958an1P4L1n2j12O1R8j45j48K09rJ5J30k07M2K72j98j16J71p2j38K03K0j06k7
6983e6J09p7J78k24O8j54K29j1q4p1J16qP6j0JR4j81O8j67M6L0R5Nj80J42J7L5
$$ plain form
7010 86 -34 179 -102 -43 -136 45 63 -7 112 112 -22 6 -81 2 17 -157 169 -222 98 145 23 170 59 -151
7034 -151 59 6 -105 2 -177 51 -35 127 -39 -14 -19 -67 -10 -62 79 134 -87 -157 55 -117 78 51 43 -48 28
7059 28 -115 5 12 -132 -17 96 -103 220 94 1 46 53 -94 135 50 -54 153 -16 97 -112 52 -84 -34
7082 -34 88 -11 81 165 86 -36 -88 106 95 243 -117 -42 15 -71 126 77 23 -73 -145 -127 3 -95 -42 -129 26 -109
7108 -109 125 22 -36 83 -114 -121 -193 -7 -61 10 4 89 80 36 -7 117 58 147 -160 -185 235 117 -95 56 -90
7133 -90 16 153 -93 -155 -113 -54 91 87 -59 -117 -81 -17 -236 130 -114 115 -235 -29 -258 -23 18 -34 -63 -8
7157 -8 291 1 -106 175 151 -101 -85 -52 -32 68 -213 -1 84 108 0 -124 -44 -41 80 118 64 -240 165 89 -9
7182 -9 -12 -37 42 -17 -76 139 22 138 -125 -125 -58 -117 62 147 -152 -101 -45 54 155 -171 -63 -80 24 30 -12 -14 28 23
$$ packed form
7010H6j20K13k81N9r3J81J8p0J19%j34K8q7Q3J5j74L26l91L20M7j22J47j11k10
7034a51K10n3j11J07j79K28q6J62j66K5nm8N7n2J41N5k21p0K12j72J95k7qr1P6
7059B8j43J20Pj44J15J13j99L23j26r3M5Pj47K29q5j04K07j69J13k09J64j36N0
7082c4J22r9R2Q4p9j22n2J94j1J48l60P5N7q6J97m9n4r6p2J8J30r8N3q7J55j35
7108a09K34j03n8J19j97pp2J86n4P1oQ5rm4m3J24n9Q9l07k5M20j18k12J51j46
7133i0J06J37k46o2M2N9J45mj46n8L6O4k19L66k44K29l50K06k29K35M1n2k9N5
7157hK99k90j07K81k4k52J6L3K0J00k81K12Q5K4j08j24Q0LJ21L8n4l04M05p6r8
7182ilk5P9n9n9K15j17J16k63%O7n9J79Q5k99N1N6R9J01l26J08j7J04Om2kM2n
$$ plain form
7210 23 34 -49 56 -120 -144 4 14 -110 -175 87 67 -1 -82 113 11 -47 -27 3 64 -223 8 50 -252 24 8
7235 8 -26 -110 86 87 67 126 9 208 28 -69 87 163 -6 -200 192 167 -72 115 4 112 -49 16 -25 48 68
7260 68 19 111 84 -164 -66 165 -133 -24 108 179 80 122 -108 -43 -4 10 87 25 -10 -232 -238 17 -149 -248 181 -13
7286 -13 154 34 -8 23 18 29 144 -136 42 -33 -72 -18 -35 -10 -132 43 82 17 142 -54 16 -156 87 138 -33
7311 -33 165 70 -66 74 110 -58 -17 99 -153 27 30 98 196 -166 12 -112 33 -21 145 43 41 151 3 -70
7335 -70 30 -144 -109 16 -96 55 -109 197 -19 -38 -55 21 44 82 59 52 89 -66 28 -28 -54 -9 14 149 186 -180
7361 -180 -73 -61 -4 -49 39 149 52 -104 -100 97 -87 -16 -4 -4 16 33 -108 38 -189 -83 -27 -207 133 -51 32
7386 32 -128 192 2 -158 81 -47 43 67 178 -75 -319 188 36 -93 65 -7 -154 29 3 178 -29 -81
$$ packed form
7210B3J1q3J05j76k4J48J0j24o5K62k0o8q1J95j02n8K0L0O1k87K31M2l02K76j6
7235Hl4q4J96Jk0N9j17J99j80r7J56P6j69j94L92k5k39J87j11J08j61O5m1P3K0
7260F8m9R2k7k48R8K31k98J09J32P1r9M2k30O5L9J4P7o2l5k22oK55j66r9M29j94
7286a3J67j20m2L1nJ1J15k80J78p5l9N4j7K5j22J75L9o5J25j96P0j72K43N1j71
7311c3J98r5j36J40L6j68M1J16k52J80LO8R8l62J78j24J45n4J66j02kJ10j48p3
7335g0J00j74L5J25j12J51j64L06k16j9j7P6K3L8k3pL7j55R4n6k6M5K3J35L7l66
7361a80J07J2N7m5Q8J10r7j56MJ97j84P1J2%K0J7j41J46k27J06N6j80L40j84Q3
7386C2j60L20j90j60K39j28R0K4J11k53k44N07j52j29J58p2j47J83k6J75k07n2
$$ plain form
7408 -81 90 58 -181 -159 -51 35 204 90 -56 -145 -17 -114 -47 53 117 -245 52 -132 -54 -107 53 19 61 256
7432 256 155 46 -13 -32 84 171 240 17 -25 -21 84 43 113 161 -56 -169 -4 -41 -70 -104 -3 39 75 129 194 7
7458 7 -89 85 75 -169 -76 80 -27 -145 -214 25 183 -72 -21 26 211 127 40 102 -63 141 -68 -32 -106 16
7482 16 128 -62 -20 62 -177 31 54 116 100 -68 -46 19 84 -218 118 62 -46 106 -56 39 144 -58 -162 -157
7506 -157 0 69 56 130 -69 22 -157 83 96 79 124 1 146 -37 -18 44 -254 141 145 -83 152 -239 94 -50
7530 -50 -174 19 -75 26 -87 -83 -110 -139 132 -29 -30 73 140 3 -110 -205 100 79 0 168 -41 70 -11 142
7554 142 -25 339 -90 251 -27 -168 50 -39 -28 -145 124 33 -96 -44 15 -63 95 123 53 -53 58 -389 48
7577 48 -100 70 16 84 -99 29 -207 65 82 -225 5 -17 63 119 8 -169 -62 -329 187 10 60 49 -23
$$ packed form
7408h1J71l2k39K2J08Q6J69j14j46q9J28r7O7J00O4l62K97j84P8n3J60l4M2J95
7432B56j01j09n9j9J16Q7O9k23m2MJ05m1P0M8k17j13J65l7k9l4J01M2L6N4O5j87
7458Gr6J74j0k44R3J56j07j18o9K39J58k55N1M7J85q4q7O2j65K04k09L6p4J22
7482A6J12j90M2Q2k39K08K3O2j6j68K2O5O5l02L36n6j08J52j62R5J05k02j04N
7506a57J57O9j3P4j99R1j79K40J3j7M5j23J45j83J9O2k98L95Mk28K35l91L33j44
7530e0j24J93r4J01j13Mk7k9K71j61jJ03O7j37j13r5L05k1p9J68k09J11q1J53
7554A42j67L64m29L41k78j41K18q9J1j17K69r1j29N2N9p8J58K8p0j06J11m47M37
7577D8j48J70n4O8j83J28k36K72J7l07K30k2Q0N6j11j77J07k67N16j77N0j1p2
$$ plain form
7600 -23 11 73 69 -88 38 -27 -6 -60 10 -34 -24 15 9 68 209 -19 29 16 -130 6 -88 -205 -37 197 -73 -61
7626 -61 -33 148 6 -181 -43 165 -109 20 73 18 -17 49 53 -115 -24 -30 72 -233 -10 71 22 -144 51 100 -17
7651 -17 -142 -240 57 -78 32 -79 -41 -223 -27 -151 28 24 70 80 -18 -122 28 -90 -92 -14 -50 -9 54 -126 -65
7676 -65 -69 -4 -117 70 129 -119 43 -17 -91 -27 17 -67 107 24 -160 -104 229 67 -39 120 2 -147 -207 -142 -166
7701 -166 -38 -6 -22 184 -97 -126 53 157 8 219 173 -3 30 44 -25 129 -15 -109 -140 -99 24 57 -62 -132
7725 -132 -54 -109 -64 105 25 42 -3 42 -46 86 158 64 117 -71 40 -117 -49 25 -87 -118 134 68 -153 156 -167
7750 -167 -22 31 28 -213 -115 54 -31 24 2 38 -74 35 103 -275 -97 -1 150 -39 -87 77 -97 83 97 11
7774 11 -94 214 127 -28 52 75 10 164 -124 -40 -59 120 59 -67 -8 19 87 114 -78 53 -113 -104 -52 -82 39
$$ packed form
7600b3L4O2mj57J26o5K1n4P0m4J0L9oN9J41k28M8j3j46J36r4j17J68K34k70J2
7626f1K8J81j42j87J38K08k74J29N3n5l5O6Mj68R1oJ02l05K23Q1m9j66J95M9j17
7651a7j25r8K97j35J10j11L8j82J96j24J79mM6J0r8j04J50j18kP8l6M1O3j80O1
7676f5mO5j13J87N9k48J62o0p4O4M4q4J74q3j84N6L33j62j06J59j18j49o0O5k4
7701a66J28L2j6K06k81k9J79J04j49K11m6j76L3J4o9J54j44r4l1M1J23L3j19p0
7725a32P8n5M5J69q0J7m5M5q8J32P2r4N3j88J11j57O8P4j12l1K52o6k21L09l23
7750a67J45N3lk41R8J69q5N5k2L6j12J09O8l78J78R6J51j89m8J64j74J80J4q6
7774A1j05L08q7j55Q0K3o5J54k88Q4j9J79o1j26N9K7O8K7j92J31j66RN2l0J21
$$ plain form
7799 39 -180 128 76 -137 82 -46 -105 251 90 -70 -65 -43 -115 -82 -123 24 -78 -81 -37 -26 27 -219 84 68 106
7824 106 187 -44 -8 -17 16 -41 0 -82 -67 -25 -132 178 -73 -53 -65 4 -54 -150 -185 -35 90 -27 3 146 -15 -16
7850 -16 -10 -63 -13 -112 -10 -99 173 -66 225 37 0 180 88 -221 29 15 -33 -3 95 -162 -27 -138 53 94 0
7875 0 -151 13 -153 -73 -321 -2 -86 -1 -21 -158 -87 0 74 -34 -41 184 -127 131 -81 2 -243 148 187 201 142
7900 142 -118 105 -40 11 -86 135 183 177 105 -176 -104 94 -139 -25 126 195 -73 -119 75 -67 149 -42 -82
7923 -82 112 2 -58 112 143 -270 136 -121 123 78 28 -25 -90 115 89 21 268 -92 -86 -35 173 -4 73 117 -18
7948 -18 69 2 69 89 100 -128 -95 -70 -196 184 5 184 -129 -133 156 10 22 59 104 21 62 21 39 23 -9 -154
7974 -154 166 -135 -171 185 -42 106 64 1 53 148 69 -102 -13 30 16 -60 -5 -23 69 -127 63 -22 -30 33 208 41
$$ packed form
7799C9k19L08n2k13K19j28n9L56j61j60NK2p2L3m1J47j02lM4J1N3k46L03j6L8
7824A06Q1k31L6rL3n7M1q2J5M2j07L10k51K0j2O9n8r6l5J50J25j17L0J43j61j
7850a6On3N0r9J02q9K72k39K91j88l7J80r2l09K50j4m8L0R8k57J35j11J91M1r4
7875@j51J64j66Q0k48L19q4Q5k0j37P1Q7P4j08pK25l11K58k12Q3k45L91L9J4n9
7900A42k60K23j45N1r7K21M8op2k81P2J98k33J14J51O9k68m6J94j42K16j91m0
7923h2J94j10o0J70L1m13M06k57K44m5n0n3o5K05k6o8K47l60ON1K08j77P7M4j35
7948a8Q7o7O7K0J1k28L3K5j26L80j79J79l13mK89j46J2L7M5q3M1m1J8j6l2j45
7974a54L20l01l6L56k27J48m2o3N2R5p9j71Q9M3j4p6N5j8R2j96J90q5qO3J75j67
$$ plain form
8000 41 31 86 62 -4 -86 6 158 30 -114 97 -183 -81 82 50 14 -68 -65 144 -87 -81 78 -82 6 76 -158
8025 -158 0 56 24 96 -100 -42 -34 -128 -11 -17 80 161 28 70 -7 5 -56 238 -2 -53 -59 -281 -71 -69 16 194 -20
8052 -20 72 -7 33 -62 5 -14 -116 24 -102 60 -165 47 -27 -79 -11 -118 104 14 6 31 102 86 68 99 31 34 -59
8079 -59 -148 304 -172 -84 -55 101 -90 -89 1 -10 154 -69 -3 -17 71 -121 59 -27 -200 86 44 120 173 47 -11
8104 -11 75 9 88 -59 6 152 -12 30 -206 100 -64 -59 -163 80 -84 -35 1 203 17 81 151 -120 -11 81
8128 81 111 -62 65 -26 6 -95 23 -88 40 42 -69 161 -76 -22 28 -46 71 -135 -19 145 -85 112 137
8151 137 19 -1 -95 -71 130 160 133 78 104 -106 -30 6 0 -44 57 29 -159 115 210 -19 -93 20 102 75 31 38 -45
8178 -45 -92 -9 73 -149 -43 -121 -142 -81 -37 62 -57 -26 87
$$ packed form
8000D1j0N5k4o6q2R2J52j28j44K11k80J02J63l2l6q2LK09k31OJ59j60Q8P0k34
8025a58J58N6l2P2j96N8Qr4J17oR7Q1j33M2p7J2o1K94k40n1ok22K10KQ5J78k14
8052b0R2p9M0r5O7j9j02J40j26J62k25K12p4n2O8j07K22r0qK5P1j6j8L1o8Lr3
8079e9q9M52m76Q8K9J56j91JR0j1J64k23O6j4Q8j92J80q6j73K86m2P6N3j26n8
8104a1Q6o6P9j47O5J46j64M2k36L06j64Nj04K43j64M9L6K02j86O4P0k71J09R2
8128H1L0j73J27r1L2j01J18j11J28Kj11K30k37N4N0p4J17k06J16J64k30J97K5
8151A37j18k0r4K4K01L0k7n5K6k10P6L6om4J01k8j88K74R5k29p4J13Q2k7m4Pq3
8178d5m7Q3Q2k22J06p8k1O1M4R9j19L1J13
8191H7
$$ Imaginary data points
##PAGE= N=2
##DATA TABLE= (X++(I..I)), XYDATA
$$ plain form
0 0 0 0 0 0 0 0 0 0 0 0 0 0 0 0 0 -8 8 -8 8 -8 8 -16 16 -16 24 -24 32 -32 40 -44 49 -56 64 -72 84 -93 105
37 105 -117 132 -148 164 -181 202 -222 246 -272 301 -330 365 -402 443 -488 538 -594 656 -726
56 -726 808 -902 1009 -1137 1292 -1483 1726 -2045 2488 -3140 4210 -6261 11647 -56783 -135758
71 -135758 -48352 36806 151250 191884 150898 79712 8956 -10311 43499 94920 148352 138757
83 138757 65871 2107 -50004 -51733 6665 34172 33364 -15953 -100202 -141673 -143599 -101931 -29884
96 -29884 2371 22894 23785 2543 15005 26701 33337 54031 43172 32124 28298 14239 22027
109 22027 17559 -243 -5219 -26218 -22797 -2553 -13317 -28082 -70968 -126428 -131791 -106757 -43951
122 -43951 29173 52693 47918 10793 -26595 -5619 38074 99297 148159 122185 65064 1266
$$ packed form
0@%%%%%%%%%%%%%%%qJ6j6J6j6J6k4L2l2M0m8N6o4P2q4R3j05J20j36J56j77J98
37A05k22K49k80L12l45L83m24M68n18N73o31O95p67Q45r31J026j132J250j382
56g26J534j710J911k146K429k775L209l771M533n628P350j0471J7908o8430p8975
71a35758Q7406Q5158J14444M0634m0986p1186p0756j9267N3810N1421N3432r595
83A38757p2886o3764n2111j729N8398K7507q08m9317q4249m1471j926M1668P2047
96b9884L2255K0523Q91k1242J2462J1696O636K0694j0859j1048l826j4059P788
109B2027m468j7802m976k0999L421K0244j0764j4765m2886n5460n363K5034O2806
122d3951P3124K3520m775l7125l7388K0976M3693O1223M8862k5974n7121o3798
$$ plain form
134 1266 -41084 -8242 52594 107269 124612 63955 -17765 -88381 -123674 -85846 -36880 -6988
146 -6988 -1884 -51982 -98757 -110116 -90716 -23124 35926 60127 55996 9780 -24272 -28057 -18407
159 -18407 24019 53849 56184 56620 31974 12897 9558 -3057 -183 -3130 -14570 -11193 -22948
172 -22948 -31802 -33453 -50166 -42508 -20649 2556 42833 55423 42436 20226 -17032 -22683 371
185 371 31866 74652 77986 47884 12396 -30572 -33704 -3316 23780 46995 25347 -29878 -77059
198 -77059 -110068 -93359 -42322 -1686 28460 14429 -27150 -49581 -58646 -30582 19198 45353
210 45353 56344 36025 717 -9274 -6713 20308 56069 62363 58542 33930 -1983 -13286 -21655
223 -21655 -17266 -1836 -4424 -3695 -8366 -21677 -18815 -22497 -22076 -8905 -7119 4327 13112 4476
$$ packed form
134A266m2350L2842O0836N4675J7343o0657q1720p0616l5293L7828M8966K9892
146f988N104n0098m6775j1359J9400O7592N9050K4201m131m6216l4052l785R650
159a8407M2426K9830K335M36k4646j9077l339j2615K874k947j1440L377j1755
172b2948q854j651j6713P658K1859K3205M0277J2590j2987k2210l7258n651K3054
185C71L1495M2786L334l0102l5488m2968l132L0388K7096K3215k1648n5225m7181
198g7059l3009J6709N1037M0636L0146j4031m1579k2431r065K8064M9780K6155
210D5353J0991k0319l5308r991K561K7021L5761O294l821k4612l5913j1303q369
223b1655M389J5430k588P29m671j3311K862l682M21J3171J786J1446Q785q636
$$ plain form
237 4476 3120 -8254 -15580 -1092 10620 30971 43622 29178 13882 -11036 -29100 -18061 -7235
250 -7235 9955 18225 -2985 -21657 -41347 -48358 -24766 -3118 16163 22493 -322 -16786 -27412
263 -27412 -25928 3184 23795 36869 40229 18326 5596 541 1655 21911 30050 28666 23142
276 23142 -468 -11623 -14267 -17127 -4446 -2762 -7063 -7020 -19227 -21351 -18207 -21601 -11725 -8600
290 -8600 -8263 1542 -1729 728 4455 -2147 3869 7180 9052 21554 19393 16596 13591 -924 -1297
305 -1297 -420 -505 9466 4231 -3217 -7946 -21168 -17818 -10465 -6540 6043 3162 -3658 -5240 -14523
320 -14523 -8947 90 3431 14754 12731 7631 9586 3272 7791 13739 9960 13173 6206 -3682 -3598
335 -3598 -11926 -10749 -6815 -10553 -4506 -4584 -7915 -2634 -8258 -8439 -5202 -10440 -4042 -1156 -973 8041
$$ packed form
237D476j356j1374p326J4488J1712K0351J2651j4444j5296k4918j8064J1039J0826
250g235J7190Q270k1210j8672j9690p011K3592K1648J9281O330k2815j6464j0626
263b7412J484K9112K0611J3074L360k1903j2730n055J114K0256Q139j384n524
276B3142k3610j1155k644k860J2681J684m301M3j2207k124L144l394R876L125
290h600L37R805l271K457L727o602O016L311J872J2502k161k797l005j4515l73
305a297Q77q5R971n235p448m729j3222L350P353L925J2583k881o820j582r283
320a4523N576R037L341J1323k023n100J955o314M519N948l779L213o967r888Q4
335c598q328J177L934l738O047p8l331N281n624j81L237n238O398K886J83R014
$$ plain form
351 8041 6619 7426 12467 8595 14831 16519 11828 13336 3496 -4481 -4816 -11696 -7063 -2611 -4572 899
367 899 -3812 -9221 -7545 -13906 -10460 -6060 -8993 -3196 -5363 -7023 891 1317 9420 18098 16401 20877
383 20877 15231 6736 5832 -2046 -2052 2378 -1300 3010 1219 -4291 -891 -5594 -5328 -1966 -8295 -6760
399 -6760 -9511 -16107 -11578 -12264 -7082 4367 6206 13318 14891 9125 11030 5231 2090 5000 -802
414 -802 633 952 -4689 -387 -1990 -2472 3483 -895 -1391 -3588 -12873 -11879 -15259 -15680 -6575 -5589 1658
431 1658 9233 8028 13979 13980 11355 14805 9352 7659 7587 785 3512 3151 910 6830 3740 2765 4424
448 4424 -3957 -6248 -11398 -19502 -17640 -20545 -18713 -11164 -11572 -3695 1124 535 7493 6322 5167 8852
464 8852 3525 3713 3963 393 6577 7527 9414 15046 9989 9598 8231 -181 -624 -6037 -12763 -10992
$$ packed form
351H041j422Q07N041l872O236J688m691J508r840p977l35o880M633M452j961N471
367H99m711n409J676o361L446M400k933N797k167j660P914M26Q103Q678j697M476
383B0877n646q495r04p878oM430l678M310j791n510L400m703K66L362o329J535
399f760k751o596M529o86N182J1449J839P112J573n766J905n799l141K910n802
414h02J435L19n641M302j603m82N955m378m96k197r285R94l380m21R105R86P247
431A658P575j205N951Jk625L450n453j693p2o802K727l61k241N920l090r75J659
448D424q381k291n150q104J862k905J832P549m08P877M819n89O958j171j155L685
464H852n327J88K50l570O184R50J887N632n057l91j367q412m43n413o726J771
$$ plain form
480 -10992 -14652 -11845 -5632 -5130 2605 3823 2058 5899 1072 1184 5471 1230 3449 1963 -2468
495 -2468 2694 3912 9070 15252 10224 7682 -328 -11325 -11132 -14685 -13964 -8107 -11950 -11750 -11553 -13532
511 -13532 -4830 774 6012 10670 3129 -596 -3214 -6211 3319 9624 13300 19230 14715 12981 13200
526 13200 9585 12268 9284 3450 847 -9821 -12681 -11149 -13224 -6633 -4100 -6263 -2528 -5023 -5455
541 -5455 -3398 -7954 -6925 -8077 -8928 -115 2894 6915 11849 6337 6667 7121 4911 10127 8036 2324
557 2324 -2547 -13490 -14450 -10667 -6106 6232 7175 1943 -1908 -11769 -11126 -3026 2082 9949 7533
572 7533 -101 -2867 -5453 4189 17084 21458 24906 16153 1251 -4072 -8808 -4957 3334 1899 -112
587 -112 -8598 -17167 -14683 -12550 -4236 2547 -3383 -7017 -12735 -17783 -9877 -3991 1827 8285 5976
$$ packed form
480a0992l660K807O213N02P735J218j765L841m827J12M287m241K219j486m431
495b468N162J218N158O182n028k542q010j0997J93l553P21N857l843K00J97j979
511a3532Q702N604N238M658p541l725k618k997R530O305L676N930m515j734K19
526A3200l615K683k984n834k603j0668k860J532k075O591K533k163L735k495m32
541e455K057m556J029j152q51Q813L009M021M934n512L30M54k210N216k091n712
557B324m871j0943r60L783M561J2338R43n232l851r861O43Q100N108P867k416
572G533p634k766k586R642J2895M374L448q753j4902n323m736L851Q291j435k011
587a12q486q569K484K133Q314O783n930l634n718n048P906N886N818O458k309
$$ plain form
602 5976 7541 8419 8490 14380 12471 9310 8299 817 725 2692 146 2255 -1561 -6558 -5300 -5996 -292
619 -292 2881 -2972 -6323 -14278 -17324 -7441 -177 9335 13988 5953 930 -3218 -1723 10635 16785
634 16785 18890 12913 -4217 -12058 -14442 -9196 6635 11742 7897 -2005 -18498 -22962 -17826 -7891
648 -7891 5781 6012 -819 -8395 -18013 -12055 1306 11857 23039 19545 9107 2094 -4100 1319
662 1319 10405 13149 15566 6967 -2748 -4478 -7594 -3134 1473 -2351 -3314 -8139 -12214 -8650 -9207 -7284
678 -7284 -5781 -8386 -3016 1188 4524 10974 6411 1335 -531 -3301 4990 13225 15303 14278 1835
693 1835 -8744 -11071 -9009 4293 13243 10046 2394 -14305 -24896 -19711 -9288 7405 16088 9148
707 9148 -1495 -15492 -18933 -6168 7560 21953 24323 10290 -2001 -12534 -12440 2064 12412
$$ packed form
602E976J565Q78P1N890j909l161j011p482r2J967k546K109l816m997J258o96N704
619b92L173n853l351p955l046R883P264R512M653q035n023m148J495J2358O150
634A6785K105n977j7130p841k384N246J5831N107l845r902j6493m464N136R935
648g891J3672K31o831p576r618N958J3361J0551J1182l494j0438p013o194N419
662A319R086K744K417q599r715j730l116M460M607l824r63m825m075L564n57J923
678g284J503k605N370M204L336O450m563n076j866k770Q291Q235K078j025j2443
693A835j0579k327K062J3302Q950l197p652j6699j0591N185J0423J6693Q683o940
707I148j0643j3997l441J2765J3728J4393K370j4033j2291j0533R4J4504J0348
$$ plain form
720 12412 18552 14171 -1733 -11469 -16618 -12947 -87 4907 5882 1921 -9191 -11426 -10087 -6415
734 -6415 2436 3650 3883 4622 930 2977 3568 1195 3628 1178 2364 7519 6307 6347 1583 -8068
750 -8068 -9383 -8990 -2042 8320 8353 4589 -5358 -17455 -15831 -8904 3244 15773 13257 4484 -7296
765 -7296 -17020 -10323 2089 14938 23221 13924 -551 -12767 -19664 -8895 5062 14069 16985 4406
779 4406 -8978 -15437 -15908 -3045 8491 11892 10437 -1475 -10610 -10761 -8065 2939 10592 9711 8432
794 8432 360 -4387 -2532 -2868 1381 2759 -359 579 -1802 -2861 -646 -4161 -3777 -2255 -2700 3664
810 3664 4689 2710 911 -6753 -8402 -4401 380 10587 13010 7758 1665 -8485 -10173 -3083 3313
825 3313 11878 10261 99 -7538 -15219 -11613 166 8052 14595 10089 -2230 -8766 -13072 -7402
$$ packed form
720A2412O140m381j5904r736n149L671J2860M994R75l961j1112k235J339L672
734f415Q851J214K33P39l692K047N91k373K433k450J186N155j212M0m764r651
750h068j315L93O948J0362L3l764r947j2097J624O927J2148J2529k516q773j1780
765g296r724O697J2412J2849Q283r297j4475j2216o897J0769J3957R007K916j2579
779D406j3384o459m71J2863J1536L401j455j1912r135j51K696J1004P653q81j279
794H432q072m747J855l36M249J378l118R38k381j059K215l515L84J522m45O364
810C664J025j979j799p664j649M001M781J0207K423n252o093j0150j688P090O396
825C313Q565j617j0162p637p681L606J1779P886O543m506j2319o536m306N670
$$ plain form
839 -7402 4390 9411 11489 5149 -5559 -7751 -7239 -1003 7921 7748 5364 -1257 -9999 -9028 -7048
854 -7048 -2769 3739 2171 1405 -278 -3687 -3 1286 2055 4895 1495 1261 2754 1115 3514 2376
870 2376 -309 1271 -460 1605 4279 887 -690 -5504 -10434 -7272 -5189 -499 4324 805 -940
885 -940 -4019 -6134 69 4023 7781 9796 3124 -481 -2944 -3525 3929 7536 8366 7267 -901 -4901
901 -4901 -6488 -6736 -1187 -198 -2138 -3377 -8981 -9326 -5404 -2964 3488 4754 2421 2469 -1008 388
917 388 4137 4441 7995 6325 3005 3983 1810 2494 4172 1029 583 -2629 -6559 -5188 -6682 -6138 -4150
934 -4150 -6796 -5044 -4273 -4230 728 1098 1679 3332 890 2341 4382 4111 8013 6869 5185 5580 2113
951 2113 2887 3442 581 1002 -2559 -6243 -5715 -8277 -6441 -4326 -5414 -3436 -4450 -4946 -1311 -1216 1500
$$ packed form
839g402J1792N021K078o340j0708k192N12O236Q924j73k384o621q742R71J980
854g048M279O508j568p66j683l409L684J289P69K840l400k34J493j639K399j138
870B376k685J580j731K065K674l392j577m814m930L162K083M690M823l519j745
885i40l079k115O203L954L758K015o672l605k463n81P454L607Q30j099q168m000
901d901j587k48N549R89j940j239n604l45L922K440O452J266k333M8l477J396
917C88L749L04L554j670l320R78k173O84J678l143m46l212l930J371j494N44J988
934d150k646J752P71M3M958L70N81J653k442J451K041k71L902j144j684L95l467
951B113P74N55k861M21l561l684N28k562J836K115j088J978j014m96L635R5K716
$$ plain form
968 1500 4061 1758 3197 3086 2267 6427 5730 6472 6653 2852 2476 665 -1815 183 -2146 -3539 -3134
985 -3134 -7286 -6557 -5280 -5499 -1517 -1760 -1442 196 -1970 640 2502 2342 6093 5360 4419 6128 3373
1002 3373 3647 4493 2162 3480 835 -2300 -2276 -5988 -5902 -4734 -6623 -4248 -4612 -5909 -3181 -4160 -2869
1019 -2869 -107 -141 2849 3457 2628 4920 3522 4732 6989 4799 6173 5095 1860 2439 -97 -1189
1035 -1189 -926 -3465 -2850 -3485 -5625 -3753 -4981 -4637 -1659 -3058 -1213 474 -1066 1951 2266 2425
1051 2425 4573 3204 4319 4820 2579 4299 1861 -282 870 -1827 -2341 -1937 -4833 -4145 -5107 -6220
1067 -6220 -3912 -4958 -3432 -1323 -2989 -274 192 -350 3331 3611 4949 6896 4892 5448 5255 3983
1083 3983 6148 4246 3352 3281 -1179 -1148 -1645 -4047 -2030 -3243 -4765 -4028 -6273 -5690 -4395 -4155 -850
$$ packed form
968A500K561k303J439j11q19M160o97P42J81l801l76j811k480J998k329j393M05
985c134m152P29J277k19L982k43L18J638k166K610J862j60L751p33r41J709k755
1002C373K74Q46k331J318k645l135K4l712Q6J168j889K375l64j297K728r79J291
1019b869K762l4K990O08q29K292j398J210K257k190J374j078l235N79k536j092
1035a189K63k539O15o35k140J872j228L44K978j399J845J687j540L017L15J59
1051B425K148j369J115N01k241J720k438k143J152k697n14M04k896O88r62j113
1067f220K308j046J526K109j666K715M66n42L681K80J338J947k004N56j93j272
1083C983K165j902q94p1m460L1m97k402K017j213j522P37k245N83J295K40L305
$$ plain form
1100 -850 -1422 -1748 76 -1513 433 3070 2284 4201 3589 1865 2877 891 1411 2139 338 1566 -274
1117 -274 -2534 -1133 -3001 -2647 -843 -2435 -953 -1102 -2171 -139 -386 926 3024 1476 3221 3631
1133 3631 2078 4186 3141 2401 3804 1733 1834 1248 -952 -126 -2102 -3163 -2014 -4429 -3888 -3446
1149 -3446 -5474 -3591 -3975 -4711 -2562 -2914 -1322 392 -646 1293 1053 1014 3710 2509 3312 4892 2547
1166 2547 3357 2769 1423 2735 1526 1604 2037 -725 -142 -1109 -2309 114 -952 -941 2 -2284 -1385 -650
1184 -650 -1262 1632 883 841 1493 -813 36 705 -412 1724 735 -974 -686 -3218 -2725 -1408 -2007 -503
1202 -503 -1959 -3594 -2850 -4334 -2490 -71 -937 1362 816 -537 1391 1245 3293 5392 4298 5045
1218 5045 3575 1522 3177 2385 3249 4370 1684 1083 -315 -2349 -871 -1954 -1975 -1464 -3784 -3808 -3767
$$ packed form
1100h50n72l26J824j589J946K637p86J917o12j724J012j986N20P28j801J228j840
1117b74k260J401j868L54J804j592J482j49j069K032k47J312K098j548J745M10
1133C631j553K108j045p40J403k071J01n86k200Q26j976j061J149k415N41M42
1149c446k028J883l84p36K149l52J592J714j038J939k40l9K696j201Q03J580k345
1166B547Q10n88j346J312j209P8M33k762N83r67j200K423j066J1R43k286Q99P35
1184f50o12K894p49m2O52k306Q49O69j117K136r89j709K88k532M93J317n99J504
1202e03j456j635P44j484J844K419q66K299n46j353J928j46K048K099j094P47
1218E045j470k053J655p92Q64J121k686o01j398k034J478j083k1N11k320k4M1
$$ plain form
1235 -3767 -4819 -2194 -2437 -2099 -408 -1934 -552 627 -197 1421 823 82 1619 605 2221 3085
1251 3085 1064 1273 -524 -2044 273 19 415 682 -2381 -2286 -3205 -2699 1083 1936 3129 3064 -594 -569
1269 -569 -124 897 5099 5064 4164 2900 -1075 -957 432 1228 4187 2556 -216 -2350 -6551 -5869 -4038
1286 -4038 -3384 -670 -2198 -4034 -4355 -5693 -3397 -243 215 2286 735 -778 526 79 2280 4237
1302 4237 3446 4771 3796 2371 3792 2042 1931 1928 -803 -166 -545 -1023 683 -1101 -1685 -1899 -3379 -964
1320 -964 609 792 1717 -1259 -3364 -2631 -2619 1543 3804 3104 2989 -860 -2876 -1660 -907 2139 3470
1337 3470 261 -1383 -5233 -5873 -2672 -620 2637 3345 -175 -2065 -3922 -3860 268 1944 3622 3469
1353 3469 -36 -278 -712 921 4649 4848 4613 2961 -803 -808 -1062 -874 1519 198 -459 -591 -2411 -1334
$$ packed form
1235c767j052K625k43L38J691j526J382J179q24J618n98p41J537j014J616Q64
1251C085k021K09j797j520K317k54L96K67l063R5r19N06L782Q53J193o5l658K5
1269e69M45J021M202l5r00j264l975J18J389P96K959j631k772k134m201O82J831
1286d038O54K714j528j836l21j338K296L154M58K071j551j513J304m47K201J957
1302D237p91J325r75j425J421j750j11lk731O37l79m78J706j784n84k14j480K415
1320i64J573J83R25k976k105P33J2M162K261p00j15l849k016J216P53L046J331
1337C470l209j644l850o40L201K052L257P08l520j890j857O2M128J676J678j53
1353C469l505k42m34J633L728J99k35j652l764nk54J88K393j321o57j32j820J077
$$ plain form
1371 -1334 -588 -1207 -445 -2123 -2576 -1315 -1909 -339 14 -1760 -471 -776 417 3168 2596 2613 799
1388 799 -2519 -1788 -1482 327 3348 2227 1038 -869 -3572 -1670 319 2377 4193 985 -1760 -3338
1404 -3338 -4710 -1282 2151 3634 4796 1172 -1509 -1784 -2037 1537 3378 2679 2010 -1835 -3717 -2507
1420 -2507 -1810 1626 2941 1097 291 -2638 -3622 -1910 -1637 342 436 -1317 -632 -1757 -1100 1208 1138
1437 1138 1821 1749 -170 1109 840 623 1451 -343 -45 805 210 2425 2392 815 332 -2495 -2509 -1042
1455 -1042 -897 1023 316 -2089 -2514 -3918 -2030 1298 2267 3455 1629 -1789 -2132 -2679 -312 3305
1471 3305 3345 3408 1402 -1942 -1083 -873 1165 3881 1893 511 -1820 -4700 -3225 -2127 -149 2274
1487 2274 449 -416 -1608 -3119 -754 58 868 2247 505 4 253 -307 1493 1862 1577 2425 1055
$$ packed form
1371a334P46o19P62j678m53J261n94J570L53j774J289l05J193K751n72J7j814
1388G99l318P31L06J809L021j121j189j907k703J902J989K058J816l208k745j578
1404c338j372L428L433J483J162l624k681k75k53L574J841o99o69l845j882J210
1420b507O97L436J315j844q06k929r84J712K73J979R4j753O85j125O57K308p0
1437A138O83p2j919J279k69k17Q28j794K98Q50n95K215l3j577m83k827j4J467
1455a042J45J920p07k405m25j404J888L328R69J188j826l418l43n47K367L617
1471C305M0O3k006l344Q59K10K038K716j988j382k331k880J475J098J978K423
1487B274j825q65j192j511K365Q12Q10J379j742n01K49n60J800L69k85Q48j370
$$ plain form
1504 1055 1004 789 -996 -632 -1272 -2391 -785 -1121 -373 306 -1515 -1511 -1973 -2131 95 867 1472 1824 -701
1523 -701 -1015 -521 74 3206 3970 3682 2840 -340 -1159 -1151 -769 1955 1522 390 -560 -3488 -3789 -2388 -1597
1542 -1597 928 705 -917 -1340 -3052 -2252 -585 -224 2082 1987 925 1455 256 442 1829 1122 2237
1559 2237 1831 290 690 -702 -862 -73 -1426 -451 -38 -774 277 -776 -1463 -832 -1764 -256 974
1576 974 1025 1878 858 -254 288 -527 969 2162 1362 1848 29 -1640 -1425 -2091 -884 68 -499 -391
1594 -391 -1925 -2737 -1888 -2071 -551 931 281 994 520 -222 783 440 1230 2532 1910 2715 1822 447
1612 447 1157 240 80 1038 -12 73 -416 -1718 -1480 -2230 -2046 -720 -875 318 408 -1095 -414 -927 -641
1631 -641 868 960 1692 1600 552 664 -178 -391 1122 302 819 539 -1386 -1433 -2398 -2909 -1284 -1124 -252
$$ packed form
1504A055n1k15j785L64o40j119J606l36P48O79j821Mm62j58K226P72O05L52k525
1523g01l14M94N95L132P64k88q42l180q19QL82K724m33j132r50k928l01J401P91
1542a597K525k23j622m23j712Q00J667L61K306r5j062N30j199J86J387p07J115
1559B237m06j541M00j392j60P89j353R75M13p36J051j053o87O31r32J508J230
1576I74N1Q53j020j112N42q15J496J193q00M86j819j669K15o66J207R52n67J08
1594c91j534q12Q49j83J520J482o50P13m74p42J005l43P90J302o22Q05q93j375
1612D47P10r17j60R58j050Q5m89j302K38p50J84J326j55J193R0j503O81n13K86
1631f41J509R2P32r2j048J12q42k13J513q20N17k80j925m7r65n11J625J60Q72
$$ plain form
1650 -252 -18 -696 -47 -535 -1021 946 815 1831 3031 1683 1831 1236 636 1966 2042 2457 3025 1205
1668 1205 343 -1047 -2690 -1962 -2078 -1199 -107 -1630 -2161 -2615 -3229 -1674 -683 175 1158 -132 -510 -739
1686 -739 -1346 699 1478 2165 3413 2379 1333 801 -550 84 225 -60 938 -708 -1020 -989 -2064 -784
1704 -784 -590 -240 1002 641 227 129 -1371 -648 -77 598 2528 2377 1939 2205 16 -166 79 -184 1199
1723 1199 377 -439 -1513 -3535 -3203 -2235 -1553 531 466 -620 -840 -2537 -2231 -790 -92 1780 1922 1098
1741 1098 1283 2 780 2158 2023 3151 2158 538 25 -1452 -1430 -386 -697 544 443 -449 -114 -934
1759 -934 -1033 -518 -925 -148 232 -241 673 -251 -118 280 241 1147 1885 1334 1245 -327 -1558 -1584 -2299 -1032
1779 -1032 136 -119 242 -1040 -1686 -1208 -1122 164 1202 602 506 -446 -1259 8 579 1934 3270 2543
$$ packed form
1650b52K34o78O49m88m86J967j31J016J200j348J48n95o00J330P6M15N68j820
1668A205q62j390j643P28j16Q79J092j523n31m54o14J555R91Q58R83j290l78k29
1686g39o07K045P79O87J248j034j046n32j351O34J41k85R98j646l12L1j075J280
1704g84J94L50J242l61m14r8j500P23N71O75J930j51m38K66k189j82K45k63J383
1723A199q22q16j074k022L32R68O82K084o5j086k20j697L06J441O98J872J42q24
1741A098J85j281P78J378j35J128r93j620n13j477K2J044l11J241j01q92L35q20
1759i34r9N15m07P77L80m73R14r24J33L98l9R06P38n51q9j572j231k6p15J267
1779a032J168k55L61j282o46M78Q6J286J038o00r6r52q13J267N71J355J336p27
$$ plain form
1797 2543 2366 1162 -199 144 -197 191 536 -665 -500 -924 -1726 -538 -818 -584 329 -784 -695 -969
1815 -969 -1635 -736 -1163 -670 443 293 1415 1707 962 1174 253 -255 261 -217 247 424 -602 -461 -1207
1834 -1207 -1056 216 341 709 1011 -729 -908 -1427 -1709 -77 124 1201 1683 394 747 364 177 1247
1852 1247 1084 1131 790 -700 -767 -904 -1068 304 269 284 618 -659 -644 -731 -1548 -577 -752 -516 -15 -332 23
1873 23 193 -226 433 323 388 1189 487 495 44 -1034 -510 -418 147 1491 1223 1122 425 -896 -776 -608 -193
1894 -193 939 246 88 -430 -1760 -958 -115 293 1762 1035 138 -399 -1899 -1324 -721 -187 1239 843
1912 843 37 46 -1017 -347 340 292 1313 646 -149 -252 -1130 -709 301 219 1133 795 166 429 -709 -528
1932 -528 -410 -886 189 395 80 452 -558 -419 -57 -452 842 1231 622 727 -411 -1101 -793 -723 519
$$ packed form
1797B543j77j204j361L43l41L88L45j201J65m24q02J188k80K34R13j113Q9k74
1815i69o66Q99m27M93J113j50J122K92p45K12r21n08N16m78M64J77j026J41p46
1834a207J51J272J25L68L02j740j79n19k82J632K01J077M82j289L53l83j87J070
1852A247j63M7l41j490o7j37j64J372l5J5L34j277J5q7q17R71j75K36N01l17L55
1873B3J70m19O59j10O5Q01p02Qm51j078N24R2N65J344k68j01o97j321J20J68M15
1894a93J132o93j58n18j330Q02Q43M08J469p27q97n37j500N75O03N34J426l96
1912H43q06Rj063O70O87m8J021o67p95j03q78M21J010q2R14l38o29K63j138J81
1932e28J18m76J075K06l15L72j010J39L62l95J294L89o09J05j138o90L08P0J242
$$ plain form
1951 519 1321 1037 915 -736 -1246 -804 -927 526 1163 701 274 -986 -1689 -720 -518 921 1829 691
1969 691 490 -711 -1358 -545 -223 874 1101 176 129 -832 -911 20 201 591 1051 -201 40 -365 -1035 203
1989 203 -193 419 741 -42 491 329 -407 19 -522 -216 552 157 606 32 -597 -291 -776 -528 832 298
2009 298 847 187 -917 -754 -931 -170 1018 753 1011 572 -937 -477 -536 259 1679 673 643 81 -1301
2028 -1301 -582 -549 -31 1038 297 -189 -361 -1371 -401 -82 98 905 298 -273 -307 -822 -53 438 112 902
2048 902 96 101 545 11 563 266 140 278 -121 -177 429 -308 -127 -210 -965 -232 -88 -50 381 -148 -530 -571
2070 -571 -912 -73 451 577 761 -190 -346 -59 -356 758 793 371 514 -417 -684 -370 -435 786 566 -180
2090 -180 47 -826 -789 -28 -139 324 239 -676 -465 -616 -342 494 210 705 518 -319 156 108 -24 717 215
$$ packed form
1951E19Q02k84j22j651n10M42j23J453O37m62m27j260p03R69K02J439R08j138
1969F91k01j201o47Q13L22J097K27r25m7r61p9R31J81L90M60j252K41m05o70J238
1989B03l96O12L22p83N33j62p36M26n41L06P68l95M49n74o29L06m85K48J360n34
2009B98N49o60j104J63j77P61J188k65K58m39j509M60n9P95J420j006l0n62j382
2028a301P19L3N18J069p41m86j72j010R70L19J80Q07o07n71l4n15P69M91l26P90
2048I02q06NM44n34N52k97j26J38l99n6O06p37J81q3p55P33J44L8M31n29l82m1
2070e71l41Q39N24J26J84r51j56K87k97J114L5m22J43r31k67L14o5J221k20p46
2090a80K27q73L7P61j11M63q5r15K11j51K74Q36k84M95j87q37M75m8j32P41n02
$$ plain form
2111 215 75 -111 -580 372 293 448 727 -69 -296 -227 -622 218 93 -260 -73 -813 -657 95 -76 550 273
2132 273 -190 176 -397 -168 356 -75 414 71 -446 300 124 409 740 11 174 -322 -827 77 -287 29
2152 29 381 -457 -456 -89 -547 328 195 12 406 -650 -485 -154 -267 454 540 3 206 -339 -111 165 197
2173 197 545 73 -601 -105 -595 -64 268 28 310 400 -171 258 -152 108 489 -290 -189 -238 -239 303 48
2194 48 101 453 -204 -161 49 -367 8 -260 -564 -282 -504 -32 -11 72 749 277 -242 121 -419 183 375 228
2216 228 331 -13 -195 100 161 371 672 17 117 -393 -822 -334 -636 -416 -182 -559 -268 -8 -327 269
2236 269 -24 175 471 -230 149 243 -32 559 109 113 407 334 490 597 -15 165 -390 -848 -207 -455 -317
2257 -317 -25 -400 -80 -402 -447 438 3 405 304 -323 -23 -161 -175 565 398 541 699 -9 381 -13 -319
$$ packed form
2111B15j40j86m69R52p9J55K79p96k27O9l95Q40j25l53J87p40J56P52j71O26k77
2132B73m63L66n73K29N24m31M89l43n17P46j76K85L31p29J63m96n05R04l64L16
2152B9L52q38JL67m58Q75j33j83L94j056J65L31j13P21Q6n37K03n45K28K76L2
2173A97L48m72o74M96m90N31L32k40K82R0n71M29m10K60L81p79J01m9jN42k55
2194D8N3L52o57M3K10m16L75k68l04K82k22M72K1Q3O77m72n19L63n40O02J92j47
2216B28J03l44j82K95O1K10L01o55J00n10m29M88l02K20K34l77K91K60l19N96
2236B69k93J99K96p01L79R4k75N91m50MK94p3J56J07o12J80n55m58O41k48J38
2257c17K92l75L20l22m5Q85m35M02j01o27L00j38j4P40j67J43J58p08L90l94l06
$$ plain form
2278 -319 291 -176 -143 -123 -671 -54 -214 -593 124 -207 -242 71 -359 -2 71 -380 118 -182 339 624 320
2299 320 632 461 -124 268 13 43 499 56 -158 -151 -829 -147 86 -21 502 18 -88 -145 -642 -119 -278
2320 -278 38 517 -100 -43 -118 -481 250 185 70 595 -156 -122 -30 -339 53 -7 -218 185 -124 -104 511 -145
2342 -145 85 -94 -369 338 144 18 467 -2 225 21 -179 469 199 230 319 -548 -461 -200 -692 41 -16
2363 -16 -101 145 -767 -466 -206 -321 387 426 -119 294 -190 -193 457 157 415 534 -19 211 -233 -223 99 -224
2385 -224 52 -99 -457 63 -230 -135 398 -270 49 249 -144 296 109 -35 241 -214 139 217 161 588 491
2406 491 -31 223 -224 -181 291 202 309 92 -410 -253 -617 -342 31 -49 159 -355 -351 -58 -222 24 460 31
2428 31 228 -49 -316 129 -108 387 465 134 63 114 -393 325 149 175 279 -164 -173 101 -304 413 -111 -280
$$ packed form
2278c19O10m67L3K0n48O17j60l79P17l31l5L13m30L57P3m51M98l00N21K85l04
2299C20L12j71n85L92k55L0M56m43k14Po78O82K33j07N23m84j06n7m97N23j59
2320b78L16M79o17N7p5l63P31o5j15N25p51L4R2l09L92o0k11M03l09K0O15o56
2342a45K30j79k75P07j94j26M49m69K27k04k00O48k70L1Q9q67Q7K61m92P33n7
2363a6q5K46r12L01K60j15P08L9n45M13m84lO50l00K58J19n53K30m44J0L22l23
2385b24K76j51l58N20k93R5N33o68L19K00l93M40j87j44K76m55L53P8n6M27r7
2406D91n22K54m47M3M72q9J07k17n02J57l64K75L73q0K08n14MK93j64K46M36m29
2428C1J97k77k67M45k37M95P8l31p1N1n07P18j76K6J04m43rK74m05P17n24j69
$$ plain form
2450 -280 -98 -265 -171 151 -161 104 -7 -299 -70 -207 -6 354 79 202 -144 -378 -116 9 195 502
2470 502 181 154 -385 -352 -52 -139 275 549 -117 -115 -212 -637 155 -86 90 262 -317 -91 -172 -310 30 6 -41
2493 -41 567 -131 103 182 -60 198 77 -46 314 -99 194 245 -317 -46 -118 -284 171 -173 171 74 -286 -135
2515 -135 -295 -301 179 164 120 251 -575 -367 -243 -105 567 455 273 266 -349 -76 -70 -28 547 144 198 213 -543 -282
2539 -282 52 -72 262 305 214 -74 -508 -385 -127 -335 213 84 -236 -237 -268 75 69 -284 343 118 -194 182
2561 182 116 -196 47 -236 200 213 177 596 4 -171 68 -542 -170 174 9 302 -11 -138 -306 -392 171
2582 171 165 131 422 -61 -669 -296 -476 -93 384 277 418 84 -481 -165 -146 253 686 241 109 -183 -468
2603 -468 -147 -79 365 410 -50 184 16 -334 -51 -89 -89 177 -84 -60 46 13 263 -187 -165 115 52 207 243
$$ packed form
2450b80J82j67R4L22l12K65j11k92K29j37K01L60k75J23l46k34K62J25J86L07
2470E02l21k7n39L3L00q7M14K74o66Kr7m25P92k41J76J72n79K26q1j38L40k4m7
2493d1O08o98K34P9k42K58j21j23L60m13K93N1n62K71p2j66M55l44L44r7l60J51
2515a35j60oM80j5m4J31q26K08J24J38O72j12j82po15K73OM2N75m03N4J5p56K61
2539b82L34j24L34M3r1k88m34J23K58k08N48j29l20jl1L43ol53O27k25l12L76
2561A82o6l12K43k83M36J3l6M19n92j75K39o10L72L44j65K93l13j27j68q6N63
2582A71ol4K91m83o08L73j80L83M77j07J41l34n65L16J9L99M33m45j32k92k85
2603d68L21O8M44M5m60K34j68l50K83l8%K66k61K4J06l3K50m50K2K80o3J55L6
$$ plain form
2626 243 -193 128 -205 -53 404 287 330 243 -106 -201 -566 -330 364 9 229 46 -469 -12 -273 -351 187
2647 187 278 86 59 -404 -357 -299 66 402 490 447 381 -310 -36 220 139 569 -51 -102 -130 -427 -32 42 -118 340
2671 340 103 -44 69 -336 -118 -78 -363 -76 -156 -49 295 93 282 477 -247 207 -21 17 257 -45 -5
2692 -5 -192 -245 -119 191 -3 479 102 -68 -101 -511 -75 138 80 295 -175 -181 -223 -175 219 32 14 -5 -284 -414
2716 -414 -115 -389 -22 239 223 13 -115 -383 112 119 482 140 -10 153 -4 -47 5 15 293 277 -243 129
2738 129 63 -123 152 -234 -88 -122 -315 36 96 -77 262 -96 -119 29 -56 300 56 -26 -19 -294 -128 126 88
2761 88 261 245 298 241 -235 -334 -36 -4 32 33 -371 38 -213 41 170 -47 -96 -33 -216 -156 -175 -172 103 57 75 312
2787 312 123 210 422 162 441 -221 -81 19 -149 28 96 -26 -6 -198 -3 30 -294 150 -75 -349 -190
$$ packed form
2626B43m36L21l33J52M57j17M3q7l49r5l65K36O94l55K20j83n15M57k61p8N38
2647A87R1j92k7m63M7N8L65L36Q8m3o6o91K74K56q1M30o20n1k8k97L95P4j60M58
2671C40k37j47J13m05K18M0k85K87q0J07L44k02J89J95p24M54k28L8K40l02M0
2692ej87n3J26L10j94M82l77j70l3m10M36K13n8K15m70om2M8L94j87j8j9k79j30
2716d14K99k74L67K61j6k10j28k68M95PL63l42j50J63j57m3N2J0K78j6n20L72
2738A29o6j86K75l86J46l4j93L51O0j73L39l58k3J48q5L56k44q2Pk75J66K54l8
2761H8J73j6N3n7m76r9K98L2L6Jm04M09k51K54J29k17m9O3j83O0j9LK75m6J8K37
2787C12j89Q7K12k60K79o62J40J00j68J77O8j22K0j92J95L3l24M44k25k74J59
$$ plain form
2808 -190 -369 -53 81 -60 261 -9 -323 -92 -76 -35 299 90 12 32 -152 100 0 3 373 114 100 37 -141
2831 -141 76 -59 -100 209 -12 -58 203 -271 -35 28 -247 16 -113 -4 -1 65 44 171 -23 109 4 23 176
2854 176 -2 142 -12 -366 286 -23 179 111 38 -77 -266 -253 61 2 -68 8 -156 -61 -36 -108 379 100 75
2877 75 150 -26 79 226 42 37 124 -177 112 -4 -39 178 -51 1 187 -114 3 -81 -122 190 -91 -188 -130 -300
2901 -300 174 -74 -139 261 -56 -25 -46 -158 69 277 53 47 -242 5 11 53 250 48 155 68 -147 73 229
2924 229 -93 185 217 -151 57 31 -141 66 -169 -213 86 -108 21 28 -27 88 -261 -80 86 -34 49 -14 -18
2947 -18 104 -80 51 55 118 321 -8 85 211 -71 67 221 134 219 14 -20 -7 -228 71 254 -89 -24 -80 -214
2971 -214 -134 -228 27 51 55 -4 -189 -18 198 -52 136 27 2 2 80 -64 204 17 144 126 -92 -32 81 -139
$$ packed form
2808a90j79L16J34j41L21k70l14K31J6M1L34k09p8K0j84K52j00LL70k59j4o3j78
2831a41K17j35m1L09k21m6K61m74K36O3k75K63j29J09LO6k1J27j94J32j05J9J53
2854A76j78J44j54l54O52l09K02o8p3j15j89J3L14n9p0P6j64R5K5p2M87k79k5
2877G5P5j76J05J47j84nQ7l01K89j16l5K17k29N2J86l01J17q4m1L12k81r7N8j70
2901c00M74k48o5M00l17L1k1j12K27K08k24ok89K47OM2J97k02J07q7k15K20J56
2924B29l22K78L2l68K08k6j72K07k35m4K99j94J29Pn5J15l49J81J66j20Q3o3m
2947a8J22j84J31MO3K03l29R3J26k82J38J54q7Q5k05l4J3k21K99J83l43O5n6j34
2971b14Q0r4K55K4Mn9j85J71K16k50J88j09k5%P8j44K68j87J27j8k18O0J13k20
$$ plain form
2995 -139 155 -39 -90 -213 -253 85 61 -205 99 21 -31 -31 -154 65 54 74 200 -143 -110 230 106 351 298 64
3019 64 -117 -31 -1 90 -111 79 29 -27 -163 -240 -30 -6 -249 -142 10 -269 -120 127 -55 81 -186 -23 65
3042 65 -67 -4 139 65 207 -201 -182 104 47 51 71 -28 259 -59 -20 148 6 28 163 -1 -132 -75 -269 193
3066 193 -113 55 -49 -225 -89 -113 -61 7 84 -113 -51 -226 102 88 -99 219 47 65 171 -45 191 148 9
3089 9 -102 54 -145 -160 157 282 245 -111 120 -260 -307 -118 151 -63 139 -144 -81 -107 67 251 331 100 295
3112 295 73 -132 2 123 108 -88 -103 75 -130 25 -269 -258 -41 -201 -74 -6 89 153 -25 -101 10 -26 -109
3135 -109 186 -72 140 189 -201 -90 -12 -23 170 237 113 -68 -235 -17 -178 -16 165 -29 72 53 -99 97
3157 97 148 -81 147 137 5 19 -9 32 39 91 278 -120 -261 -242 -174 146 48 -65 148 -219 -97 110 -51 155
$$ packed form
2995a39K94j94n1j23m0L38k4k66L04p8n2%j23K19j1K0J26l43L3L40j24K45n3k34
3019F4j81Q6L0R1k01J90n0n6j36p7K10K4k43J07J52k79J49K47j82J36k67J63Q8
3042F5j32O3J43p4J42m08J9K86n7MK0r9K87l18L9J68j42K2J35j64j31N7j94M62
3066A93l06J68j04j76J36k4N2O8P7j97O2j75L28j4j87L18j72J8J06k16K36m3j39
3089Ij11J56j99j5L17J25l7l56K31l80m7J89K69k14K02k83O3k6J74J84Q0k31J95
3112B95k22k05J34J21j5j96j5J78k05J55k94J1K17j60J27O8R5O4j78p6J11l6q3
3135a09K95k58K12M9l90J11P8j1J93O7j24j81j67K18j61J62J81j94J01j9j52J96
3157I7N1k29K28j0j32J4k8M1PN2J87l98j41J9O8L20r8j13K13l67J22K07j61K06
$$ plain form
3181 155 26 76 170 -174 113 232 96 133 43 -79 201 26 87 211 -164 -226 -152 -214 -15 -135 -53 34 -144
3204 -144 -182 -127 65 193 264 104 222 60 124 136 170 251 347 138 167 54 -68 399 -90 100 -192 -152 -144 -321
3228 -321 -253 24 -16 -4 192 -258 63 -66 -64 358 -107 106 176 -51 94 85 169 187 -46 120 96 -130 -66 5
3252 5 -103 -241 -78 -232 113 -35 -63 124 -181 84 -165 177 102 46 116 -80 -141 10 198 237 299 134 78
3275 78 149 -320 20 -52 -210 138 -51 -129 -209 -235 -130 153 8 -86 -74 6 129 25 42 112 -28 175 -248 -48
3299 -48 -63 185 119 15 -252 123 -133 -164 144 101 59 -65 -194 -33 117 76 173 -130 194 82 -63 237 19
3322 19 -8 -10 -92 121 26 -202 -20 1 153 -69 -151 -59 88 187 -102 203 17 166 7 95 326 -91 172 -68
3346 -68 -58 51 106 -22 162 -29 43 87 -49 -20 -140 76 177 -89 -159 -241 -160 210 61 192 277 274 -41 -77
$$ packed form
3181A55j29N0R4l44K87J19j36L7r0j22K80j75O1J24l75o2P4o2J99j20Q2Q7j78
3204a44l8N5J92J28P1j60J18j62O4J2L4Q1R6k09K9j13j22M67m89J90k92M0Qj77
3228c21O8K77m0J2J96m50L21j29KM22m65K13P0k27J45rQ4J8k33J66k4k26O4P1
3252Ej08j38J63j54L45j48k8J87l05K65k49L42p5n6P0j96o1J51J88L9O2j65n6
3275G8P1m69L40p2j58L48j89p8q0k6J05K83j45r4J2Q0J23j04J7P0j40K03m23K00
3299d8j5K48o6j04k67L75k56l1L08m3m2j24j29J61J50m1R7l03L24j12j45L00k18
3322A9k7kq2K13r5k28J82K1J52k22q2R2J47R9k89L05j86J49j59Q8K31m17K63k40
3346f8J0J09N5j28J84j91P2M4j36K9j20K16J01k66p0q2Q1L70j49J31Q5ll15l6
$$ plain form
3370 -77 -49 296 230 16 139 9 -72 36 -6 -13 33 59 0 -142 -83 36 -59 29 33 -147 -37 -111 -91 101 14 55
3396 55 192 -5 143 -28 17 219 216 41 -113 18 254 -7 -73 17 -189 -144 -68 -62 207 8 -23 -90 -320 -48
3420 -48 -40 109 166 -23 -151 -126 2 -179 113 -75 270 -26 -299 23 66 212 161 38 242 134 -181 193
3442 193 -24 -6 44 -8 200 -66 -78 200 67 -47 84 -34 40 -68 -75 -205 -264 -141 130 -84 139 -13 51
3465 51 99 -242 9 136 -154 37 203 -21 112 55 -141 53 89 108 29 -165 -137 -194 -302 20 22 81 92 -37
3489 -37 -113 -121 -55 259 37 -104 82 171 -19 -173 87 304 18 37 207 216 -33 -14 -104 37 33 -132 39 42 -28
3514 -28 0 -112 -68 177 -50 93 -155 -29 -169 -343 -208 57 119 512 160 -40 114 -162 -85 -106 -90 171
3536 171 131 -2 -82 -90 288 24 228 87 -86 -77 2 -249 -178 200 -121 133 -199 -93 12 -152 103 82 -155
$$ packed form
3370g7K8L45o6k14J23j30q1J08m2pM6K6n9j42N9J19r5Q8Mj80J10p4K0J92q7M1
3396E5J37j97J48j71M5K02lj75j54J31K36k61o6R0k06M5P6OK69j99l1o7k30K72
3420d8QJ49N7j89j28K5J28j81K92j88L45k96k73L22M3J46n1j23K04j08l15L74
3442A93k17J8N0n2K08k66j2K78j33j14J31j18P4j08pj30n9J23K71k14K23j52O4
3465E1M8l41K51J27k90J91J66k24J33n7j96J94L6J9p9j94K8n7j08L22KN9J1j29
3489c7p6qO6L14k22j41J86Q9j90j54K60K17k86J9J70Rk49J9r0J41mj65J71Lp0
3514b8K8j12M4K45k27J43k48J26j40j74J35K65O2L93l52k00J54k76P7k1J6K61
3536A71m0j33q0qL78k64K04j41j73RP9k51P1L78l21K54l32J06J05j64K55k1k37
$$ plain form
3559 -155 183 152 -202 -111 -59 -152 196 -23 121 -13 220 202 -31 -191 -63 14 -34 34 -51 -85 -15 -108 -100 -48 41
3584 41 218 -49 4 -88 -204 -24 -184 -11 175 -123 321 225 60 -17 354 133 -56 29 -80 -146 -121 -64 -66 135
3608 135 141 122 55 -164 5 13 -146 44 126 -190 10 34 77 -28 2 148 22 0 210 51 -21 -86 -10 208 125
3633 125 153 169 -94 -84 5 -124 -109 -25 -74 -89 -220 -70 202 -158 -129 248 7 -60 49 49 -137 -133 -128 190 -49
3658 -49 -34 193 48 -88 11 -82 18 -98 -116 -122 -85 21 -35 -24 21 -104 -173 39 48 -62 113 -130 -130 -38 -107 37
3684 37 60 70 -92 -1 133 -10 75 272 -54 -51 -123 -214 130 89 221 195 81 80 36 -39 -2 232 -91 73 -103
3709 -103 -44 -180 -101 7 131 11 -23 -12 -50 -83 -186 -2 259 99 64 191 25 -19 -20 69 63 135 95 -44 -146
3734 -146 96 22 -185 45 -129 102 -31 -39 254 -36 -202 129 -17 -79 45 62 106 -66 -69 80 97 311 106
$$ packed form
3559a55L38l1l54R1N2r3L48k19J44j34K33j8k33j60J28P7m8O8q5l4P0r3QN2Q9
3584D1J77k67N3r2j16J80j60J73J86k98M44r6j65p7L71k21j89Q5j09o6K5N7kK01
3608A35Oj9o7k19J69Qj59J90Q2l16K00K4M3j05L0J46j26k2K10j59p2o5P6K18q3
3633A25K8J6k63J0Q9j29J5Q4m9j5j31J50K72l60K9L77k41o7J09%j86MNL18k39
3658d9J5K27j45j36R9r3J00j16j8oL7J06n6J1M5j25o9K12Rj10J75k43%R2o9J44
3684C7K3J0j62R1J34j43Q5J97l26Lp2r1L44m1J32k6j14jm4p5L7K34l23J64j76
3709a03N9j36P9J08J24j20l4J1l8l3j03J84K61j60l5J27j66m4jQ9oP2m0j39j02
3734a46K42p4k07K30j74K31j33qK93k90j66L31j46o2J24J7M4j72lJ49J7K14k05
$$ plain form
3757 106 -162 58 4 -119 -69 -105 37 182 155 -89 -225 -185 5 136 20 -81 -233 185 -141 -42 68 -13
3779 -13 -85 93 131 236 -10 80 190 -70 175 172 -3 164 -80 -108 119 -73 63 45 -28 126 -97 -252 -56
3802 -56 -36 -92 170 98 113 49 -199 -109 138 82 49 -9 57 0 -234 -55 8 -79 5 -11 -102 -8 -134 48 -75 14
3828 14 134 114 -136 -71 -114 282 -151 -59 117 -60 253 111 72 -49 -319 -289 -58 -38 23 154 -106 53 -78
3851 -78 -96 138 268 212 50 -270 -194 -50 -299 308 -90 84 35 -89 -24 16 -65 40 -133 104 14 -112 106
3874 106 104 72 187 244 -50 -33 -120 -25 -92 -114 -204 9 -7 27 91 279 257 -87 172 227 -80 95 0 -22 144 -55
3900 -55 235 6 -63 174 -38 5 50 -280 -106 -162 120 -136 84 -131 101 72 87 59 115 221 -140 -188 -127 -95
3924 -95 -84 148 -175 183 122 60 56 -106 -48 23 -248 -132 -324 -196 8 98 -100 160 -138 122 150 77 347 -116
$$ packed form
3757A06k68K20n4j23N0l6J42J45k7k44j36M0J90J31j16j01j52M18l26R9J10q1
3779a3p2J78L8J05k46R0J10k60K45lj75J67k44k8K27j92J36j8p3J54k23j55J96
3802e6K0n6K62p2J5o4k48R0K47n6l3n8O6n7k34J79O3q7Q4j6r1R4j26J82j23Q9
3828A4J20k0k50O5m3L96m33R2J76j77L13j42l9j21k70L0K31K0O1J31k60J59j31
3851g8j8K34J30n6j62l20P6J44k49O07l98J74m9j24O5M0q1J05j73K37r0j26K18
3874A06kl2J15N7k94J7q7R5o7k2r0K13j6L4O4J88k2l44K59N5l07J75r5k2J66j99
3900e5K90k29o9K37k12M3M5l30J74n6K82k56K20k15K32k9J5k8N6J06l61m8O1L2
3924i5J1K32l23L58o1o2mj62N8P1k71J16j92J28K04R0j98K60k98K60K8p3K70m63
$$ plain form
3948 -116 -100 -117 18 37 364 165 80 388 121 91 -142 6 -153 -268 53 -65 -55 63 -76 179 -46 180
3970 180 -9 -78 -26 -62 -185 87 -177 -44 181 130 235 274 269 412 -223 -159 -118 -87 -213 -111 -39 -327 35 -202
3994 -202 111 30 115 41 -41 -50 -147 -154 175 29 286 236 172 63 389 229 18 237 -182 88 -185 -228 -115 -76
4018 -76 92 22 126 138 59 -162 -74 -472 -308 76 -159 90 204 40 257 233 402 362 -106 162 163 -121 4
4041 4 -109 -114 -23 173 168 146 23 -169 -154 -87 -65 -155 135 94 -31 216 -59 146 326 287 197 150 -112 -60 -25 33
4067 33 59 32 -70 -398 -165 -61 87 -210 -80 3 -207 -114 -204 -236 -187 71 91 12 75 325 230 258 127 208 190
4092 190 -25 -9 -6 -164 332 -23 -47 82 -34 -5 172 -40 -132 -321 -237 -175 -79 313 225 133 81 156 -91 164
4116 164 159 349 204 -128 116 -46 -241 255 -92 38 52 -146 -19 -77 -206 -97 -244 -162 56 -106 108 122
$$ packed form
3948a16J6j7J35J9L27j99q5L08k67l0k33J48j59j15L21j18J0J18j39K55k25K26
3970A80j89o9N2l6j23K72k64J33K25n1J05L9nJ43o35O4M1L1j26J02P2k88L62k37
3994b02L13q1Q5p4q2rr7pL29j46K57n0o4j09L26j60k11K19m19K70k73m3J13L9
4018g6J68p0J04J2p9k21Q8l98J64L84k35K49J14j64K17k4J69m0m68K68Jk84J25
4041Dj13nR1J96nk2j23j92J5O7K2r0K90m1j25K47k75K05J80l9r0m7k62N2L5N8
4067C3K6k7j02l28K33J04J48k97J30Q3k10R3r0l2M9K58K0p9O3K50r5K8j31Q1j8
4092A90k15J6Lj58M96l55k4J29j16K9J77k12r2j89Q4O2R6L92q8r2n2P5k47K55
4116A64nJ90j45l32K44j62j95M96l47J30J4j98J27n8j29J09j47Q2K18j62K14J4
$$ plain form
4138 122 -57 -11 181 234 211 31 162 173 49 -45 32 -104 150 -13 -8 16 -242 -20 -80 -122 -189 10 -32 -131 -33
4163 -33 -33 47 -91 132 5 41 -54 -203 -153 231 -170 179 63 -149 127 -97 98 -20 79 92 61 16 -37 -276
4187 -276 -17 148 -50 -94 28 -126 73 -77 26 164 -59 33 -12 107 42 47 -161 -116 -45 109 35 -149 85
4210 85 -57 -25 138 10 39 -140 30 172 -343 -2 -84 22 -60 -23 59 176 114 -126 83 -6 -152 137 -44
4233 -44 14 -49 -151 8 -102 -76 55 -56 -49 -107 -161 -74 -228 -129 -13 146 111 199 37 113 52 -99 205 -123 -22
4258 -22 131 16 77 34 75 171 219 95 332 -99 -200 -300 -297 -91 -12 9 125 66 -76 -216 -143 248 406 93
4282 93 -77 78 80 -336 -102 261 139 143 42 -18 0 -365 -217 -224 -155 -86 170 -182 4 -115 -157 138 -165 135
4306 135 -40 15 48 22 -107 20 -147 316 507 265 -100 -117 -197 171 -240 -214 -34 -67 -181 -135 -247 -114 72
$$ packed form
4138A22j79M6J92N3k3j80J31J1j24r4P7j36K54j63NK4k58K22o0m2o7J99m2r9R8
4163c3%Q0j38K23j27L6r5j49N0L84m01L49j16k12K76k24J95j18R9J3l1m5n3k39
4187b76K59J65j98m4J22j54J99j50J03J38k23R2m5J19o5Nk08M5P1J54p4j84K34
4210H5j42L2J63j28K9j79J70J42n15L41q2J06q2L7Q2J17o2k40K09q9j46K89j81
4233d4N8o3j02J59j10K6J31j11Pn8n4Q7j54R9J16J59l5Q8j62P6o1j51L04l28J01
4258b2J53j15O1m3M1R6M8j24K37m31j01j00LK06P9K1J16n9j42j40P3L91J58l13
4282I3j70J55Km16K34L63j22Mj01o0J8l65J48pO9O9K56l52J86j19m2K95l03L00
4306A35j75N5L3k6j29J27j67M63J91k42l65j7q0L68m11K6J80l3j14M6j12J33J86
$$ plain form
4329 72 -98 139 227 31 30 -99 72 169 80 273 117 189 220 19 64 63 130 292 -6 62 -25 -202 -131 46 -171
4354 -171 -91 101 7 56 2 -1 -142 -12 53 104 59 334 9 33 211 -16 31 81 101 -43 -219 -396 -135 -90 178
4379 178 94 87 219 -195 -129 127 -169 17 -14 -56 -3 -53 -42 204 254 133 347 186 70 -159 -204 91 -164 -9
4403 -9 -81 -16 95 -234 -115 -35 -93 -115 -47 123 -46 -163 -107 44 167 94 97 78 273 -112 -81 -3 -82 -263 14
4428 14 -142 30 -206 0 -57 -111 56 179 116 118 -76 -151 -146 -107 -158 164 176 223 165 38 235 29 114 -52 -79
4453 -79 233 13 -196 -89 -122 1 -101 69 83 115 -171 59 -37 -124 -52 25 150 168 135 208 -65 21 284 250
4477 250 37 142 -49 -94 -135 -78 -89 -57 -71 126 -163 -110 -230 -18 40 -119 116 -141 -114 -252 -171 -22 159
4500 159 129 41 222 -101 1 -21 -75 46 -104 59 122 15 -41 -227 -207 -64 57 -63 -63 -121 -80 -135 -39 26 106
$$ packed form
4329G2j70K37Q8j96jj29J71R7q9J93j56P2L1k01M5jO7J62k98O8q7j77P1J77k17
4354a71Q0J92r4M9n4lj41J30O5N1m5K75l25K4J78k27M7N0K0j44j76j77K61M5K68
4379A78q4pJ32m14O6K56k96J86l1m2N3n0J1K46N0j21K14j61j16k29m5K95k55J55
4403ip2O5J11l29J19Q0n8k2O8J70j69j17N6J51J23p3Lj9J95l85L1P8p9j81K77
4428A4j56J72k36K06n7n4J67J23o3Kj94p5NL9n1L22J2M7n8j27J97k06Q5j66k7
4453g9L12k20k09J07l3J23j02J70J4L2k86K30r6q7P2P7J25J8l3P3k73Q6K63l4
4477B50k13J05j91m5m1N7j1L2j4J97k89N3j20K12N8j59K35k57K7j38Q1J49J81
4500A59l0q8J81l23J02k2n4J21j50J63O3j07n6j86K0J43J21j20%n8M1n5R6O5Q0
$$ plain form
4525 106 -81 27 31 68 -37 -6 15 117 -52 208 -48 34 -49 34 95 25 -24 169 -18 -123 -62 -306 -205 44
4549 44 -160 2 -35 -139 159 -153 -39 -105 -112 -11 -7 -60 144 0 103 -78 -49 59 -111 38 -93 -206 -193
4572 -193 -157 36 73 -98 -88 98 -34 8 -103 -123 79 57 2 -21 -273 45 207 38 46 142 0 122 50 52 50
4597 50 72 40 -63 -53 -33 19 -145 -43 -55 45 -19 -106 -97 -115 -105 -52 24 37 275 249 38 146 10 102 197 146 161
4624 161 15 24 14 32 94 29 -43 118 -124 118 -101 -36 32 133 -176 102 -82 168 157 -179 -41 -24 -13 186
4648 186 207 -11 -51 -75 45 -29 32 147 -50 -163 87 -248 -76 -55 1 -26 -132 42 -62 10 48 84 212 -13
4672 -13 -24 -1 337 85 160 -36 -84 24 -42 -80 -125 12 124 -133 23 19 -110 58 138 -224 -7 -155 3 58
4696 58 -107 50 160 -39 87 -104 -137 -13 32 20 98 -81 -24 -117 -202 39 -70 -31 -17 -167 -71 103 -221 5
$$ packed form
4525A06j87J08ML7j05L1K1J02j69K60k56Q2q3Q3O1p0m9J93j87j05O1k44J01K49
4549D4k04J62l7j04K98l12J14o6pJ01Mn3K04j44J03j81K9J08j70J49j31j13J3
4572a93L6J93L7j71J0J86j32M2j11k0K02k2n5k3k52L18J62j69QR6j42J22p2Kk
4597E0K2l2j03J0K0N2j64J02j2J00o4q7Rj8J0N3P6J3K38k6k11J08j36R2R5n1J5
4624A61j46Rj0J8O2o5p2J61k42K42k19O5O8J01l09K78j84K50j1l36J38J7J1J99
4648A86K1k18m0k4J20p4O1J15j97j13K50l35J72K1N6k7j06J74j04P2L8L6J28k25
4672a3j1K3L38k52P5j96m8J08o6l8m5J37J12k57J56mj29J68Q0l62K17j48J58N5
4696E8j65J57J10j99J26j91l3J24M5j2P8j79N7r3q5K41j09L9J4j50R6J74l24K26
$$ plain form
4720 5 1 -217 -230 -126 104 132 92 153 179 111 138 118 188 10 -4 6 -26 -252 -12 -178 -33 192 -52 122 3
4745 3 -200 -154 78 -73 -39 66 -64 -72 79 146 -32 50 156 36 18 127 -145 -178 -110 137 -37 -130 -4 163
4769 163 70 -50 -104 -12 -129 -84 -92 25 146 -6 338 -1 112 168 -124 -105 232 156 -41 -25 39 -31 95 6
4793 6 65 -93 -19 56 50 -93 -114 -33 -61 78 -12 -169 131 -145 -6 -60 -46 -81 76 -81 -132 -103 -176 174 29 192
4819 192 48 -126 180 -51 -45 -21 -113 -23 85 -128 -45 38 11 190 120 -163 -10 80 200 60 -133 108 30 96
4843 96 17 29 -112 58 107 69 -131 -125 146 172 -152 203 133 -24 -173 -18 12 14 -11 138 -8 81 135 -1 105
4868 105 -18 -102 -1 -31 55 180 -136 -17 -57 -172 32 -146 -184 -96 103 183 -24 -119 113 106 -22 161 -94
4891 -94 -51 98 -123 -49 119 183 152 -177 199 33 153 36 -117 2 38 -194 -81 -22 -71 -208 -201 0 -190
$$ packed form
4720Emk18j3J04K30K8m0O1K6o8K7k0P0j78j4J0l2k26K40j66J45K25k44J74j19
4745Ck03M6K32j51L4J05j30qJ51O7j78Q2J06j20j8J09k72l3O8K47j74r3J26J67
4769A63r3j20n4R2j17M5qJ17J21j52L44l39J13N6k92J9L37p6j97J6O4p0J26q9
4793FN9j58P4P5oj43k1Q1k8J39r0j57L00k76J39n4J4l5J57j57n1K9p3L50j45J63
4819A92j44j74L06k31OK4r2R0J08k13Q3Q3k7J79p0k83J53R0J20j40j93K41p8O6
4843I6p9J2j41J70M9l8k00OK71K6l24L55p0j57j49J55L0Kk5J49j46Q9N4j36J06
4868A05j23q4J01l0Q6J25l16J19m0j15K04j78l8Q8J99Q0k07r5K32pj28J83k55
4891i4M3J49k21P4J68O4l1l29L76j66J20j17j53J19L6k32J13N9m9j37PK01j90
$$ plain form
4914 -190 -111 69 -81 93 187 -180 -2 -24 -111 -107 352 19 155 40 -156 313 43 97 -97 -107 -64 143 -57
4937 -57 107 -118 -120 61 -165 72 -111 -117 119 -63 10 59 -51 75 177 93 199 -131 80 70 -120 32 -83
4960 -83 -166 95 -94 24 -223 -125 109 21 -73 -214 -300 -119 31 -9 1 -120 77 50 40 -24 310 157 -32 221
4984 221 42 -92 113 22 -198 -45 -6 -122 -165 65 101 -3 -68 -88 -116 -1 -295 135 -94 -1 56 33 -7 227
5008 227 -60 216 -88 -47 253 101 228 157 52 14 92 -7 76 -116 -111 100 -73 290 58 -166 48 71 -35
5031 -35 42 -260 -3 -66 15 -41 -185 -111 152 -152 -32 -14 -331 104 158 -4 -129 9 -298 -3 -152 -56 -51 -196
5055 -196 11 -33 -8 -46 -28 47 15 282 208 48 0 -43 61 201 -28 76 43 79 73 226 -54 64 -59 104
5079 104 34 -199 61 -18 -65 95 -29 -76 -39 -118 -28 -59 50 74 38 -75 52 23 10 81 12 7 75 -61 161 -206
$$ packed form
4914a90P9J80j50J74R4l67J78k2q7MM59l33J36j15j96M69k70N4j94j0M3K07k00
4937e7J64k25kJ81k26K37j83oK36j82P3M9j10J26J02q4J06l30K11j0j90J52j15
4960h3q3K61j89J18k47R8K34q8r4j41q6J81J50m0J0j21J97k7j0o4L34j53j89K53
4984B21j79j34K05r1k20J53L9j16m3K30L6j04o5k0k8J15k94M30k29R3N7k3m0K34
5008B27k87K76l04M1L00j52J27p1j05l8P8r9Q3j92NK11j73L63k32k24K14K3j06
5031c5P7l02K57o3Q1n6j44P4K63l04J20J8l17M35N4j62j25J38l07K95j49R6Nj45
5055a96K07m4K5l8J8P5l2K67p4j60m8m3J04J40k29J04l3L6oJ53k80J18j23J63
5079A04p0k33K60p9m7J60j24m7L7p9R0l1J09K4l6j13J27k9j3P1o9nO8j36K22l67
$$ plain form
5105 -206 -39 125 -96 -287 -40 134 -81 92 84 -21 7 157 132 61 111 -61 -125 17 -92 -211 -53 -113 -15
5128 -15 0 -70 -72 -121 -126 -44 -38 -41 -28 -168 59 33 -14 -48 -116 28 -66 -127 -169 -81 4 62 188 107 -123 28 46 -36 -7
5157 -7 -125 -97 -17 2 -157 -79 -39 68 146 132 162 -88 -134 139 -72 36 18 -145 146 116 -60 131 4 -14 94
5182 94 -167 -195 24 32 157 -111 -213 -219 -203 44 -97 -143 37 35 3 3 105 -153 -32 10 76 71 -94 14 1 61
5208 61 -37 278 -5 -170 -13 109 -107 -240 182 -218 -212 -54 -32 49 34 -23 -82 -113 56 95 -58 112 -23 -129
5232 -129 133 51 23 223 -84 -142 30 -113 132 -38 31 -54 -70 76 -117 -79 -124 -90 -123 5 -105 72 55 -46
5256 -46 361 67 78 -29 50 35 73 50 17 0 -97 52 -75 -70 -98 -160 -200 -102 -141 -39 192 50 183 189 -168 180
5282 180 -268 87 195 -47 -14 -169 30 -99 -86 -2 -150 -101 53 -70 -168 123 -158 161 -322 -145 37 -147
$$ packed form
5105b06J67J64k21j91K47J74k15J73qj05K8J50k5p1N0j72o4J42j09j19J58o0R8
5128a5J5p0km9nQ2OlJ3j40K27k6m7l4o8J44r4o1m2Q8Q5N8J26q1k30J51J8q2K9
5157gj18K8Q0J9j59P8M0J07P8j4L0k50m6K73k11J08j8j63K91l0j76J91j27j8J08
5182I4k61k8K19QJ25k68j02oJ6K47j41m6J80kl2%J02k58J21M2O6nj65J08j3O0
5208F1r8L15k83j65J57J22k16j33M22m00OJ58K2Q1j5n7n9l1J69L9j53J70j35j06
5232a29K62q2k8K00l07n8J72j43K45j70O9q5j6J46j93L8m5L4l3J28j10J77j7j01
5256d6M07k94J1j07P9j5L8k3l3j7r7J49j27Nk8o2m0R8l9J02K31j42J33Ol57L48
5282A80m48L55J08k42L3j55J99j29J3Q4j48M9J54j23r8K91k81L19m83J77J82j84
$$ plain form
5304 -147 11 -135 -173 168 166 25 227 6 1 141 -84 37 -82 -126 -213 143 -213 -205 7 -26 20 -83 -117 -57
5328 -57 87 -136 91 173 7 -5 -44 -4 -127 84 121 -35 126 128 5 -88 116 69 -142 -150 -23 59 18 123 -127
5353 -127 25 -209 -193 -108 -148 -82 47 5 -6 51 95 161 150 161 -9 166 -53 -15 91 139 13 283 6 -50 -111
5378 -111 -76 -200 4 -99 -109 63 22 166 35 -141 -7 51 -6 -21 48 -139 -19 -3 -25 3 90 33 146 152 54
5403 54 0 -69 174 52 124 47 -1 -220 29 122 -46 -139 -22 -35 4 -24 -112 -50 26 147 -35 160 104 171 8
5428 8 34 125 81 79 -81 -32 97 -15 31 112 -157 -72 -150 -124 53 -91 34 -62 110 150 64 219 120 -104 15 -180
5454 -180 -10 10 11 59 -22 -36 -74 95 8 -43 17 94 231 -40 -48 58 -141 -96 93 -53 108 -257 116 -100 73
5479 73 148 11 15 -62 51 44 22 -15 -193 19 -36 -141 -116 -123 101 -313 43 171 85 -101 -160 94 -95 -69 127
$$ packed form
5304a47J58j46l8L41kj41K02k21nJ40k25J21j19m4q7L56l56QK12l3M6j03l4O0
5328e7J44k23K27Q2j66j2l9M0j23K11L7j56J61Kj23r3K04m7k11qJ27Q2m1J05k50
5353a27J52k34J6Q5m0O6J29m2j1N7M4O6j1J1j70J75k19L8J06M8j26K70k77n6o1
5378a11L5j24K04j03j0J72m1J44j31j76J34N8n7j5O9j87J20J6k2K8Q7n7J13Or8
5403E4n4o9K43j22P2p7m8k19K49R3j68r3J17j3L9k8q8O2P6J21j82J95n6O7j63
5428HK6R1m4kj60M9J29j12M6Q1k69Q5p8K6J77j44J25r6J72M0q6J55r9k24J19j95
5454a80J70K0JM8q1j4l8J69q7n1O0P7J37k71qJ06j99M5J89j46J61l65L73k16J73
5479G3P5j37Mp7J13pk2l7j78K12n5j05K5pK24m14L56J28q6j86n9K54j89K6J96
$$ plain form
5504 127 -83 9 -50 63 -34 -37 80 207 148 -34 -101 -69 5 -77 -78 -74 -144 36 -69 163 -133 39 -10 75 -98 88
5530 88 107 53 112 -28 -63 -198 100 -47 33 -156 -106 -88 -6 -166 -62 137 70 -129 -92 157 -223 -166 104 71
5554 71 -153 24 50 -87 -63 20 -92 89 128 3 80 -39 23 -19 8 93 -148 59 -147 -96 -204 19 69 -194
5578 -194 -119 -30 -145 -65 -2 -128 111 17 -145 -49 27 191 85 130 -84 -20 36 148 64 34 60 -56 136 -36
5602 -36 -42 44 -13 -33 -78 -273 -65 -32 -58 -16 105 -16 145 -76 13 -39 18 102 3 11 97 -79 138 87 -40 42 26
5629 26 -165 -54 -94 84 -96 -55 181 -122 116 97 131 72 -29 -20 -39 0 -56 281 91 94 -146 -32 -32 151 66
5654 66 155 -100 60 7 -51 -170 -258 138 -100 -167 -9 -3 -55 84 13 1 226 155 58 -280 158 33 -7 -109 -214
5679 -214 85 87 46 -60 -140 -152 -14 62 -264 -78 160 -110 1 159 -127 108 -294 75 -120 -43 -174 15
$$ packed form
5504A27k10R2n9J13r7lJ17J27n9j82o7L2P4q2jMp0J80j05K32k96J72m9Q5j73J86
5530H8J9n4N9j40l5j35K98j47Q0j89N0J8Q2j60J04J99o7j99L7K49l80N7K70l3
5554G1k24J77K6j37K4Q3j12J81L9j25P7j19O2m2K7Q5k41K07k06N1j08K23N0k63
5578a94P5Q9j15Q0O3j26K39r4j62R6P6J64j06M5k14O4N6J12q4l0K6j16J92j72
5602c6oQ6n7k0m5j95K08L3k6M2J21j21J61k21Q9n2N7Q4r9QQ6j76K17n1j27Q2j6
5629B6j91J11m0J78j80M1K36l03K38j9L4n9j01Rj9L9n6L37j90Lk40J14%J83q5
5654F6Q9k55J60n3n8j19q8L96k38o7J58On2J39p1j2K25p1r7l38M38j25m0j02j05
5679b14K99Km1j06q0j2J38P6l26J86K38k70J11J58k86K35m02L69j95P7j31J89
$$ plain form
5701 15 58 -93 139 140 -91 -61 34 -18 -93 -118 29 113 -45 -99 -65 -25 204 -24 -166 75 118 -126 26 -27 -104
5726 -104 -46 -271 -10 154 84 202 -80 -73 52 78 63 83 -16 108 -152 46 30 -27 -82 111 -36 -114 18 -26
5750 -26 76 -12 10 207 -49 -180 196 -26 201 163 -71 101 -74 221 108 110 20 -74 -84 62 -24 3 -177 -85
5774 -85 106 115 61 -7 -91 -39 57 67 -96 70 -72 200 91 -78 152 -217 -155 -33 -126 57 54 -116 -19 -221 -133
5799 -133 -84 -278 36 -56 -281 184 28 84 -124 125 -43 143 155 87 99 -42 -14 -60 -68 -30 -110 -59 -144 -6 34
5824 34 -8 -85 -66 17 95 -29 71 178 -6 -65 67 -61 -94 -249 -79 119 -64 136 172 -10 54 -42 -117 -89
$$ packed form
5701A5M3j51K32Jk31L0R5n2p5k5J47Q4j58n4L4M0K29k28j42K41M3k44J52n3p7
5726a04N8k25K61J64p0J18k82PJ25K6j5K0r9J24k60J98j6n7n5J93j47p8J32m4
5750b6J02q8K2J97k56j31L76k22K27l8k34J72j75K95j13Kr0r4j0J46q6K7j80R2
5774h5J91Rn4o8q4N2R6J0j63J66j42K72j09j69K30l69O2J22r3J83lj70R7k02Q8
5799a33M9j94L14r2k25M65j56N6k08K49j68J86J2o8J2j41K8m6qL8q0N1q5J38M0
5824C4m2p7J9Q3P8j24J00J07j84n9J32j28l3j55J70J98j83K00L6j82O4r6p5K8
$$ [...]
8191C0
##END NTUPLES=NMR FID
##END=
