##TITLE=1H_17-2022
 CDCl3
 8 sc, 
 9.03.2022
##JCAMPDX= 6.0         $$ Bruker NMR JCAMP-DX V2.0
##DATA TYPE= NMR FID
##DATA CLASS= NTUPLES
##ORIGIN= UXNMR, Bruker Analytische Messtechnik GmbH
##OWNER= root
$$ XWIN-NMR		Version 3.5
$$ Wed Mar  9 11:51:19 2022 Russian Standard Time (UT+4h)  she@DPX200
##.OBSERVE FREQUENCY= 200.131346
##.OBSERVE NUCLEUS= ^1H
##.DELAY= (6, 6)
##.ACQUISITION MODE= SIMULTANEOUS
##.ACQUISITION SCHEME= undefined
##.AVERAGES= 8
##.DIGITISER RES= 18
##SPECTROMETER/DATA SYSTEM= spect
##.PULSE SEQUENCE= zg30
##.SOLVENT NAME= CDCl3
##.SHIFT REFERENCE= (INTERNAL, CDCl3, 0, 15.7039)
##AUDIT TRAIL= $$ (NUMBER, WHEN, WHO, WHERE, WHAT)
$$ ##TITLE= Audit trail, XWIN-NMR		Version 3.5
$$ ##JCAMPDX= 5.01
$$ ##ORIGIN= Bruker BioSpin GmbH
$$ ##OWNER= she
$$ F:/spectra/data/she/nmr/H-F/1/audita.txt
$$ ##AUDIT TRAIL=  $$ (NUMBER, WHEN, WHO, WHERE, WHAT)
(   1,<2022-03-09 11:50:00.14 +0400>,<she>,<DPX200>,
      <created by zg, POWCHK disabled, PULCHK disabled
       configuration hash MD5:
       00 E9 B6 7A A2 85 ED C7 34 08 36 98 17 FE 4E 26
       data hash MD5: 16K
       87 59 23 8A 4E D1 70 6F ED 82 33 72 70 C0 AA 25>)
$$ ##END=
$$ 
$$ hash MD5
$$ B2 E5 9D F7 A5 E5 1C 30 09 E7 C3 D0 79 A4 5E 13
##$RELAX= 
##$RELAX= 
##$RELAX= 
##$RELAX= 
##$RELAX= 
##$RELAX= 
$$ Bruker specific parameters
$$ --------------------------
##$DU= <F:/spectra>
##$EXPNO= 1
##$NAME= <H-F>
##$PROCNO= 1
##$TYPE= <nmr>
##$USER= <she>
##$AMP= (0..31)
100 100 100 100 100 100 100 100 100 100 100 100 100 100 100 100 100 100 
100 100 100 100 100 100 100 100 100 100 100 100 100 100 
##$AQSEQ= 0
##$AQ_mod= 1
##$AUNM= <au_zg>
##$AUTOPOS= <>
##$BF1= 200.13
##$BF2= 200.13
##$BF3= 200.13
##$BF4= 200.13
##$BF5= 200.13
##$BF6= 200.13
##$BF7= 200.13
##$BF8= 200.13
##$BYTORDA= 1
##$CFDGTYP= 0
##$CFRGTYP= 5
##$CHEMSTR= <none>
##$CNST= (0..31)
1 1 145 1 1 1 1 1 1 1 1 1 1 1 1 1 1 1 1 1 1 1 1 1 1 1 1 1 1 1 1 1 
##$CPDPRG= <>
##$CPDPRG1= <>
##$CPDPRG2= <>
##$CPDPRG3= <>
##$CPDPRG4= <mlev>
##$CPDPRG5= <mlev>
##$CPDPRG6= <mlev>
##$CPDPRG7= <mlev>
##$CPDPRG8= <mlev>
##$CPDPRGB= <>
##$CPDPRGT= <>
##$D= (0..31)
0 1.2 0 0 0 0 0 0 0 0.06 0 0.03 0 0 0 0 0.0002 0 0 0 0 0 0 0 0 0 0 0 0 
0 0 0 
##$DATE= 1646812199
##$DBL= (0..7)
120 120 120 120 120 120 120 120 
##$DBP= (0..7)
150 150 150 150 150 150 150 150 
##$DBP07= 0
##$DBPNAM0= <>
##$DBPNAM1= <>
##$DBPNAM2= <>
##$DBPNAM3= <>
##$DBPNAM4= <>
##$DBPNAM5= <>
##$DBPNAM6= <>
##$DBPNAM7= <>
##$DBPOAL= (0..7)
0.5 0.5 0.5 0.5 0.5 0.5 0.5 0.5 
##$DBPOFFS= (0..7)
0 0 0 0 0 0 0 0 
##$DE= 6
##$DECBNUC= <off>
##$DECIM= 32
##$DECNUC= <off>
##$DECSTAT= 4
##$DIGMOD= 1
##$DIGTYP= 9
##$DL= (0..7)
0 120 120 120 120 120 120 120 
##$DP= (0..7)
150 150 150 150 150 150 150 150 
##$DP07= 0
##$DPNAME0= <>
##$DPNAME1= <>
##$DPNAME2= <>
##$DPNAME3= <>
##$DPNAME4= <>
##$DPNAME5= <>
##$DPNAME6= <>
##$DPNAME7= <>
##$DPOAL= (0..7)
0.5 0.5 0.5 0.5 0.5 0.5 0.5 0.5 
##$DPOFFS= (0..7)
0 0 0 0 0 0 0 0 
##$DQDMODE= 0
##$DR= 18
##$DS= 0
##$DSLIST= <SSSSSSSSSSSSSSS>
$$ [...]
##$SUBNAM2= <"">
##$SUBNAM3= <"">
##$SUBNAM4= <"">
##$SUBNAM5= <"">
##$SUBNAM6= <"">
##$SUBNAM7= <"">
##$SUBNAM8= <"">
##$SUBNAM9= <"">
##$SW= 18.0517287032376
##$SWIBOX= (0..15)
0 0 2 0 0 0 0 0 0 0 0 0 0 0 0 0 
##$SW_h= 3612.71676300578
##$TD= 16384
##$TD0= 1
##$TE= 0
##$TE2= 300
##$TE3= 300
##$TEG= 300
##$TL= (0..7)
0 120 120 120 120 120 120 120 
##$TP= (0..7)
150 150 150 150 150 150 150 150 
##$TP07= 0
##$TPNAME0= <>
##$TPNAME1= <>
##$TPNAME2= <>
##$TPNAME3= <>
##$TPNAME4= <>
##$TPNAME5= <>
##$TPNAME6= <>
##$TPNAME7= <>
##$TPOAL= (0..7)
0.5 0.5 0.5 0.5 0.5 0.5 0.5 0.5 
##$TPOFFS= (0..7)
0 0 0 0 0 0 0 0 
##$TUNHIN= 0
##$TUNHOUT= 0
##$TUNXOUT= 0
##$USERA1= <user>
##$USERA2= <user>
##$USERA3= <user>
##$USERA4= <user>
##$USERA5= <user>
##$V9= 5
##$VALIST= <valist>
##$VCLIST= <CCCCCCCCCCCCCCC>
##$VD= 0
##$VDLIST= <DDDDDDDDDDDDDDD>
##$VPLIST= <PPPPPPPPPPPPPPP>
##$VTLIST= <TTTTTTTTTTTTTTT>
##$WBST= 1024
##$WBSW= 4
##$XGAIN= (0..3)
0 0 0 0 
##$XL= 0
##$YL= 0
##$YMAX_a= 219730
##$YMIN_a= -302297
##$ZGOPTNS= <>
##$ZL1= 120
##$ZL2= 120
##$ZL3= 120
##$ZL4= 120
##$ABSF1= 10
##$ABSF2= 0
##$ABSG= 5
##$ABSL= 3
##$ALPHA= 0
##$AQORDER= 0
##$ASSFAC= 0
##$ASSFACI= 0
##$ASSFACX= 0
##$ASSWID= 0
##$AUNMP= <proc_1d>
##$AZFE= 0.1
##$AZFW= 0.1
##$BCFW= 1
##$BC_mod= 2
##$BYTORDP= 1
##$COROFFS= 0
##$CY= 11.3945322036743
##$DATMOD= 1
##$DC= 2
##$DFILT= <>
##$DTYPP= 0
##$F1P= 2.36226072786647
##$F2P= -0.459571619588291
##$FCOR= 0.5
##$FTSIZE= 0
##$FT_mod= 4
##$GAMMA= 1
##$GB= 0.15
##$INTBC= 1
##$INTSCL= 1
##$ISEN= 128
##$LB= 0.24
##$LEV0= 0
##$LPBIN= 0
##$MAXI= 10000
##$MC2= 0
##$MEAN= 0
##$ME_mod= 0
##$MI= 1.114404
##$NCOEF= 0
##$NC_proc= 0
##$NLEV= 6
##$NOISF1= 3.799351
##$NOISF2= 2.8
##$NSP= 1
##$NTH_PI= 0
##$NZP= 0
##$OFFSET= 15.70392
##$PC= 1
##$PHC0= -16594.6
##$PHC1= 19.20078
##$PH_mod= 1
##$PKNL= yes
##$PPARMOD= 0
##$PSCAL= 0
##$PSIGN= 0
##$REVERSE= no
##$SF= 200.130013532006
##$SI= 16384
##$SIGF1= 3
##$SIGF2= 2
##$SINO= 400
##$SIOLD= 16384
##$SREGLST= <1H.CDCl3>
##$SSB= 0
##$STSI= 0
##$STSR= 0
##$SW_p= 3612.71676300578
##$SYMM= 0
##$S_DEV= 0
##$TDeff= 0
##$TDoff= 0
##$TI= <>
##$TILT= no
##$TM1= 0
##$TM2= 0
##$TOPLEV= 0
##$USERP1= <user>
##$USERP2= <user>
##$USERP3= <user>
##$USERP4= <user>
##$USERP5= <user>
##$WDW= 1
##$XDIM= 8192
##$YMAX_p= 0
##$YMIN_p= 0
$$ End of Bruker specific parameters
$$ ---------------------------------
##NTUPLES= NMR FID
##VAR_NAME=  TIME,          FID/REAL,        FID/IMAG
##SYMBOL=    X,             R,               I
##VAR_TYPE=  INDEPENDENT,   DEPENDENT,       DEPENDENT
##VAR_FORM=  AFFN,          ASDF,            ASDF
##VAR_DIM=   8192,          8192,            8192
##UNITS=     SECONDS,       ARBITRARY UNITS, ARBITRARY UNITS
##FACTOR=    0.0002768,     1,               1
##FIRST=     0,             0,               0
##LAST=      2.2672688,     0,               0
##MIN=       0,             -302297,         0
##MAX=       2.2672688,     219730,          0
$$ Real data points
##PAGE= N=1
##DATA TABLE= (X++(R..R)), XYDATA
$$ [...]
$$ plain form
1517 -170 382 339 -291 135 -519 -310 513 -166 727 614 -646 15 -392 -391 668 230 217 192 -751 47 -217
1538 -217 -283 732 -140 116 250 -911 -300 123 -300 927 145 -231 40 -645 -58 367 -119 661 113
1557 113 -320 -170 -476 183 568 26 693 -16 -668 81 -584 14 710 -199 180 -182 -602 108 -231 306
1577 306 578 -129 9 -123 -513 378 127 116 595 -377 46 265 -528 428 154 -96 396 -409 -294 283
1597 283 -190 395 -116 -388 62 -222 -90 198 -432 251 2 -602 247 25 -13 515 -62 -10 -34 -532 253
1618 253 -74 193 541 -157 -104 -179 -506 388 108 -87 443 -344 -307 71 -454 152 379 -172 309 -273 -443
1639 -443 68 -324 501 343 -176 161 -426 -371 314 -112 317 566 -512 -25 -197 -423 427 340 183 271 -196
1660 -196 -114 -239 -292 506 -74 72 89 -671 -145 -42 -173 461 76 -235 221 -350 -213 50 31 459 153
$$ packed form
1517a70N52m3o30M26o54K09Q23o79Q93j13j260O61m07JJ059m38j3k5r43P98k64
1538b17o6J015q72K56J34j161O11M23m23J227p82l76K71o85N87M25m86P80n48
1557A13m33J50l06O59L85n42O67p09o52P49o65N98O96r09L79l62m20P10l39N37
1577C06K72p07J38j32l90Q91k51j1M79r72M23K19p93R56k74k50M92q05J15N77
1597B83m73N85n11k72M50k84J32K88o30O83k49o04Q49k22l8N28n77N2k4m98P85
1618B53l27K67L48o98N3p5l27Q94k80j95N30p87L7L78n25O06K27n51M81n82j70
1639d43N11l92Q25j58n19L37n87N5O85m26M29K49j078M87j72k26Q50q7j57Q8m67
1660a96Q2j25n3P98n80J46J7p60N26J03j31O34l85l11M56n71J37K63j9M28l06
$$ plain form
1681 153 -150 128 -277 181 180 -223 564 17 -295 459 -274 -226 504 -235 48 97 -400 234 -58 -124 179 -531
1703 -531 0 188 -456 486 -108 -66 371 -399 -111 365 -184 379 54 -172 -18 -188 -44 326 -130 206
1723 206 33 -440 112 -269 4 354 -48 -54 71 -510 146 -75 -48 432 2 -35 -47 -221 29 40 166 489
1745 489 -52 -60 -6 -489 229 240 55 449 -107 -189 -52 -249 159 213 71 206 -266 -186 55 -200 259 264 -142
1768 -142 161 -204 -328 358 -126 211 287 -283 -119 -41 -214 215 -89 55 206 -161 102 -147 -150 184 -150
1789 -150 -90 97 -426 -166 115 -31 296 150 -306 39 -163 -116 145 -200 192 -158 -183 168 -117 -67 170
1810 170 -297 -29 39 -295 45 -5 -100 160 -124 -94 -65 -191 194 145 215 77 -231 7 153 -161 317 94
1832 94 -76 295 -246 -81 118 5 266 375 -159 107 -15 -142 157 -64 234 71 -192 143 -327 -135
$$ packed form
1681A53l03K78m05M58jm03P87n47l12P54p33M8P30p39K83M9m97O34k92o6L03p10
1703e31N31J88o44R42n94M2M37p70K88M76n49N63l25k26J54j70J44L70m56L36
1723B06j73m73N52l81K73L50m02oJ25n81O56k21K7M80m30l7j2j74K50J1J26L23
1745D89n41qN4m83P18J1j85L94n56q2J37j97M08N4j42J35m72Q0K41k55M59Nm06
1768a42L03l65j24O86m84L37P6n70J64P8j73M29l04J44J51l67K63k49lL34l34
1789a50O0J87n23K60K81j46L27j46m56L45k02M7K61l45L92l50k5L51k85N0K37
1810A70m67K68O8l34L40n0r5K60k84L0K9j26L85m9P0j38l08K38J46l14M78k23
1832I4j70L71n41J65J99j13K61J09n34K66j22j27K99k21K98j63k63L35m70J92
$$ plain form
1852 -135 270 61 64 212 -179 -20 -54 -230 201 19 4 36 -129 30 -2 121 399 -108 80 199 -231 116
1874 116 162 -261 310 196 -156 -113 -155 -162 183 -78 102 -185 -16 142 -177 84 95 -76 53 113 -231 263
1896 263 -97 4 243 -102 -31 -22 -247 124 -59 26 180 -107 -6 96 -271 81 253 -185 17 -60 -181 260
1918 260 -14 235 302 -221 -66 -193 -49 170 -37 165 62 -165 86 57 -80 297 -162 71 42 -210 -1
1939 -1 21 5 173 -29 15 -41 -162 104 148 175 262 -235 -19 110 -284 -147 133 -127 264 -85 -175 195 -47
1962 -47 90 -42 -65 57 -127 -135 144 -19 25 234 -139 -70 59 -219 79 -153 -130 163 -69 174 22 -56 75
1985 75 -21 75 117 -232 93 -44 -70 148 20 -176 -38 -166 -77 276 -62 85 3 -246 -28 -26 -1 206 -65
2008 -65 0 -27 -175 232 29 51 109 -224 92 23 -46 61 -108 -94 2 -108 -106 38 -216 92 70 -145 136 -276
$$ packed form
1852a35M05k09LJ48l91J59l4j76M31j82j5L2j65J59l2J23K78n07J88J19m30L47
1874A16M6m23N71j14l52M3m2pL45k61J80k87J69J58l19K61J1j71J29O0l44M94
1896B63l60J01K39l45P1Rk25L71j83Q5J54k87J01J02l67L52J72m38K02p7j21M41
1918B60k74K49O7n23J55j27J44K19k07K02j03k27K51k9j37L77m59K33k9k52K09
1939aK2j6J68k02M4n6j21K66M4K7Q7m97K16J29l94J37K80k60L91l49r0L70k42
1962d7J37j32k3J22j84qK79j63M4K09l73O9J29k78K98k32K3K93k32K43j52p8J31
1985G5r6R6M2l49L25j37k6K18j28j96J38j28Q9L53l38J47q2k49K18KK5K07k71
2008f5O5k7j48M07k03K2N8l33L16o9o9J07j69J4R6j10KJ44k54L08k2k15K81m12
$$ plain form
2032 -276 61 132 14 27 151 -113 -127 -13 -199 -13 87 -56 80 -153 -15 21 -3 89 -14 53 173 -55
2054 -55 -7 102 -197 215 -30 31 121 -214 -57 -32 -90 69 -44 -31 82 -193 13 -11 -38 187 -5 -186 140
2077 140 -78 -10 187 -115 103 153 -38 130 22 -5 67 -206 97 -53 -100 -50 -179 114 208 -25 -169 193
2099 193 -38 30 0 -179 77 87 29 -6 -2 -128 -33 -84 84 -71 -105 116 -58 2 161 -33 -93 18 -272 151
2123 151 -41 -4 -3 -49 -3 -129 -45 194 101 115 118 -262 21 70 -101 31 13 -160 5 -175 77 43 10 180 63
2148 63 -193 24 -196 -60 199 18 123 78 -196 49 -186 20 194 -125 -62 -23 -186 179 -16 -47 119 -50
2170 -50 -172 39 -45 53 69 -19 158 -64 -131 129 -168 -15 44 -92 86 22 -86 -8 -16 150 -58 -124 55 -89
2194 -89 -130 54 0 108 108 -223 94 149 11 93 133 -53 -154 -169 25 -88 -115 157 -17 60 140 -75 198 138
$$ packed form
2032b76L37P1j18J3J24k64j4J14j86J86J00j43J36k33J38L6k4R2j03O7J20k28
2054e5M8J09k99M12k45O1R0l35J57K5n8J59j13J3J13k75K06k4k7K25j92j81L26
2077A40k18O8J97l02K18N0j91J68j08k7P2k73L03j50m7N0j29K93R4k33j44L62
2099A93k31O8l0j79K56J0n8l5Mj26R5n1J68j55l4K21j74O0J59j94o0J11k90M23
2123A51j92L7Jm6M6j26Q4K39r3J4Ll80K83M9j71J32j8j73J65j80K52l4l3J70j17
2148F3k56K17k20J36K59j81J05m5k74K45k35K06J74l19O3L9j63L65j95l1J66j69
2170e0j22K11q4R8J6q8J77k22o7K60k97J53N9j36J78o4j08P8qJ66k08o6J79j44
2194h9m1J84n4J08%l31L17N5j38Q2M0j86j01j5J94j13k7K72j74P7Q0k15K73o0
$$ plain form
2218 138 -90 284 -89 -136 -46 -26 -23 324 -61 105 45 -245 -9 -76 -55 85 -217 -13 -51 -286 147 -144 14
2241 14 45 0 -174 23 -66 -131 74 98 196 129 -55 78 31 134 73 -65 175 -131 -58 139 -21 69 138 -207
2265 -207 107 -18 1 125 5 180 14 -70 42 15 60 42 -117 -46 -6 47 -24 -50 -193 95 117 -146 22 -184
2289 -184 -63 43 17 -52 -99 107 -4 -100 165 135 -53 130 -95 118 13 -88 -13 124 27 -72 8 81 -43
2312 -43 64 42 185 -73 58 -72 -60 314 -23 42 215 36 -2 -61 -161 -4 96 51 88 -156 -160 -84 -156 82
2336 82 -34 -41 26 -97 -58 131 22 115 222 -139 148 123 -140 26 -61 132 125 -30 153 38 -159 260 -83
2359 -83 -49 32 -198 52 -83 -103 90 -83 -14 20 -129 -68 -49 -29 7 -40 -7 158 69 153 204 -87 71 -141 -124
2384 -124 79 17 36 123 -174 -90 -3 -92 109 -24 -214 35 -69 6 18 -100 131 -131 -138 168 -114 -142 44 -23
$$ packed form
2218A38k28L74l73m7R0K0LL47l85J66o0k90K36o7K1J40l02K04l8k35M33k91J58
2241A4L1m5j74J97q9o5K05K4R8o7j84J33m7J03o1j38K40l06P3J97j60R0O9l45
2265b07L14j25J9J24j20J75j66q4J12k7M5j8j59P1M0N3p1k6j43K88K2k63J68k06
2289a84J21J06k6o9m7K06j11r6K65l0j88J83k25K13j05j01P5J37r7r9Q0P3j24
2312d3J07k2J43k58J31j30J2L74l37O5J73j79l8n9j00J57J00m5L7k44mP6p2K38
2336H2j16pO7j23L9J89j09R3J07l61K87k5k63J66q7J93pj55J83j15j97M19l43
2359h3L4Q1k30K50j35k0J93j73O9L4j49O1J9K0L6m7L3J65q9Q4N1k91J58k12J7
2384a24K03o2J9Q7k97Q4Q7q9K01j33j90K49j04P5J2j18K31k62pL06k82k8J86o7
$$ plain form
2408 -23 14 -108 -67 86 -176 103 100 -65 105 42 -28 139 -132 -89 224 -154 213 45 -299 -14 80 -26 153
2431 153 -131 -10 -30 -289 73 60 -6 68 79 91 -50 -159 18 9 -4 131 115 -231 -169 -163 -49 89 52 16 -221
2456 -221 -88 -14 -83 -18 129 -223 127 51 -261 36 25 -109 22 -104 -42 113 72 123 -29 140 105 -199 231
2479 231 65 -170 77 -146 -126 324 -158 -151 90 22 4 -105 -251 -26 39 -32 95 -55 111 -93 -103 165 14
2502 14 98 140 -30 113 139 -88 71 20 73 46 -127 -108 35 -238 92 -49 -51 127 -140 -112 25 -211 -10 57
2526 57 -65 57 -252 -86 6 72 157 -28 19 -126 14 -53 151 41 59 -60 -124 114 -60 -64 127 -70 135
2549 135 -149 -85 135 -62 -137 107 90 -28 142 -322 80 -244 -242 -16 181 15 230 -22 131 66 -233 381
2571 381 17 37 137 10 -74 210 8 54 -130 73 241 -214 91 110 -113 169 -101 -163 200 13 -65 29
$$ packed form
2408b3L7j22M1J53k62K79lj65J70o3p0J67k71M3L13l78L67j68l44K85R4j06J79
2431A53k84J21k0k59L62j3o6P4J1J2j41j09J77rj3J35j6l46O2OJ14J38l7l6k37
2456b21J33P4o9O5J47l52L50p6l12K97j1j34J31j26O2J55m1N1j52J69l5l04M30
2479B31j66k35K47k23K0M50m82PK41o8j8j09j46K25O5p1J27j50J66k04j0K68j51
2502A4Q4M2j70J43K6k27J59n1N3k7j73J9J43k73L30j41kJ78k67K8J37k36K01O7
2526E7j22J22l09J66R2O6Q5j85M7j45J40o7K04j10J8j19o4K38j74mJ91j97K05
2549A35k84O4K20j97p5K44j7j18J70m64M02l24KK26J97j66K15k52J53o5k99O14
2571C81l64K0J00j27q4K84k02M6j84K03J68m55L05J9k23K82k70o2L63j87p8R4
$$ plain form
2593 29 -123 -48 108 -160 43 -88 -26 -11 -219 178 40 -5 258 -126 -143 31 -114 -100 87 30 96 -72 -115
2616 -115 -161 50 44 195 -34 77 73 -216 73 -84 140 363 2 -45 45 -35 113 78 -89 83 -96 48 -96
2639 -96 -154 -25 27 -185 -43 6 -29 77 -157 100 44 -113 -1 -57 -309 79 123 190 231 56 -20 164 -155 57
2663 57 -82 36 131 101 -50 102 -72 113 25 -40 81 -22 -126 -4 -62 14 -39 73 10 -113 -47 227 -50
2686 -50 83 -187 -84 126 -20 18 84 -66 94 93 -49 -25 40 -32 122 78 19 -71 -101 110 -189 -123 91 -79
2710 -79 -42 -23 -111 109 163 -125 6 -97 -109 -71 -212 35 -6 116 39 -177 -75 148 -95 160 257 -217 -26
2733 -26 97 -96 91 -28 -72 135 -79 36 -57 21 215 -19 0 -40 -154 -38 124 -104 -28 54 -191 -28 -158
2756 -158 64 127 67 30 136 -77 94 29 116 28 130 16 86 -202 80 -33 -54 320 -129 40 106 -173 51
$$ packed form
2593B9j52P5J56k68K03j31O2J5k08L97j38m5K63l84j7J74j45J4J87n7O6j68m3
2616a15m6K11oJ51k29J11mk89K89j57K24K23l61m7R0q0J48l5j67J72j79J44j44
2639i6n8J29N2k12J42M9l5J06k34K57n6j57J12n6k52L88M4O7M1j75p6J84l19K12
2663E7j39J18R5l0j51J52j74J85q8o5J21j03j04J22n8P6n3J12o3j23O6K74k77
2686e0J33k70J03K10j46L8O6j50J60jj42K4O5p2J54m4n9r0l0K11k99O6K14j70
2710g9L7J9q8K20N4k88J31j03j2L8j41K47m1J22p7k16J02K23k43K55R7m74J91
2733b6J23j93J87j19m4K07k14J15r3P8J94k34J9m0j14J16J62k28P6Q2k45J63j30
2756a58K22O3o0l7J06k13J71o5Q7q8J02j14P0k88K82j13k1L74m49J69O6k79K24
$$ plain form
2779 51 64 -39 140 -56 127 -36 39 30 -58 -112 127 -100 57 91 -148 94 -25 -77 21 20 -73 -75 -26 133 97 -96
2805 -96 68 -162 -93 66 45 215 -41 -73 21 129 -19 177 -178 -34 -13 -152 83 10 -110 48 -36 -45 -14 -210
2829 -210 -115 -82 -82 148 226 58 -26 -127 110 165 96 -86 -2 9 -31 -50 91 183 -54 240 50 -104 45 -172
2853 -172 18 88 -36 68 5 -115 88 18 147 -46 -95 -27 29 -202 58 -20 -112 130 -223 -24 89 -34 31
2876 31 144 -91 46 34 -31 -124 -10 96 -82 -262 223 -160 -115 36 -85 62 -62 -154 91 4 5 139 -73
2899 -73 39 14 -60 -119 14 11 66 -255 119 93 -129 -3 -39 145 106 -126 -76 116 -86 -114 49 -12 74 -20 -63
2924 -63 74 -51 -32 -83 -176 -145 -184 -121 280 45 -141 96 -141 153 -58 -172 101 107 31 -99 -267 -46 58
2947 58 -109 -23 -34 -98 185 -98 184 -40 -430 204 80 -149 150 57 -28 134 -128 88 -46 6 201 -138
$$ packed form
2779E1J3j03J79j96J83j63P5rq8n4K39k27J57L4k39K42j19n2R8jr3kM9J59l6j93
2805i6J64k30O9J59k1J70k56l2R4J08j48J96l55J44K1j39K35p3j20J58q4rL1j96
2829b10R5L3%K30P8j68q4j01K37N5o9j82Q4J1m0j9J41R2k37K94j90j54J49k17
2853a72J90P0j24J04o3j20K03p0J29j93m9O8N6k31K60p8r2K42l53J99J13j23O5
2876C1J13k35J37j2o5r3J14J06j78j80M85l83M5J51j21J47j24r2K45q7JJ34k12
2899g3J12k5p4n9J33lN5l21L74k6k22J26l6J84l9k32N0J92k02k8J63o1Q6r4m3
2924f3J37j25J9n1r3L1l9O3M01k35j86K37k37K94k11j14K73Op6j30j68K21J04
2947E8j67Q6j1o4K83k83K82k24l90O34j24k29K99r3q5J62k62K16j34N2J95l39
$$ plain form
2969 -138 35 195 -74 123 57 -2 163 -82 37 104 19 -32 92 -55 154 -1 63 -20 -99 -8 -13 -25 177 -11
2993 -11 -31 -94 -32 35 183 90 14 18 1 107 -109 -41 133 117 39 -45 -116 19 104 -69 186 -161 34 -139 -340
3018 -340 15 -15 20 -136 91 14 36 -45 185 71 -9 -1 -41 150 179 98 -8 83 -66 211 -108 -146 87 -193
3042 -193 -15 147 -33 118 -66 -102 134 -146 50 39 -145 13 56 -94 60 -21 134 -74 -9 19 25 -106 -72
3065 -72 -57 14 252 -143 18 56 -30 103 -122 -51 33 160 -223 -6 -91 73 48 26 16 -141 -102 35 -103 -1
3089 -1 -108 -102 207 -137 3 91 -175 61 133 -60 -19 213 -52 123 -113 -40 -58 -135 15 -5 36 -9 -197 85
3113 85 113 -20 253 25 -107 83 76 48 90 -28 16 154 22 -32 17 54 239 -26 127 114 -73 -36 -51 -204
3137 -204 89 -163 -127 25 -171 111 -39 -173 90 -105 19 186 -132 80 100 -32 177 -123 -88 -44 -218
$$ packed form
2969a38J73J60k69J97o6n9J65k45J19O7q5n1J24j47K09j55O4q3p9R1nj2K02j88
2993a1k0o3O2O7J48r3p6Mj7J06k16O8J74j6p8q4p1J35Q5j73K55l47J95j73k01
3018c40L55l0L5j56K27p7K2q1K30j14q0Qm0J91K9q1j06R1j49K77l19l8K33k80
3042a93J78J62j80J51j84l6K36k80J96j1j84J58M3j50J54q1J55k08O5K8Oj31L4
3065g2J5P1K38l95J61L8q6J33k25P1Q4J27l83K17q5J64k5k2j0j57L9J37j38J02
3089aj07OL09l44J40Q8k66K36P2j93M1K32k65J75k36P3j8p7J50k0M1m5j88K82
3113H5K8j33K73k28j32J90pk8M2j18M4J38j32n4M9L7J85k65J53j3j87L7j5j53
3137b04K93k52L6J52j96K82j50j34K63j95J24J67l18K12K0j32K09l00L5M4j74
$$ plain form
3158 -218 -55 115 -88 288 -39 -62 199 -14 -72 127 -14 -81 -11 -89 36 -99 42 143 -292 78 -84 -81
3180 -81 128 117 -211 38 -114 116 -13 94 198 63 110 181 -88 76 54 -206 43 -218 -158 127 -38 42
3202 42 -39 -165 48 57 -212 65 -171 60 72 10 -11 126 5 168 90 0 109 -136 -31 -98 -43 5 -35 -103 106
3227 106 -7 -188 -65 -215 -6 -37 -47 81 41 51 95 -35 101 187 25 277 45 -15 202 -53 93 -41
3249 -41 -16 183 -36 -11 138 -64 -32 36 -207 161 -17 -100 55 -15 -56 182 -219 -35 96 21 87 -81 -44 54
3273 54 -116 93 34 -166 183 39 -15 56 -163 10 -26 20 63 6 48 164 -63 -25 98 -219 72 -45 -295
3296 -295 88 -236 -73 44 -145 -138 105 -71 261 11 -5 -17 -175 -22 -62 52 181 96 -19 57 -138 -63 125
3319 125 -117 225 58 -242 129 -71 -49 40 -165 -61 7 -103 -93 19 -92 70 -88 -119 -15 -224 61 182
$$ packed form
3158b18J63J70k03L76l27k3K61k13n8J99j41o7P0p8J25j35J41J01m35L70j62L
3180h1K09j1l28K49j52K30j29J07J04j35M7P1k69J64k2k60K49k61O0K85j65Q0
3202D2q1j26K13Rk69K77k36K31J2o2k1J37j21J63p8r0J09k45J05o7N5M8m0o8K09
3227A06j13j81J23j50K09l1j0J28m0J0M4j30J36Q6j62K52k32o0K17k55J46j34
3249d1K5J99k19K5J49k02L2O8k43L68j78q3J55p0m1K38m01J84J31p5O6j68L7R8
3273E4j70K09n9k00L49j44n4P1k19J73l6M6M3n7M2J16k27L8J23l17K91j17k50
3296b95L83l24J63J17j89PK43j76L32k50j6j2j58J53m0J14J29q5j15P6j95P5J88
3319A25k42L42j67l00L71k00K2Q9k05J04O8j10J0J12j11J62j58l1J04k09K85J21
$$ plain form
3341 182 17 375 -37 67 171 -188 9 47 49 -17 -147 62 87 -105 313 32 -91 249 -26 -266 -1 -75
3363 -75 108 133 -67 14 64 -90 246 -106 44 182 -1 -91 -15 19 215 -116 65 61 -264 97 20 -279 306
3386 306 -47 -86 187 -100 -95 40 -118 156 9 -108 122 -244 68 116 -185 121 144 -283 56 -128 -80 190
3408 190 -91 73 -44 -213 176 -80 -65 49 -213 1 38 -222 127 28 -249 114 -65 -102 -5 -161 16 -122
3430 -122 -152 85 -103 -229 100 -100 130 -19 28 208 -114 -41 184 -140 -51 9 -166 65 -108 -25 43 -38 81
3453 81 78 -118 -23 40 -57 -11 -171 55 120 -167 47 -85 -38 158 -12 -116 23 -184 -200 184 -14 185 -29
3476 -29 -57 143 -161 66 6 -8 170 39 -28 -48 -63 132 149 -145 -56 37 -16 44 -33 -41 127 -141 77 32 -1 102
3502 102 127 60 344 -75 -3 -79 -88 149 -36 75 51 -21 86 85 84 111 33 -70 93 -201 -15 122 -214 174 45
$$ packed form
3341A82j65L58m12J04J04l59J97L8Ko6j30K09K5j92M18k81j23L40k75k40K65p4
3363g5J83K5k00Q1N0j54L36l52J50J38j83r0P6L4J96l31J81ml25L61p7k99N85
3386C06l53l9K73k87NJ35j58K74j47j17K30l66L12M8l01L06K3m27L39j84M8K70
3408A90k81J64j17j69L89k56J5J14k62K14L7k60L49r9k77L63j79l7R7j56J77j38
3430a22l0K37j88j26L29k00K30j49M7J80l22P3K25l24Q9O0j75K31j73Q3O8q1J19
3453H1lj96R5O3r7M6j60K26O5k87K14j32M7J96j70j04J39k07j6L84j98J99k14
3476b9k8K00l04K27o0j4J78j31o7k0j5J95J7k94Q9R3n3O0p7qJ68k68K18m5l3J03
3502A02K5o7K84m19P2p6rK37j85J11k4p2J07jjK7p8j03J63k94J86J37l36L88j29
$$ plain form
3527 45 -189 77 11 240 259 -59 21 -51 -53 -78 -26 -25 112 -131 18 77 -182 109 40 -110 173 -33 -23 165 -87
3552 -87 188 -78 -10 66 79 -80 216 46 176 130 -71 71 3 -94 149 -158 -26 1 -140 169 93 -79 37
3575 37 -60 -42 80 -82 -54 34 -166 44 -15 40 271 -72 37 -61 -19 95 19 -194 10 -210 145 111 23 38
3599 38 -68 -137 23 82 54 172 -85 -36 -38 -130 172 -14 58 192 -149 -21 1 -50 127 13 -16 -9 -138 165 -31
3624 -31 -157 183 -134 -99 15 -165 -150 96 -70 127 -124 -65 -50 -218 -8 90 -52 98 -1 -196 100 -68
3646 -68 -11 207 -87 20 101 7 159 34 -28 15 -122 118 -155 -138 91 -28 -10 80 -98 80 19 84 -36 -79
3670 -79 -110 238 -102 -183 69 -71 108 69 -84 67 -185 -124 23 49 -8 -10 -39 -26 -126 -100 -6 -16 -17 114 -222
3695 -222 -65 -54 -236 35 -114 -43 -64 -229 -112 97 -36 247 -144 -48 99 -102 135 162 -103 -10 23 -55 68
$$ packed form
3527D5k34K66o6K29J9l18Q0p2kk5N2JJ37k43J49N9k59K91o9j50K83k06J0J88k52
3552h7K75k66O8P6J3j59K96j70J30m6k01J42o8r7K43l07J32K7j41L09p6j72J16
3575C7r7J8J22j62K8Q8k00K10n9N5K31l43J09r8M2J14p6k13K04k20L55l4q8J5
3599C8j06o9J60N9k8J18k57M9kr2L02j86P2J34l41J28K2n1J77j14k9Pj29L03j96
3624c1j26L40l17L5J14j80J5K46j66J97k51N9J5j68K10R8j42J50r9j95K96j68
3646f8N7K18k94J07Q1r4J52j25o2M3j37K40k73J7K29j19J8R0j78J78o1O5j20m3
3670g9l1L48l40q1K52j40J79l9j53J51k52O1J47K6n7kk9J3j00K6R4j0jJ31l36
3695b22J57J1j82K71j49P1k1j65J17K09j33K83l91R6J47k01K37K7k65R3L3p8J23
$$ plain form
3718 68 -42 -169 45 -164 116 -15 -77 40 -66 -10 -46 -170 -4 27 -130 95 140 62 34 -17 -45 -44 39 126 -109
3743 -109 -102 -58 14 -45 68 -192 66 -25 -197 117 -5 -141 -11 13 72 -89 -331 62 -142 -30 190 -26 46
3766 46 206 -118 174 8 -31 158 -60 34 -4 31 -42 39 48 -116 31 57 -22 -206 49 -39 -132 32 -255 -173 -59
3791 -59 -239 25 -37 -263 60 -193 87 48 -53 136 101 34 99 49 -142 78 0 171 -70 -33 210 -11 118
3814 118 104 -97 106 173 -97 36 37 -213 62 114 12 99 -78 105 40 -68 18 -106 -48 219 -219 -170 14
3837 14 -85 85 -148 93 12 -143 75 -5 -107 4 -118 -72 79 -67 140 -40 59 -84 122 -97 -89 -102 -114
3860 -114 152 -66 -85 26 -107 30 -15 99 141 74 167 -41 -56 128 99 -234 91 -153 34 97 -35 5 69
3883 69 -1 67 -33 -157 147 -133 -5 311 -107 163 42 2 139 30 47 -12 -47 54 59 -122 -34 -12 36 50
$$ packed form
3718F8j10j27K14k09K80j31o2J17j06N6l6j24J66L1j57K25M5p8k8n1k8JQ3Q7k35
3743a09PM4P2n9J13k60K58r1j72L14j22j36J30K4N9j61k42L93k04J12K20k16P2
3766D6J60l24K92j66l9J89k18R4l8L5p3Q1Rj64J47K6p9j84K55q8r3J64k87Q2J14
3791e9j80K64o2k26L23k53K80l9j01J89l5o7O5n0j91K20p8J71k41L7K43k21J29
3814A18j4k01K03O7k70J33Jk50K75N2j02Q7j77J83o5j08Q6j24N8K67m38M9J84
3837A4r9J70k33K41q1j55K18q0j02J11j22M6J51j46K07j80R9j43K06k19Qj3j2
3860a14K66k18j9J11j33J37m5J14M2o7R3k08j5J84k9l33L25k44J87O3j32M0O4
3883F9p0O8j00j24L04k80J28L16m18K70j21m0J37j09J7n9l5J01Nj81Q8K2M8J4
$$ plain form
3907 50 -167 -19 88 -9 35 -148 -77 163 -80 31 -23 -80 -61 86 -14 14 60 19 83 -14 -2 97 39 202 10
3932 10 -5 115 49 6 51 -99 102 69 64 -36 -20 -67 26 -33 50 -159 -124 -33 -35 -32 100 -155 55 -175 -176 96 -19
3959 -19 127 -85 -14 103 32 -11 43 -15 138 59 -39 26 96 -33 26 -34 -65 47 -63 46 78 -204 81 -28 -55
3984 -55 175 -60 5 11 -51 101 49 -95 135 -163 46 105 -79 -19 -15 117 -116 -66 -19 139 35 -40 89 -55
4008 -55 157 -57 -192 -87 -54 -75 45 134 139 -80 18 87 6 69 87 -28 18 174 102 -51 -61 -81 -108 -66 81 84
4034 84 -191 -3 14 23 84 -94 -42 65 -36 -53 12 -94 4 -43 -26 43 -137 78 -98 -31 99 -137 38 53 -122
4059 -122 175 21 132 109 35 19 190 -44 -177 67 50 -235 62 -56 42 -112 -135 195 2 166 -47 -56 54
4082 54 21 65 94 30 39 -93 -86 16 -39 -188 71 -134 42 156 18 -104 0 42 45 -51 42 86 117 -8 -113 9
$$ packed form
3907E0k17J48J07r7M4j83P1K40k43J11n4n7J9J47j00K8M6m1O4r7J2R9n8J63j92
3932A0j5J20o6m3M5j50K01l3nj00J6m7R3n9Q3k09L5R1kLJ32k55K10k30jK72j15
3959a9J46k12P1J17p1m3N4n8J53p9r8O5P0j29N9o0l1J12j10J09L2k82K85j09k7
3984e5K30k35O5Oo2J52n2j44K30k98K09N9j84O0MJ32k33N0M7J58j04p5J29j44
4008e5K12k14j35J05L3k1J20Q9Nk19R8O9q1O3J8j15M6J56p2j53j0k0k7M2J47L
4034H4k75J88J7RO1j78N2J07j01j7O5j06R8m7J7O9j80K15j76O7J30k36J75J5j75
4059a22K97j54J11k3p4j6J71k34j33K44j7k85K97j18R8j54k3L30j93J64k13rJ10
4082E4l3M4K9o4Rj32PJ02n5j49K59k05J76J14j38j22J04M2Lr6R3M4L1j25j05J22
$$ plain form
4108 9 26 10 -89 -88 -53 60 73 -5 59 -32 102 -65 53 51 187 -15 124 -61 -109 39 -45 8 67 -5 28 74 65 -48
4136 -48 -107 -170 161 -116 88 39 0 76 23 58 -20 -88 -61 128 -137 148 41 -199 -29 -105 57 121 37 -1 -8 -152
4162 -152 76 -108 -133 121 -44 -98 -88 47 -81 -18 -20 30 -130 84 127 -33 -73 117 25 66 -91 132 124 -109
4186 -109 136 -79 -35 20 -185 -95 84 -78 60 -46 39 71 -24 -84 133 -95 -137 29 -8 67 -47 -2 92 76
4210 76 11 88 6 93 19 -199 -153 -3 -19 0 -103 -113 76 -2 92 42 -115 -40 -111 138 34 -145 -20 8 -123
4235 -123 32 -75 79 -7 -93 116 113 14 151 77 -4 57 -185 53 -105 -38 43 -22 38 -93 -132 103 -13 -14 49
4260 49 90 -60 6 -122 29 235 -123 74 -173 -162 51 -235 -149 94 -103 48 30 -167 107 -3 -71 -28 30
4283 30 85 5 -80 60 -56 8 143 -84 -53 103 -63 141 -110 -22 -7 -152 45 -51 30 83 176 -67 27 -170
$$ packed form
4108IJ7j6r9JL5J13J3p8O4r1J34j67J18kJ36k02J39j85m8J48q4N3N9p2L3M6rj13
4136d8n9o3L31k77K04m9l9P6n3L5p8o8K7J89k65K85j07k40J70p6J62O4q4l8pj44
4162a52K28j84k5K54j65n4J0J35j28O3kN0j60K14M3j60m0J90r2M1j57K23qk33
4186a09K45k15M4N5k05R0J79j62J38j06Q5L2r5o0K17k28m2J66l7P5j14M5R4j6
4210G6o5P7q2Q7p4k18M6J50j6J9j03j0J89p8R4n0j57P5p1K49j04j79J25K8j31
4235a23J55j07J54q6q6K09lr9J37p4q1O1k42K38j58O7Q1o5O0j31l9K35j16jO3
4260D9M1j50O6j28J51K06l58J97k47J1K13k86Q6K43j97J51j8j97K74j10o8M3N8
4283C0N5q0q5J40j16O4J35k27L1J56j66K04k51Q8J5j45J97r6Q1N3R3k43R4j97
$$ plain form
4307 -170 -11 110 -68 -37 84 -143 -147 -140 -86 56 -94 -9 40 -233 -93 -46 -84 13 -168 228 -30 222 -80 -16
4331 -16 107 49 -100 -143 108 -34 -29 11 116 74 -9 -201 38 -33 29 -34 47 -38 -40 -118 68 13 0 98 -132 86
4357 86 70 -120 33 -14 -73 142 55 4 63 -80 13 -8 -18 195 -60 -41 77 65 -50 15 -28 29 -23 -33 119 -181
4383 -181 -40 -34 -45 86 -155 23 167 -153 -13 -35 -24 -84 -72 -67 -46 -5 64 328 -147 160 -147 13 13 53 -121
4408 -121 54 -38 8 -53 61 41 105 -54 -58 114 94 13 -102 92 -127 53 206 -132 34 -95 -195 -46 22
4431 22 -54 144 -43 -106 153 -67 -136 51 34 27 38 154 85 12 68 -7 -75 59 65 66 155 40 -198 140 -57 113
4457 113 0 -126 -36 -68 -135 -6 -54 103 -70 -37 104 50 -17 2 10 -46 88 -114 -68 56 86 86 -40 20 44 -139
4483 -139 41 136 -105 104 32 -30 -6 -27 68 166 -111 31 55 74 102 64 17 90 -75 -30 72 -227 0 -262 -42
$$ packed form
4307a70J59J21j78L1J21k27mPN4J42j50Q5M9k73J40M7l8R7j81L96k58K52l02O4
4331a6J23n8j49m3K51j42NM0J05m2q3j92K39p1O2o3Q1q5kp8J86n5j3R8k30K18
4357H6j6j90J53m7n9K15q7n1N9j43R3k1j0K13k55J9J18j2j15O5m3N7n2j0J52l00
4383a81J41Oj1J31k41J78J44l20J40k2J1o0J2NK1M1O9K64m75L07l07J60%M0j74
4408a21J75r2M6o1J14k0O4j59mJ72k0q1j15J94k19J80J53l38J66j29j00J49O8
4431B2p6J98j87o3K59k20o9J87j7pJ1J16o9p3N6p5o8J34OJQ9j15k38L38j97J70
4457A13j13j26R0l2o7J29m8J57j73L3J41n4o7J9Qn6J34k02M6J24L0%j26O0K4j83
4483a39J80R5k41K09p2o2K4k1R5R8k77J42K4J9K8l8m7P3j65M5J02k99K27k62K20
$$ plain form
4508 -42 21 -8 -140 33 -94 15 -13 -6 72 -92 -23 -37 -55 18 -42 -212 138 -185 -20 -86 -40 133 -28 -218 -56
4533 -56 -2 -22 -8 -170 -25 -44 -107 89 -69 19 41 7 204 76 -154 -51 -7 101 163 -203 117 51 -55 102
4557 102 -63 -183 17 -227 103 117 -31 -42 -120 -39 14 -89 -94 74 -189 -20 53 -62 25 71 26 150 -43 -25
4581 -25 -2 3 88 25 -88 141 -140 -71 -11 -47 24 -67 -136 121 27 144 -45 29 165 -170 -4 168 -11 -66 102
4606 102 11 22 73 29 139 -103 -31 -54 -125 -15 68 17 122 -147 0 146 -21 -20 36 -45 14 51 -105 34 29 -40
4632 -40 -20 -143 -42 -103 -195 -99 94 -24 -20 -18 18 50 -216 56 -31 -4 88 6 -173 75 34 181 133 18 -50 2
4658 2 88 117 -103 -12 -21 24 -27 40 -7 91 -11 9 36 -126 43 12 -117 50 -4 47 -50 -238 -61 131 -291 -10
4684 -10 23 -57 119 -115 -19 185 93 139 -212 34 138 -89 -33 55 1 162 5 -9 -93 72 -95 26 -55 53
$$ packed form
4508d2O3k9j32J73j27J09k8PP8j64O9j4j8P3o0j70L50l23J65o6M6J73j61j90J62
4533e6N4k0J4j62J45j9o3J96j58Q8K2l4J97j28k30J03M4J08O2l66L20o6j06J57
4557A02j65j20K00k44L30J4j48j1p8Q1N3j03nJ68k63J69P3j15Q7M6m5J24j93J8
4581b5K3NQ5o3j13K29k81O9O0l6P1r1o9K57r4J17j89P4J36l35J66J72j79n5J68
4606A02r1J1N1m4J10k42P2k3p1J10Q3n1J05k69J47J46j67JN6q1N9L7j56J39no9
4632d0K0j23J01o1r2R6J93j18MKL6L2k66K72q7K7R2q2j79K48m1J47m8j15o8N2
4658BQ6K9k20R1rM5n1O7m7R8j02K0K7j62J69l1j29J67n4N1r7j88J77J92m22K81
4684a0L3q0J76k34R6K04r2M6l51K46J04k27N6Q8n4J61j57j4q4J65j67J21q1J08
$$ plain form
4708 53 79 -59 106 -121 48 283 18 81 -73 -199 66 4 -9 114 -65 -118 -11 -226 60 105 -82 138
4730 138 -35 0 30 -8 79 125 120 13 -91 -70 -11 -96 97 202 -7 34 88 -125 -86 -121 -68 -71 -107 -45 -89 -119 78
4757 78 -34 -25 -35 7 102 108 31 121 16 115 215 4 -12 58 -43 110 -116 -281 47 -40 -24 47 -175 105 -143
4782 -143 49 179 72 111 127 -52 99 53 -83 79 -140 62 56 -181 103 167 -209 -8 72 36 19 -195 -69
4805 -69 -46 -19 119 -112 -5 -57 -114 36 77 -173 228 155 -111 -11 -73 -31 163 -77 2 -34 33 81 -142 -4
4829 -4 -24 2 52 -35 -55 -90 6 -167 145 -119 2 91 -64 74 -56 102 -63 -219 11 -44 -101 91 -81 -143
4853 -143 104 11 -105 -41 -115 169 148 59 35 -54 24 65 -31 3 22 -53 -3 -154 -18 142 -237 -85 107 -112 90
4878 90 47 -89 92 86 -128 82 84 89 20 -20 215 -16 -42 96 16 8 98 39 -19 -66 -39 155 -82 109 -43 -137 18
$$ packed form
4708E3K6j38J65k27J69K35k65O3j54j26K65o2j3J23j79n3J07k15K86M5j87K20
4730A38j73L5L0l8Q7M6nj07j04K1N9q5J93J05k09M1N4k13L9l5N3ll6O2m4l0J97
4757G8j12Rj0M2R5Op7R0j05R9J00k11j6P0j01J53k26j65L28q7J6P1k22K80k48
4782a43J92J30j07L9J6j79J51m6j36J62k19K02ok37K84O4l76K01Q0l6j7k14J26
4805f9K3K7J38k31J07n2n7J50M1k50M01p3k66J00o2M2J94k40P9l6O7M8k23J38
4829dk0K6N0q7k0l5R6j73L12k64J21Q9j55J38j30J58j65j56K30n5n7J92j72o2
4853a43K47r3j16O4p4K84k1q9k4q9P8M1r6L4J9p5N0j51J36J60l79J52J92k19K02
4878I0m3j36J81ok14K10KNo9m0K35k31k6J38q0qR0n9n8m7K7J94k37J91j52r4J55
$$ plain form
4905 18 -71 -44 61 -58 -25 80 7 2 123 -87 162 -82 -16 -60 -70 223 -74 6 131 100 -82 64 -106 -58
4929 -58 -12 -87 -61 132 0 61 -98 11 25 -39 4 -155 -155 137 171 -107 -5 -46 -21 163 -83 116 -36 -3 108
4954 108 -86 49 42 -251 117 -47 -28 -130 -7 102 -43 -126 -91 -134 -96 -3 25 -185 63 -21 126 72 -56 187
4978 187 -45 -16 180 -55 34 32 19 53 61 -128 120 20 10 -133 -290 78 -47 61 133 -136 -53 138 -66 99
5002 99 28 -225 133 -89 21 5 -85 129 215 0 161 -15 -177 103 -22 -14 86 -75 46 -29 -222 24 -118
5025 -118 -29 97 2 -36 -54 -65 23 -101 -43 79 -159 114 -47 -84 105 -177 -3 117 -182 -125 -76 -5 123 92
5049 92 -102 42 -69 -203 -38 -118 147 -31 -222 131 -31 -118 134 -79 -56 90 -123 20 -96 -73 140 -137
5071 -137 10 30 -5 88 23 -159 249 64 0 86 84 -30 260 -167 -6 -156 -110 15 -157 -29 -24 -18 43 -232 -72
$$ packed form
4905A8q9K7J05j19L3J05p3nJ21k10K49k44O6m4j0K93k97Q0J25l1j82J46j70M8
4929e8M6p5K6J93j32O1j59J09J4o4M3j59%K92L4k78J02m1K5J84k46J99j52L3J11
4954A08j94J35pk93L68j64J9j02J23J09j45q3L5m3L8R3K8k10K48q4J47n4j28K43
4978A87k32K9J96k35Q9kj3L4Qj89K48j00j0j43j57L68j25J08P2k69Q3J91k04J65
5002I9p1k53L58k22J10j6r0K14Q6k15J61j76j62K80j25QJ00j61J21p5j93K46j42
5025a18Q9J26r5l8j8j1Q8j24N8J22k38K73j61l7J89k82J74J20k99N7M9P1J28l1
5049I2j94J44j11j34J65q0K65j78j91L53j62q7K52k13K3J46k13J43j16K3K13k77
5071a37J47K0l5R3o5j82M08j85o4Q6kj14K90m27J61j50M6J25j72J28NOO1k75J60
$$ plain form
5096 -72 48 -63 113 152 -247 10 112 -120 145 -147 -123 156 -51 167 46 154 84 -33 52 63 -170 68
5118 68 -106 -58 129 -47 -56 113 -105 51 47 33 89 -73 -71 158 -60 -22 185 -81 -45 -19 -43 50 -18 99 69 -267
5144 -267 16 81 -230 123 -83 -72 46 -118 20 -34 136 153 -90 -168 7 -10 -92 155 -281 168 62 -182
5166 -182 99 71 62 139 4 106 89 158 152 -112 18 -11 -154 66 -17 -24 27 -93 -106 55 29 -11 218 71 92 -142
5192 -142 22 306 -55 -88 -7 5 66 65 -95 24 -111 -16 -3 -325 25 41 -18 -68 -158 -4 155 -138 -92 -45 -3
5217 -3 192 25 -74 153 -119 -26 139 -90 -45 -18 -66 235 -33 -48 75 27 8 130 -65 -113 -1 -83 -97 -268
5241 -268 117 121 28 91 20 227 -20 -155 -113 -67 -36 38 -4 29 91 6 95 146 -66 172 10 -210 164 -16 -17 46
5267 46 -170 -9 60 -22 -168 -69 55 50 117 12 148 -151 35 -53 -48 153 -78 192 47 -219 108 129 -65 90
$$ packed form
5096g2J20j11J76L9l99K57J02k32K65k92K4K79k07K18j21J08p0j17Q5J1k33K38
5118F8j74M8J87j76rJ69k18J56mj4N6j62KK29k18L8K07k66L6K6k4R3o8J17l0l36
5144b67K83O5l11L53k06J1J18j64J38n4J70J7k43p8J75j7q2K47m36M49j06k44
5166a82K81k8rP7j35J02j7O9ok64J30k9j43K20q3pN1j20j3J61k6m0K29j47K1k34
5192a42J64K84l61l3Q1J2O1jj60J19j35R5J3l22L50J6n9n0r0J54J59k93M6M7M2
5217cJ95j67r9K27k72R3J65k29M5K7m8L01k68j5J23m8j9J22j95m8J12q2j4j71
5241b68L85Mr3O3p1K07k47j35M2M6L1P4m2L3O2q5Q9N1k12K38j62k20L74j80jO3
5267D6k16J61O9q2j46R9J24nO7j05J36k99J86q8NK01k31K70j45k66L27K1j94J55
$$ plain form
5291 90 137 -99 143 23 191 -131 -125 26 64 83 10 -137 -65 -59 -117 156 97 -261 -129 12 -96 -28 -148 130
5315 130 -1 59 27 -82 114 -75 -125 -69 60 -90 -128 -137 -173 108 -33 -33 49 -28 32 2 66 72 22 -24 34 -29 18
5342 18 -74 -32 107 -45 -21 192 14 -6 10 -116 189 -97 -51 143 -58 -2 27 -140 48 -55 -28 -8 -98 -59
5366 -59 19 -103 52 -65 -158 156 68 -17 50 -90 8 54 -77 98 89 14 118 127 72 73 -78 145 67 62 21 22 61 88
5394 88 -16 79 59 59 76 -130 55 200 -59 125 45 -173 59 -47 55 130 -216 52 24 -56 -39 24 -77 44
5418 44 -257 49 15 -88 140 -10 -39 -2 -101 8 20 -108 94 84 5 72 5 73 91 -281 61 86 8 -48 -72
5443 -72 -4 234 -9 -52 26 46 44 66 -104 40 -44 -94 56 -139 -3 17 -126 188 -49 7 41 -52 67 -190 -20
5468 -20 58 36 -25 153 -48 39 21 12 47 -37 -107 65 -15 111 -135 -39 282 -96 -86 6 -96 47 0 -133 37
$$ packed form
5291I0M7k36K42j20J68l22OJ51L8J9p3j47P2On8K73n9l58J32J41j08O8j20K78
5315A30j31O0l2j09J96j89n0N6J29j50l8rl6K81j41%Q2p7O0l0O4On0m6N8o3M7
5342A8r2M2J39j52K4K13j78k0J6j26L05k86M6J94k01N6K9j67J88j03K7K0r0L9
5366e9P8j22J55j17r3L14q8q5O7j40R8M6j31J75rp5J04Rn5Jj51K23p8nm1JL9K7
5394H8j04R5k0%J7k06J85J45k59J84q0k18K32j06J02P5l46K68k8q0J7O3j01J21
5418D4l01L06l4j03K28j50k9L7r9J09J2j28K02j0p9O7o7O8J8l72L42K5p8n6k4
5443g2O8K38k43m3P8K0kK2j70J44q4n0J50j95J36K0j43L14k37N6L4r3J19k57J70
5468b0P8k2o1J78k01Q7j8rL5q4p0J72q0J26k46R6L21l78J0R2j02J43m7j33J70
$$ plain form
5493 37 -110 -131 -14 3 -75 89 -115 183 9 -71 -13 -31 -98 244 -17 -33 65 -78 166 206 -102 27 -36 -40 23
5518 23 -66 126 42 -183 -85 -26 114 200 -81 -178 -28 -61 88 -107 -96 237 -53 46 150 94 149 -82 -109 41
5542 41 -141 48 72 -62 155 2 -29 -29 -191 23 61 2 -113 -64 -79 47 10 -120 101 -164 12 14 -143 11
5566 11 -63 -57 25 63 -74 136 -100 114 -79 14 90 -126 84 61 3 30 15 -25 25 83 -28 27 -87 146 -90
5591 -90 -26 32 -137 -182 -3 -25 16 78 -170 125 -9 -179 66 -17 64 156 -36 174 -123 -167 -6 -23 -34 42 -157
5616 -157 -47 -61 68 158 -66 -81 -11 -3 31 243 -87 154 27 20 85 -76 3 89 -238 -22 65 -201 100 31 -47
5641 -47 -64 -46 -31 -14 -76 271 -54 -31 70 -142 118 66 -197 -60 -9 -37 70 -116 59 119 -136 91 60 -19
5665 -19 -87 30 62 177 -82 47 170 -152 265 13 -22 92 -23 -109 207 86 -3 -42 -56 160 21 -11 46
$$ packed form
5493C7j47k1J17J7p8J64k04K98j74q0N8j8o7L42k61j6R8j43K44M0l08J29o3mO3
5518B3q9J92q4k25R8N9J40Q6k81r7J50l3J49j95J1L33k90R9J04n6N5k31k7J50
5542D1j82J89K4j34K17j53l1%j62K14L8n9j15M9j5J26l7j30K21k65J76Kj57J54
5566A1p4OQ2L8j37K10k36K14j93R3P6k16K10k3n8K7j5m0N0N8j11N5j14K33k36
5591i0O4N8j69m5J79k2M1O2k48K95j34j70K45q3Q1R2j92K10k97m4J61j7j1P6j99
5616a57J10j4J29R0k24j5P0QL4K12l30K41j27pO5j61P9Q6l27K16Q7k66L01o9p8
5641d7j7J8J5J7o2L47l25K3J01k12K60n2k63J37N1k8J07j86J75O0k55K27l1p9
5665a9o8J17L2J15k59J29J23l22M17k52l5J14j15q6L16j21q9l9j4K16j39l2N7
$$ plain form
5688 46 65 173 -65 -39 81 44 -15 0 80 151 200 87 81 -114 -100 30 -45 -63 305 -137 -7 -203 13 111 47
5713 47 -19 34 -167 25 42 76 211 -56 131 149 -53 148 -193 -89 108 14 -35 75 -188 21 134 -174 27
5736 27 -105 -104 185 4 -189 93 -54 10 -59 24 11 -50 19 74 -42 133 -7 -237 98 -114 12 233 -189
5759 -189 95 -62 -28 22 -36 5 153 -50 -118 -154 -14 80 47 23 103 -66 -117 140 11 133 7 143 25 -197
5783 -197 -46 247 -93 122 67 -101 7 -49 20 1 20 -97 107 -152 35 110 -176 -75 -59 33 129 -84 -62
5806 -62 -41 44 -87 -130 -81 30 -101 98 102 -45 -111 -43 16 180 -78 -81 25 8 151 35 -49 112 -70 23 93
5831 93 -140 -79 28 89 21 -109 -117 102 -167 61 40 -57 109 -212 -59 171 -38 -15 132 -101 -85 -53 -155 34
5855 34 -170 -51 90 112 -68 78 -95 236 39 47 -13 -16 40 50 59 85 59 -107 114 -210 -32 43 -131 -38 66
$$ packed form
5688D6J9J08k38K6J20l7n9J5Q0P1M9j13oj95J4J30p5j8L68m42J30j96K16R8o4
5713D7o6N3k01J92J7L4J35k67J87J8k02K01l41J04J97r4m9J10k63K09J13l08K01
5736B7j32JK89j81j93K82j47O4o9Q3j3o1O9N5j16J75j40k30L35k12J26K21m22
5759a89K84j57L4N0n8M1J48k03o8l6J40R4l3k4Q0j69n1K57j29J22j26J36j18k22
5783a97J51K93l40K15n5j68J08n6O9j9J9j17K04k59J87P5k86J01J6R2R6k13K2
5806f2K1Q5j31m3M9J11j31J99Mj47o6O8N9J64k58lJ06j7J43j16q4J61j82R3P0
5831I3k33O1J07O1o8j30qK19k69K28k1r7J66l21J53K30k09K3J47k33J6L2j02J89
5855C4k04J19J41K2j80J46j73L31j97Qo0lN6J0RK6k6j66K21l24J78P5j74R3J04
$$ plain form
5880 66 14 -36 -126 109 152 -38 26 -47 -86 44 98 84 -120 -262 156 -15 -139 167 21 -99 41 -133 -40 87
5904 87 -191 -39 -5 -22 31 90 -37 32 43 116 2 4 199 -159 64 130 36 -51 32 -26 46 22 193 -12 -44 148
5930 148 82 3 17 -5 82 146 -122 74 129 -94 83 -64 -10 158 -30 -28 110 -38 82 -76 -15 51 19 2 -31
5955 -31 -290 32 179 22 242 -102 -71 68 -85 44 -49 -51 19 -39 14 48 -31 -71 95 -167 40 21 -115 197
5979 197 -130 18 -55 -30 121 77 -138 30 -79 -151 84 50 -47 20 -180 -81 14 -26 -1 -163 -43 125 -118 36
6003 36 150 -96 65 -97 62 21 -144 -68 43 -66 235 -67 -80 153 -184 -37 -29 -118 95 -88 -45 157 44
6026 44 139 66 -58 33 -38 -90 23 -62 137 -10 108 62 -20 -96 30 -16 -48 134 5 70 50 6 60 -110 -30 -107
6052 -107 5 -63 -25 -105 33 74 -136 102 -48 -189 -61 -132 128 -133 -74 100 30 38 -68 -44 -55 -48 -194 201
$$ packed form
5880F6n2n0r0K35M3j90O4p3l9J30N4j4k04j42M18j71j24L06j46j20J40j74R3J27
5904H7k78J52L4j7N3N9j27O9J1P3j14KJ95l58K23O6r4q7Q3n8P2k4J71k05l2J92
5930A48o6p9J4k2Q7O4k68J96N5k23J77j47N4J68j88KJ38j48J20j58O1O6l2j7l3
5955c1k59L22J47j57K20l44L1J39j53J29r3kP0n8N3L4p9m0J66k62K07j9j36L12
5979A97l27J48p3K5J51m4k15J68j09p2K35l4r7O7k00R9R5m0K5j62J20J68k43J54
6003C6J14k46J61j62J59m1j65P6J11j09L01l02j3K33l37J47Qq9K13j83M3K02j13
6026D4R5p3j24R1p1n2J13q5J99j47J18m6q2p6J26m6l2J82j29O5k0m4N4j70Q0p7
6052a07J12o8L8q0J38M1k10K38j50j41J28p1K60k61N9J74p0Qj06K4j1Pj46L95
$$ plain form
6076 201 -17 70 60 -67 49 -43 -85 48 83 13 114 10 76 12 -44 -49 6 -30 151 -17 -6 4 -69 211 -10
6101 -10 -184 197 10 40 -92 -241 36 15 -91 105 -67 -34 28 -248 155 170 -112 -115 -61 -3 43 35 23 195 -103
6126 -103 52 -101 -120 2 -117 44 47 -76 -38 85 4 -41 -54 45 103 -63 -59 -18 -145 116 84 -79 117 -17
6150 -17 -68 -66 -36 -11 198 -131 57 -26 -17 238 -65 32 -49 -126 110 -48 24 101 46 80 22 13 27 24 -182 105 -12
6177 -12 108 54 -3 119 -141 -193 121 -60 -45 111 -17 182 -3 38 134 -15 -188 108 -61 19 -35 -130 -66 73
6201 73 48 -22 -72 -10 28 -225 -18 70 -50 123 11 -55 -69 -130 97 46 -16 168 26 -11 69 66 19 38 -144 34
6227 34 -14 -135 -48 56 -92 21 -144 1 -119 -98 -22 -168 62 -140 -65 -203 58 -25 105 -11 95 -60
6249 -60 -1 17 78 -128 158 102 -69 -45 -116 11 -136 116 6 145 -85 29 -63 -96 180 -90 92 -202 -32
$$ packed form
6076B01k18Q7j0j27J16r2m2J33L5p0J01j04O6o4n6nN5l6J81j68J1J0p3K80k21
6101a0j74L81j87L0j32j49K77k1j06J96j72L3O2k76M03J5k82lN4N8M6qj2J72k98
6126a03J55j53j9J22j19J61Lj23L8J23q1m5j3R9N8j66MM1j27K61l2j63J96j34
6150a7n1KL0K5K09l29J88q3RK55l03R7q1p7K36j58P2P7n5L4n8rJ4lk06K87j17
6177a2J20n4n7J22k60n2L14j81J5J56j28J99j85M1R6j49j73K96j69Q0n4r5O4J39
6201G3k5p0n0O2L8k53K07Q8j20J73j12o6j4o1K27n1o2J84j42l7Q0lm7J9j82J78
6227C4m8j21Q7J04j48J13j65J45j20K1P6j46K30k02P5j38K61q3J30j16J06j55
6249f0N9J8O1k06K86n6j71K4p1J27j47K52j10J39k30J14r2l3K76k70J82k94J70
$$ plain form
6272 -32 200 102 31 -6 -353 -40 -135 -33 63 40 -150 192 -113 -7 -18 -72 280 -219 -78 114 -85 -39 52 3
6296 3 59 13 -26 78 -119 -32 163 -171 -51 -32 -127 77 22 -20 180 -129 82 -150 -41 135 -49 -83 50 72
6320 72 -5 -46 -20 52 87 -168 190 -113 47 31 -134 -80 -35 -66 147 -4 -21 30 -105 -20 55 -140 -77 36 31 -41
6346 -41 -347 136 -38 -109 -10 11 177 9 -101 121 13 -116 -30 -154 93 -77 -17 -98 69 -37 -122 136 63
6369 63 109 114 96 -76 -16 -57 180 38 123 -33 -200 -99 -14 78 43 -103 96 88 -148 -12 -340 -131 78 -13 29
6394 29 -10 0 51 -45 178 82 -59 -71 18 -39 -17 -251 -27 84 54 -56 -3 24 -12 151 25 -95 -127 -92 1 -36
6420 -36 225 -76 -80 -8 48 7 -15 62 29 56 -21 179 -31 40 170 -29 83 -214 -54 54 -89 39 102 -45
6444 -45 -25 37 11 155 -26 -73 171 16 96 28 -157 67 1 82 119 81 -26 -198 -148 102 -111 -197 22 -10 -82
$$ packed form
6272c2K32r8p1l7l47L13r5J02R6k3j90L42l05J06j1n4L52m99J41J92j99M6R1m9
6296CN6m6l9J04j97Q7J95l34J20J9r5K04n5m2K00l09K11k32J09J76j84l4J33K2
6320G2p7m1K6P2L5k55L58l03J60j6j65N4M5l1K13j51j7N1j35Q5P5j95O3J13np2
6346d1l06M83j74p1R9K1J66j68j10K22j08j29Q6j24K47j70O0q1J67j06q5K58p3
6369F3M6Nj8j72O0m1K37j42Q5j56j67J01Q5R2l5j46J99qk36J36l28K09K09r1M2
6394B9l9J0N1r6K23r6j41j2Q9n7K2k34K24J11l0j10N3K7l6J63j26j20l2L5R3l7
6420c6K61l01mP2N6m1k2P7l3K7p7K00k10P1J30j99J12k97J60J08j43J28O3j47
6444d5K0O2k6J44j81m7K44j55Q0o8j85K24o6Q1L7l8j07j72N0K50k13q6K19l2p2
$$ plain form
6469 -82 9 -42 193 52 -87 -3 -85 83 116 -34 110 183 -69 47 32 40 61 71 -57 176 15 -59 89 -112
6493 -112 80 68 -78 52 -42 -48 68 79 104 -37 6 165 -117 -242 -93 -23 169 62 -48 139 -94 60 63
6516 63 -8 -31 -5 -51 -99 3 92 107 -29 20 -110 -93 112 -82 74 -25 -112 -34 34 -71 -19 54 -10 81 77 19 -34
6543 -34 -37 47 -14 -188 128 9 -95 58 -201 -89 98 -31 3 47 -39 49 42 81 177 -43 59 -98 57 63 126
6568 126 -41 35 32 -89 23 45 63 -46 212 -111 25 112 -128 43 8 54 169 46 135 -183 -61 83 14
6591 14 70 -62 56 6 12 -61 -126 5 -218 124 -49 -78 -25 71 -178 128 11 -53 2 -52 -73 144 96 5 129
6616 129 -186 73 65 -75 -19 -211 -27 19 37 61 -76 -153 -5 -83 10 32 -32 57 153 -73 -51 1 -76 -96 -96 -9 -11
6643 -11 121 63 -19 -63 -1 -143 68 -58 -92 22 -108 83 125 -34 15 76 -69 228 172 -36 -175 -134 -84 -59
$$ packed form
6469h2R1n1K35j41j39Q4q2J68L3j50J44P3k52J16j5QK1J0j28K33j61p4J48k01
6493a12J92j2j46J30r4oJ16J1K5j41M3J59k82j25J49P0J92j07j10J87k33J54L
6516F3p1k3K6m6m8J02Q9J5j36M9j30J7K05j94J56r9q7P8O8j05N2P3o4R1mn8n3
6543c4lQ4o1j74L16j19j04J53k59J12J87j29L4M4q6Q8pL9R6k20J02j57J55OO3
6568A26j67P6lj21J12K2J8j09K58l23J36Q7k40J71l5M6J15j23Q9l18J22J44o9
6591A4N6j32J18n0Op3o5J31k23L42j73k9N3R6k49L06j17o4N5n4k1K17m8r1J24
6616A29l15K59qj40N6j92J84M6J8K4j37p7J48p8R3K2o4Q9R6k26K2N2p7k0%Q7k
6643a1J32n8q2m4O2j42K11j26l4J14j30J91M2j59M9O1j45K97n6k08j39M1N0K5
$$ plain form
6667 -59 -61 52 -33 -20 -75 148 -52 -69 -96 -128 -68 -138 169 94 53 12 -17 82 -30 -19 -109 14 161 -104 -79 -33 71
6694 71 72 61 -7 -37 -4 34 38 65 49 113 96 -28 -38 -51 -1 -57 -201 16 -70 -316 62 17 -80 128 -133 25 -73
6721 -73 -43 -1 61 208 -76 -74 -139 -49 44 -79 11 37 86 37 -7 105 42 -47 25 0 153 -108 -33 35 -258 -111 -69
6748 -69 29 25 -111 -75 209 -60 90 24 -102 128 19 206 57 -10 48 -114 -176 129 -178 -79 -12 -17 -12 178 132
6773 132 79 -38 110 -87 21 -81 107 49 172 -66 -16 65 90 110 56 48 -38 68 -54 -59 11 -108 87 61 -95
6798 -95 54 -111 218 -53 6 77 -17 81 126 -24 118 -78 60 -1 129 17 -20 49 -21 -89 -109 79 6 -49 25
6823 25 -183 -47 -46 40 217 -42 -106 -44 -77 -80 -20 -76 19 -63 -23 -40 13 82 -16 50 108 -122 119 19 -31 -69 47
6850 47 -70 59 90 -104 -6 -21 -7 89 -107 -18 12 -42 -128 1 169 -12 -154 74 74 -19 157 -11 -179 33
$$ packed form
6667e9kJ13q5J3n5K23k00j7k7l2O0p0L07p5m1m1k9R9j12J1r0J23J47k65K5M6J04
6694G1Jj1o8l0L3L8MK7j6O4j7j24j0j3N0n6j44K17q6k46L78m5r7K08k61J58r8
6721g3L0M2O2J47k84Ko5R0R3j23R0K6M9m9m4J12o3q9P2k5J53k61P5O8k93J47M2
6748f9R8mj36L6K84k69J50o6j26K30j09J87j49o7N8j62o2L05l07R9O7nNJ90m6
6773A32n3j17J48j97J08j02J88n8J23k38N0Q1K5K0n4qq6J06j22nP0j19J95k6j56
6798i5J49j65L29k71N9P1r4R8M5j50J42j96J38o1J30j12l7O9p0o8k0J88p3n5P4
6823B5k08J36JQ6J77k59o4O2l3lO0n6R5q2M0j7N3O9r8O6N8k30K41j00n0l8J16
6850D7j17J29L1j94R8j5J4R6j96Q9L0n4q6J29J68j81j42K28%r3J76j68j68K12
$$ plain form
6874 33 -11 -5 37 -28 -6 113 3 -42 55 33 -9 7 54 -52 7 -29 -8 70 -14 -5 -104 -97 -70 -14 -24 -24 -61 -51 -33 -84 69
6905 69 -74 78 -109 18 16 139 107 45 -5 80 0 -95 -64 -2 -50 43 -106 2 -98 -17 -7 -89 85 -203 64
6930 64 -78 -100 -139 -2 -129 168 -51 101 17 5 17 -32 35 2 -20 52 112 42 20 54 -113 14 88 -38 98
6955 98 -33 -9 105 -33 -26 115 74 83 -50 -217 -21 -314 28 136 -75 136 -72 -79 -144 -208 7 54 -69 80
6979 80 -9 -85 -34 -99 73 -21 3 -42 115 2 -54 28 127 -85 41 16 27 32 -37 -39 -61 21 -156 -41 212 83 -209
7006 -209 -24 -107 -27 1 -114 -142 9 153 -97 44 -154 35 -37 89 -114 41 80 31 60 -29 -113 -65 -91 -18
7030 -18 131 -197 31 -11 114 45 65 23 138 -168 17 64 70 73 -55 -97 107 -1 151 62 150 -10 -5 149 68
7055 68 28 17 138 -67 116 37 -74 41 -10 -13 -2 -37 55 -56 -61 28 -248 -33 80 -99 -106 -246 -42 44 -8 -50
$$ packed form
6874C3m4OM2o5K2J19j10m5R7k2m2J6M7j06N9l6K1P8q4Rr9PK7N6j0%l7J0J8n1J53
6905F9j43J52j87J27kJ23l2o2n0Q5q0r5L1O2m8R3j49J08j00Q1J0q2J74k88K67
6930F4j42k2l9J37j27K97k19J52q4j2J2m9O7l3k2P2O0p0k2L4j67J27P4j26J36
6955I8j31K4J14j38PJ41m1Rj33j67J96k93L42J08k11K11k08po5o4K15M7j23J49
6979H0q9p6N1o5J72r4K4m5J57j13n6Q2R9k12J26k5J1No9kk2Q2j77J15K53j29k92
7006b09J85q3Q0K8j15k8J51J44k50J41j98J89p2J26k03J55L9m9K9q9q4M8k6P3
7030a8J49l28K28m2J25o9K0m2J15l06J85M7OLj28m2K04j08J52q9Q8j60NJ54q1
7055F8m0j1J21k05J83p9j11J15n1lJ1l5R2j11nQ9k76K15J13j79pj40K04Q6n2m2
$$ plain form
7081 -50 -7 -90 -71 -5 -107 80 10 -16 93 27 4 -51 14 61 -41 71 -68 16 77 16 -16 -128 46 81 14 -242
7107 -242 42 44 79 73 -18 -9 -162 -107 114 88 23 11 -50 -43 53 -33 75 -42 -44 32 10 -87 -30 48 61 -43 -199 -139 -42
7136 -42 -24 42 107 18 -92 80 -30 -13 -107 -26 153 60 108 -16 -62 37 38 -111 -32 -160 52 53 32 -82 102 -92
7162 -92 91 33 38 -134 -80 164 121 20 -46 -21 -167 4 -28 -43 145 -24 -39 -152 34 5 76 -19 -47 -10 80 -98
7188 -98 52 48 79 47 143 -60 251 195 -90 -181 -198 -74 32 76 -41 -16 -64 109 77 158 85 -73 -40 -86 101 -91
7214 -91 0 139 201 10 16 110 63 -27 -51 -72 -35 22 -140 64 101 -84 46 157 -123 -114 48 -36 39 23 117 4
7240 4 174 -8 12 32 -189 125 148 33 -72 -101 -3 -93 -55 -55 -20 -48 19 32 197 104 -35 16 -64 -22 -37 104 110
7267 110 13 -15 -39 16 84 98 96 -209 129 -71 52 -29 16 47 48 -7 81 19 76 -66 -28 -37 -128 -231 27 2 8 -4
$$ packed form
7081e0M3q3J9O6j02J87p0k6J09o6k3n5O5M7j02J12j39Q4O1o1l2j12J74L5o7k56
7107b42K84KL5or1Rj53N5K21k6o5j2o1PR6q6J08j17kP6k2r7N7P8J3j04j56O0R7
7136d2J8O6O5q9j10J72j10J7r4Q1J79r3M8j24m6R9Jj49P9j28K12Jk1j14J84j94
7162i2J83n8Nj72N4K44m3j01o6K5j46J71l2j5J88j69j5j13J86k9P1r5k8L7R0j78
7188i8J50mL1l2R6k03L11n6k85r1j7J24J06M4j17K5m8J73l2Q1p3j58L3m6J87j92
7214i1R1J39O2j91OR4m7r0k4k1L7N7j62K04L7j85J30J11k80RJ62q4P5j6R4j13
7240DJ70j82K0K0k21L14K3j15j05k9R8r0L8%L5k8O7J3J65r3j39N1q0M2j5J41O
7267A10r7k8k4N5O8J4kl05L38k00J23q1M5L1Jn5Q8o2N7j42L8rr1j03K58k5Oj2
$$ plain form
7295 -4 22 99 -52 150 -62 -41 -82 -6 -112 46 -94 -124 -109 -40 -152 2 114 22 -21 52 77 -12 15 -101 -163 -59
7321 -59 -79 -22 51 -40 74 -32 -17 61 18 -44 -47 184 45 -50 116 -82 105 -33 -24 95 14 47 -97 9 112
7346 112 69 -11 -38 -70 -9 68 120 190 57 32 148 -84 111 82 -4 76 -30 105 71 22 83 -90 0 143 -109
7371 -109 37 23 -66 -65 -58 -26 86 -46 8 13 6 1 37 -51 199 -35 -61 97 -29 -66 -29 -72 120 -14 17 117 -76
7398 -76 33 107 -62 14 -45 -32 20 -100 -29 -28 -8 3 -160 15 156 43 23 6 -163 13 -56 -3 -16 -21 178 25
7424 25 -61 -53 -112 144 -60 32 82 12 -44 -119 28 35 -115 109 118 87 -61 -130 186 -82 -64 -62 -18 31 -100 8 -30
7451 -30 -3 13 29 80 -194 -53 14 -92 -119 37 4 38 3 -95 -38 -63 105 66 38 -22 -76 -43 80 20 29 -105 117
7478 117 -63 3 56 37 -151 18 -15 -23 -105 -42 57 -78 -74 -11 -45 -12 3 -177 73 -162 -77 135 -69 -83 18 165
$$ packed form
7295dK6P7j51K02k12K1m1P6j06J58j40l0J5O9j12J54J12r2m3P3K5q9K7j16o2J04
7321e9k0N7P3r1J14j06J5P8m3o2lK31j39r5J66j98J87j38RJ19q1L3j44J06J03
7346A12m3q0k7l2O1P7N2P0j33k5J16k32J95k9q6Q0j06J35l4m9O1j73R0J43k52
7371a09J46j4q9JPL2J12j32N4NpnL6q8K50k34k6J58j26l7L7m3J92j34L1J00j93
7398g6J09P4j69P6n9J3N2j20P1JK0J1j63J75J41j13k0j7j69J76o9N3j3nJ99j53
7424B5q6Qn9K56k04R2N0p0n6p5J47Pj50K24Rl1j48o9L16k68J8KM4M9j31J08l8
7451c0K7J6J6N1k74J41O7j06k7J56l3L4l5r8N7k5J68l9k8o0n4L3J23o0Rj34K22
7478A17j80O6N3j9j88J69l3qq2O3R9j35MO3l4L3J5j80K50k35Q5K12k04j4J01J47
$$ plain form
7504 165 53 98 -143 18 76 33 16 80 54 -32 39 11 -82 58 80 83 78 42 -23 -142 -107 122 -81 -22 28 -175 -83
7531 -83 -56 6 55 -8 -92 45 66 -84 28 -122 100 146 -101 26 -168 -96 -20 56 -88 13 -101 -155 159 -27
7555 -27 99 -1 -146 -92 -41 112 107 -19 -13 -157 116 -78 23 55 -130 26 121 -86 -18 26 -3 -22 11 -27 66
7580 66 89 -116 -173 110 -113 -22 102 192 -157 33 213 -37 129 172 184 66 104 -19 -38 102 -93 25 60
7603 60 66 75 64 15 113 -126 -98 -31 109 -137 22 -44 -129 -107 217 -8 -31 40 -39 -55 93 139 -49 107 -101 62
7629 62 -4 -87 168 41 -77 135 0 39 -104 -112 -37 -157 40 283 -101 -74 -28 -57 -174 31 21 25 -73 78 -79
7654 -79 70 48 -62 -106 -70 -28 -81 17 -133 19 9 -31 -105 -116 -95 -59 0 -47 -162 -80 120 -110 33 114 -69 -25
7680 -25 -14 229 160 90 -83 7 39 38 108 8 -129 -50 -17 52 -67 66 -5 -67 -16 -77 42 -143 -186 -171 39 -1
$$ packed form
7504A65j12M5k41J61N8m3j7O4k6q6P1k8r3J40K2Lnl6o5j19L5K29k03N9N0k03R2
7531h3K7O2M9o3q4J37K1j50J12j50K22M6k47J27j94P2P6P6j44J01j14n4L14j86
7555b7J26j00j45N4N1J53nj26Oj44K73j94J01L2j85J56R5k07O8M4k9j9L3l8R3
7580F6K3k05n7K83k23R1J24R0l49J90J80k50J66M3J2j18L8j23j9J40j95J18L5
7603F0ORj1m9R8k39K8O7J40k46J59o6q5K2L24k25k3P1p9j6J48M6j88J56k08J63
7629F2o6q3K55j27j18K12j35L9j43qP5j20J97K43l84K7M6k9j17K05j0Mr8J51j57
7654g9J49k2j10m4L6M2n3R8j50J52j0m0p4j1K1L6N9m7j15Q2K00k30J43Q1j83M4
7680b5J1K43o9p0j73R0L2jP0j00j37P9L3O9j19J33p1o2N1o1J19j85m3J5K10m0
$$ plain form
7706 -1 -83 -128 -182 26 63 62 78 -33 81 -47 121 116 9 40 -116 128 -55 -119 -8 -173 0 -110 46 -4 25
7731 25 88 -13 57 -72 -77 49 -60 56 46 -189 65 -49 -34 39 -23 135 20 60 74 -4 -98 22 -107 -18 29
7756 29 50 85 52 9 140 -71 -18 -41 -148 -32 7 -35 67 -45 -4 68 -49 41 -41 -52 90 7 -66 7 8 -57 34
7783 34 158 -13 -104 -34 -52 -99 130 138 -9 -52 67 16 -13 35 -57 60 -61 -4 32 52 -43 -8 -2 53 -63 72 -56
7810 -56 -91 -17 159 98 -4 79 5 -15 74 -76 141 37 210 8 95 59 -71 116 53 -66 100 -22 28 83
7834 83 -141 -85 50 -69 6 -130 -97 81 24 156 162 3 -19 -2 81 -18 171 66 76 45 17 27 -66 -142 -173 157
7860 157 99 102 -6 22 -140 -34 9 49 6 47 53 -3 -46 25 -13 -55 24 -171 -51 188 38 26 -119 -50 128 -167
7886 -167 39 -82 -132 42 -94 49 -43 -25 71 -151 -103 117 -203 -245 -69 19 -126 -102 -22 -15 81 -24 -28 27 29 -220
$$ packed form
7706aq2m5n4K08L7jJ6j11J14j28J68nj07L1j56K44j83o4J11j65J73j10J56n0K9
7731B5O3j01P0j29nJ26j09J16j0k35K54j14J5P3o2J58j15M0J4p8r4J20j29Q9M7
7756B9K1L5l3m3J31k11N3k3j07J16L9m2J02j12M1P2j17R0q2j1J42q3p3P3Jo5R1
7783C4J24j71r1P0j8m7K29Qj47m3J19n1k9M8r2J17j21N7L6K0r5L5ON5j16J35j28
7810e6l5P4J76o1j02Q3p4k0Q9j50K17j04J73k02Q7l6j30J87o3j19J66j22N0N5
7834H3k24N6J35j19P5j36L3J78n7J32Oj59k2J7Q3r9J89j05J0l1k8J0r3p6l1L30
7860A57n8Lj08K8j62J06M3M0m3M1On6m3P1l8m2P9j95J20K39j50j2j45O9J78k95
7886a67K06j21n0J74j36J43r2J8R6k22M8K20l20m2J76Q8j45K4Q0PR6j05mN5Kk49
$$ plain form
7912 -220 -36 -14 2 -92 -121 -6 0 148 -105 158 -131 -89 -48 -12 6 118 -119 -4 3 -73 -18 12 22 -22 83 8
7938 8 58 -28 72 43 -10 129 -132 30 -87 -135 20 126 48 126 -9 -130 69 19 71 -38 -63 -91 36 123 41
7963 41 62 -37 57 45 46 95 81 -91 -103 -1 40 52 -81 108 -51 119 -75 21 69 -89 18 4 -67 -70 -161 -99 26
7990 26 -32 -289 -44 -55 -16 58 -32 159 127 41 58 23 114 -96 -23 -120 -104 -241 61 173 -25 0 -35 6 -23 -151
8016 -151 -82 54 129 -42 -67 11 6 120 73 -8 -96 -24 153 -75 70 -83 61 62 17 63 -104 -13 192 47 -90
8041 -90 72 -82 116 104 125 -98 -129 -13 28 151 50 -2 -130 -63 -84 -88 14 -61 -87 32 -49 56 -122 28
8065 28 30 44 122 50 -58 68 63 38 14 -32 58 103 -175 118 -52 8 59 -148 93 -29 -141 -20 52 39 82 -96
8091 -96 -88 23 7 -152 137 -19 -48 10 -165 -91 -70 -77 92 -136 220 -181 -66 153 -59 23 78 37 50 -8 -144
$$ packed form
7912b20J84K2J6r4k9J15OJ48k53K63k89M2M1L6J8J12k37J15Pp6N5L0J0m4J05p5
7938HN0q6J00k9n3J39k61J62j17m8J55J06p8P8j35j21J99n0N2j09k5k8J27Q7q2
7963D1K1r9R4j2JM9j4j72j2J02M1J2j33J89j59J70j94R6M8j58J07j4p1lr1O2J25
7990B6n8k57K45j1L9P4r0J91l2q6J7l5R1k10P3r7J6j37L02J12j98K5l5M1k9j28
8016a51O9J36P5j71k5P8nJ14m7q1q8P2J77k28J45j53J44Jm5M6j67R1K05j45j37
8041i0J62j54J98j2K1k23l1J16M1J23j01n2j28O7k1mJ02p5k6J19q1J05j78J50
8065B8KJ4P8p2j08J26nk5k4m6R0M5k78K93j70O0N1k07K41j22j12J21P2j3M3j78
8091i6QJ11j6j59K89j56k9N8j75P4K1pJ69k28L56m01J15K19k12Q2N5m1J3n8j36
$$ plain form
8116 -144 13 20 -128 24 -32 -22 34 -95 16 -6 110 -105 70 -17 23 -161 85 11 102 76 -36 -123 16 49
8140 49 4 37 2 -89 -80 174 107 -155 -29 -105 -38 169 -143 40 201 6 4 -63 -79 -41 -97 5 -81 -116 51 -25
8166 -25 -119 23 -26 -37 15 -40 -51 -24 81 22 3 -75 -44 -15 16 24 -29 -9 -186 40 -3 45 89 24 65
$$ packed form
8116a44J57Pj48J52n6J0N6j29J11k2J16k15J75q7M0j84K46p4R1k6j12q7J39L3
8140D9m5L3l5r1RK54o7k62J26p6O7K07l12J83J61j95ko7j6L8n6J02q6l5J67p6
8166b5r4J42m9j1N2n5j1K7J05n9j9p8L1K9L1Qn3K0j77K26m3M8M4o5M1
8191F5
$$ Imaginary data points
##PAGE= N=2
##DATA TABLE= (X++(I..I)), XYDATA
$$ plain form
0 0 0 0 0 0 0 0 0 0 0 0 0 0 7 -8 8 -8 8 -8 15 -16 16 -24 24 -31 32 -40 47 -54 61 -69 79 -89 101 -113 128
35 128 -144 161 -179 198 -221 246 -273 302 -333 367 -407 448 -492 542 -595 657 -724 799 -883
54 -883 976 -1086 1211 -1357 1529 -1737 1992 -2313 2731 -3298 4111 -5364 7503 -11806 23587
69 23587 -115931 -302297 189669 82322 -211694 127165 183639 -206643 -62737 209624
79 209624 -79364 -187799 164214 97928 -133141 63367 74022 -168587 -40351 143497
89 143497 16164 -76889 38981 48644 -101908 -32119 107907 -48305 -67663 125866 10364
100 10364 -130353 43088 65280 -102568 3943 137636 -67222 -90252 137454 -26446
110 -26446 -151491 144899 73483 -174161 58490 115052 -143455 -6956 159114 -92938
$$ packed form
0@%%%%%%%%%%%%Pj5J6j6J6j6K3l1L2m0M8n5O3p2Q7j01J15j30J48j68J90k14K41
35A28k72L05l40L77m19M67n19N75o35P00p74Q55r40J034j137J252j381J523j682
54h83J859k062K297k568K886l266L729m305N044o029P409r475J2867j9309L5393
69B3587j39518j86366M91966j07347k94016L38859N6474l90282J43906K72361
79B09624k88988j08435L52013o6286k31069J96508J0655k42609J28236J83848
89A43497j27333r3053J15870R663j50552O9789J40026j56212j9358J93529j15502
100A0364j40717J73441K2192j67848J06511J33693k04858k3030K27706j63900
110b6446j25045K96390p1416k47644K32651N6562k58507J36499J66070k52052
$$ plain form
120 -92938 -123613 150936 38605 -153540 72004 86864 -151086 11964 138423 -97966
130 -97966 -83828 117135 35405 -86207 11964 48862 -82288 -25748 135841 796 -112469
141 -112469 50725 53492 -89850 -6422 92355 -33528 -57042 106455 16666 -155017 28138
152 28138 100355 -85846 18176 117374 -96765 -84120 96208 -9704 -85098 81462 65751
163 65751 -94438 1810 66318 -97275 -29003 122588 -15192 -50335 69037 -17356 -85367
174 -85367 28569 52266 -24974 3579 58016 -31670 -72706 37461 25654 -45567 30050 49567
186 49567 -40831 -34140 29873 -6593 -53755 39900 69886 -59418 -26775 59733 -52337 -41499
198 -41499 89939 4095 -69632 42773 40552 -69079 -7719 69735 -38115 -36337 85788
$$ packed form
120i2938l0675K74549j12331j92145K25544J4860k37950J63050J26459k36389
130i7966J4138K00963q1730j21612R8171L6898j31150N6540J61589j35045j13265
141a12469J63194K767j43342Q3428R8777j25883k3514J63497q9789j71683J83155
152B8138P2217j86201J04022R9198k14139J2645J80328j05912p5394J66560j5711
163F5751j60189R6248O4508j63593O8272J51591j37780l5143J19372q6393o8011
174h5367J13936K3697p7240K8553N4437q9686m1036J10167j1807p1221P5617J9517
186D9567r0398O691O4013l6466m7162R3655K9986j29304L2643Q6508j12070J0838
198d1499J31438q5844p3727J12405k221j09631O1360P7454j07850J778J22125
$$ plain form
209 85788 -10983 -81399 52161 28170 -61437 23201 40088 -47087 -16950 50167 -4495 -47590
221 -47590 25502 21955 -48574 11258 42813 -31873 -12439 34246 -9876 -33143 12499 30468
233 30468 -16814 -5874 42899 -23279 -46780 38942 9953 -34527 36046 30017 -43838 -18498
245 -18498 27949 -18015 -26374 53611 19744 -54386 15932 17048 -61008 9388 54714 -17691
257 -17691 -8864 29527 -19632 -45442 16961 33433 -18226 12415 38926 -37825 -32261 27209
269 27209 -6519 -9602 35807 16742 -24998 -17588 8737 -11946 -16587 38296 17833 -31386 6894
282 6894 4006 -37130 381 31953 2107 -11094 13906 1077 -38171 4222 33383 -20399
294 -20399 2116 36942 -23440 -23610 22630 -1926 -15777 19013 19834 -21174 -11675 23179 -13882
$$ packed form
209H5788r6771p0416J33560k3991q9607Q4638J6887q7175L0137O7117n4662m3095
221d7590P3092l547p0529N9832L1555p4686J9434M6685m4122k3267M5642J7969
233C0468m7282J0940M8773o6178k3501Q5722k8989m4480P0573o029p3855K5340
245a8498M6447m5964q359P9985l3867p4130P0318J116p8056P0396M5326p2405
257a7691Q827L8391m9159k5810O2403J6472n1659L0641K6511p6751N564N9470
269B7209l3728l083M5409j9065m1740P410K6325k0683m641N4883k0463m9219L8280
282F894k888m1136L7511L1572k9846j3201K5000j2829l9248M2393K9161n3782
294b0399K2515L4826o0382j70M6240k4556j3851L4790Q21m1008R499L4854l7061
$$ plain form
307 -13882 -19684 31727 -382 -26168 17869 5150 -21182 3736 13281 -7757 -13520 12889 8014
320 8014 -19528 10726 16027 -23951 -1365 16757 -10064 -1810 16688 5265 -13542 -5161 10586
333 10586 -12753 -4865 30936 -2425 -18436 12632 -8708 -21224 11573 15577 -2943 -1957 9203
346 9203 -12078 -26837 12959 13564 -11097 19699 11717 -27823 -7048 6002 -5994 6200 20020
359 20020 9192 -15235 -8588 2951 -15900 3750 28673 -1188 -5954 3923 -15099 -13774 3621
372 3621 13198 7349 -2359 6398 -9617 -24652 7822 9350 -5190 15545 8055 -14994 -9148 611
386 611 780 -1118 13687 13545 -15346 -3773 7987 -15952 2131 18879 -4480 -1537 6141 -7172
400 -7172 -10012 643 9844 -1109 -3956 8444 -8689 -10093 12175 -1643 -7479 5916 289
$$ packed form
307a3882n802N1411l2109k5786M4037j2719k6332K4918R545k1038n763K6409m875
320H014k7542L0254N301l9978K2586J8122k6821Q254J8498j1423j8807Q381J5747
333A0586k3339P888L5801l3361j6011L1068k1340j2516L2797M004j8520R86J1160
346I203k1281j4759L9796O05k4661L0796p982l9540K0775J3050j1996J2194J3820
359B0020j0828k4427O647J1539j8851J9650K4923k9861m766R877j9022J325J7395
372C621R577n849r708Q757j6015j5035L2474J528j4540K0735p490k3049N846R759
386F11J69j898J4805j42k8891J1573J1760k3939J8083J6748k3359K943P678j3313
400g172k840J0655R201j0953k847J2400j7133j404K2268j3818n836J3395n627
$$ plain form
413 289 -1359 146 1159 2133 -6492 4349 7526 -11805 1725 11127 -3953 2217 3040 -8437 -5813
428 -5813 4479 10329 -1829 -3540 6997 -11340 -9439 11477 -4741 -2422 15401 -2083 -10193
441 -10193 -3490 -4117 -1277 5469 13189 2433 -10068 519 -5972 -9345 12362 9070 1434 5137
455 5137 -6322 -9039 -4192 136 10393 3817 1756 5453 -11948 -11855 1403 -65 7179 11080 780
470 780 -9965 -12605 1463 2176 -1688 13573 2471 -9921 6451 -4309 -14221 6901 10032 4383
484 4383 4553 -2858 -9864 -7889 7558 9150 -4093 3659 1716 -9247 2874 -715 -8121 5255
498 5255 4445 1446 -87 -8604 -2043 1567 638 6519 -1966 -4765 2809 309 682 -128 -149 2492 -3377
515 -3377 2821 5065 -7321 4220 5732 -10262 1676 4977 -6400 2897 5547 -3255 -3837 -56
$$ packed form
413B89j648J505J013R74q625J0841L177j9331J3530R402j5080O170Q23j1477K624
428e813J0292N850j2158j711J0537j8337J901K0916j6218K319J7823j7484q110
441a0193O703o27K840O746P720j0756j2501J0587o491l373K1707l292p636L703
455E137j1459k717M847M328J0257o576k061L697j7401R3J3258j468P244L901j0300
470G80j0745k640J4068P13l864J5261j1102j2392J6372j0760r912K1122L131n649
484D383J70p411p006J975J5447J592j3243P752j943j0963J2121l589p406J3376
498E255q10k999j533q517O561L610r29N881q485k799P574k500L73q10k1K641n869
515c377O198K244j2386J1541J512j5994J1938L301j1377R297K650q802n82L781
$$ plain form
529 -56 -1189 -6481 3965 10546 -4765 -1722 811 -11934 1564 10202 -716 2890 989 -3925
543 -3925 -684 -3562 -707 3993 4276 8014 -576 -9251 -6168 -2738 6987 7142 503 1853 -7315 -6732
559 -6732 4291 -5257 -1082 11660 527 -1856 -284 -10471 -5790 6463 9031 2911 -1334 112
573 112 -7952 -4827 8440 -670 245 11135 -3498 -6412 1198 -5516 -74 7424 3051 331 -3249
588 -3249 -3417 -2850 -2745 4484 2490 -487 1590 -4856 -2424 1888 -2656 4348 2297 -4700 4513 -52
604 -52 -5633 3931 967 -1653 3819 981 -2731 -1798 3329 2145 -4057 2376 -633 -6481 6904 2808
620 2808 -6599 2982 -1405 -5693 3383 685 -1310 2323 1194 -552 -4172 -1687 1288 84 6404
635 6404 2977 -4686 -138 -3252 -2482 6168 1061 2257 3894 -5572 -2924 -824 -3481 4031 5413
$$ packed form
529e6j133n292J0446O581j5311L043K533j2745J3498Q638j0918L606j901m914
543c925L241k878K855M700K83L738q590q675L083L430R725J55o639J350r168N83
559f732J1023r548M175J2742j1133k383J572j0187M681J2253K568o120m245J446
573A12q064L125J3267r110R15J0890j4633k914P610o714N442P498m373k720l580
588c249j68N67J05P229j994k977K077o446K432M312m544P004k051o997R213m565
604e2n581R564k964k620N472k838l712R33N127j184o202O433l009n848J3385m096
620B808r407R581m387m288R076k698j995L633j129j746l620K485K975j204O320
635F404l427p663M548l114P70Q650n107J196J637r466K648K100k657P512J382
$$ plain form
650 5413 863 -1420 -3952 -3341 -3607 1654 7287 -554 995 1739 -9378 -2495 4340 -1405 5529 5644
666 5644 -3789 -2795 -2505 -2266 1393 3926 5441 -596 -2135 -767 -6121 -84 5279 -534 3520 1094
682 1094 -6384 -1155 -1723 -1338 5062 943 -337 -25 -3549 -1272 -122 1001 2543 43 1928 -820
698 -820 -3899 2559 -112 -1042 5525 -1732 -3146 3056 -1688 -559 2630 -1232 -881 -162 358 -55 -1569
715 -1569 1855 -925 -2843 2262 -1801 -1602 4749 -1054 -752 1302 -3792 -170 2067 749 3266 471
731 471 -1408 -1318 -2753 1357 1735 1713 3402 -2443 -2172 -355 -3934 1761 3385 -702 2977 -1056 -5565
748 -5565 -1403 -1048 1613 4593 1403 -605 -3734 -2460 706 -952 3543 3938 -1580 1395 -1912 -5708
764 -5708 1365 1871 2298 4572 -1573 -3392 -2344 -2040 1928 1408 1398 1752 -2654 -1343 -1632 -3247 2764
$$ packed form
650E413m550k283k532O11k66N261N633p841J549P44j1117O883O835n745O934J15
666E644r433R94K90K39L659K533J515o037j539J368n354O037N363n813M054k426
682A094p478N229n68L85O400m119j280L12l524K277J150J123J542k500J885k748
698h20l079O458k671r30O567p257j414O202m744J129L189l862L51P19N20m13j514
715a569L424k780j918N105m063J99O351n803L02K054n094L622K237j318K517k795
731D71j879R0j435M110L78k2J689n845K71J817l579N695J624m087L679m033m509
748e565M162L55K661K980l190k008l129J274L166j658M495L95n518K975l307l796
764e708P073N06M27K274o145j819J048L04L968n20j0L54m406J311k89j615O011
$$ plain form
781 2764 1983 413 2530 -3387 -2905 1143 -919 2263 2703 -1014 543 -1311 -1292 833 -263 2228
797 2228 601 -1031 1310 -2259 -1100 2303 -1650 575 1620 -2819 208 256 -1414 1558 -333 -964
813 -964 -359 -1230 1761 633 -387 1284 -2271 -389 2073 -1111 1845 1722 -1574 1076 -1242 -2393
829 -2393 1371 594 2012 1597 -2188 -1208 -2072 -581 2615 193 1184 675 -3168 -602 -1337 -1490 3524
846 3524 1566 361 965 -3583 -1853 340 606 3377 1354 -126 -755 -3438 -401 969 456 3956
862 3956 466 -2028 -158 -3479 -1328 2546 470 2009 568 -2578 -1415 -2000 334 2398 538
877 538 1840 -503 -2705 508 -1241 460 3185 -180 712 170 -2779 344 321 164 2327 -379 -681
894 -681 -308 -1720 494 -34 -203 1647 -1502 -301 452 -2184 1341 1053 -1605 1139 -653 -876 1760
$$ packed form
781B764p81j570K117n917M82M048k062L182M40l717J557j854J9K125j096K491
797B228j627j632K341l569J159L403l953K225J045m439L027M8j670K972j891o31
813i64O05q71K991j128j020J671l555J882K462l184K956j23l296K650k318j151
829b393L764p77J418m15l785R80q64J491L196k422R91n09l843K566p35j53N014
846C524j958j205O04m548J730K193K66K771k023j480o29k683L037J370n13L500
862C956l490k494J870l321K151L874k076J539j441l146J163n85K334K064j860
877E38J302k343k202L213j749J701K725l365Q92n42k949L123k3j57K163k706l02
894f81L73j412K214n28j69J850l149J201P53k636L525k88k658K744j792k23K636
$$ plain form
911 1760 -371 378 466 -1226 826 -469 -15 2099 -731 630 108 -2538 895 675 -237 2334 -812
928 -812 -1543 -245 -2229 478 1303 68 1739 -918 -1749 -499 -1559 1647 2015 221 1507 -1426
944 -1426 -2104 550 -1269 1530 3195 -189 198 -1358 -2623 217 612 1515 1643 -847 -374 -1948 -2240
961 -2240 1119 -33 1294 2374 -1860 -1390 -1075 -1986 2184 1845 431 995 -1629 -866 -28 -756 1729
978 1729 1073 499 1278 -1965 -1128 89 -620 2467 1081 -1466 325 -1412 -1179 1357 -579 534 807
995 807 -1024 104 -884 -486 983 -590 821 379 -1599 1190 52 -539 1884 -626 -494 920 -1009
1012 -1009 674 810 -329 498 -1222 -615 692 -468 1313 370 -1148 502 -1354 -964 1340 -535
1028 -535 1246 1261 -1603 -369 -878 -858 2211 990 508 106 -1807 -257 -592 66 2188 52 712 592
$$ packed form
911A760k131P49Q8j692K052j295M54K114k830J361n22k646L433k20r12K571l146
928h12p31J298j984K707Q25j235J671k657q31J250j060L206L68j794J286k933
944a426o78K654j819K799J665l384L87j556j265K840L95R03J28k490M73j574k92
961b240L359j152J327J080m234M70L15r11M170l39j414N64k624P63Q38p28K485
978A729o56n74P79l243Q37J217p09L087j386k547J791j737K33K536j936J113K73
995H07j831J128r88L98J469j573J411m42j978K789j138n91K423k510J32J414j929
1012a009J683J36j139Q27j720O07J307j160J781r43j518J650j856L90K304j875
1028e35J781J5k864J234n09K0L069j221m82m02j913J550l35O58K122k136O60j20
$$ plain form
1046 592 -2860 -678 226 -256 2551 805 -1294 -467 -2107 -419 970 289 1862 -20 -960 -330 -2203
1063 -2203 155 1450 299 1942 -292 -2042 172 -1219 166 2144 130 599 -153 -1872 -131
1078 -131 -449 380 1617 -433 269 -561 -1854 612 -383 -258 1869 -967 -640 199 -1609 694 738 -221
1096 -221 1023 -696 -185 658 -600 940 284 -684 869 -836 -407 1183 -953 539 430 -1515 444
1113 444 -179 -405 1399 -299 -381 -83 -1250 204 -18 280 1359 -847 -448 -108 -1640 1180 1088 -109
1131 -109 1517 -710 -1224 172 -730 811 1479 70 646 -1242 -1473 -89 -713 1308 1456 -783 165
1148 165 -1337 -1793 707 37 1106 1701 -1036 -419 -828 -1391 1051 640 966 1117 -945 -425 -752 -673
1166 -673 1731 494 459 846 -1962 -667 218 -834 1262 531 -361 506 -1388 -805 197 -379 1433
$$ packed form
1046E92l452K182R04m82K807j746k099Q27j640J688J389o81J573j882r40O30j873
1063b203K358J295j151J643k234j750K214j391J385J978k014M69p52j719J741
1078a31l18Q29J237k050P02q30j293K466r95J25K127k836L27Q39j808K303M4r59
1096b21J244j719N11Q43j258J540o56r68J553j705M29J590k136J492j09j945J959
1113D44o23k26J804j698q2K98j167J454k22K98J079k206L99L40j532K820r2j197
1131a09J626k227n14J396r02J541O68j409N76j888k31J384o24K021J48k239R48
1148A65j502m56K500o70J069N95k737O17m09n63K442m11L26J51k062N20l27P9
1166f73K404j237l5L87k808J295Q85j052K096p31q92Q67j894N83J002n76J812
$$ plain form
1183 1433 229 -738 375 -1308 -73 1173 -530 833 337 -789 716 -369 -345 1164 -316 373
1199 373 242 -1120 533 14 -104 792 -900 -37 -98 -910 910 202 -619 546 -986 -567 761 -364
1217 -364 850 635 -722 274 -524 -105 870 27 1203 414 -1177 9 -931 -383 1749 112 360 5
1235 5 -1860 -39 -135 -158 1331 -69 -115 -198 -1830 -465 58 186 1709 60 -504 -349 -1633 482 1162
1254 1162 -8 1234 -216 -982 93 -1046 325 1238 299 979 -575 -1367 -15 -792 674 1260 -641
1271 -641 281 -611 -1502 351 -284 283 1120 -526 139 -398 -1058 609 22 425 1011 -588 -11 -89 -716
1290 -716 1006 279 -211 735 -909 -132 402 -556 627 61 -664 475 -609 -191 523 -411 634 -94
1308 -94 -762 440 -297 159 1102 -566 97 -38 -885 726 244 104 778 -476 -306 -85 -898 731 494
$$ packed form
1183A433j204r67J113j683J235J246j703J363m96j126J505j085K4J509j480O89
1199C73j31j362J653n19j18Q96j692Q63o1q12J820p08q21J165j532M19J328j125
1217c64J214k15j357R96p98M19R75q43J176p89j591J186r40N48K132j637K48l55
1235Ej865J821r6k3J489j400m6q3j632J365N23J28J523j649n64J55j284K115O80
1254A162j170J242j450p66J075j139J371R13r39O80j554p92J352p77J466N86j901
1271f41R22q92q91J853o35N67Q37j646O65n37o60J667n87M03N86j599N77p8o27
1290g16J722p27m90R46j644P77N34r58J183n66p25J139j084M18P14r34J045p28
1308i4o68J202p37M56R43j668O63j35q47J611m82j40O74j254J70K21q13J629k37
$$ plain form
1327 494 -40 734 -1028 -840 38 -654 905 715 -445 248 -990 -769 465 -166 1047 849 -549 58
1345 58 -979 -664 817 206 925 755 -951 -161 -686 -520 1117 116 613 399 -1176 -453 -489 -335 971
1364 971 83 276 87 -1326 28 -3 -144 1001 196 -397 164 -1014 7 489 -96 975 -64 -496
1382 -496 367 -773 118 709 -221 490 -128 -906 318 -438 244 747 -509 226 107 -656 472 -203 33
1401 33 553 -688 -84 122 -428 764 128 -347 434 -808 66 533 -148 655 256 -519 180 -649 51
1420 51 660 -193 589 -121 -935 202 -506 -49 953 -268 244 -264 -1071 169 -125 292 1046 -151 81
1439 81 -73 -897 410 102 278 966 -252 -436 -254 -973 608 626 236 637 -845 -665 -45 -631 358
1458 358 547 -81 565 -684 -672 103 -378 673 740 -504 156 -372 -690 684 -161 348 541 -611 76
$$ packed form
1327D94n34P74j762J88Q78o92J559j90j160O93j238K21J234o31J213j98j398O07
1345E8j037L15J481o11P19j70j706P90n25J66J637j001M97k14j575P23l6J54J306
1364I71q88J93j89j413J354l1j41J145q05n93N61j178J021M82n85J071j039m32
1382d96Q63j140Q91N91r30P11o18p78J224p56O82N03j256P35j19p63J128o75K36
1401C3N20j241O04K06n50J192o36m75P81j242Q74M67o81Q03l99p75O99q29P00
1420E1O09q53P82p10q14J137p08M57J002j221N12n08q07J240k94M17P54j197K32
1439H1j54q24J307l08J76O88j218j84J82p19J581J8l90M01j482J80O20n86R89
1458C58J89o28O46j249J2P75m81J051O7j244O60n28l18J374q45N09J93j152O87
$$ plain form
1477 76 -371 -525 621 -129 280 511 -726 -86 -144 -423 694 -115 -195 198 -555 42 197 -290 536 -171
1497 -171 -206 252 -311 173 508 -290 409 -97 -350 489 -399 180 542 -535 -62 -244 -514 631 188 173
1517 173 309 -743 -179 -150 -413 715 -104 76 359 -613 -367 235 -254 893 580 -303 -35 -874 -112
1536 -112 482 115 619 194 -546 25 -654 -298 650 -5 603 112 -746 -20 -639 -114 553 -101 104 -93
1556 -93 -659 -18 -339 -29 728 127 115 -76 -718 158 116 77 786 -119 -279 45 -575 109 320 -107 480
1577 480 -228 -224 4 -392 349 248 -358 312 -38 -298 221 -422 171 410 -447 172 3 -90 482 -6 224
1598 224 399 -378 137 180 -136 513 -239 2 317 -568 205 242 -248 346 -107 -475 -57 -442 66 444 -226
1619 -226 362 -302 -398 43 -290 446 410 -356 123 -342 -455 301 48 112 677 -332 1 -256 -350 371 94
$$ packed form
1477G6m47j54J146p50M09K31j237O40n8k79J117q09q0L93p53N97J55m87Q26p07
1497a71l5M58n63M84L35p98O99n06k53Q39q88N79L62j077M73j82k70J145m43j5
1517A73J36j052N64K9k63J128q19J80K83r72K46O02m89J147l13q83K68q39P62
1536a12N94l67N04m25p40N71o79L56R48o55O08m91q58P26o19N25O67o54K05j97
1556i3n66O41l21L10P57o01j2j91o42Q76m2l9P09r05j60L24o20O84K11m27N87
1577D80p08MK28l96P41j01o06O70l50k60N19o43N93K39q57O19j69r3N72m88K30
1598B24J75p77N15M3l16O49p52K41L15q85P73L7m90N94m53l68M18l85N08L78o70
1619b26N88o64r6M41l33P36l6p66M79m65j13P56k53O4N65j009L33k57r4P21k77
$$ plain form
1640 94 56 358 -597 -50 -113 -622 542 222 -71 338 -551 -341 284 -229 441 194 53 162 -317 -228 279
1661 279 -86 640 91 -318 213 -518 -241 318 -274 207 117 -478 -119 -367 -251 299 -16 167 212 -443 -87
1682 -87 -102 -73 273 -151 49 117 -387 206 146 -239 264 -42 -273 241 -152 225 258 44 114 -166 -89 227 -368
1705 -368 151 186 -438 211 -267 -280 466 -27 38 113 -455 -7 70 37 436 86 117 231 -338 172 88 83 574
1728 574 56 -240 86 -628 29 332 -305 443 -46 -392 55 -232 -16 254 -5 124 -179 -364 172 -167
1748 -167 139 439 -64 48 -159 -461 64 16 13 469 -104 -138 -138 -279 100 6 84 306 -270 -114 35 -427 241
1771 241 150 -115 464 -127 -127 119 18 187 201 -156 125 -172 -54 196 -165 258 110 -233 252 -125 -164 314
1793 314 -199 -68 174 -195 8 66 -227 188 -223 46 -147 -341 86 136 -152 145 -205 -176 158 -222 211
$$ packed form
1640I4l8L02r55N47o3n09J164l20k93M09q89K10O25n13O70k47j41J09m79Q9N07
1661B79l65P26n49m09N31p31K77N59n92M81r0n95L59k48J16N50l15J83M5o55L56
1682h7j5K9L46m24K00O8n04N93o0l85N03l06k31N14l93L77L3k14P0k80P7L16n95
1705c68N19L5o24O49m78j3P46m93O5P5n68M48P7l3L99l50L1J14n69N10q4nM91
1728E74n18k96L26p14O57L03o37P48m89l46M47k87K16K70k59J29l03j85N36l39
1748a67L06L00n03J12k07l02N25m8lM56n73l4%j41L79r4P8K22n76J56J49m62O68
1771B41r1k65N79n91%K46j01J69J4l57K81k97J18K50l61M23j48l43M85l77l9M78
1793C14n13J31K42l69K03N8k93M15m11K69j93j94M27N0k88K97l50K9L34l80M33
$$ plain form
1814 211 275 -118 233 -117 -152 220 -94 245 192 -97 123 -59 -413 218 -143 305 269 -565 88 -79 8 206
1836 206 94 42 230 -256 -94 116 -94 133 5 114 167 -70 -9 -77 -279 346 13 -289 302 -152 -223 -5
1858 -5 -149 139 230 -239 86 -226 21 95 -161 313 46 -201 33 -115 -254 369 -124 -66 -34 -367 29 -58
1880 -58 68 224 -148 -185 -130 -258 -2 -74 -40 240 -60 -118 181 -144 -101 -26 -68 170 31 -164 209 -100 85
1903 85 31 -400 17 -266 -64 294 -49 168 -3 -254 111 -105 -140 208 238 4 213 -293 6 116 -152
1924 -152 215 -71 -215 -72 -102 -6 100 -53 405 -107 -300 131 -121 -54 248 -100 11 -104 -41 135 -17
1945 -17 -28 27 -203 -8 -226 -241 133 169 -27 255 -175 -129 -49 -107 87 5 21 99 68 -88 34 -234 90 -26
1969 -26 1 127 -78 -167 200 -166 190 210 -127 47 -55 -13 104 32 54 117 -18 11 -181 -102 -38 -80 139 -17
$$ packed form
1814B11O4l93L51l50l5L72l14L39n3k89K20j82l54O31l61M48l6q34O53j67Q7J98
1836B06j12n2J88m86J62K10k10K27j28J09N3k37O1o8k02O25l33l02N91m54p1K18
1858ej44K88R1m69L25l12K47P4k56M74k67k47K34j48j39O23m93N8L2l33L96q7
1880e8J26J56l72l7N5j28K56p2L4K80l00n8K99l25M3P5m2K38j39j95L73l09J85
1903H5n4m31M17k83K02L58l43K17j71k51L65k16l5L48L0k34K09n06K99J10k68
1924a52L67k86j44J43l0R6J06j53M58n12j93M31k52O7L02l48J11j15O3J76j52
1945a7j1N5k30J95k18j5L74L6j96K82m30M6Q0n8J94q2J6P8l1j56J22k68L24j16
1969b6K7J26k05q9L67l66L56K0l37J74j02M2J17p2K2O3j35K9j92P9O4m2K19j56
$$ plain form
1993 -17 -132 -54 142 31 91 -54 9 104 91 52 95 -52 90 -204 -174 4 22 -9 21 -113 159 -67 -154 53
2017 53 -12 -38 70 -204 -21 105 -80 122 -93 106 210 -6 -50 63 102 216 -18 108 62 -32 -69 -44 -234
2040 -234 76 -7 -36 -109 -239 52 27 67 12 70 11 17 -68 -15 63 -94 138 122 17 -77 -42 -222 -58 -36 -54 -78
2066 -78 -143 114 -102 -86 100 -95 -19 90 -213 104 -170 -125 287 -134 -61 43 -8 -48 21 -38 145 143 -21 64
2090 64 -223 169 260 -16 41 -42 -197 34 40 -147 51 -210 128 5 -162 93 -59 -15 9 -49 -24 -159 -26
2113 -26 174 -19 -163 15 -127 -134 196 -56 181 34 -164 98 -206 -42 80 52 254 114 55 -35 31 -121
2135 -121 80 -355 111 90 -211 123 -128 -128 133 87 -7 91 -212 9 -141 -138 77 52 160 6 -151 -15 -39
2158 -39 -61 224 -174 -111 110 -85 -32 -3 16 -90 84 78 60 -93 29 98 -10 20 -117 -161 114 -22 -44 50 18
$$ packed form
1993a7j15P8J96j11O0j45O3R5j3l9M3j47J42k94L0J78J8l1L0j34K72k26q7K07
2017E3o5k6J08k74J83J26j85K02k15J99J04k16m4J13L9J14k34J26m6r4l7K5j90
2040b34L10q3k9p3j30K91k5M0n5N8n9Oq5N3P8j57K32j6j05r4L5j80J64K2j8k4
2066g8o5K57k16J6J86j95P6J09l03L17k74M5M12m21P3J04n1m0O9n9J83kj64Q5
2090F4k87L92R1k76N7q3j55K31Oj87J98k61L38j23j67K55j52M4K4n8K5j35J33
2113b6K00j93j44J78j42pL30k52K37j47j98K62l04J64J22k8K02j40n9r0O6j52
2135a21K01m35M66k1l01L34k51%K61m6r4R8l03K21j50LK15k5J08j54j57J36k4
2158c9k2K85l98O3K21j95N3K9J9j06J74oj8j53J22O9j08L0j37m4K75j36k2R4l2
$$ plain form
2183 18 -157 -117 -163 -73 -13 -47 -13 -114 -40 83 -9 141 16 -48 -65 -124 -121 -30 -125 64 76 -95 -125 -160 -83 83 -56
2210 -56 26 1 -109 53 26 -59 188 -232 -71 -88 -224 -28 -68 -52 68 56 -105 48 -183 -184 252 -98 128 -28
2234 -28 89 76 -263 102 -134 60 151 -19 -58 98 8 119 138 -249 77 -27 -294 -88 34 63 44 -43 173
2257 173 63 -178 26 -61 -4 2 -68 -81 173 -81 138 5 -31 43 -170 -129 -81 29 114 -95 -71 70 -112 -128
2281 -128 34 -190 37 110 -31 62 76 -93 52 54 -1 -2 -221 87 -59 131 336 133 -123 -191 -147 65 -224
2304 -224 -13 96 -130 -225 44 -126 -40 -111 -23 100 -74 -160 17 -18 -74 130 -137 206 -32 -188 224 -232
2326 -232 -97 79 -157 -93 -115 -176 38 70 171 61 -241 -46 -49 -163 135 135 -20 252 -264 -130 138 -137 15
2349 15 -8 -148 5 -202 -101 50 -1 -95 34 -12 -13 -187 -86 202 -21 92 76 -253 -38 75 -117 68 169
$$ packed form
2183A8j75M0m6R0O0l4L4j01P4J23r2J50j25o4j7n9LR1r5J89J2j71l0l5P7J66j39
2210e6Q2k5j10J62k7q5K47m20J61j7j36J96m0J6J20j2j61J53k31jM36l50K26j56
2234b8J17j3l39L65k36J94R1j70l9J56r0J11J9l87L26j04k67K06J22K9j9q7K16
2257A73j10k41K04q7N7Op0j3K54k54K19j33l6P4k13M1M8J10Q5k09K4J41j82j6
2281a28J62k24K27P3j41R3J4j69J45Kn5jk19L08j46J90K05k03k56o8M4K12k89
2304b24K11J09k26r5K69j70Q6p1Q8J23j74q6J77l5n6K04k67L43k38j56M12m56
2326b32J35J76k36O4k2o1K14L2J01j10l02J95lj14K98%j55K72n16J34K68k75J52
2349A5k3j40J53k07J01J51n1r4J29m6jj74J01K88k23J13j6l29K15J13j92J85J01
$$ plain form
2372 169 -4 -70 -281 97 -116 -38 126 -17 18 -47 -171 79 42 -45 160 -99 -89 -98 -19 40 84 -73 82 -43
2396 -43 128 119 -130 252 119 -131 167 -373 -46 83 -59 176 -42 16 22 27 -49 176 -120 36 65 -172 -87 159
2420 159 24 197 46 8 175 -182 -125 213 -18 -50 72 -187 36 -148 10 -17 74 173 -59 22 57 -93 69
2443 69 -77 4 61 44 -188 34 93 100 149 -126 -99 -105 -62 79 -184 16 387 -249 -8 -17 -226 13 -71 -105 168
2468 168 -116 -176 209 3 52 -3 -20 95 -88 -1 7 -98 147 180 -399 165 -147 -78 182 -4 18 141 -306
2491 -306 54 19 -13 187 48 72 5 -235 77 142 -84 60 -71 47 -18 -160 -43 86 -77 -11 -17 -129 -15
2514 -15 -43 267 -104 -46 7 17 -67 152 -138 -31 186 -277 -46 6 -194 145 14 -90 295 -96 23 -95
2536 -95 -134 213 -70 -2 263 -76 21 76 -114 197 53 -6 28 45 -3 66 77 294 67 -104 85 -127 -88 -6
$$ packed form
2372A69j73o6k11L78k13P8J64j43L5o5j24K50l7q7K05k59J0rP9N9M4j57J55j25
2396d3J71rk49L82j33k50K98n40L27J29j42K35k18N8ONp6K25k96J56K9k37Q5K46
2420A59j35J73j51l8J67l57N7L38k31l2J22k59K23j84J58k7R1R9k32Q1L5j50J62
2443F9j46Q1N7j7k32K22N9PM9k75K7oM3J41k63K00L71o36K41rk09K39q4l4K73
2468A68k84o0L85k06M9n5j7J15j83Q7Qj05K45L3n79N64l12O9K60j86K2J23m47
2491c06L60l5l2K00j39K4o7k40L12O5k26J44j31J18o5j42J17J29j63O6oj12J14
2514a5k8L10l71N8N3J0q4K19k90J07K17m63K31N2k00L39j31j04L85l91J19j18
2536i5l9L47k83O8K65l39R7N5j90L11j44n9L4J7m8O9J1K17k27j71J89k12L9Q2
$$ plain form
2560 -6 -68 60 -128 -203 75 -25 29 211 -328 103 251 -14 -22 -29 -95 114 -204 115 22 -141 -50 93 -85 97
2584 97 -48 -91 -179 -190 117 93 -242 -128 -108 -145 -1 -16 146 46 -181 -17 -135 -24 117 -66 135 159 -100
2607 -100 5 76 3 -28 47 45 -150 -62 63 -1 68 78 -28 -48 -79 -220 -37 70 10 55 -30 -255 87 -46 50
2632 50 205 -50 48 -140 -36 166 102 -111 75 19 17 -64 -100 169 -119 25 49 -149 65 -72 -134 -53 -76 -74 55
2657 55 19 -78 -17 -18 243 -99 26 171 -28 8 100 -131 54 67 -138 136 -45 -79 -9 -144 75 -47 -235 151
2681 151 -62 -146 42 -172 -53 7 -119 -54 -57 -32 52 6 -132 -12 -47 189 84 98 39 18 149 6 -100 144
2705 144 77 -18 128 54 -45 94 -256 100 -9 -137 -111 -135 -189 74 -49 6 126 -63 -84 -50 -49 100 67 89 237
2730 237 -238 -48 -30 29 282 51 -34 18 -7 -37 -74 -220 127 41 23 -84 -83 -105 48 -173 81 -109 -66 42
$$ packed form
2560fo2J28j88p5K78j00N4J82n39M31J48k65qpo6K09l18L19r3j63R1J43j78J82
2584I7j45m3q8j1L07k4l35J14K0l7J44j5J62j00k27J64j18J11J41j83K01K4k59
2607a00J05P1p3l1P5kj95Q8J25o4O9J0j06k0l1j41J83J07o0M5q5k25L42j33R6
2632E0J55k55R8j88J04K02o4k13J86n6kq1l6K69k88J44K4j98K14j37o2Q1k3KJ29
2657E5l6r7O1jK61l42J25J45j99L6R2k31J85J3k05K74j81l4P0j35K19j22j88L86
2681A51k13q4J88k14J19O0j26O5lK5Q4m6j38J20l5K36j05J4n9k1J31j43j06K44
2705A44o7r5J46p4r9J39l50L56j09j28K6k4n4K63j23N5J20j89k1L4JJ49l3K2J48
2730B37m75J90J8N9K53k31q5N2k5l0l7j46L47q6j8j07Jk2J53k21K54j90M3J08
$$ plain form
2754 42 -76 -34 85 27 -73 -34 -167 70 -65 25 24 -31 -90 106 -111 34 18 -144 11 -52 3 3 17 62 66 -197
2780 -197 -5 -66 -183 87 -177 -39 -13 -128 69 47 -29 172 -79 94 95 -123 231 66 -38 73 46 12 -146
2803 -146 -67 70 -89 -12 121 -87 -21 132 -213 -7 -31 -187 219 -74 -170 94 25 -42 65 51 124 -77 71
2826 71 138 -100 -61 50 -176 -48 80 -88 -22 -75 -34 137 -133 -55 -188 -136 73 -172 -41 119 67 35 24 -45
2850 -45 176 125 40 139 -142 -170 113 -287 96 72 -100 74 -51 36 74 -9 118 -45 -248 -58 -182 -154 74
2873 74 -98 81 226 -133 -43 88 46 86 9 94 53 -186 64 -28 -67 136 -8 -24 132 -45 -10 -82 65 84
2897 84 -37 -130 73 28 50 116 -30 122 -142 -116 55 -72 7 91 -30 31 -171 -47 116 14 148 105 -24
2920 -24 -51 -45 -132 130 59 17 -119 -124 108 -120 -97 162 -70 -10 -7 -119 -212 111 -55 -90 83 -69 120 -29 44
$$ packed form
2754D2j18M2J19n8j00L9j33K37j35R0jn5n9J96k17J45j6j62J55o3N5%J4M5Mk63
2780a97J92o1j17K70k64J38K6j15J97k2p6K01k51J73Jk18L54j65j04J11k7l4j58
2803a46P9J37j59P7J33k08O6J53l45K06k4j56M06k93r6K64o9o7J07j4P3k01J48
2826G1O7k38L9J11k26J28J28j68O6n3M1J71k70P8j33N2K09k45J31J60n2l2j1o9
2850d5K21n1q5R9k81k8K83m00L83k4j72J74j25Q7L8q3J27j63k03J90j24K8K28
2873G4j72J79J45l59R0J31m2M0p7Q5m1k39K50r2l9K03j44j6J56j77L5p2J47J9
2897H4j21r3K03m5K2O6j46J52k64K6J71j27P9Q4j21O1k02J24J63j02J34m3j29
2920b4k7Oq7K62p1m2j36nK32k28K3K59k32O0Lj12r3L23j66l5J73j52J89j49P3
$$ plain form
2945 44 78 -83 152 17 -7 170 -150 -101 245 9 -31 2 -238 89 61 -164 71 3 -139 -1 -113 47 21
2968 21 -11 23 16 -32 -125 -48 -37 -49 -188 -1 14 -41 113 -90 84 148 7 47 -27 -119 -92 19 -43 10 -38 244 -141
2995 -141 -100 -1 -15 -84 30 -117 -5 -50 -46 121 152 12 144 6 77 130 29 43 81 -95 120 -129 144 121
3019 121 -22 103 9 -196 -2 -9 83 -12 -25 174 -118 -26 204 109 -120 71 -84 31 -57 -180 70 205 -49
3042 -49 101 -5 97 182 -168 76 -29 -79 231 -193 -6 67 -184 -62 9 -111 -46 0 -228 63 -71 98
3064 98 89 -170 240 -72 -174 104 -135 224 81 -114 51 -113 -74 129 -111 -64 44 -130 153 86 178 132 -50
3087 -50 -180 74 -61 124 57 -58 206 -108 -129 124 -26 -12 151 -42 14 -33 -140 27 -56 -73 104 -139 107
3110 107 -142 -242 58 -138 -28 122 -180 -61 19 -59 64 140 -6 120 -36 -76 -94 -24 180 185 -36 3 -54
$$ packed form
2945D4L4j61K35j35k4J77l20M9L46k36m0L3k40L27k8k25K35o8j42J38j12J60k6
2968B1l2L4pm8r3P7J1j2j39J87J5n5J54k03J74O4j41M0p4r2K7J11o2N3m8K82l85
2995a41M1R9j4o9J14j47J12m5MJ67L1j40J32j38P1N3j01J4L8j76K15k49K73k3
3019A21j43J25r4k05J94pR2r5j3J99k92R2K30r5k29J91j55J15q8j23K50J35k54
3042d9J50j06J02Q5l50K44j05n0L10m24J87P3k51J22P1j20O5M6k28K91j34J69
3064I8rk59M10l12j02K78k39L59j43j95J65j64L9K03k40M7J08j74K83o7R2m6j82
3087e0j30K54j35J85o7j15K64l14k1K53j50J4J63j93N6m7j07J67q3j7J77k43K46
3110A07k49j00L00j96J10J50l02J19Q0p8J23P6j46J26j56m0j8P0K04Nk21L9n7
$$ plain form
3133 -54 -123 66 -120 213 -122 -74 33 -76 -47 164 80 20 34 -311 -46 -28 -53 85 -6 86 10 -25 51 135 134 150
3159 150 -32 -182 186 -51 154 45 -6 50 -22 66 86 -219 133 11 -55 -40 -19 -57 -8 -51 -13 6 -68 62 25
3184 25 -275 -71 -11 18 25 -3 -11 -66 -107 123 -87 47 140 -106 -132 133 -117 7 91 -41 46 -115 48 100 -101
3209 -101 104 27 75 33 -177 76 44 -98 120 -15 -52 175 -94 -200 193 6 47 6 -126 198 -40 17 81
3232 81 -150 186 -28 -135 88 47 -126 81 -138 66 119 -218 126 216 -164 310 33 -59 -175 77 94 63
3254 63 -108 126 48 59 159 -216 136 -60 -194 20 -3 95 136 -113 -46 -76 -67 15 26 -118 138 -112 12 1
3278 1 -170 105 130 -152 73 64 116 89 -96 189 127 -49 126 126 -48 117 -171 31 21 -210 22 -227 -86 153
3302 153 -104 -169 -4 -116 42 -37 -36 85 -137 22 -29 -122 -109 -35 98 193 -84 -20 103 -246 57 18 -114 77
$$ packed form
3133e4o9J89j86L33l35M8J07j09K9K11q4o0J4l45K65J8k5J38r1R2p6l5P6Q4jJ6
3159A50j82j50L68k37K05j09n1N6p2Q8K0l05L52j22o6J5K1l8M9m3L8J9p4J30l7
3184B5l00K04O0K9Pk8qn5m1K30k10J34R3k46k6K65k50J24Q4j32Q7j61J63N2k01
3209a01K05p7M8m2k10K53l2j42K18j35l7K27k69j06L93j87M1m1j32L24k38N7O4
3232H1k31L36k14j07K23m1j73K07k19K04N3l37L44R0l80M74k77r2j16K52J7l1
3254F3j71K34p8J1J00l75L52j96j34K14k3R8M1k49O7l0RQ2J1j44K56k50J24j1
3278Aj71K75K5k82K25rN2k7j85K85o2j76J75%j74J65k88K02j0k31K32k49J41K39
3302A53k57o5J65j12J58p9JJ21k22J59n1r3J3P4J33R5k77O4J23l49L03l9j32J91
$$ plain form
3326 77 267 -90 111 -207 -64 63 4 121 -131 -79 226 -223 -22 -7 -20 94 68 -163 83 -32 45 211
3348 211 -79 -10 -4 -176 16 3 -109 299 -178 122 -126 -171 53 -121 -205 164 -189 20 78 -136 35 87 60
3371 60 38 -55 92 148 -90 217 -58 -98 190 10 -100 177 -111 47 8 -169 -191 69 61 211 -103 40 50
3394 50 -243 -120 -41 -63 221 27 -16 218 -375 -76 129 34 53 -69 -23 190 70 73 69 60 77 55 -86 53 -90
3419 -90 -47 249 -117 158 -106 -140 151 -38 106 14 -266 55 117 -323 22 68 -89 75 -173 -70 -46 -79 55
3442 55 96 -48 122 -212 40 -268 -145 157 -19 -109 186 -62 68 -17 -102 121 -128 -233 178 136 -26 45
3464 45 -200 90 -28 -101 17 -132 60 244 -60 2 -49 -30 17 111 -88 201 -73 8 31 -368 151 13 -141
3487 -141 79 -50 -140 93 -7 13 39 -95 167 96 -44 181 -253 -65 99 -72 154 -131 -140 209 50 -6
$$ packed form
3326G7J90l57K01l18J43J27n9J17k52N2L05m49K01J5j3J14k6k31K46j15P7J66
3348B11k90O9Oj72J92j3j12M08m77L00k48m5K24j74q4L69l53K09N8k14J71N2k7
3371F0k2r3J47N6k38L07k75m0K88j80j10K77k88J58l9j77k2K60qJ50l14J43J0
3394E0k93J23P9k2K84j94m3K34n93K99K05r5J9j22M6K13j20LmrJ7k2j41J39j43
3419i0M3K96l66K75k64l4K91j89J44r2k80L21O2m40L45M6j57J64k48J03K4l3J34
3442E5M1j44J70l34K52l08J23L02j76r0K95k48J30q5q5K23k49j05M11m2j62P1
3464D5k45K90j18p3J18j49J92J84l04O2n1J9M7R4j99K89k74Q1K3l99N19j38j54
3487a41K20j29r0K33j00K0K6j34K62p1j40K25m34J88J64j71K26k85rL49j59n6
$$ plain form
3509 -6 149 -21 -21 -66 30 121 -128 -38 -131 -235 -19 -42 -116 75 -73 168 -4 -22 53 -25 -120 41 33 -158 260 -76
3535 -76 50 16 -113 156 -291 -229 102 -91 93 104 37 67 -56 -53 192 -207 -33 110 -181 43 -74 -228 31
3558 31 -45 28 133 -154 149 29 -47 205 -50 -99 241 -152 -34 62 -148 -16 3 -101 116 -30 97 63 -214
3581 -214 141 194 -155 15 -139 119 316 -63 134 66 -313 73 -94 43 74 53 195 35 -88 -40 59 -108
3603 -108 83 -69 -28 -10 -42 145 104 -98 10 -258 -40 114 3 109 -114 -113 -74 32 -35 57 -228 80 179
3626 179 -21 62 36 -224 183 -92 -65 151 -212 32 5 -101 -37 -87 62 133 -61 21 -31 -74 107 -118 -187 178
3650 178 -155 8 68 -83 99 -139 -7 60 -134 202 49 -42 62 -8 -118 101 -126 11 51 -172 39 65
3672 65 -74 -56 8 30 168 12 45 -115 -118 8 114 -101 80 -350 -73 179 -124 66 68 -1 105 -140 -38
$$ packed form
3509fJ55j70%m5R6R1k49R0r3j04K16k3p4J91j48K41j72j8P5p8r5J61qj91M18l36
3535g6J26l4j29K69m47O2L31j93J84J1o7L0j23LK45l99J74J43k91K24j17j54K59
3558C1p6P3J05k87L03j20p6K52k55m9L40l93J18R6k10J32J9j04K17j46J27l4k77
3581b14L55N3l49J70j54K58J97l79J97o8l79L86j67J37L1k1J42j60j23M8R9j67
3603a08J91j52M1J8l2J87m1k02J08k68K18J54j11J06k23JL9J06o7R2k85L08R9
3626A79k00Q3k6k60M07k75K7K16l63K44k7j06O4n0J49P1j94Q2n2m3J81k25o9L65
3650A78l33J63O0j51J82k38J32O7j94L36j53r1J04p0j10K19k27J37M0k23K11K6
3672F5j39J8O4K2J38j56L3j60lJ26J06k15J81m30K77K52l03J90Ko9J06k45J02
$$ plain form
3695 -38 125 -139 77 -10 -217 35 -133 -94 163 -118 161 51 -88 -141 27 -110 77 -253 32 60 -234 189
3717 189 -39 -104 237 -11 -61 -2 -8 137 101 -152 166 -47 31 67 -117 5 -164 -142 60 -32 23 142 -71 -7
3741 -7 28 -83 -102 -111 -20 119 -160 -45 -86 -208 46 18 -4 90 -159 -60 147 -196 14 161 -90 25 -24 13 54
3766 54 -186 63 11 -130 97 -33 146 -59 -17 -39 -72 -162 161 -11 -78 -21 -30 49 188 -83 74 196 -176 -38
3790 -38 22 -125 307 -121 -156 135 -208 11 -197 -217 6 -61 185 6 1 80 107 -33 63 25 -44 206 -85 27
3814 27 -39 -16 43 -283 -27 58 -23 314 126 -52 254 -197 -148 101 -6 108 42 -93 9 -64 116 80 -18 -90
3838 -90 100 -175 7 122 -69 242 -6 49 114 127 87 106 -29 137 -14 -32 26 160 -96 -56 -55 -56 -24 -48 54
3863 54 -223 -166 -55 -62 45 -9 -60 93 -7 145 -141 -136 -56 19 15 14 -239 -35 116 -106 195 3 16 -85 5
$$ packed form
3695c8J63k64K16q7k07K52j68L9K57k81K79j10j39n3J68j37J87l30K85K8k94M23
3717A89k28o5L41k48n0N9oJ45l6k53L18k13P8L6j84J22j69K2K02r2N5J19k13O4
3741gL5j11j9rR1J39k79J15m1j22K54k8k2R4k49R9K07l43K10J47k51J15m9L7M1
3766E4k40K49n2j41K27j30J79k05M2k2l3r0L23j72o7N7rP9J39k71J57J22l72J38
3790c8O0j47M32m28l5K91l43K19k08k0K23o7K46j79nP9K7j40R6l8o9K50k91J12
3814B7o6K3N9l26K56Q5q1L37j88j78L06m51M9K49j07J14o6j35J02p3J80l6r8p2
3838i0J90k75J82J15j91L11k48N5O5J3m0J9j35J66j51j8N8J34k56M0JjL2k4J02
3863E4k77N7J11pJ07n4n1J53j00J52k86NQ0P5mjk53K04J51k22L01j92J3j01R0
$$ plain form
3888 5 -47 -45 -173 -57 13 59 98 54 -130 -69 112 63 -7 -82 -35 60 -37 191 -31 -21 -6 -168 87 122 -26 49 -2
3915 -2 61 155 -197 -61 52 -59 118 -68 -128 76 -34 183 91 -84 138 63 -49 153 -41 34 -84 -105 138
3938 138 59 -84 8 -12 -19 -20 -106 -28 -1 -5 181 -122 -166 -74 -115 116 -23 -67 -39 47 -57 54 -122 -144 135 -22
3964 -22 46 172 -197 24 -29 -198 232 -99 29 141 73 174 -10 -89 109 -27 -58 36 -204 -78 -18 34 134
3987 134 14 3 127 -59 -56 -64 -145 123 -79 -56 -5 -150 110 70 19 99 -217 -29 9 -22 50 82 -39 25 -93
4012 -93 -109 19 -102 -10 45 -111 16 46 -105 139 -13 2 61 -125 189 -8 -5 51 -38 -95 -11 -44 -58 63 -56
4037 -56 129 -71 -50 -125 -58 -61 66 -63 8 113 -49 10 -134 9 -62 -57 -111 55 79 72 165 -130 9 -41 21 22 -115
4064 -115 -91 -5 -138 -14 -3 -13 64 59 17 41 -72 62 -119 87 104 -154 55 39 50 -123 -165 98 106 126 -26
$$ packed form
3888En2Kj28J16P0M6L9m4j84O1J81m9p0p5M7R5r7K28k22J0J5j62K55L5j48P5n1
3915bO3R4l52J36J13j11J77j86o0K04j10K17r2j75K22p5j12K02j94P5j18k1K43
3938A38p9j43R2k0pjq6P8K7mJ86l03m4R2m1K31j39m4K8Q6j04J11j76k2K79j57
3964b2O8J26l69K21n3j69M30l31J28J12o8J01j84p9J98j36l1R4k40J26O0N2J00
3987A34j20j1J24j86Lqq1K68k02K3N1j45K60m0n1Q0l16J88L8l1P2L2j21O4j18
4012i3j6J28j21R2N5j56J27L0j51K44j52J5N9j86L14j97LN6q9n7Q4l3j4J21j19
4037e6J85k00K1p5O7lJ27j29P1J05j62N9j44J43p1Nn4J66K4pR3k95J39n0O2Jj37
4064a15K4Q6j33J24J1j0P7nm2K4j13J34j81K06J7k58K09j6J1j73m2K63QK0j52
$$ plain form
4089 -26 159 -275 171 70 -93 75 -4 -48 -71 19 97 -57 -69 76 -56 16 -13 62 -28 -147 -8 41 13 11 28
4114 28 -89 2 126 -36 92 -3 -33 8 -80 -4 30 -177 -62 36 -152 9 -28 -38 103 -131 -71 -43 -39 -1 80 -241
4140 -241 68 18 34 31 -199 198 59 42 114 -32 -167 109 -216 67 -198 6 -213 -69 12 91 -29 -13 76
4163 76 71 145 -201 -40 31 -109 1 138 117 38 -113 27 -80 -71 183 -114 -135 111 -14 -28 50 132 11 176
4187 176 24 145 116 -114 57 -62 22 -51 -62 101 80 -54 64 94 8 36 78 34 96 27 -22 -16 -36 184 -91
4212 -91 -13 71 -158 23 144 -92 -176 -29 -11 145 -39 175 96 113 64 -4 -117 98 -137 33 -5 -52 -56 -59 -45
4237 -45 -71 -36 22 81 -237 21 -39 -105 10 -78 -44 -8 -102 91 98 -69 42 -15 117 124 -182 -65 -2 -146 47 -19
4263 -19 44 40 -225 -103 30 63 13 -13 29 78 -10 90 -52 -31 -5 -156 -75 58 67 -141 -52 39 13 29 -94 -5 92
$$ packed form
4089b6J85m34M46j01j63J68p9m4k3R0P8j54j2J45j32P2k9P5r0j19J39M9k8kJ7
4114B8j17R1J24j62J28r5l0M1q8P6L4k07J15R8j88J61l7j0J41k34O0K8ML8Q1l21
4140b41L09n0J6lk30L97j39j7P2j46j35K76l25K83k65K04k19J44Q1P9j20J6Q9
4163G6nP4l46J61P1j40J10J37k1p9j51J40j07RK54k97k1K46j25j4P8Q2j21J65
4187A76j52J21k9k30J71j19Q4p3j1J63k1j34J18L0q6K8M2m4O2o9m9Ok0K20k75
4212i1P8Q4k29J81J21k36q4J47J8J56j84K14p9J7m9o8j13K15k35J70l8m7mlJ4
4237d5k6L5N8N9l18K58o0o6J15q8L4L6r4J93Pj67J11n7J32Pl06J17O3j44J93o6
4263a9O3mk65J22J33L3n0k6M2M9q8J00j42K1K6j51Q1J33Rk08Q9R1k6J6j23Q9R7
$$ plain form
4290 92 -103 -20 -31 -62 43 -7 27 -111 -19 66 126 40 108 -75 2 83 -203 36 132 -19 59 -64 90 135 -27
4315 -27 218 23 70 127 -62 -159 14 63 90 118 113 185 67 62 58 -59 -94 -159 -142 151 -52 -76 58 37 13 -24 -186
4342 -186 -143 -27 -22 164 27 -153 105 -64 53 -26 -64 126 16 160 -46 -67 30 16 27 99 -125 -18 106
4365 106 -38 -100 -29 15 -113 67 -85 -21 93 177 186 -66 -108 -104 11 -85 -46 80 191 67 -173 -37 42 31 76
4390 76 19 43 -72 -15 144 -97 101 189 57 10 -49 -49 27 -115 50 -197 24 -11 26 -159 -73 32 -47 -11 -124
4415 -124 36 -26 -95 134 -154 -74 127 -35 -27 5 53 64 -3 63 -68 -44 43 85 -53 79 3 -117 64 -44 -21
4440 -21 -81 -94 220 -73 15 107 16 -9 -27 5 42 -145 -31 75 14 -50 197 -156 76 24 -238 109 -27 56 -91
4465 -91 -24 3 125 88 44 -1 -150 95 -73 88 -57 32 142 -4 149 109 -214 -194 201 -200 45 68 -118
$$ packed form
4290I2j95Q3j1l1J05n0L4j38R2Q5O0q6O8j83P7Q1k86K39R6j51P8j23J54M5j62
4315b7K45j95M7N7j89r7J73M9K7K8nP2j18nmj17l5o5J7K93k03k4J34k1k4l7j62
4342a86M3J16NJ86j37j80K58j69J17p9l8J90j10J44k06k1R7j4J1P2k24J07J24
4365A06j44o2P1M4j28J80j52O4J14Q4Rk52m2MJ15r6L9J26J11j24k40J36P9j1M5
4390G6n7K4j15N7J59k41J98Q8j32m7n9%P6j42J65k47K21l5L7j85Q6J05p9L6j13
4415a24J60o2o9K29k88Q0K01j62QL2M8J1o7O6j31K4Q7M2j38J32p6j20J81j08K3
4440b1o0j3L14k93Q8R2r1k5j8L2L7j87J14J06o1o4K47l53K32n2k62L47j36Q3j47
4465i1O7K7J22l7m4m5j49K45j68J61j45Q9J10j46J53m0l23K0L95m01K45K3j86
$$ plain form
4488 -118 45 -34 -114 -24 117 72 91 19 18 -30 165 19 -101 34 3 -68 66 53 -13 230 -96 -27 137 -112 77
4513 77 -35 88 128 -24 60 106 -56 126 55 -156 47 -37 -41 54 -66 154 119 -104 12 33 -6 109 -70 -86
4537 -86 160 -97 -32 -19 -103 95 -28 2 -75 -23 -36 -19 -60 12 -140 -101 71 83 -37 200 -34 -68 -88 -146 148
4562 148 96 16 0 -99 -143 20 21 -7 3 -87 -77 -9 -32 -12 -239 -131 -68 3 -111 -7 -8 28 -38 151 84 115 211 66
4590 66 143 58 -268 -23 24 -44 -79 -148 -55 -193 51 -19 -43 -5 -101 -100 -6 196 -32 242 -29 -70 98 111 147 143 18
4617 18 34 89 -29 192 -31 -184 -33 -136 19 -48 -60 126 36 -18 106 32 -66 -23 -229 -103 -10 -122 8 13
4641 13 -157 37 88 60 3 31 -46 22 3 95 -64 -81 -9 -159 -46 90 64 -30 107 -83 144 -130 -111 171 -195
4666 -195 54 6 35 35 3 13 187 15 150 71 -89 25 -135 -78 137 99 -11 44 -31 170 -144 -147 72 -151
$$ packed form
4488a18J63p9q0R0J41m5J9p2jm8J95j46j20J35l1p1J34j3o6K43l26O9J64k49J89
4513G7j12J23M0j52Q4M6j62J82p1k11K03q4mR5j20K20l5k23J16K1l9J15j79j6
4537h6K46k57O5J3q4J98j23L0p7N2j3J7m1P2j52L9J72J2j20K37k34l4k0n8K94
4562A48n2q0j6r9m4J63Jk8J0r0J0O8k3K0k27J08O3P1j14J04jL6o6J89o7L1R6j45
4590F6P7q5l26K45M7o8l5o9R3j38K44p0k4L8r6JR4K02k28K74k71m1J68J3L6mj25
4617A8J6N5j18K21k23j53J51j03J55o7j2J86r0n4J24p4r8M3k06J26R3j12J30N
4641A3j70J94N1k8n7K8p7O8j9R2j59j7P2j50J13J36k6r4J37j90K27k74J9K82l66
4666a95K49m8K9%l2J0J74j72J35p9j60J14j60N7K15l8j10N5p5K01l14lK19k23
$$ plain form
4690 -151 45 164 -144 253 69 66 -9 4 53 37 25 148 173 5 -29 -133 14 149 -4 -8 -226 -77 184 21
4714 21 -103 -19 -68 -26 -100 -223 45 149 -175 80 -107 137 48 -64 95 -16 8 93 72 50 78 -152 -18 -7
4738 -7 -101 239 -157 -152 -36 -14 4 186 -138 65 -1 24 93 -175 -28 -34 -197 129 -78 -103 173 -236 36 113 -1
4763 -1 153 -66 -43 104 35 17 211 46 111 -58 -7 252 95 -54 68 -215 -5 88 -64 -56 -85 -117 -77 -127 151
4788 151 67 -24 101 -75 67 53 173 -26 -11 -65 -58 5 -37 81 160 42 133 -49 78 129 57 185 47 73 66
4813 66 10 157 -48 -238 68 0 100 169 40 -177 119 -106 29 21 -89 16 -66 -83 126 -35 -2 -28 -92 128
4837 128 -76 -97 80 -41 40 -59 -229 29 44 -156 -40 -51 43 -140 -157 114 -96 34 49 -33 -64 -8 -29 86
4861 86 -87 -108 15 -10 -173 158 -82 53 -87 -127 134 65 -32 95 7 32 210 70 69 13 -41 95 72 137 92
$$ packed form
4690a51J96J19l08L97j84lp5J3M9j6j2J23K5j68l4j04J47J35j53mk18J49K61j63
4714B1j24Q4m9M2p4j23K68J04l24K55j87K44q9j12J59j11K4Q5k1k2K8k30J34J1
4738gr4L40l96NJ16K2J8J82l24K03o6K5O9k68J47oj63L26k07k5K76m09K72P7j14
4763aJ54k19K3J47o9j8J94j65O5j69N1K59j57j49J22k83K10R3j52Qk9l2M0n0K78
4788A51q4r1J25j76J42j4J20j99J5n4PO3m2J18P9j18R1j82J27N1p2J28j38K6p
4813F6n6J47k05j90L06o8J00O9j29k17K96k25J35qj10J05q2j7K09j61L3k6o4K20
4837A28k04k1J77j21Q1r9j70K58J5k00J16j1R4j83j7K71k10J30J5q2l1N6k1J15
4861H6j73k1J23k5j63L31k40J35j40m0K61o9r7J27q8K5J78j40jn6n4J36k3O5m5
$$ plain form
4886 92 -140 153 56 -142 52 -105 20 -61 -128 -15 -117 -22 8 110 -38 -13 42 -72 90 -162 129 -58 -27
4909 -27 117 -69 -136 34 -29 -24 -5 -7 -42 -50 -97 201 -34 -215 177 -127 75 -28 -34 158 -15 -15 -18 -39 54 -61 59
4936 59 116 21 -29 62 -105 -159 59 -90 35 146 -44 119 -58 -83 -92 3 12 -54 25 -3 -103 -17 52 18 40 18 -173
4963 -173 137 99 -27 53 -136 -173 22 41 19 40 -25 38 -226 -46 119 -65 97 219 6 22 93 -56 223
4986 223 -71 63 79 -122 57 -70 19 -45 -14 -37 -105 -71 129 -70 74 256 15 61 84 27 6 -35 -125 74
5010 74 -63 -76 75 51 79 41 -105 72 125 9 97 -74 144 104 -66 101 -91 6 56 -192 123 -34 43 -52
5034 -52 -4 -69 136 -168 -37 -28 -48 48 -15 -72 131 -54 17 187 -165 20 -62 8 121 91 -122 -19 -89 3 80
5059 80 -114 89 -188 46 57 -79 -46 45 -50 77 -206 -53 51 -11 27 175 -143 13 -29 -71 276 -162 -65
$$ packed form
4886I2k32K93r7j98J94j57J25q1o7J13j02R5L0J02j48K5N5j14J62k52K91j87L1
4909b7J44j86o7J70o3NJ9kl5qm7K98k35j81L92l04K02j03oJ92j73%lk1R3j15J20
4936E9N7r5n0R1j67n4K18j49J25J11j90J63j77k5rR5Ro6P9k8j00Q6O9l4K2k2j91
4963a73L10l8j26Q0j89l7J95J9k2K1o5O3k64J80J65j84J62J22k13J6P1j49K79
4986B23k94J34J6k01J79j27Q9o4L1k3o8L4K00j99J44J82k41M6K3n7k1m1r0J99
5010G4j37j3J51k4K8l8j46J77N3j16Q8j71K18m0j70J67j92R7N0k48L15j57P7r5
5034e2M8o5K05l04J31Rk0R6o3n7K03j85P1J70l52J85q2P0J13l0k13J03p0R2P7
5059H0j94K03k77K34J1j36L3R1r5J27k83J53J04o2L8J48l18J56m2m2L47m38R7
$$ plain form
5082 -65 110 -83 137 -3 -178 26 -172 -16 12 -171 -178 181 -166 145 -21 -78 98 -72 -69 19 -21 74 -77
5105 -77 23 92 27 12 166 89 35 46 56 170 -139 -56 40 -15 -19 -189 -44 91 -56 -252 105 -145 81 -44
5129 -44 20 3 121 -33 35 -111 96 9 -98 27 88 33 -46 75 -10 -46 -67 -106 -24 -102 32 -154 -138 184 -129
5154 -129 72 37 -83 30 1 -221 106 -150 10 -8 51 -26 149 -175 84 39 -57 -18 -90 -41 108 -85 108
5177 108 -28 -84 100 -96 14 67 -66 206 19 -152 40 -124 138 119 -99 -20 118 -150 198 -96 -34 19
5199 19 -48 62 61 -103 50 -112 136 108 -24 171 94 -9 42 74 39 125 -112 -2 70 -251 67 -53 -97 116
5223 116 -215 95 167 -13 33 111 -56 -45 -21 -237 207 -98 58 60 -25 136 -94 -172 86 -5 36 56 -197 40
5247 40 -108 38 90 151 -26 30 -184 0 -22 68 262 -112 -70 51 -199 78 78 55 168 -107 -47 65 53 159
$$ packed form
5082f5J75j93K20j40j75K04j98J56K8j83pL59l47L11j66n7J76j70LQ8m0R5j51
5105g7J00O9o5j5J54p7n4J1J0J14l09Q3R6n5mj70J45J35j47j96L57k50K26j25
5129d4O4j7J18j54O8j46K07q7j07J25O1n5p9J21q5l6k1l9Q2p8J34j86J6L22l13
5154a29K01l5j20J13k9k22L27k56J60j8N9p7J75l24K59m5r6L9p2M9J49j93J93
5177A08j36n6J84j96J10N3j33K72j87j71J92j64K62j9k18P9J38k68L48k94O2N3
5199A9o7J10jj64J53j62K48k8j32J95p7j03N1L2l5Q6k37J10P2l21L18j20m4K13
5223A16l31L10P2j80M6P8j67J1K4k16M44l05J56Kq5J61k30p8K58r1M1K0k53K37
5247D0j48J46N2O1j77N6k14J84k2R0J94l74M2J21k50K77%k3J13k75O0J12j2J06
$$ plain form
5271 159 27 -127 122 -92 -87 62 -13 171 -34 -11 -22 102 -82 -33 -128 -34 186 -147 74 12 -91 -59 14 -84
5295 -84 59 13 -5 -29 -15 198 -84 76 188 -256 0 148 -89 141 3 11 -91 -19 10 -10 9 30 95 -94
5319 -94 -37 24 -75 -28 11 -44 103 -78 146 -196 33 133 -12 -45 -16 -161 -39 -36 -37 123 -121 -31 0 -111 -80
5344 -80 -55 53 113 46 45 229 46 88 44 -174 70 43 -111 74 30 130 -42 -82 48 -71 -152 -107 -52 144 35
5369 35 -104 126 -68 -128 38 18 -88 73 114 150 110 -82 -32 124 8 100 -50 86 179 -167 -123 80 -81
5392 -81 110 -77 -60 -64 -93 230 -103 -112 133 -139 77 47 -212 229 -56 144 89 93 -15 234 -177 11 54 5
5416 5 113 -16 -91 -80 -37 117 -9 -218 61 -79 -109 5 -57 94 229 -27 77 79 1 -11 -14 -151 53 -101
5440 -101 53 -175 -122 191 113 12 -5 27 29 12 -101 72 61 -129 183 -76 -26 -69 90 186 72 -27 66 136 -1
$$ packed form
5271A59j32j54K49k14NJ49p5J84k05K3j1J24j84M9r5R4K20l33K21o2j03L2P3r8
5295h4J43m6j8k4J4K13k82J60J12m44K56J48k37K30j38Qj02P2K9k0J9K1O5j89
5319i4N7O1r9M7L9n5J47j81K24l42K29J00j45l3K9j45J22LjJ60k44R0L1j11L1
5344h0K5J08O0o7jJ84j83M2m4k18K44k7j54J85m4J00j72m0J30j19q1M5N5J96j09
5369C5j39K30j94o0J66k0j06J61M1L6m0j92N0J56j16R2j50J36R3l46M4K03j61
5392h1J91j87J7mk9L23l33rK45k72K16l0k59M41k85K00n5Mj08K49m11J88M3m9
5416EJ08j29p5J1M3J54j26k09K79j40l0J14o2J51J35k56J04Kp8j2lj37K04j54
5440a01J54k28N3L13p8j01j7L2Kj7j13J73j1j90L12k59N0m3J59R6j14r9R3P0j37
$$ plain form
5465 -1 71 -183 26 -63 42 -40 -11 -207 102 28 -86 29 -8 141 -31 3 88 -168 -17 14 -23 -44 -27 53 182
5490 182 -143 -123 127 -188 182 81 -37 86 109 -48 146 -54 50 -5 -123 93 -188 1 90 29 35 28 -68
5513 -68 157 113 -109 220 13 -65 229 -41 -1 -182 -124 87 -13 -7 -28 -186 -67 111 -111 -34 -70 -133 120 114
5537 114 42 103 -165 -10 31 42 45 -23 -25 23 -155 35 117 -86 -51 -55 -54 60 -134 69 51 0 -33 -146 -69 171 -165
5564 -165 43 44 -178 162 -45 -60 106 -93 1 49 -151 85 3 -216 226 24 -135 169 -71 7 -90 4 138
5587 138 -118 -126 57 194 101 -18 -204 175 -18 -135 68 55 -164 219 -35 29 -122 -96 179 -22 161 36
5609 36 2 21 14 -158 149 30 -120 135 -150 66 108 -76 112 -84 -67 63 -5 85 94 -135 68 82 -35 -54
5633 -54 -78 -131 100 -126 167 -18 -28 -3 -64 74 191 -65 119 62 -116 72 120 -218 97 -7 34 12 -173
$$ packed form
5465aP2k54K09q9J05q2K9j96L09p4j14J15l7J49j72L4Q5k56J51L1l7k1J7Q0J29
5490A82l25K0K50l15L70j01j18J23K3j57J94k00J04n5j18K16k81J89Q9o1Opr6
5513f8K25m4k22L29k07p8K94k70M0j81N8K11j00Ok1j58J19J78k22P7l6o3K53o
5537A14p2O1k68J55M1J1Lo8kM8j78J90Q2k03L5mJJ14j94K03j8n1l3j13P7K40l36
5564a65K08Jk22L40k07j5J66j99R4M8k00K36q2k19M42k02j59L04k40P8r7R4J34
5587A38k56qJ83J37r3j19j86L79j93j17K03j3k19L83k54O4j51K6K75k01J83j25
5609C6l4J9pj72L07j19j50K55k85K16M2j84J88j96J7J30o8R0Rk29K03J4j17j9
5633e4k4n3K31k26K93j85j0K5o1J38J17k56J84n7j78J88M8l38L15j04M1k2j85
$$ plain form
5656 -173 68 -22 -90 58 -46 13 82 -43 81 112 -40 100 -85 80 -7 -13 2 81 -178 153 -166 -36 -62 -121
5680 -121 -6 108 23 -54 -8 -32 77 -114 -103 -2 -132 36 48 9 51 194 2 -50 -105 -41 6 -179 71 21
5704 21 25 87 -112 71 62 -66 -27 104 -51 155 -53 -38 37 -98 20 -24 -175 -62 -129 -77 85 -127 154 -148
5728 -148 -231 2 23 -15 167 -26 25 106 35 -16 -40 -131 185 -76 -183 160 -46 -79 -8 -22 164 -133 58 64 -79
5753 -79 19 -31 -41 68 -184 -80 163 -94 72 -5 -72 110 -174 -81 85 120 -96 -221 -114 61 7 -51 22 -19
5777 -19 -14 67 -164 26 92 61 -12 -13 -40 165 52 9 96 -83 80 -21 52 74 -119 -16 -4 -74 -59 61 -136 -96
5803 -96 -107 80 -51 -48 6 37 -17 -42 -32 -51 58 -307 75 47 -66 21 -64 171 -42 78 158 99 13 63 112 -59
5829 -59 211 -7 56 102 -70 11 23 -22 -22 -63 -60 -19 -81 -121 -18 -182 147 -125 -51 -108 -71 103 85 -13 -26 -85 -15
$$ packed form
5656a73K41r0o8J48j04N9O9j25J24L1j52J40j85J65q7oJ5P9k59L31l19J30k6n9
5680a21J15J14q5p7M6k4J09j91J1J01j30J68J2l9M2J43j92n2n5O4M7j85K50n0
5704B1MO2j99J83rj28L9J31j55K06k08J5P5j35J18m4j51J13o7N2J62k12K81l02
5728a48q3K33K1l8J82j93N1Q1p1n1k4r1L16k61j07L43k06l3P1j4J86k97J91Oj43
5753g9R8n0j0J09k52J04K43k57J66p7o7J82k84R3J66L5k16j25J07J75n4n8P3m1
5777a9NQ1k31J90O6l1p3jk7K05j13m3Q7j79J63j01P3K2j93J03J2p0J5J20j97M0
5803i6j1J87j31LN4L1n4k5J0j9J09l65L82k8j13Q7q5K35k13J20Q0n9q6N0M9j71
5829e9K70k18O3M6j72Q1J2m5%m1LM1o2m0J03j64L29k72P4n7L7J74j8r8j3n9P0
$$ plain form
5856 -15 35 17 -160 -51 4 40 -8 -236 69 48 -71 -19 -134 -31 -34 -118 136 -74 -48 52 112 -90 -18 -72 108
5881 108 59 -164 76 -126 -99 -101 -16 21 50 -8 113 -155 14 -150 -37 -144 -37 -46 16 51 -136 -87 -92 27 112
5906 112 4 246 -42 -28 164 -42 119 124 1 -46 123 -217 -55 75 -86 78 -95 -39 154 -37 28 -22
5928 -22 -129 -106 -12 74 39 -141 -13 159 41 7 -74 -68 113 57 142 172 -99 154 -179 -22 84 -123 171 -9
5952 -9 -46 55 -74 -91 52 -100 59 44 -213 152 18 -48 57 -21 -128 83 45 113 -23 39 -14 -7 20 57 -71
5977 -71 136 71 119 248 -80 0 138 -49 14 -75 -184 -108 -64 -59 2 104 7 26 -123 -107 118 -110 0 -132 94
6002 94 106 3 37 44 134 13 24 -14 31 -152 2 8 -173 51 -118 -23 34 -18 -61 -96 -22 75 28 -71 94 -86 56
6029 56 162 -46 -60 38 71 80 -176 133 215 -52 -83 -53 -51 89 130 88 -48 -199 64 -49 -70 35 -17 88 88 -14
$$ packed form
5856a5N0j8j77J09N5L6m8k28L05k1j19N2j15J03lq4K54k10K6J00O0k02P2n4J80
5881A08m9k23K40k02K7kQ5L7K9n8J21k68J69j64J13j07J07rO2L5j87M9nJ19Q5
5906A12j08K42k88J4J92k06J61Nj23m7J69l40J62J30j61J64j73N6J93j91O5n0
5928b2j07K3R4Q6l5j80J28J72j18l4q1OJ81n6Q5L0k71K53l33J57J06k07K94j80
5952il7J01j29j7J43j52J59j5k57L65j34o6J05p8j07K11l8O8j36O2n3PK7L7j28
5977g1K07o5M8J29l28Q0J38j87O3q9j09P6M4NO1J02r7J9j49J6K25k28J10j32K26
6002I4J2j03L4PR0j21J1l8M5j83J54Oj81K24j69R5N7n2m3l5P4R7m7r9J65j80J42
6029E6J06k08j4R8L3Rk56L09Q2k67l1L0KJ40M1m2j36j51K63j13k1J05n2J05%j02
$$ plain form
6055 -14 122 102 -64 -18 -51 -16 73 -81 -74 17 119 -67 -12 -47 216 14 -47 -25 85 9 63 -4 151 91 114 121 -16
$$ packed form
6055a4J36k0j66M6l3L5Q9j54PR1J02j86N5l5K63k02o1K2J10p6N4o7J55o0K3Pj37
$$ [...]
8190D3n
8191C8
##END NTUPLES=NMR FID
##END=
