##TITLE=1H_16-2025
 200.13MHz, DMSO-d6,
 8 sc
 
 28.1.2025
##JCAMPDX= 6.0         $$ Bruker NMR JCAMP-DX V2.0
##DATA TYPE= NMR FID
##DATA CLASS= NTUPLES
##ORIGIN= UXNMR, Bruker Analytische Messtechnik GmbH
##OWNER= pz
$$ XWIN-NMR		Version 3.5
$$ Tue Jan 28 14:53:55 2025 Russian Standard Time (UT+4h)  she@DPX200
##.OBSERVE FREQUENCY= 200.1313
##.OBSERVE NUCLEUS= ^1H
##.DELAY= (6, 6)
##.ACQUISITION MODE= SIMULTANEOUS
##.ACQUISITION SCHEME= undefined
##.AVERAGES= 8
##.DIGITISER RES= 18
##SPECTROMETER/DATA SYSTEM= spect
##.PULSE SEQUENCE= zg30
##.SOLVENT NAME= DMSO
##.SHIFT REFERENCE= (INTERNAL, DMSO, 0, 14.3821)
##AUDIT TRAIL= $$ (NUMBER, WHEN, WHO, WHERE, WHAT)
$$ ##TITLE= Audit trail, XWIN-NMR		Version 3.5
$$ ##JCAMPDX= 5.01
$$ ##ORIGIN= Bruker BioSpin GmbH
$$ ##OWNER= she
$$ F:/spectra/data/she/nmr/H-C/1/audita.txt
$$ ##AUDIT TRAIL=  $$ (NUMBER, WHEN, WHO, WHERE, WHAT)
(   1,<2025-01-28 14:52:45.29 +0400>,<she>,<DPX200>,
      <created by zg, POWCHK disabled, PULCHK disabled
       configuration hash MD5:
       00 E9 B6 7A A2 85 ED C7 34 08 36 98 17 FE 4E 26
       data hash MD5: 16K
       4F 60 B1 D4 3A 8C FA B5 15 C2 A0 89 0C 22 CA 90>)
$$ ##END=
$$ 
$$ hash MD5
$$ CB 42 E9 AE 11 B4 BC 90 43 55 E1 B4 8C E2 7C BF
##$RELAX= 
##$RELAX= 
##$RELAX= 
##$RELAX= 
##$RELAX= 
##$RELAX= 
$$ Bruker specific parameters
$$ --------------------------
##$DU= <F:/spectra>
##$EXPNO= 1
##$NAME= <H-C>
##$PROCNO= 1
##$TYPE= <nmr>
##$USER= <she>
##$AMP= (0..31)
100 100 100 100 100 100 100 100 100 100 100 100 100 100 100 100 100 100 
100 100 100 100 100 100 100 100 100 100 100 100 100 100 
##$AQSEQ= 0
##$AQ_mod= 1
##$AUNM= <au_zg>
##$AUTOPOS= <>
##$BF1= 200.13
##$BF2= 200.13
##$BF3= 200.13
##$BF4= 200.13
##$BF5= 200.13
##$BF6= 200.13
##$BF7= 200.13
##$BF8= 200.13
##$BYTORDA= 1
##$CFDGTYP= 0
##$CFRGTYP= 5
##$CHEMSTR= <none>
##$CNST= (0..31)
1 1 145 1 1 1 1 1 1 1 1 1 1 1 1 1 1 1 1 1 1 1 1 1 1 1 1 1 1 1 1 1 
##$CPDPRG= <>
##$CPDPRG1= <>
##$CPDPRG2= <>
##$CPDPRG3= <>
##$CPDPRG4= <mlev>
##$CPDPRG5= <mlev>
##$CPDPRG6= <mlev>
##$CPDPRG7= <mlev>
##$CPDPRG8= <mlev>
##$CPDPRGB= <>
##$CPDPRGT= <>
##$D= (0..31)
0 0.7 0 0 0 0 0 0 0 0 0 0.03 0 0 0 0 0 0 0 0 0 0 0 0 0 0 0 0 0 0 0 0 
##$DATE= 1738061564
##$DBL= (0..7)
120 120 120 120 120 120 120 120 
##$DBP= (0..7)
150 150 150 150 150 150 150 150 
##$DBP07= 0
##$DBPNAM0= <>
##$DBPNAM1= <>
##$DBPNAM2= <>
##$DBPNAM3= <>
##$DBPNAM4= <>
##$DBPNAM5= <>
##$DBPNAM6= <>
##$DBPNAM7= <>
##$DBPOAL= (0..7)
0.5 0.5 0.5 0.5 0.5 0.5 0.5 0.5 
##$DBPOFFS= (0..7)
0 0 0 0 0 0 0 0 
##$DE= 6
##$DECBNUC= <off>
##$DECIM= 32
##$DECNUC= <off>
##$DECSTAT= 4
##$DIGMOD= 1
##$DIGTYP= 9
##$DL= (0..7)
0 120 120 120 120 120 120 120 
##$DP= (0..7)
150 150 150 150 150 150 150 150 
##$DP07= 0
##$DPNAME0= <>
##$DPNAME1= <>
##$DPNAME2= <>
##$DPNAME3= <>
##$DPNAME4= <>
##$DPNAME5= <>
##$DPNAME6= <>
##$DPNAME7= <>
##$DPOAL= (0..7)
0.5 0.5 0.5 0.5 0.5 0.5 0.5 0.5 
##$DPOFFS= (0..7)
0 0 0 0 0 0 0 0 
##$DQDMODE= 0
##$DR= 18
##$DS= 0
##$DSLIST= <SSSSSSSSSSSSSSS>
$$ [...]
##$SUBNAM0= <"">
##$SUBNAM1= <"">
##$SUBNAM2= <"">
##$SUBNAM3= <"">
##$SUBNAM4= <"">
##$SUBNAM5= <"">
##$SUBNAM6= <"">
##$SUBNAM7= <"">
##$SUBNAM8= <"">
##$SUBNAM9= <"">
##$SW= 18.0517328524113
##$SWIBOX= (0..15)
0 0 2 0 0 0 0 0 0 0 0 0 0 0 0 0 
##$SW_h= 3612.71676300578
##$TD= 16384
##$TD0= 1
##$TE= 0
##$TE2= 300
##$TE3= 300
##$TEG= 300
##$TL= (0..7)
0 120 120 120 120 120 120 120 
##$TP= (0..7)
150 150 150 150 150 150 150 150 
##$TP07= 0
##$TPNAME0= <>
##$TPNAME1= <>
##$TPNAME2= <>
##$TPNAME3= <>
##$TPNAME4= <>
##$TPNAME5= <>
##$TPNAME6= <>
##$TPNAME7= <>
##$TPOAL= (0..7)
0.5 0.5 0.5 0.5 0.5 0.5 0.5 0.5 
##$TPOFFS= (0..7)
0 0 0 0 0 0 0 0 
##$TUNHIN= 0
##$TUNHOUT= 0
##$TUNXOUT= 0
##$USERA1= <user>
##$USERA2= <user>
##$USERA3= <user>
##$USERA4= <user>
##$USERA5= <user>
##$V9= 5
##$VALIST= <valist>
##$VCLIST= <CCCCCCCCCCCCCCC>
##$VD= 0
##$VDLIST= <DDDDDDDDDDDDDDD>
##$VPLIST= <PPPPPPPPPPPPPPP>
##$VTLIST= <TTTTTTTTTTTTTTT>
##$WBST= 1024
##$WBSW= 4
##$XGAIN= (0..3)
0 0 0 0 
##$XL= 0
##$YL= 0
##$YMAX_a= 37372
##$YMIN_a= -104550
##$ZGOPTNS= <>
##$ZL1= 120
##$ZL2= 120
##$ZL3= 120
##$ZL4= 120
##$ABSF1= 10
##$ABSF2= 0
##$ABSG= 5
##$ABSL= 3
##$ALPHA= 0
##$AQORDER= 0
##$ASSFAC= 0
##$ASSFACI= 0
##$ASSFACX= 0
##$ASSWID= 0
##$AUNMP= <proc_1d>
##$AZFE= 0.1
##$AZFW= 0.1
##$BCFW= 1
##$BC_mod= 2
##$BYTORDP= 1
##$COROFFS= 0
##$CY= -3
##$DATMOD= 1
##$DC= 2
##$DFILT= <>
##$DTYPP= 0
##$F1P= 0
##$F2P= 0
##$FCOR= 0.5
##$FTSIZE= 0
##$FT_mod= 4
##$GAMMA= 1
##$GB= 0.15
##$INTBC= 1
##$INTSCL= 1
##$ISEN= 128
##$LB= 0.25
##$LEV0= 0
##$LPBIN= 0
##$MAXI= 10000
##$MC2= 0
##$MEAN= 0
##$ME_mod= 0
##$MI= 1.114404
##$NCOEF= 0
##$NC_proc= 0
##$NLEV= 6
##$NOISF1= 3.799351
##$NOISF2= 2.8
##$NSP= 1
##$NTH_PI= 0
##$NZP= 0
##$OFFSET= 14.38212
##$PC= 1
##$PHC0= 239.1164
##$PHC1= 25.79223
##$PH_mod= 1
##$PKNL= yes
##$PPARMOD= 0
##$PSCAL= 0
##$PSIGN= 0
##$REVERSE= no
##$SF= 200.129724274929
##$SI= 16384
##$SIGF1= 3
##$SIGF2= 2
##$SINO= 400
##$SIOLD= 16384
##$SREGLST= <1H.CDCl3>
##$SSB= 0
##$STSI= 0
##$STSR= 0
##$SW_p= 3205.1282051282
##$SYMM= 0
##$S_DEV= 0
##$TDeff= 0
##$TDoff= 0
##$TI= <>
##$TILT= no
##$TM1= 0
##$TM2= 0
##$TOPLEV= 0
##$USERP1= <user>
##$USERP2= <user>
##$USERP3= <user>
##$USERP4= <user>
##$USERP5= <user>
##$WDW= 1
##$XDIM= 8192
##$YMAX_p= 0
##$YMIN_p= 0
$$ End of Bruker specific parameters
$$ ---------------------------------
##NTUPLES= NMR FID
##VAR_NAME=  TIME,          FID/REAL,        FID/IMAG
##SYMBOL=    X,             R,               I
##VAR_TYPE=  INDEPENDENT,   DEPENDENT,       DEPENDENT
##VAR_FORM=  AFFN,          ASDF,            ASDF
##VAR_DIM=   8192,          8192,            8192
##UNITS=     SECONDS,       ARBITRARY UNITS, ARBITRARY UNITS
##FACTOR=    0.0002768,     1,               1
##FIRST=     0,             0,               0
##LAST=      2.2672688,     0,               0
##MIN=       0,             -104550,         0
##MAX=       2.2672688,     37372,           0
$$ Real data points
##PAGE= N=1
##DATA TABLE= (X++(R..R)), XYDATA
$$ [...]
1611b5M7J46l33K09j4O8J29j70m09L15K44j46j27J14J55k92j76J87J07N0j18o5
$$ -25 22 168 -165 44 30 98 227 57 -352 -37 207 61 -66 48 203 -89 -265 -78 29 79 -39 -104
1633a04R2R1J7j07l4K00m1k67J42J17q2K50l53M1k6K04R8k97j6Q8k7n5j85R1K40
$$ -104 -12 79 96 -11 -45 155 114 -153 -11 106 24 274 -79 -38 -64 140 238 -59 -75 13 -14 -69 -254 -163 77
1658G7Pj10k4J82K0o2l76L78k01K49k17O9kK47l05P1j36J4K48j12J30j05J98k74
$$ 77 84 -26 -50 132 152 90 -286 92 -109 140 -77 -8 -10 237 -68 3 -133 -119 129 17 147 42 240 -34
1682c4l5q0K51j40J45j3j03P3K30n02K79JM4j41l13L75J24k84j87J81J28L7j08
$$ -34 -69 -149 102 -38 107 94 -9 64 294 -208 71 72 116 -25 -338 37 161 -123 -310 -129 -1 36 -72
1705g2L6j58L33J43l43m5J51O1l40LJ46J15Qj31p4J60N4O2o0r6J14p6j93J12P3
$$ -72 -36 -194 139 282 -61 -106 45 106 -234 -231 -85 30 38 -93 -167 -7 47 109 49 -47 67 -9 -202 -90 -17
1730a7j87J39j33lK36K29l44J14j09K22o1k08p3J70rr2j15nN25k06l19J65Q6J33
$$ -17 -204 -65 -198 -201 35 264 -80 34 -75 147 86 -122 -195 -25 -34 -126 -241 -246 279 73 -246 -81 5 138
1754A38k54J10Q6j1j98J60j15K19k68J35j48J27K26j19j26l6J06n9k20J79J05
$$ 138 -116 -6 80 69 -129 31 -84 135 -133 2 -146 -19 207 88 -38 -74 32 -27 -247 -68 37
1775C7Nn2po4N8MK8j58J20K50n4j46J9n9K71j86k31O5J91j00r3K58J4R6j70k28
$$ 37 42 -10 -17 -81 -23 -19 9 -149 -29 221 167 21 40 -19 252 66 -165 -100 91 -9 -102 156 170 266 96 -132
1801a32l2L27j90P4k28R8J15j05K80k50K08J83k95j86J57J04%j16r5J73n8k29
$$ -132 -164 163 -27 47 -181 -83 32 -73 207 -43 165 348 53 -133 24 128 128 12 -83 90 32 -197
1823a97L2q2L39j40j19J16K20q7jj52RO8P1j82K5J74R6o6l31l0L30J90l65j0K3
$$ -197 -165 -247 92 -48 -167 -51 169 82 81 -71 -62 6 77 -105 -80 94 190 124 -207 -237 93 283 -82 -92 -69
1848f9N7J50k80J01J57N0l70P2Q5Q5q4p3N8PK29j43k48J19K20Nk64P4j6K65k04
$$ -69 -12 138 -142 -41 116 166 -204 -132 -47 38 -46 -119 -61 -54 175 32 -216 -97 123 128 -136 -62 -78 187 -17
1873a7j38LL01n0j41o2K19j38q2J17k2L7p2j66N5J71J4l7j39o2M02k62Kp9K48
$$ -17 -155 -152 149 99 -42 -104 115 -23 -105 12 -10 27 -45 -211 -156 15 29 -8 -147 -209 193 -69 -67 -146 102
1898A02J37m74L6M08n6k19J91k92J59J64L7k14j2K2K09j05j40M0K50k15j21n5
$$ 102 239 -235 -199 209 153 -66 125 -167 -8 156 193 -21 -33 -11 198 93 -47 -7 243 28 -93 -148
1920a48K42K12m12L1k7o5o0n8O5L89K1k43q0J26J87j65Q5j99L13k79J7j93K41
$$ -148 94 306 -106 -75 -102 -167 -227 -285 -220 169 190 -53 -133 -7 180 15 100 -99 214 -65 -48 -241 0
1943@J01J14m10O5J00L55l22k14J99J62np2m48M54Q8j54r1j56L65%k04j79J21
$$ 0 101 215 -195 -130 -30 325 3 -211 -12 150 145 73 -375 79 167 13 -78 -234 131 131 -73 -252 -131
1966a31M61j67l48J6L79k9k22j02P0J92j94q2M4K76p7j62nl6K05J07j18j90K61
$$ -131 330 163 -185 -169 210 181 -41 -143 -73 119 -75 -157 -113 163 86 -76 -81 -117 88 195 77 -113 148
1989A48m4k10q2Q2M0K85l88L2J52mO5q6k44L76M0l08P9J17O7k35J44KJ31m0l56
$$ 148 104 -106 -188 -106 -66 219 -169 -137 15 11 76 -10 -254 122 162 -146 -67 50 117 -118 26 28 159 119 -237
2014b37L56R0r2j14k66M00n3Q0k98o0R5R7J20j22k7Q0P7j12k01N3K43O5j43k70
$$ -237 119 209 117 3 -263 137 84 164 -134 -194 -99 -2 118 -4 -31 49 126 14 -187 -134 109 174 31 -239
2038b39M50k36j53p4J94J23O6k69k8%M00j71k45J66j01J75j29K17j50K06k02k09
$$ -239 211 -25 -178 -252 -58 65 131 -138 -166 -166 234 63 -182 -16 -117 58 -71 146 -4 202 0 -209
2060b09K13j82M17n54J42L37j44K56k96l6J75J07j56j24J63q9p1J84k27J38p5
$$ -209 4 -178 239 -315 -173 164 20 276 -20 -56 119 226 70 -54 109 20 -51 133 -94 44 -31
2081c1J14r0j23J80k6k38K11j59J64k00Q8K23j64j02J67M1l7q0K26k57J87j37
$$ -31 83 -7 -130 50 24 -214 -3 -162 2 -198 -110 113 -51 -153 14 55 18 -62 164 -93 94 -43
2103d3l5r4J10J10J47p7k40K5l6L0N2J56P7j47n5j05k8J2K09k42k7K20K99k96
$$ -43 -78 -172 -62 48 195 118 -122 -97 -133 -103 -51 105 182 35 -20 -125 -153 -141 68 -174 -201 19 318 22
2127B2N5p5j63K85j38j48k6O3J78k10K5K70k21Q0JJ38m8l9j43J36l1K32j9k37
$$ 22 77 2 -161 124 -14 -162 -188 -125 53 -157 -132 138 -83 -3 -2 136 88 49 -94 42 11 243 224 -13
2151a3j93K12l1k42J45K92j12j71J12L3r7k5m7j0R2K05k14J17p7J67o1L1j02M7
$$ -13 -206 6 -25 -267 -122 170 58 -113 -1 32 -65 -90 -137 -147 -55 150 -64 53 -24 143 82 113 11 58
2175E8J2J4l07J88n6J20O4j20ok7J80j29P8p9J15j83m3K29j33j26J02P1k6L6j38
$$ 58 70 84 -223 -35 -91 29 93 -27 -33 -60 120 -9 69 -10 105 -78 -121 108 -25 -151 -49 22 -4 32 -106
2200a06K59k39Q5R6r3J20j89J65o5j10J5R3j44j34K87p9q4L28l45K2K28j69j83
$$ -106 153 -86 -1 95 2 122 -67 98 33 -77 -62 31 -113 -247 40 -39 -123 205 -140 -118 110 -59 -242
2223b42l1M04j23j4l5O4L8m0M6p1K4Q3j63L4K00j59l3Lo7OJ30O7l79K84l5O1j98
$$ -242 -273 131 8 -6 -41 23 61 21 67 -4 20 103 -60 -26 174 15 -18 -15 -82 -76 54 121 -258 26 -9 52 -146
2250a46O3J63k2l0l63K80n7K46k82J9K12M8k55J64j86K31j87J45l5k0J10k28J66
$$ -146 -83 80 58 28 -335 -55 -112 134 -148 -129 83 131 -124 40 -146 85 -102 43 8 -12 98 -130 36
2273C6l1R5j62j36K35r3P3j74L04k13J93L9j75N5j16J90j22R6r3m5J2j08Q7N6
$$ 36 5 100 -62 -198 37 -56 17 -157 147 -66 127 166 -9 46 -70 120 -2 94 1 -44 -32 -140 -53 3
2297CJ32l5j73K07k03L0j43j28J00K94j85J93J10k57P5J29j55n8J3o2J5J59l20
$$ 3 135 100 -73 134 -69 -39 -182 -310 -210 84 -101 92 202 -55 20 149 -6 -64 -51 -113 -98 61 -259
2320b59M12j57R7o0J42j30j06J51j63R8J04j85K4M5l13L27j04j78L64o0k06J34
$$ -259 153 -4 93 33 175 45 -61 90 -73 25 129 -56 -32 13 -300 27 -77 -255 109 49 -157 -23
2342b3K50k80n9m9K94P2j75J03o1J00k97m8P2rL9J40P6l18R9k5l5J18k20K44k8
$$ -23 227 -53 -112 -161 133 205 30 133 72 172 -125 -173 -101 -110 -71 69 145 -173 -74 -99 -134 -16 -236 8 -20
2367b0J66j01j40J65Pj48J43m6qj28J91j85K26R8j38p1p6J54k40L05j39Q3m5L2
$$ -20 146 45 -95 70 77 -71 72 26 18 -110 81 -104 122 220 82 11 -65 89 -151 154 15 98 53 85
2391H5j42R7M3m4m0m1K98j80j09KJ64k48K28j40J77j1k12N5Lq6J25J5k9J9J18
$$ 85 -57 40 83 39 -1 -42 256 76 -33 -31 133 -115 113 -27 150 139 -73 -18 -15 -101 24 39 10 29 147
2416A47L1l13K91p8P9r0j43J16L2k16K55l35K14p8J6K3J5j18J13M5M5o6J44j67
$$ 147 178 -135 156 78 157 67 -76 40 72 -144 111 -224 -10 -88 -72 -49 -34 -152 -39 6 51 -15 129 -38
2440c8J25k34K68J06j85J3p5J95j14Oj93J75j87K86m16K47kR1k24L95k34k48K78
$$ -38 87 -147 121 227 42 55 -20 175 61 67 -126 49 -138 148 -268 -21 -23 68 -156 239 5 -243 35
2463C5j90J38P1n6j2L3M6Rl8p6j86K53j60qM4j8J2K75p0j53L4n8K11p5L1k28J54
$$ 35 -155 -17 54 -2 -14 19 65 74 36 -40 -226 27 -133 -141 -97 -115 -103 172 102 -51 -17 -75 136 61 92 -136 18
2490A8j19J57o8Rk9l9q5J76J24k75K56q4q0Rr0K26MN2k43NL1r3N7J01J07m41J95
$$ 18 -101 56 -12 -3 -32 -71 -156 20 144 -131 125 41 -39 -30 -120 106 110 162 -81 -76 -45 -138 -81 20 127 -314 -119
2517a19mj28L38j20q1J02o3J10k8J54j72Ol1n4K8J39j35j8K98l73J76R2m02K05
$$ -119 -123 -251 87 -33 -114 -12 -75 35 7 161 -11 -5 -36 -90 -62 77 -58 -76 222 -151 25 117 -285 -80
2541h0j0j03K20R1q7j24J3O4K3L0K0JkJ40k80M9l5O8J5q4j58J82j07J22lK6M8
$$ -80 -90 -193 27 118 31 -93 -80 -16 7 37 57 58 56 196 -84 -35 -70 -2 13 -71 -229 -47 -154 -32 -35 -9 39
2568C9j01L0J13o7m2j13J12j63J26K34J53k31j43j31J25J50k00J38J29j15p7J75
$$ 39 -62 -32 81 14 -28 -141 -29 -192 -66 168 321 90 -53 -184 -59 91 -109 29 158 43 -34 141
2590A41j36j0J0j34K57K6j31r3O2k01K10j11L1J02J1m0k62K92j51L59k20k25O6
$$ 141 5 -5 5 -129 128 154 23 -70 -8 -209 1 -110 -79 23 34 -6 -268 24 -127 232 12 -213 -147
2613a47J83k08J28M4q1K7J9p4l5J94o1R0k51J25Q9K5K6PL7q9M0l43K05O3j9m0
$$ -147 36 -172 -44 0 -81 -54 -35 -109 -144 50 -11 79 -172 -47 42 67 93 100 137 48 88 -255 -50 13 -6 -46
2639d6k26K95j17J07Q8p4jn9j13K18p5J15j15P1J71l91J77j1j71J01J38j91jJ10
$$ -46 -272 23 -94 13 101 27 26 -33 -146 72 -3 112 -3 68 239 -152 25 14 -157 -56 82 -109 -110 0
2663@j33J39q7pNkQ3M0o0L1J06l9k2k1j01j37L04k9j63J45k07K52j54J08o8j39
$$ 0 -133 6 -81 -88 -83 -85 -2 38 -22 9 115 76 54 33 -68 -205 99 70 -93 52 -155 97 -57 51 -17 -156
2689a56J30J59j91n1J10k70L33j34J32P3j20j66O4J04Q2L3k96K29P6j16r3K40
$$ -156 -26 133 -58 -109 1 -269 64 -70 62 135 15 -151 -87 17 99 132 -164 65 141 25 -68 172
2711A72j34j01J3J63k98J21J92q3Q7k50Q9q1J23O5m9j38J21r0J59j41J95j74j
$$ 172 38 -63 -50 113 -185 -64 128 45 132 -118 -29 -110 13 78 29 -109 12 -78 81 -60 135 -39 -40
2734d0J97M0l83R7J39j22L5n5R7M1J1j32J20p0J24k68J19L3k2K00j24n3J59k65
$$ -40 157 197 -186 -89 50 -72 -37 -92 5 46 57 -75 45 -25 99 -169 -50 -17 -39 161 37 -16 143 -122
2758a22j6Q2K74k34R1l19J28K40p2k5k6r2J53j24j12L02j67J04j63R1j94K64M9
$$ -122 -138 -56 218 -16 75 -244 -116 124 52 27 1 -91 62 -62 -174 128 -39 65 -98 -7 -201 63 112
2781A12n0J1N4j41J02j2K1j04K02k38J52P1l40J24Q8j4j17j21K28j5R1k69k9p
$$ 112 62 73 127 -14 88 76 97 -7 195 -43 109 180 -160 -36 52 38 -79 -200 28 13 104 -165 -194 -201
2805b01J52kK23k24L6o3j44M74l4k81Q4K1j02M28l56pm1PJ06j1n1K19k36K7r0
$$ -201 -49 -51 172 -52 -16 -79 -223 251 217 -64 20 41 -61 367 11 4 -37 -30 76 65 14 233 -3 24 -66
2830f6J3R2j0k05J38k9j49L67m3k00p6Q2Q6q9l9P4J8nl6J57j38J7O9J46n8k34
$$ -66 -53 39 29 -176 -38 -67 -216 151 108 -92 -168 -86 0 -89 -128 -54 -36 -41 -77 80 -58 -41 28 174 116 -118
2856a18R5j16J48J20j42k0j75M36j54n6J4n2p8j50J14K29j67Q5J81m5j68K42j95
$$ -118 -23 -139 9 129 -13 -33 -208 228 74 18 32 -20 -98 -248 -134 95 -72 13 194 149 -19 223 28
2879B8n4k0j5P6N6l7L7k37KJ65j18L6J67m6K9l65J38M05k51k4j18J94q3K15j06
$$ 28 -26 -46 -61 15 71 34 71 -166 -164 1 -117 -81 86 40 69 -296 -158 247 -4 -28 -146 48 -35 180 74
2904G4l3n1M1M3n7L3r5K31m4M5o4k80L16m6l26J68K2n7J97j10K4m5J12k58L12
$$ 74 41 -10 31 74 17 50 -45 186 142 187 123 -157 159 113 -213 -45 -23 -80 117 7 31 -14 98 -160 152
2929A52k30LK8O5l5M4j95J75j89K14M3l7o8j10J79j33p8R7K60l26M4L9L5j7J7
$$ 152 -78 -75 -47 18 -17 27 -168 7 -182 32 75 38 -30 -140 39 -94 -172 -75 185 -141 -97 -58 -23 -40 -23
2954b3O8j34K49j13J2l0j11J46j8L5J6j44Nm1O9n6j49K99j57J81p1j06Q8K0r6
$$ -23 45 -89 160 47 59 29 -82 64 46 81 97 -47 -42 -83 -14 -70 -219 80 -77 104 33 -73 15 35 -61
2979f1Nl2P7j85J70M9j08j21J10L06r8j67J4J32p8Q3K6j93J73j17j98J18Q9l2
$$ -61 -56 -88 -11 -196 -26 23 -85 -206 -96 210 112 -55 -41 91 13 96 122 -71 102 -15 -213 -95 -6 -38
3003c8j03J02J01M2j41J24O2j83K5M0L0j64m0J22j01K41j45l33J65J76L6q7P6
$$ -38 -141 -39 62 104 -37 87 149 -34 -9 31 61 -103 -143 -21 -122 119 -26 -359 -194 -18 18 -69 7
3026Gj08J34J00j20J1l6O5k91L30J2j57o1Qp5K84j35K5l33L80R1Q1k78JK06q0
$$ 7 -101 33 133 13 24 -12 53 -238 92 104 -53 -114 -106 -181 103 -32 -7 -340 40 131 212 -66 -65 141 61
3051F1j07J63j0o7M6Rk08M5O9q2k5p2K14j99K55j09q0L6lK8N6j57Q7K01k07J42
$$ 61 -46 117 107 40 86 95 -113 -68 1 -81 -106 -178 36 -163 92 -17 -97 -61 -64 -36 20 -137 -50 151 -56 86
3077H6l02J99K02j4j13j44m1J35j75K68J00rj16N9N3k6j17l0k8K65j65m7k50K77
$$ 86 -216 -17 185 171 58 -86 -127 8 -167 101 201 192 76 135 188 162 45 15 -13 252 87 40 -210 67
3101F7J00j90J51k49J21r7K38j67K36k3j20o9J42p7J6j10J02j64J3J5K39k10P7
$$ 67 167 -23 128 -121 0 -97 141 -26 210 187 67 -2 140 63 79 -31 71 -93 -80 -65 174 -36 41
3124D1J08j12j82J37n0K24k29J49J7k08J34j33K9P9L6K5j26R6N2k69L36l03J74
$$ 41 149 37 -145 -8 -58 166 -63 86 103 -105 29 -104 -75 4 40 65 -61 35 87 -182 154 -149 25
3147B5p4R3r0p8K43P5j60PR9r5j00j87Q1M26j30j57p6L8l8mL1J55j2p1k32J28
$$ 25 -49 44 -46 -124 119 194 34 41 140 45 -55 -242 -161 265 135 -22 -98 -60 -98 -102 -71 84 72 1 -231 -103
3173a03J8n9K01j1r2K42j8q1k83J51J61l06J04J57r4o8J4J57j42m7J18l2J58l30
$$ -103 -85 -144 57 46 -46 196 178 97 -186 -35 126 -180 -76 81 -13 -81 -67 90 -52 -99 19 -13 145 -185
3197a85J86j21J07j01O9k40L11o3J56k18K35Nj45K6R2j02j85K31j97J53k7K01
$$ -185 1 -120 -13 -114 -45 -285 26 -37 119 -99 136 141 -4 22 114 12 -173 58 -139 14 -13 188
3219A88k95p6J39q8J94j61m8K26j47R3k41L54k48K89k60K39j29p4J63K0p2j74
$$ 188 -107 -183 -44 -132 62 -99 -147 79 -68 25 -216 138 -110 179 -81 158 29 -45 118 138 66 -108
3241a08J11j43J02p3KJ41L0j88P3J4N0L7j12j58J10O0J03R3k50J45j73J16K40
$$ -108 3 -140 -38 -111 -109 32 62 -126 -53 -39 11 48 -64 -222 -112 -52 51 144 -106 39 -134 -18 222
3264B22j91P9j32K5QQ6k60K14N5k70p8L40j11M1J16j81J07R0l29L22l29J05J75
$$ 222 31 110 -22 3 11 97 -163 51 106 -164 -242 98 -13 28 144 -37 70 160 -169 153 -176 -71 104
3287A04j31l5l9K5MN4k32L92k16J0K52j07m1N6Q8j31j27m9Q8O3j58rJ75n7L1j05
$$ 104 -27 -62 -101 -76 -72 -18 -250 142 -74 -64 188 81 40 96 184 53 -74 -123 -35 28 -130 -139 36 -21 10 -95
3313i5K44l43n2L11j79J68m9Jj81j00K99p2q3K94k39K59k30L4n4J61k26K38K4
$$ -95 149 -194 -246 65 -114 54 5 6 -175 -275 24 -48 -131 163 -76 183 -47 -13 -67 94 -132 106 130
3336A30k31J07QJ4n8L7j17J42J15O4l64J91J16j81n3K10p9j36R5o1j02j1J60j54
$$ 130 -101 6 14 28 -30 7 -110 32 147 211 -153 38 154 -27 -80 130 51 -85 10 -51 -153 -164 -4 -158
3360a58J42K92k70K5M2N8j55jJ31rK6k41K92j58OJ36k99J22nj53O8M6l9j17L82
$$ -158 -16 276 6 31 73 131 -24 -25 106 97 123 -118 174 16 22 158 -141 -19 -24 -177 -109 -63 -102 -219 163
3385A63p7p7J13rq1j47j7J35J42q4m1n0qj33J93J75o4j41P2K13k18j52K67j34
$$ 163 86 9 122 113 32 -115 -132 3 145 61 20 -30 -38 -171 22 197 133 -8 64 277 59 -93 174 40
3409D0J3O5m32J13J58J26j35J71lj65Mm7J20jp6m7O8O3l8Q6R1r1O8k61J87o4J63
$$ 40 53 118 -314 -201 -43 83 -52 119 116 -49 -45 -92 28 27 -49 -96 -28 35 -3 83 174 83 151 -110 77 13 176
3436A76l9k32K49j10Rj52K36K2j55J83j18J3j93J09J19l4k15M43k57l8N4r6n6
$$ 176 137 -95 154 44 53 -99 137 159 4 187 69 82 -111 -2 117 83 -132 311 54 16 70 -26 -82
3459h2J00Q3k15M9J00Nn2k93J36J65j1J36n1j17m2K06j12J18n2k6J09j32j58J13
$$ -82 18 101 -114 -65 35 40 -12 -305 -169 -4 -15 121 70 -47 -89 117 5 123 71 45 154 22 -136 -23
3483b3r1j65K99Q8J08k35j22J48r5J15q4Nj31K82r0j46J30O3K56k53k5L8j17O
$$ -23 -114 -279 20 108 216 -19 -141 7 -88 27 -57 -52 -183 99 9 -137 -7 56 312 59 34 72 -45 -39
3507c9L6L7M4j58O7J99k78j5J12J72j56J4lN9k2n4J0l28M50j99o2J36L7J99k92
$$ -39 -3 34 78 -80 -13 186 -92 -107 5 177 21 35 32 91 69 15 25 -303 147 -52 -114 22 59 258 -34
3532c4lP9n2k5J3N4L9lO8k48J88k9n0N9j7L8k93K70k35K51l8q8K37k25j4oL5k0
$$ -34 -37 42 -10 -35 -22 32 71 68 136 -112 76 47 -3 56 39 77 -216 54 -181 70 32 -56 181 -44 -58 -64 -29 -49
3560d9j6O2J6J30k12j08L11q5M7j81J19P8l42J54K09j20p4J48j05K21j98j12j33
$$ -49 -65 -3 13 143 -69 -177 134 49 96 -85 34 112 -230 -76 133 13 -61 87 -18 203 5 -107 -240
3583b40L05k2J4j12K37k82l5P6J2J24k02P5q2R9J1r8J99J62p9j89J44l13J75k60
$$ -240 65 43 57 -55 182 -100 -135 -59 -47 77 -125 -50 -132 -33 -22 -120 79 241 162 -27 117 -196 -21 -281
3607b81L23j84K60r4kn5k81K88q5K92l39P2L02l7j49r6R9q1J42k3j44O6J8J06
$$ -281 42 -142 118 24 22 -33 -314 -26 -111 181 -158 -86 216 179 30 -66 33 -48 94 71 -73 -7 11 117
3631A17j78Q1j12J83j82M2j77K60P3l61J71KL06m34L29k03O9j16R7n9J85%k01
$$ 117 -61 20 -92 91 -91 -49 -226 34 107 -254 -83 -81 225 -209 120 -83 -14 -130 -33 -92 93 93 -108
3654a08J03j53J19k08L20k44O4J20K2k21J45j75J10M3J18j73K24J18j88k3nR1
$$ -108 -5 -158 -39 -247 73 -171 -107 13 35 -186 -41 -216 -106 -63 55 -118 106 224 36 13 8 99
3676I9K9q9q8N7L9j2J3J04l24O6K09N1o4j98L6ML1kq0K23j69L1P2J06p1J1L0l5
$$ 99 128 39 -49 8 47 35 48 152 -172 -106 103 154 90 -108 -72 -68 -37 -39 -119 104 -65 -34 38 144 73 84 114 79
3704G9r4P2J34j62j19RN7nJ20M2p3k7O9p4Q2r2k5R0j54R1N8l6j30m5N4K16p5J10
$$ 79 -15 57 191 29 -90 -81 -24 -29 91 133 60 33 102 28 110 18 -7 83 -71 20 78 42 -88 -133 -79 137 62 172
3732A72o7p3j75K18M1k37K51o8M9J20k42M1r0K8J5J67r0r7M9k5K0j79p9K98o8
$$ 172 105 32 -143 75 116 -121 130 62 111 231 -11 30 -60 -32 -17 150 60 -37 12 -13 7 -172 -251 47 -21
3757b1J31j52O7n9J58k81J15j04j7O9K26j25M9j31M6R9k22L9R6K29N3l46J29r2
$$ -21 110 -42 25 -34 124 -157 -42 -146 -163 -94 132 7 56 -75 -29 70 -152 -113 -17 212 265 -81 48 -44
3781d4K31j82k00L46k39J41j43J22n8j14M1m4K56k44O5J58o1n8k92M00m2Nl8Q5
$$ -44 187 5 -195 151 -88 53 -90 32 -26 -140 -99 -143 113 -131 -66 92 31 -27 -319 81 39 44 6 91
3805I1J6j84P0L1j04k0J33l7l2N9p3j23J51J75k33J49j35J10J59j00j28j01j08
$$ 91 107 -77 -7 24 -80 -100 33 -4 -36 23 -50 -173 -22 153 -80 69 -66 44 203 103 -25 -126 -234
3828b34K20j09J71k9q8j50K27M3n4L4O8j05j6l0K6J02o7kM1j15N3J7k81L19n4
$$ -234 -14 -123 48 19 -69 -219 8 51 -3 31 99 -6 -22 -52 -26 76 9 7 48 -67 -14 3 -278 41 -13
3853a3pJ71r7k68K39j42j06J70J33j37L6k16K06Q5J11k24j14K95L3k61J09j1Q7
$$ -13 -20 151 54 -214 25 -117 -223 -53 80 -57 -21 -237 -31 54 165 -59 -173 122 155 -106 3 -8 79
3876G9J60M8k74K77l14o1%K12j29Lj4r2L5J20j14o4K06j7jj62J84l1L5l8Q9k74
$$ 79 239 287 13 290 -24 -85 -85 127 -2 1 -13 -105 -70 50 -64 -128 78 61 60 -102 82 51 86 48 137 -137
3902a37J20q5M0J44j80J55l12J42l7K1N8J28o4p8Q4J59j05M5j42J34j44N4J37
$$ -137 -17 -102 -62 82 -98 57 -255 -113 -150 -129 -71 57 -7 -85 -1 158 53 98 -44 90 -54 0 137
3925A37k21l8K97l18J21L9j30P6k1J76j89m3J68o6J75l22r4K94J53k4j74R9j32
$$ 137 -84 -122 175 -143 -22 17 -113 -37 -58 118 -71 -114 54 -12 163 -159 -253 41 194 170 -4 95 -37
3948c7o2O0Q2m2L3L4Nj08j26J38P2R0k21K7k86K94J28O5j26p2M4J6J27Ro6m4j45
$$ -37 -99 -39 43 1 34 68 73 -35 -161 -23 49 139 -82 -55 -341 -47 81 146 20 -52 -8 8 135 144 78 34 -111
3975a11J1J21j78Q7J2N8j47O0J24o2J23R9l75l8L01J2o1k4k0N8l8K9j09n8K02
$$ -111 -100 21 -157 -70 -58 0 -147 -87 37 -25 98 197 -178 -216 85 97 36 12 -8 50 12 41 -68 -126 76
4000G6M0j41J29k65J79j28j7K63k25l2J68R7n3R0j03j34j99L66J2j74j19K63j5
$$ 76 116 -25 104 -161 18 -110 -127 136 -89 -121 47 144 91 181 78 -56 -255 111 123 -51 -170 93 78
4023G8N7j15p2n8J86o7p8k65J26L65k67q4R1J87k11J38j11K58j65J39j59Q9J28
$$ 78 135 20 -52 -110 76 9 -69 -334 -208 157 -110 -194 -103 84 -127 11 -100 158 -7 132 -27 62 190
4046A90k39K09l52L6J14M0O0j32q7J15M8MQ4J9j34K50k09o4K07j98n1J06l22M31
$$ 190 -49 160 -192 -156 -42 -2 58 -74 -161 -46 2 6 90 109 -25 225 16 -48 159 -39 -90 16 -306 125
4070A25l31L17oOj50J10j31L6j10ML5P7l1O9k7J27j83J35q7q9Q9j1J39j56J21
$$ 125 -206 111 105 111 -39 71 -60 -24 -134 -130 -95 -18 -49 20 -7 120 -63 72 -15 -104 -15 -26 113 -43 78
4095G8j46K79j72k19L9J67m6O4j35J68j58N0N7O6k78K74k26N1J87j74J16n7J02
$$ 78 -68 211 39 -180 -141 26 -20 44 -91 77 -81 -31 26 92 -186 88 -138 -87 100 -74 42 -15 87
4118H7r9J37n5j54P4jJ74k43k7P1p3N4j31J74l6K31k39K41R6k41L9j50K45k48
$$ 87 -12 125 70 -84 -10 -11 163 -80 -107 -36 -109 -55 -186 -12 -48 183 -56 185 281 40 79 -71 174 -74
4142g4j3J26j19K7J52Rj22J7j25K51l4k42K74k37J71j64P9P8J1j73J13j02oK2
$$ -74 -87 39 -80 -53 99 108 -14 3 -122 129 95 -147 127 -110 61 -103 -24 54 65 -108 5 -97 -103 -81
4166h1J39J6N8j82RJ79j87Q6j09O5J61p9j96N1K64k25J76j41p7l6K74j78M7J14
$$ -81 58 74 132 -50 -41 138 -49 37 -72 -7 154 75 -121 -70 194 -31 145 4 -73 -109 165 -13 34 148
4190A48O2J8l20J37j71J41k6M4OL7n8M9j43L9j77L99j74ol4J41k11J03m5L7l3
$$ 148 210 228 -92 45 -126 15 -11 33 39 76 18 67 -76 -37 -214 185 11 5 -29 112 -99 4 -41 -4 -37
4215c7m3K11j74K9k1Q4j03J89j8k16l5J95k5k58N6K25j0P0j26L6j75Rj6K74j14
$$ -37 -80 131 -43 -14 -35 49 -54 135 117 -99 -134 61 36 -222 -166 59 49 119 -7 29 -146 -137 -153 121 7
4240GJ59j1k81N9L6j1J28q3Jp3j13K17j80J39Mj62K73j89K3Q2j86K19k30L58j89
$$ 7 166 155 -126 -67 -31 -42 86 3 4 -69 -182 35 -145 -6 -2 -164 109 -80 -57 25 -161 58 -172 186 -3
4265cq9J41m2J66k47J45j20OO6j22M2K27K1k18l2J02L7o4j47J50O6j74J24Nr7
$$ -3 -92 49 7 173 -74 71 -49 -43 23 -99 -57 170 191 -27 -59 43 80 16 -131 19 85 -89 35 40 -57
4290e7j5Q4m1m1m8K71j21j28J46m8J4J3j10J33n9n5Ojr8K32l36M52l45J91K09
$$ -57 -72 12 -29 -70 -118 153 32 -96 50 2 16 29 -81 52 -7 -62 -56 -57 -155 77 -259 193 -152 39 248
4315B48l46J49R1j9j5NM9k05lj8N6J0J32k49q4K04M1oj62L7P2K01k32O5o6J28
$$ 248 -98 51 142 123 108 113 162 -43 -46 -64 -8 2 134 -115 -199 5 46 40 -122 -85 -13 188 -44 21 -45 83
4341H3P1j37n8j5J62j66M3j0J91j54J31k3j25lk16L30j90j3o3m4K83Q9m8j98L19
$$ 83 154 17 -41 -56 106 -60 -17 -27 164 10 141 118 -7 -10 -226 104 -86 -99 -162 -206 77 166 118 -80 239
4366B39k79K57k15N5j6M9k33J92j17J92j6j10Rj32K3J19J06m2R4k73K54m1k29
$$ 239 -40 217 2 57 41 90 -143 49 -68 124 108 -2 7 -125 -102 17 123 81 175 -98 156 115 -114
4389a14Q7J58j33J2j22L97l22L6M5r2LJ43p7N6n6k6M4j20K95j20n4P6n6M6k22
$$ -114 -27 131 -2 10 -112 285 -37 -1 44 -48 -45 98 21 77 21 -5 39 -81 214 94 40 116 60 106 -116
4414a16K71k80J91L6m57M21m0J30j04q2k39M38j32r6M1m7O4k8l6K55k04k0N6R6
$$ -116 155 -125 66 102 -355 66 26 156 52 -30 -269 169 37 -59 -18 -65 -1 -29 -65 190 -14 -34 22 118
4438A18j70K38k36J06k26J82J05j74Q9L7j69K5m2J19J96M7l46K19j68P3j03L26
$$ 118 -52 186 -50 56 -170 12 117 -57 32 69 -100 -75 -117 2 198 245 -101 118 -50 23 -80 246
4460B46j10j01k7j06j2J17p5LJ8N6K65m77P0Q7O5J43r2M2k0j1j31M5O3j64K08
$$ 246 136 35 8 -98 -110 7 -68 -65 -47 9 274 -203 -133 -46 19 162 70 112 92 81 -50 -5 58 -106 102
4485A02j54J20r7k28J51K50l72K23K35j91J34k54J26k9J51p3j29j41l9J68J41
$$ 102 -52 68 -29 -257 -106 144 -228 -5 230 39 173 -81 45 16 167 94 -35 -176 -215 -47 94
4506I4j2K7N6q8p4J30j80K30k10O9l27K63N6r2J23nJ8p1k0j19J03n6L73k57q4
$$ 94 82 109 165 77 3 133 -47 183 -27 42 -285 -22 34 -58 65 60 78 7 -13 -132 -29 -85 288 31 -53
4531e3J57j43J50j40J53K8j09k30N4QK2L6O5K35m76J73K38L6M9j42k37K63j23
$$ -53 104 -39 111 -29 124 152 43 -187 -133 -125 -103 -67 -2 233 -243 -70 168 204 253 111 -126 137 14
4554A4j29R5o8o3o2J90J02k12K13k00Q6M2j34K05k46L27k21J19j16j13K12J84
$$ 14 -115 -20 -88 -151 -213 -23 79 -133 80 -120 -34 8 -126 79 -167 160 -61 58 -58 -171 41 225
4576B25n99K88K6J31m9j41Q2J02k63L36j49M5l6M3kr5K5K0p9MN5J65j33K9OP0
$$ 225 -374 -86 -60 71 22 -119 -37 65 -198 138 -11 34 -2 41 39 -56 -31 -11 -90 -86 -31 134 1 30 36 106
4602A06j48r1K07n1j40L11J1k93l9J65j67J66k9j38J15r8J99j34K65j21J9l9N2
$$ 106 -42 -133 74 23 -117 194 205 -88 -127 38 -129 37 8 -130 -15 -113 86 -48 217 96 115 76 128
4625A28l33K29n0L8R6m2j49M11j33k37k1O4L5p0J01l36K55N7m8J54l07O5K13J8
$$ 128 -205 24 -26 12 108 66 -83 328 195 -42 -63 1 36 -34 67 -269 -14 43 -5 149 -158 -93 120 138
4649A38k00J47j69N1j31J83r3O9j53k2M6K4K27Ol4q6j5J23jm4J11m8J0k42L1L29
$$ 138 -62 85 -84 -33 -164 19 -74 -5 -158 -180 -134 -110 117 123 89 3 -12 111 110 66 177 129 139 -103 -72 257
4675B57n16J57Q0j59J97N1j46R1o6j23k7J34K78k53J70k20O7J22j27j14K35j53
$$ 257 -259 -102 -22 -181 16 67 -79 12 -54 -177 -204 -70 208 -45 125 -95 -28 94 -33 -147 88 -65
4697f5J69J2Ok05J21k14K00L6j75J17R4n8m2o3R9j76L17j46j9M8j64Q0n2O2j84
$$ -65 104 116 122 -83 38 -176 24 60 -115 2 96 38 -4 -67 32 -144 173 27 8 56 -108 -28 -80 -18 -202
4722b02J02K36j83J01O7J14n54L37K17k27m0K94k94p0n0L66k9j10J15O6k20J16
$$ -202 -100 136 -47 54 121 235 -319 18 235 8 -32 262 -32 -102 -152 214 185 75 190 256 36 152
4744A52j81q5J34R3N2k66J32J9k8j05J21j32J89J41n8l47J74j67J55J39j93J16
$$ 152 -29 -114 20 113 165 -101 31 50 22 -83 38 -94 95 236 178 -169 5 -162 -7 132 -61 55
4766E5j84J23N1j38O7J64k27q5L62Qj32j77QJ31L4o3j53J20K6lQ1O9j83J22K5
$$ 55 -129 -6 45 -93 -26 138 -89 -174 188 196 64 -113 -105 26 60 -3 -156 -36 -10 -13 68 137 -46 76 101
4791A01n0k6J11j82K7J00l2n2j13K00M5p4j91K77k51K69k76L00k26J34kO6k86
$$ 101 51 25 136 -46 -19 81 49 -3 -116 84 129 55 -136 141 -110 159 -117 183 -43 91 89 155 -131
4814a31K03j38J57K2m9o2l4r2l5N17k55p0j13K70k26o3Jl4J66j42K8j10L04J1
$$ -131 72 -66 91 113 64 2 -32 -124 -159 358 103 33 -80 190 -36 -99 -98 -132 34 -108 -80 -190 114 125
4838A25N2n5K5k2k69K31k7k17J35k4jQ4l33L71q5L9J26j46JM8j10J80j17J9J74
$$ 125 177 122 147 125 -144 87 60 -157 -22 -46 -47 37 -296 75 -10 29 155 9 10 58 -52 128 11 30 204
4863B04j90r0J73J63j01m5j29j78L76j87R5Oj25N0M4j4J54m22J43K98k52p9J65
$$ 204 14 -76 97 260 159 114 -15 -193 183 -4 91 97 -28 22 66 52 206 -216 -73 225 -27 -106 59
4886E9k0O0n7j3o7O7K3r3J22l9J39j2l44K63p2Kj61J58mj33K93j35p2R7J6o2j46
$$ 59 39 99 42 29 -38 29 52 -41 81 42 181 169 -175 88 16 18 -143 15 11 -122 171 36 -36 61 77 15 -131
4913a31J66r2o4nK12j95k1J26J91j08k7k0Lj30M7j7K87j76l9P4j9J80j24j4j74
$$ -131 35 -57 -121 -126 86 -109 -130 -4 187 79 52 32 35 -95 -48 -65 222 46 7 81 62 242 118 104 -70
4938g0J74l37N17m01K57j07k48L32Q9k07j02J25K4k9J58j81J7R4j0q9p1K00j88
$$ -70 104 -233 284 -117 140 33 -215 117 206 -1 -103 22 46 17 175 -6 11 105 95 6 -65 135 -53
4961e3J12n4lr1K1k6J02J10J1j22K5q1Q1k22K82l12K88l2k72K78J00r7j46L90
$$ -53 59 5 2 -89 -68 -94 8 118 129 7 32 -49 32 -190 92 -220 68 36 -236 42 142 45 -101 289
4985B89l88L26j13k03J07o9K61j23r7j96M9K56j36k1L1J47Nl17J16K34j01q6J77
$$ 289 -99 227 114 -89 18 -51 210 87 -10 -206 -157 99 -37 -58 -27 120 125 -192 -76 158 57 -29 148
5008A48k21K8J5p3J15o4J65O1j70k56J70P1o8k00M19J91j35m95N02j71R3k26o8
$$ 148 -73 -45 -30 -103 12 -52 113 174 4 -252 -82 -11 -79 -279 140 331 196 -299 203 32 125 -101 -169
5031a69K61j92K8J74j85Q8kj04P6J71q1j43k0l9J46L16k37k03p8K91L3k01o9M5
$$ -169 92 -100 -72 102 -83 5 3 -101 -25 146 65 -78 -98 -137 9 325 88 -115 -193 98 131 -70 -139 -94
5055i4P0N5j78lK7O7R6k06J11j26J90j92J72r8J45q0j17J24L28k59P7L7k7j52
$$ -94 -24 31 -147 -150 -123 -56 40 -166 -55 -181 9 -183 -11 -109 36 -44 -161 -37 291 32 109 146 119 -33
5079c3q4j68L38J2p4j4M8J22m2j65R8j76R4j05J78k29K09J36j15L1k31J80o4k4
$$ -33 -117 -285 53 65 -9 -23 25 147 105 -60 38 -138 -44 -149 29 -200 9 145 30 61 -170 10 -54 -78
5103g8j60K57M3J77m59K33J09k56J78j77J51J6P2m3K76n32K24j7j54J69K67k96
$$ -78 -238 19 62 239 -220 13 122 -134 44 -133 18 34 106 63 339 -193 31 14 -140 29 296 0
5125@l4K7L6j12j67L09j99J45L7J34l47JP2J53j14q5J16Rr0M2L7Q4o3L4k08Q6
$$ 0 -34 -7 29 -83 -250 59 -140 5 42 176 -171 -170 -98 55 -59 -144 -28 -19 -109 -67 -30 54 -9 25 -183 -97
5151i7K33j27J1R5j75k2R8p1N4J2L3p9J09J10l28o8K81j48K44j41Q0J6n4Q1m3
$$ -97 136 9 20 115 -60 -82 16 -55 -1 11 44 -35 74 184 -144 -212 69 -79 165 24 104 120 66 147 104
5176A04m6q0J49p1j31m2LJ43n6j4k14K79n2p3j1J82j5O1l08L01j7p7j67N6J69
$$ 104 58 -22 127 56 -75 -117 -114 29 -27 -41 -255 24 -28 -101 -112 70 55 116 -192 109 92 15 -152 -96 73
5201G3j20j51R7J01J66j32QRk2j33K86j62J01j13l7J34k86L56k86N5J19L5r7j6
$$ 73 -47 -198 -101 0 166 34 42 51 29 -104 182 20 121 8 -29 105 -181 175 -111 -56 63 98 1 -15
5225a5j44K88m2p8L6J6N4j17j36K36j2j71K37p1JJ25k85m8KK45k42J80k78L71
$$ -15 -159 129 87 9 45 61 115 -2 -138 98 86 -85 152 81 82 207 -78 -126 -124 121 -121 59 -219 152
5249A52l03K75j3j03j86J76M0k7r2J09k2p9l9K27j90K15N2j29P1k08L1J28j95
$$ 152 -151 124 111 8 -178 -2 38 11 -81 28 6 -73 -112 115 -75 140 192 63 134 -74 -43 85 -110
5272a10mK54j42k2K1j1M7K0j74k4M0K27k00L8R3q3k47L45J6Jj36J27j18J15j16
$$ -110 -114 140 -2 -24 -3 -14 33 53 -121 -145 -105 122 -78 -40 53 -30 -277 68 84 85 -51 76 -42 73 -43
5297d3J6j73M02k48k5J96l64K84o4J7Q1j11L9M6j1J43k10l12L05j21J43L1Q8k20
$$ -43 -27 -200 202 -46 -71 125 -239 45 -19 -2 79 -32 7 53 42 185 -25 -337 -32 -153 -10 21 109 -111
5321a11R6o6lP7o3K8O6j96K98Q0j72j99K26nq4k87M28p0k8O7n5j15k7l4J85l07
$$ -111 -15 -81 -84 -7 -70 -42 24 -172 126 206 34 -165 61 56 -28 -315 113 43 15 82 27 -88 -115 -149 36 -271
5347b71K39J00j12J14m8j41k25M60o2j0j07J74N1r0k9Km0j1R8m2j02J62k02O2
$$ -271 -32 68 -44 70 22 -119 -344 116 54 44 -63 111 162 72 43 45 5 -6 92 50 -52 110 -92 -30
5371c0J18k48rK51j44O9r6L0J16O1J1o1k44R4J30M3j96J30j85L36j88J33k17L93
$$ -30 88 -160 -169 82 -62 7 -89 -59 57 118 129 68 -176 -82 48 91 -105 25 -160 176 -12 121 -96 297
5395B97j47m2jk43J90O2k9j25M9J00j56o4K09k3l13Q9L0K23qk56J40J98l10K40
$$ 297 150 108 107 -136 54 116 87 -38 11 111 -45 -109 100 77 -236 -147 -117 106 98 -158 -18 180 -130 110
5419A10K1l7O5k46J55J9j64J63k53J5K23Nj66L1R8o5M5N2m8l0n4Q6m4o3N3l5K49
$$ 110 131 94 159 -87 68 87 -77 86 -167 -152 71 76 -90 -59 39 -26 19 71 23 -7 -61 25 -19 -82 -29 -64 185
5446A85j36o7L1L8k95L82j91J07j29j2J20r8K60k04j78lN9K18k0J80k44p2J97
$$ 185 49 -18 13 51 -244 138 -53 54 -75 -87 33 -65 195 -9 -187 -190 -131 87 67 247 3 -69 128
5469A28k50k7L9M4j7nJ01J73k0j99J17l18L28j2J66k46K98l25k8J79m3j74J55
$$ 128 -122 -149 -110 -66 -83 -88 13 186 166 -33 84 -234 94 82 248 2 300 -25 -53 126 83 -91 64
5492F4Pj44J15R2j36k2J59j39o4J83m4J25l19QJ58k47Q5J77Pj66N2Pj04M2L97
$$ 64 71 -73 42 134 -2 -24 135 -4 -68 115 71 196 -123 -115 43 -204 -119 58 65 -101 -49 -42 -146 -104 293
5517B93j83J1j66O9j38K73Jk23j90J62j7K73r6O7j55J02O3r1r5MKj06l1L17k79
$$ 293 110 121 -45 24 -114 159 160 -63 -253 -91 -108 165 69 136 -19 83 146 55 -40 -36 -34 -140 -171 146 -133
5542a33l7J04p6J87rkj32J88r0L7p0J3k27K00J98j77Q3j69K3NJ20k6j59K26l43
$$ -133 -170 -66 -142 45 36 34 -98 90 0 37 -33 -20 -247 -47 151 -26 57 -112 -89 -84 36 10 -149 77 -266
5567b66K81j46MJ12l6J84k81J77r3J40k5Jj6j75J86M7j37n3RK49l34M3Q0J37j60
$$ -266 15 -131 -127 -15 -51 133 -148 29 -64 76 51 52 36 -139 47 94 -43 -96 -87 162 -172 -129 -49 88 -72
5592g2J01j45Q6O2j70K54J0j61j16K44l29L28p8J08j37j03j1J29j13MJ97O0J26
$$ -72 29 -116 -30 32 -138 116 126 -35 -151 93 -236 92 14 122 -15 -118 -129 0 -113 -109 88 148 274
5615B74j85j15Q3L3o7P7k85k0K40j43K48j92L2k2J52j09n8Rj0J98R1k13j41J57
$$ 274 89 -26 57 90 23 100 -185 -205 35 -108 140 -52 -20 -42 110 1 -57 -48 -58 140 231 18 -123 34
5639C4J3l3p2Q8N2k01q5L53j65M5r0P2p8K36p5j20J79rk00K98j76j02l0j3J71
$$ 34 47 14 -58 30 82 -119 -204 149 -16 29 -61 11 -67 169 94 -26 153 144 -56 242 66 -36 -66 -79 92
5664I2Q0o5j87PK6p6K3L08k79J33j87J45RM3j43L2R3j50P1o2k2m0oK1l3K92M8
$$ 92 172 107 -80 -73 -47 -123 -100 208 -71 62 -125 20 29 72 -71 -39 54 -96 -25 -87 -109 -149 -155 -134 -167 125 173
5691A73q4j67J69j06j99K73K2j94J85J01j82m8K22j86K1J9Pk5k47K26J19j77K17
$$ 173 89 -78 91 -15 -214 59 81 -113 72 173 -9 -57 165 -21 0 19 26 1 -246 -20 99 -78 139
5714A39k63kJ31k9j23j45L21j5K36k23j38k1M2N6qK39l12rK6M9p7J37j61J43J7
$$ 139 -124 -126 5 -24 -147 -292 29 14 250 27 -111 -132 -90 -34 -42 197 -115 -124 -98 -49 -126 11 -150 -7 10
5739A0j76L53l06o4K47K7j16pj05L17j23j4r5K22j25j09MK08k26m7J69l6J01k93
$$ 10 -166 187 -119 -183 64 91 -25 -32 -137 180 57 43 -52 170 45 -64 -60 148 -78 -125 44 8 109 -184
5763a84K80k0p6J62k89P6q3K18k9q6J85j62Oj13L81m18K25p3m8O7j5M6KL7j68
$$ -184 96 76 0 162 -127 -51 -134 84 55 -31 154 -8 -2 -115 266 -152 73 0 -48 19 4 50 52 89 -79
5788g9L46j90j43J02n2O8K2l75J87n1M28m01j72L77n7M2o2N1r9K06j97L38j94
$$ -79 267 77 -66 36 -16 52 74 -301 -114 -165 263 -138 -310 67 10 52 -10 41 -58 148 -49 289 95
5811I5k71P4K01L1j79Q1M0N3j58K7OJ55NR0o9k87o7L2J73j64J07m8J38j55R1Q4
$$ 95 -176 -102 99 130 -49 32 72 125 -33 -6 0 155 160 250 181 -106 -173 -141 32 -132 -25 -73 65 -90 1 85
5837H5J9k25l6J82r1J25j01J06l1O4O3rj16j30O6K02n6k21j0J88O8k27L4P8j59
$$ 85 104 -121 -157 25 -66 59 -42 64 33 97 160 151 35 -95 -29 173 117 -104 -114 74 142 -85 -51 27 -132
5862a32p8J6J90J27K1l07J71m8N7r2J2Q8J34j51p6J23l06K06Q2O5n7l6p3K41k3
$$ -132 -210 -194 -4 123 144 -163 8 -40 17 -75 -63 25 159 8 -68 55 -251 -45 37 102 45 9 -64 177 154
5887A54m9n5k13L34k18M2j03J45o5J93j97J36j68l4J58j53j98J21K47k06R2l9
$$ 154 105 50 -163 171 -47 -5 -108 37 -28 165 -32 104 -64 -98 60 -93 -291 -170 77 -129 -37 -76
5909g6K14p8M3n3j01j09K64m7o5o0%p1L25k65R4J38m13O2L98k45j73M26k07N8
$$ -76 138 60 103 50 -51 -160 104 57 -8 -68 -68 -139 186 -79 15 153 -260 -198 200 -45 -218 208 1 59
5933E9r6j42L12j49Q9l9j13K50j82N2r5K62l8n7j46M1O8k06J90p7K6k9L05j53
$$ 59 -37 -179 133 -16 73 34 -79 171 -11 41 -54 208 170 113 -33 8 76 -130 60 -17 9 -20 285 132
5957A32q7j44N6J18o7j9Q9k07K12r3Qj8M0oj24N1q1J01N3J05j48L72l20j33R6
$$ 132 45 -99 -43 75 8 -11 78 -129 83 -10 -2 -20 20 14 -110 -59 -140 -39 14 119 -29 343 23 -110 -14
5982a4J56o3j06J83j97K01k19M10l58J2Jj64J54m5lK5r3L01j39j2l14L73k48K25
$$ -14 142 79 -27 156 -41 160 -59 351 -7 5 6 -158 -4 -49 -52 -27 -120 181 42 30 -284 89 -159 66
6006F6kk96K42k61K34K45k86J55k23j35K67j09J66l8r1L5k5R4O1l18K04P4l17
$$ 66 64 -232 10 -251 -17 228 -58 97 -126 -261 6 -103 63 25 -66 -31 -56 38 99 -219 -15 59 -258
6029b58L26Jl6P3m0K2j69K30n0l36L80k53M46l78n8K6M2J3j02R6n7l7J22j31R4
$$ -258 68 69 33 106 66 88 -81 149 99 -237 143 -110 336 -42 -100 -74 -32 -19 -121 -25 -82 -119 3 -128 -34
6054c4J01r2j1O7K03j56K8O1Pj07k16J40k27J12M3J75j63J84j96R8r1l8nK99K5
$$ -34 67 -25 -36 31 234 78 106 167 174 67 -149 -9 -236 -124 -81 94 -69 115 -81 17 -74 -112 -117 182 207
6079B07m72L45K4r8N2k9J16j07n5j83J94J49R8j0q5p3o6rj27M8J76k1o7j04L9
$$ 207 -265 80 104 6 58 29 145 38 -17 -200 -6 143 241 231 146 73 7 -2 -129 -81 95 74 7 -97 -58
6104e8k82O7K29N2N9k59J86Q3j30L0J04K4m3j20J13qKj32J32j24K04J03k70j3
$$ -58 -340 -273 -44 8 67 -192 -6 77 -53 -23 81 105 62 -58 55 47 49 -83 49 -75 129 232 -38 -51
6128e1L8J80l24L2K68j7j57J38k36J21j08j01J91OK26j14j0k03Q1J07k18L02n2
$$ -51 -13 167 -157 -125 143 126 -31 107 -129 -8 -116 -217 -26 -20 206 92 82 -121 -40 67 -151 151 99
6151I9j46J02M3l3o8n6K01j23N7o6K00r8l62J41J46j08J88lk13J53j0k72K52l3
$$ 99 -47 55 98 65 -3 -59 142 19 76 10 210 112 -250 -109 37 -71 117 114 -99 54 44 -228 24 -9
6175il7J76j53j9K32j95J95k71J24l14L88l1m5r1o7J45j14L50l14rm7K61n2J23
$$ -9 -46 130 -23 -42 190 -5 190 -81 43 -271 117 86 41 -50 -117 28 -86 264 -50 -59 -106 155 103 226
6199B26k14J65j08M2j40pJ06K0k53J27K8QL8p0K07k96J36O1j72l5R8N9J94k05
$$ 226 12 177 69 111 -29 -36 70 90 -163 -36 -8 0 38 -32 175 -121 15 76 -96 -131 -33 26 220 15
6223A5J5j05N6l92M36q8K12O3k87J81j75n3K8r7K69j17NQ0N4k97J99j60K82J39
$$ 15 30 -75 -19 -411 25 -63 149 212 -75 106 -69 -122 -94 -191 78 -39 -34 46 100 -197 2 -158 124 263
6247B63k57j59K98R8m27L38j80P0K5j60K49o3r8m3j3P5J67j92j01J49r6L1J03
$$ 263 6 -153 145 243 -184 154 -26 44 69 -91 158 95 -3 -46 -59 16 183 -9 -110 39 -57 -26 77
6270G7j74K04M1k47J00j03Q6J8J0J11q3Q1J44k88K92l29J65k59J03K68l3k94M2
$$ 77 -97 107 148 -99 1 -102 -16 2 12 123 40 121 265 -23 269 -60 105 -154 -51 217 184 -110 -68
6293f8J13j98M06k93j05K70j5j51L6R4N7p2j57R1k20K72p9Q5J0k01P9K41k22L0
$$ -68 45 -153 253 -40 -145 125 110 -41 -5 89 146 74 -83 8 -212 60 -19 66 76 -125 -46 195 -27 3
6317Cn7l4m0K14k42J37J46k5m6j20k7Q0Kn3J56j83k2j05K70q9N1N9r2J5k3J14
$$ 3 -54 -88 -128 86 -156 -19 127 102 56 -64 -91 -11 -9 -62 94 -89 -111 -216 54 -35 16 75 -17 -2 -25 89
6343H9j17J83j74j56L52k41J45l3j38O8n2J49r3O7m59J92M28m06J87J74l59K17
$$ 89 -28 155 -19 -175 177 -64 81 48 -90 -22 -74 75 -18 49 -410 -218 210 -196 -9 165 -194 23
6365B3j00J65l37L70j33j52P9J47L5k24L11j43J0j52J7J37j4j33J34n5K2Q1L9
$$ 23 -77 88 -249 121 -12 -164 -85 62 97 -127 184 41 51 -101 -84 53 39 -94 40 -15 7 88 127
6388A27j63j5Q3j96P4K57pl73L0J86k86K03J11k22J68P8j04K24kl35K54J02k43
$$ 127 -36 -51 32 -164 -90 167 160 -213 -183 3 -283 -80 31 -191 -23 55 -49 175 173 -162 92 194 -49
6411d9J90Qj48M8qm7M3q5K31j66o8J57k7r6o6o5Q6O8J86r6J1j28K10j82j14K13
$$ -49 141 149 1 49 41 -6 37 -48 183 17 -51 106 79 -17 -83 -148 -62 6 192 96 107 -21 189 7 -107 106
6437A06j37J63j10n6P9l5J41k01J05p2j80J97l5M2k8J41k67nK14q3J6k73L56J3
$$ 106 -31 132 22 -34 45 10 151 -50 55 -17 -197 0 -35 7 -21 120 -147 -152 62 -21 -5 -278 78 91
6461I1j34j15J67r7J24j96J73n7k30K13q4K37K1k57J25Q7m2k8m6QM5k0Nl5r6L15
$$ 91 -43 -158 9 -88 36 -160 13 -44 -274 -61 -145 92 113 -144 -19 68 26 -2 -48 -40 5 -15 -10 -45 -141 174
6487A74p6j31j24J41j19O1J15p2j18nK14j47L9n9K48k22Q2L7M6j00mR7j39M3p6
$$ 174 98 -33 -157 -16 -135 -74 41 -31 -149 -154 60 -87 -48 -107 141 -81 1 38 84 -16 -20 77 -62 -19 -95
6512i5pJ77J99l00J39r8M5N7j31M7R3k3k00K01j94j05K80j66J1L7J19J65k78K0
$$ -95 -102 75 274 -26 113 15 60 117 -14 33 126 103 -97 104 -90 -195 85 -81 -70 -33 86 251 -27 -7
6536gJ4j38J24j38j04K61j29J20j91K32P5m8k23J43K50k73r1K54N6l33kL43j70
$$ -7 7 -131 -7 -145 -249 12 -117 3 -188 44 119 71 -152 -9 241 -32 -123 131 187 -146 -148 195 25
6559B5K6Q1NN1j75n2pJ66k04K50j85%Km8j2J63j05m7q3O1L8mj67J67O1j08KkL4
$$ 25 51 132 137 188 13 -39 -46 120 -84 166 -19 -19 -17 -65 -77 86 -19 -66 -149 -88 -50 -54 -221 -54 7 -101 -99 -101 -67
6588f7K0k29K53J9l9o0Q0L4j11q0L57k57j46L18j69J4J54k33J10j92J88J39L7
$$ -67 -47 -276 -23 -4 -43 -103 -23 11 -100 -180 177 -80 -226 92 -77 -63 91 -142 -32 -224 -36 103 140
6611A40l19K36j2r8jp5O3MK08j74j44K93p4k33N0R7O8p1j3J39j78J27k28J88J45
$$ 140 -179 57 45 -53 -54 -129 -66 -62 146 -28 -172 121 47 -186 -136 -39 29 -42 -55 84 -94 33 -195 -7 138
6636A38m42L70j6M9q7N8k42J66J78j42j55o2K75j00j7q0R1o2L40k15n1J99P2q8
$$ 138 -304 66 50 99 12 70 -172 -6 172 30 -125 -187 88 -12 -29 -109 -18 -80 260 45 -6 193 265 177
6660A77j0k27J96n5j46r1J90K3n9L9j43N9l3J5J34k12M7N8j37O0R6M5j22O0j25
$$ 177 167 -60 136 81 -65 -156 34 57 -2 37 -106 -47 -80 -65 69 -143 -96 -38 -175 -115 -19 26 -96 -36 -161
6685a61L10o1j66J58l26K20Q5j15j53K40k3Qq5R5k1j46O6K23j36j21k1R8J46j28
$$ -161 149 88 -78 80 -246 -26 59 -56 -209 31 8 16 -69 26 5 -141 -75 148 12 -109 -130 -32 114 -14
6709a4m0J82j30q3j7P5K76j25l3j85K03J29l20O3K6Oj26j37L70q1M1k24L8j8j4
$$ -14 -54 128 -2 -85 -102 -27 249 124 91 -94 109 238 -82 -19 7 13 -113 -250 120 39 80 -144 -106 -124 -138
6734a38J80N9j62Nn5K83K6j01J0o5j30J97l7j28L8j63J52j00P9o4L74l26J28m6
$$ -138 42 101 -61 -56 -111 172 198 97 107 42 -88 109 72 -56 -18 -181 -29 -129 -50 -114 260 -66 62 16
6758A6O2l20M1K51m9J68j87P1j44J96k37J20N5n5J03j41j06K03m2j54J56Q8j04
$$ 16 78 -242 -201 50 1 169 -18 53 -91 105 -132 -12 43 -12 91 -50 -156 47 5 -149 7 95 -9
6781iq8J05r6q3K00k2K79j80m4j62M5N5Q1l27L15l2P3j14q0O5j23K62k60J0MN2
$$ -9 -97 8 -88 -171 29 7 286 106 62 -100 -55 0 81 -246 69 37 110 -4 -84 -19 -142 120 -140 -130 -126 -74
6807g4J62n8l34K03J52M6k21K64j74M0m6J05M1k61j39J37J09N5R0p7k01J98p6
$$ -74 88 30 -304 -101 51 97 -124 140 -34 6 -40 65 106 -155 -294 -157 -48 7 97 20 -181 17 -59
6830e9L4J50j34j5M3Mr1J93j81J17jj56J74j82J20OK15j62j29J37j37nJ90j2q7
$$ -59 -25 125 -9 -24 19 23 -68 125 -56 61 60 -96 78 -104 16 22 237 75 -54 83 -54 -59 131 119 32
6855C2k02N2J28o4J07j6j02J75j93K41l19J31Q7l54M05j44j7J19j01J09K6J6p4
$$ 32 -170 -118 10 -54 53 37 -65 110 -83 158 -161 -30 57 -297 108 -36 -53 66 -35 74 100 116 42
6878D2P3N2k81Q9J92k87l9R3jK22r6j54J17n4Q0j79J72m5j31L25r9k38n6K17j8
$$ 42 115 167 -114 -25 167 -120 -159 -66 -67 155 59 -95 22 -32 48 -131 41 -4 -135 190 91 -147 -203 14 -4
6903dr5J58k23J42p2k2o0j39N07k72J38j67J18J00k86J57k9k1Qk1K15k78J63j2
$$ -4 -99 59 -164 -22 -94 -116 -176 -315 192 -80 58 -109 9 109 -177 -20 -49 -70 -62 -83 132 -146 17 5
6927EK9KJ0L2l4J1J59j30k8j29J18j77j5J40K1k4Mm2J57k49J90K9J85p2j69M0
$$ 5 34 36 46 78 44 55 214 84 56 -73 45 -132 -147 -7 14 -10 -6 -48 109 -140 50 79 264 192 23 63
6953F3M0j13k9R7q9K05j50j61J94j45J62j11O4P2%k31J02J5N5J37j91J80j89J06
$$ 63 103 -10 -39 58 -31 174 24 -137 57 -88 74 -37 27 99 99 -132 -30 -15 40 177 -14 166 -23 83
6977H3o5K1k36L06K3J30l80J54jk65L60j46K30L0k57J52k89J52J13k27J19j6j01
$$ 83 18 39 -197 109 132 262 -118 36 35 -230 130 -16 214 244 -13 139 -150 2 115 -112 7 -9 -110
7000a10J40l71L11J11R7k83pK50j89K8j0k3k4K2J00j77M3J18j4k18N6K39O2l32
$$ -110 30 -341 -30 81 178 -105 -112 138 -51 -23 -33 -56 -80 -58 42 -135 -92 26 12 -206 -150 89 151 -181
7024a81M7N6Q7K47k88J01l30K02M2J15k25J15k07J74K11q9m0O9k55L07j17k46
$$ -181 -134 -78 9 256 -32 69 -261 -59 -17 98 -127 -12 -219 -45 166 77 37 106 -149 158 41 -205
7046b05J48J70l17j0L80k27m9mJ83j63N9l2J28j36P4J44j59j5J00R9J14m27j29
$$ -205 -57 113 -204 -214 166 -61 -110 -114 69 -94 -35 -67 61 -75 -1 143 -16 -31 69 168 282 -145 -274
7069b74K00O9R4K0q4M7k79J62k3Rq2O7r0K37O0l7q4pJ04n2K1k20J53r1P9j29K87
$$ -274 -74 -5 89 109 25 72 -207 -45 -68 -59 -141 -74 -164 73 133 96 12 5 109 57 78 -142 11 -80 -1 -130 157
7096A57k20Qm1J48j60P1J26l54L50j06j7o1q8K53Q4K9j63j43L01k24J57k04J60
$$ 157 -63 -55 -96 52 -108 -37 89 -265 85 -21 -38 -99 -187 66 150 179 16 -127 174 -50 107 -97 63
7119F3m4j71K62r5N2j21R5J27k23K49q0j53m8P2k6J19K42j83P6j55N3k21J23J3
$$ 63 19 -152 110 15 67 -54 41 168 -55 194 114 -39 -87 -15 -41 78 320 137 213 58 111 -110 13 26
7143B6l4r8lK68m24K46n7J36K7k27J04P8q2J1j2K26q8J2l07J42J38O9r2j17K08
$$ 26 -8 -106 -109 159 -265 -19 -76 60 87 -140 -36 42 -40 -29 -41 185 97 109 -198 -56 82 151 59 -58 150
7168A50M8j1l17J62R3k51J78J68j77m7M1R8k13L9k10L40l25K16j2r6N4K81k00
$$ 150 198 187 -130 32 125 -126 52 220 43 -4 37 135 -78 -39 -249 91 -234 -18 -30 -126 -72 209 9
7191Il16N87k37k3J58j49j04Q5oJ16J37l24J48k81K25l3K1L2j41K06k03J47j47
$$ 9 -307 280 43 20 178 29 -75 10 4 120 257 -67 81 -200 25 -8 13 45 -96 110 -93 54 -93
7214i3J74k35J27K43o6j97MJ39O6k35j82K96j50K16r3j65J25p1Q1K5n4L66l58
$$ -93 81 -154 -27 216 150 -47 -43 96 162 -73 -255 41 -109 107 14 -151 -26 -97 -16 9 -45 321 -37
7237c7Q6O2j07n8Q5J34k02J79N4j99M6p3n5J4K19p4o5L1n8J12j98R3J23k8l0O2
$$ -37 49 111 4 -54 31 165 -37 142 196 -3 43 -30 -85 -71 148 74 9 40 -18 94 -104 -11 112 84 54 116
7263A16O0j18K7K9j50rR1k0rr5OJ57j53L7l7Q0pJ16k66L08l3N1k27p9J34k2K81
$$ 116 176 58 85 114 -36 -45 46 26 17 -78 -72 85 -68 -31 -68 12 5 121 -145 163 130 181 -46 -125 9 -13 268
7290B68l84K31q7J77p1k92K55l1j35K0J4J66l44J78M1j57K74k80J21R7n3K55k56
$$ 268 -116 115 28 205 134 -158 97 66 -69 -49 -35 131 -213 -35 6 -151 123 -157 -36 61 8 263 7
7313GJ11j84J8J23M4L8j99j1K8K19j8j36j33J45j25K04m18K51J34j4l60L85m8
$$ 7 118 -66 -48 75 119 157 -42 -53 -25 194 176 40 -93 52 -73 131 -287 -36 98 84 -276 109 61
7336F1j73j33K00K05l23R0J74K5k2n5Q7k63K40j94K44j29M6k79J00K04p0O9m4
$$ 61 -112 -245 -45 160 -163 -73 101 126 104 49 136 -127 113 -81 163 34 80 -199 -99 105 35 104 60
7359F0K3m1j00M2J27n1J11m9l37J48J45j8m03L91k1n6p7J68l0q7q1K62j95J27
$$ 60 83 42 -58 -16 111 60 171 122 -215 -67 78 60 -343 48 27 -29 -106 62 32 -55 -136 126 -69 58
7383E8n5L1p7j13K36J10k61n6l3K99j43J8j03M8Q1N7q7L7Q4j18m2N7k78K06K46
$$ 58 3 34 -43 -156 80 190 -71 -127 -160 139 -4 14 -89 -41 40 97 10 47 131 13 -29 28 -250 -44 202
7408B02%k26L3Mj20M7j11K65k37P1%K54k44J33j38O2L2j25p0L08J6l8j49l44M28
$$ 202 202 -24 9 13 -107 -60 -171 94 -143 -72 -72 182 -62 71 -67 -5 27 -98 -168 140 156 118 -31 -375 53
7433E3K0m1j28J01M5k07L60k39j87L16j39MK2J02O8j82m0J07O1j29K7J05j29J66
$$ 53 73 32 -96 5 50 -157 203 -36 -223 93 -46 -42 -20 82 150 -32 -72 35 96 -33 -6 99 -30 136
7457A36j89K2J83L3k42M2r%j05R2j87K48lO2j33j03J11L7j62L70l35J27J49j51
$$ 136 -53 -31 152 185 -57 -15 -24 -24 -129 -37 -224 24 21 83 -50 -153 -42 -5 -167 203 -132 -5 144 -7
7481gK7j40P0j02j8k9K99j14J67l7o4J61k20j01J56k83K10j08J84J6l31L31R9
$$ -7 20 -120 -50 -152 -170 -199 100 -14 153 116 52 213 -7 -108 48 -235 -25 -133 51 67 -264 67 166
7504A66k8j73J82k57M4j34K86k46J69k5o1l6J7J24j68M6q8K96J6ml82L08O3j76
$$ 166 138 -35 147 -110 -66 -200 86 -160 9 -16 -77 -113 -96 28 -140 -94 -182 114 130 126 -256 52 115 -61
7528f1L7N4m9j61J27J35Jk07K4J94o4O2j18l8O6k1jN8k4l0K2k51K51O6m2m1L9
$$ -61 -24 30 -19 -180 -53 82 83 -124 -100 94 30 92 -26 -64 2 -19 -20 38 14 -16 6 -245 6 72 30 -11 28
7555B8oK8r6k53R8K07j46J87p9l9p1N0J11j74J73j10J48P9j1k16P1m9k6K38l9
$$ 28 22 50 -46 -299 -201 6 -140 47 -32 -71 -142 -92 19 -155 18 -92 56 135 124 -92 -21 -70 -96 142 103
7580A03j76J84l62K50J5J15j8k43P2K12k8j32k47K07J1L0l8p4Q3m5O8j0o2J43
$$ 103 -73 111 -251 -1 14 129 111 -132 -60 152 124 -8 -255 -48 -37 -7 -45 -119 -36 -81 -13 -23 -85 58
7604E8l26K27N7j21J41J37k31L5R2j48p9R5k59L75n9K16k4k99K07m6L4j50l1K9
$$ 58 -268 -41 16 -105 36 173 -58 -23 69 -79 -158 -63 -322 53 -6 210 186 -113 94 48 82 -68 -99 -70
7628g0J32l83L26j49K50k21J29j29R5Mj5o2K31k38L5K4oK03j73l2N8m6l7R4k94
$$ -70 62 -321 5 -144 106 -115 14 -115 -20 -16 -31 -93 138 -100 -65 -41 -47 156 -17 -49 9 -37 -74 20 -274
7653b74L25j73J54l4O5J00P3l48J07O6j22J08J85j43p9j69J41q5K26j99O8K42
$$ -274 51 -122 32 -2 63 163 236 -112 -5 61 -61 47 232 89 10 -159 -18 -103 123 -76 -8 234
7675B34l76M8PJ22o1J03j93J0K47K7k33K0P7k21N4J77k7oJ52P3m36K28L1j01J62
$$ 234 -142 -94 -87 35 -26 77 -116 -106 141 168 -65 -45 32 -189 -135 42 15 9 161 234 -202 26 57 -44 118
7700A18j56n9L13r1J17q4k18P4q0M3n8K0J21n2m2o8J55l00R2O1J01J17J87l52
$$ 118 -38 -97 216 125 242 158 -60 14 -66 -23 -81 -61 60 8 -34 -102 53 -247 -155 -94 7 124 311 -41
7724d1M5J7K51l92J27j16J26k0N2j00J31rL7j84jK13j56J49k64L9M4o3J30k5L5
$$ -41 4 21 272 -120 7 -109 17 -3 49 -51 80 71 108 -76 -77 136 -20 129 -135 -96 -52 -115 15 -10 25
7749B5o6K37k19O5J64j01P4l73J87k6K2J17j09L4J16k20J6KKR3m1N2j32O1J76
$$ 25 -41 196 -23 42 206 105 179 -194 -7 -33 -11 106 -3 31 147 -73 -57 -55 -53 40 -1 51 -81 -20 156
7774A56k12jnk0J14J11j92Q2R3j62j12J52K87l43j79K34m6k4J07k28j9J56J6K39
$$ 156 -56 -57 -62 -82 32 143 -49 33 126 -36 -148 4 291 -52 -231 3 -43 -67 40 -188 -207 -51 -35 204
7798B04k25K36p8j61j1J61L1J46k83L2k19K42k14J00K1J7k1j7J74m1q5J00j13
$$ 204 -21 215 137 -24 -35 126 157 303 20 52 -167 75 -139 -39 -18 -1 -22 -39 135 94 9 109 -4
7821dL26l51J92k0k21L0L9j07O0p5L7j05J29M4K47k80J52p3j63J86j21K72k62
$$ -4 322 -29 163 143 -78 -48 -9 -116 -56 -131 -94 -199 -70 -26 221 -59 93 20 -143 43 -78 194 -68
7844f8k7J36n0N1j09J08Mj96l1J69r5J23p8k2M0L6j39NQ3k9J53O5j3q2q5k7J0
$$ -68 -95 41 -9 42 -67 41 45 -151 -182 -13 -108 15 -63 -85 -45 -9 -148 -143 -60 -89 64 129 116 34 -51 -78 -68
7871f8j29K6J95M0k16K42M4j68o9p3K36N1k12K47j3l17L53l77J47J24J59k35k2
$$ -68 -197 -171 24 64 -152 90 134 -34 -103 -176 60 111 -101 146 133 -184 169 -208 -61 63 222 -13 -35
7894c5J46j52J4J04j75J87j25l7L6n4J50n9k7K6K65l79L65j77k7r8j9K96k51K29
$$ -35 111 -41 -27 77 -98 89 -36 -73 -37 -91 59 0 -27 -1 264 -115 250 73 46 -52 -71 225 -26 203
7918B03j10m40L82O9k6k86J45J07o9p0k9K27l21K43j42J54m0q9J86k05J84K0o4
$$ 203 93 -347 35 104 78 -208 -63 44 -25 -95 -124 103 -218 25 -117 37 -3 -92 94 -111 73 93 29
7941B9p2r9K64N9k02K29p7j06p4J21k08l5J95m8J32J26k76Q5P4K8LqR5m98L95
$$ 29 -43 -142 122 181 -21 208 131 25 -49 72 -136 -171 24 -24 108 234 -42 43 117 145 148 140 235 -263 132
7966A32j25j4j05J53K8j02R6rM7j45J16o8m7k37P1L18j0J08j79q1J9p1J60j81
$$ 132 7 -7 -112 41 69 -33 63 54 101 -44 72 4 -43 -280 -209 109 99 207 28 -53 -34 -105 55 -126
7990a26K60l24J39J52j76J50l43K74p6P7nk26N8L05k54J51p7j2p2MM9K4K01k56
$$ -126 134 -190 -51 101 -75 75 -268 6 -70 7 2 -224 -166 139 -115 36 -41 -53 -125 -121 -72 -48 153 -103
8014a03J8MJ65r2K58j61k46M6J38j6M9k1K3p8J08j26k6R8M4j53P8J18Lj29J47
$$ -103 -85 -81 84 -8 250 89 -157 -111 27 11 60 39 62 -16 92 -34 -60 38 82 -71 7 125 128 -1 146
8039A46k42J91Nj15L9p2lK31m6N5k72J1J57k1J8k43J45j27K68q1j6R9j47k8J09
$$ 146 -96 95 100 -15 24 -48 -51 180 134 189 -83 -72 85 64 82 -161 -16 -143 125 44 28 127 -20 -48 61
8064F1j13N3j52J01j3L3j63J66J10j50O2J06j64J0J63l5j02O1J9q8j64lL38o3
$$ 61 -52 1 -151 -50 -63 -30 -193 -27 83 -67 -5 101 -63 -53 110 75 -27 34 53 -35 -199 -202 136 73
8088G3p8P6p5j86J09O4q3j6K20o9j9k02P0P7J55p1R5j36k1n2K57l50J18L2L1l2
$$ 73 -5 71 -4 -190 -81 -17 -100 -116 104 35 16 -186 -116 -39 116 45 140 4 -17 -69 188 -162 -44 -12 19 -13
8114a3L5N7RL4R6k22J3m6J01p5L04j95j75l5n8J72m1l1r2Q4R0o9k10M84k30n1
$$ -13 22 79 88 122 218 -4 9 -37 64 -11 293 98 -77 -112 -170 2 -39 -70 -162 -78 12 -57 -267 217 -13 -64
8140f4J8n7M6J02M8q5K6l20K67K6n1p8N3J92n3m15L66q3L1J20J1j32j6J38j23
$$ -64 -46 -103 -57 45 93 8 34 -286 -19 7 -44 -122 -69 123 70 -345 21 -62 -31 89 100 -32 -48 90 -33
8165c3j45J6N2J00J36j08Pm9Q1p9J48j65JP3n2j81j7J60J77j6j17J41l6q0k2j60
$$ -33 -178 -162 -110 -10 126 18 25 -24 57 -22 126 -39 -38 35 -17 -198 -215 -55 122 106 -11 130 94 14 -8 -168
8191a68
$$ Imaginary data points
##PAGE= N=2
##DATA TABLE= (X++(I..I)), XYDATA
0@%%%%%%%%%%%%%%%qJ6j6J6j6K4l2L2m0M8n4O2p2Q2r0J04j20J38j57J79k02K26
$$ 0 0 0 0 0 0 0 0 0 0 0 0 0 0 0 0 -8 8 -8 8 -8 16 -16 16 -24 24 -30 32 -40 42 -48 56 -64 74 -83 96 -106 120
37A20k55K86l19L54l95M40m87N37n93O56p23P98q81R70j068J177j298J433j586
$$ 120 -135 151 -168 186 -209 231 -256 281 -312 344 -379 419 -462 508 -560 617 -681 752 -834
56h34J758j955K183k448K768l156L638m261N097o287Q133j1423J9114p5778m1099
$$ -834 924 -1031 1152 -1296 1472 -1684 1954 -2307 2790 -3497 4636 -6787 12327 -63451 -104550
71a04550O1926O884J6564J1602K8954K680j1750j5424J1688J1984Q76j4543P98
$$ -104550 -42624 -35740 -19176 -7574 21380 24060 12310 -3114 8574 20558 21434 6891 7689
84G689J0487k41k1247j2367P867K0718O582l927M658J5972J181k0303k4460m193
$$ 7689 18176 17935 -3312 -15679 -7812 12906 19488 15561 20219 36191 37372 17069 -7391 -11584
98a1584P052k914j1020K325J5854Q673j3911k0795l258Q535j721q975K828K1146
$$ -11584 -4532 -7446 -18466 -16141 -287 8386 -5525 -26320 -29578 -21043 -22764 -31739 -28911 -7765
112g765J8104l497j1366K921J1960K693r021r58J7245J4112p279j7743p557K445
$$ -7765 10339 6842 -4524 -1603 10357 13050 4029 3071 20316 34428 27149 9406 1849 4294
126D294m493j5652n169J6242J9375L216q583p77P778l487j7772j2622N527J1950
$$ 4294 -199 -15851 -21020 -4778 14597 17813 9230 8453 16231 12744 -5028 -17650 -12123 -173
140a73j92j1333k414Q675M62j3168r723R028J7858O491l521K976J1160M229j2561
$$ -173 -365 -11698 -14112 -5437 -4975 -18143 -27866 -18838 -980 5511 1990 4966 16126 20355 7794
155G794j5210K302J1928K605o005J74J0535M861j2781j6942k214Q220J993n935
$$ 7794 -7416 -5114 6814 9419 3414 3588 14123 18984 6203 -10739 -12953 -4733 -2740 -8675
169h675n5J3630J0352p340j2792k562O746J527q135k780J1012J0361n019j2916
$$ -8675 -8730 4900 15252 7912 -4880 -7442 -696 831 -7304 -10084 928 11289 6270 -6646
183f646m171O535J953p279j802J2095J3981P52r874l792M923o80j0366p120P117
$$ -6646 -10817 -4282 -2329 -9608 -11410 685 14666 15418 5544 1752 6675 5995 -4371 -11491 -4374
198d374J2508J040q409k460M838P88r329q888M950J2496K839o375j721N900K556
$$ -4374 8134 9174 765 -1695 3143 3931 -5398 -14286 -9336 3160 5999 -376 -2097 3803 6359
213F359q583r539L568J0847M042m186j686O609L717r172j1738n57P537L527m343
$$ 6359 -2224 -11763 -8195 2652 6694 2508 822 7431 11148 1976 -9762 -10319 -2782 745 -3598
228c598j553Q380O597n236r491j806P494L883m679k034P197O483m289j1142m367
$$ -3598 -5151 3229 9826 4590 -4901 -6707 787 4670 -9 -2043 5154 11637 7348 -3794 -8161
243h161M608J488n075k167P010R595k8p685k297N202K108m804m275N125Q338o30
$$ -8161 -3553 -2065 -7140 -9307 -2297 7298 7270 -415 -2712 2490 4598 -206 -4481 644 8982 8352
259H352q194m125K058J213n289n700M679R386K775m152k481M185K856n482o274
$$ 8352 158 -3967 -1909 -696 -5985 -11685 -7006 2380 5155 1003 -1478 2707 5563 81 -6193
274f193K118P703K878m405k959L909K567n603o676J5O728L235m028j958M413L922
$$ -6193 -4075 3628 6506 2101 -858 3051 5618 15 -6661 -6646 82 3317 -711 -2669 1744 5666
290E666l171p033p74O613L112l101k093L519L768l433q276k895L987J988k168
$$ 5666 2495 -4538 -5312 1301 4413 1312 -781 2738 6506 3073 -5203 -8098 -4111 -2123 -4291
305d291j606M458O834r1n130j676L897K467l176l834K875M230r50n578l770K424
$$ -4291 -5897 -1439 5395 5304 174 -1502 2395 4862 1686 -2148 727 4957 4007 -1571 -5341 -2917
321b917K947k636k662L466N992K001m008l338K340J927m052m043J314N238K189
$$ -2917 30 -2606 -5268 -1802 4190 6191 2183 -1155 1185 3112 -940 -4983 -3669 1569 3758
336C758l691j894K790K213k745m417P2M468K142l331k111K437K744j509l933K10
$$ 3758 67 -1827 963 3176 431 -3986 -3914 554 2696 -635 -2746 -309 2435 926 -3007 -2797
352b797M631K440j770k430J231K576k615n077j392L061K372r20j643K492M455
$$ -2797 1834 4274 2504 74 1305 3881 1266 -3811 -5203 -2142 230 -690 -2333 159 4614
367D614p32l894j528K144J624k651k841J465L005q8l126j344K826K781j052j945
$$ 4614 3882 -12 -1540 604 2228 -423 -3264 -1799 1206 1118 -2008 -3352 -526 2255 1203 -742
383g42J416K888m9l898k718J614J009j395j741J220M339J736j927j063J420J609
$$ -742 674 3562 3513 -385 -3103 -1489 -480 -1875 -3616 -2396 1943 3679 1752 689 2109 3718
399C718j753l779o57K316O20k466j934J443K786l51k075R98K987J851j496k283
$$ 3718 1965 -1814 -2471 -155 465 -2001 -3935 -2492 294 -57 -2132 -1134 1853 3704 2208 -75
415g5M99J826j579l165l76J921J696j247j386J884K309m38k197j231K029J246
$$ -75 424 2250 671 -2494 -2870 -949 747 -500 -1886 -2 2307 1869 -328 -1559 470 1716
431A716j377j543J260J958M94j998j048J684R34j413j876l39J188k30k370j055
$$ 1716 339 -1204 56 2014 2508 510 -538 1146 2080 667 -1209 -1548 -360 -590 -2960 -4015
447d015J359J993J04o26R73K717P90j249j272M88Q33j731k290m32J504O75j053
$$ -4015 -2656 -663 -559 -1185 -212 2505 3295 2046 774 1262 2095 364 -1926 -2358 -854 -179 -1232
464a232n39J190K442p2q88J50J498L60j168j946O2Q20j085j548m64Q97J076q35
$$ -1232 -1771 -581 1861 1789 901 1051 2549 2909 1741 -205 -143 677 -408 -1956 -2420 -1523 -447 -1282
482a282r75R68J118M54j095o17J393J028p74m37O64J398N12j394o95O14M13j129
$$ -1282 -2257 -1289 -171 283 -812 -1429 -36 992 218 -219 445 1843 2355 961 266 880 1293 164
500A64j593m75J201M45j092J25J240J369J03n67Q2R71j46r86j214k94L67j074
$$ 164 -1429 -1904 -703 -258 -1350 -1225 15 1384 1487 920 1002 1973 1827 841 -373 -667 -300 -1374
518a374j338l48R19M63K10J06J382J436N25n02j87L69K95j138r83K25J63n7q53
$$ -1374 -2712 -3060 -2141 -1678 -1468 -1362 20 1456 1981 1479 1292 1661 1956 818 -165 60 223 166 -687
537f87n96M14P40n46k25M01J229L07p80j24J34K13m01q78Q2P44L89j131Q8K48
$$ -687 -1283 -869 -129 -675 -900 -499 730 1037 257 133 267 480 79 -799 -717 27 416 -715 -627 -379
557c79L50m84p66M31R20J46J35rL95P19m09o54N4M80j37j46m83p6q4o67n56l59
$$ -379 -29 -513 -1279 -848 72 218 353 344 739 1458 1049 395 449 929 792 646 163 87 3 -664 -1220 -1579
579a579K75L41m7L64R06N67J27kl82J69K6m12k34J09l6r4q35m21M33J28J03K25
$$ -1579 -1304 -963 -1010 -646 260 827 954 952 570 739 765 353 119 228 192 98 -737 -1158 -725 -597 -494 -269
601b69K72R27L63k80l43q8k65k32o88j23N12l0j73k4j85M05j22m21M63M73N60
$$ -269 3 930 1293 1013 670 582 317 85 -603 -726 -214 -244 -417 -441 -626 -221 -343 -764 -301 172 732
622G32j25j01j85kj51m14J35K3M27k5r2K12q0o41j77l22L50K20l16L62K86M10
$$ 732 607 506 321 319 168 -246 -111 -88 339 314 222 434 354 -287 -464 -786 -436 -216 -532 -170 116 526
644E26j31p0m07K15k02J36M1l6l8n1p18o9L49k4J28M71M00O18k8k65j4n88l74
$$ 526 395 325 -82 133 -69 67 108 72 34 -17 -735 -804 -455 -479 -351 120 520 1138 1110 845 831 243 -131
667a31Kk17J40j24K89r2r9j66K1j27j27R5L13L85l2l6L7J8k69P0R1L08N70j53
$$ -131 -129 -346 -206 -330 -41 -133 -232 -398 -377 -504 -631 -536 -223 162 130 94 131 149 -120 -50 41 349 919 766
691G66j67L5m87j02k25j35L47l2P5M59p3k2l7m50k20n0j50J46J22p8k11n1Q6j95
$$ 766 599 634 147 45 -180 -315 32 0 75 534 461 439 402 -48 -268 -318 -468 -322 -200 -278 -489 -540 -454 -649
715f49J95K47K63J08J35K10j83J31m52J37j12k08J56L66L4j40J77k04l5J4m25
$$ -649 -454 -207 56 164 299 509 326 457 5 142 30 -178 -22 344 378 238 415 211 176 190 -235
736b35K21j23P1K68k47Mj20j2n6J64j69J88J16j2P4l86j08j64K3j9O48l57L58
$$ -235 -14 -137 -66 202 -45 -41 -161 -173 -229 -65 -234 -46 70 58 132 -254 -362 -526 -503 -522 126 -231 127
759A27K19k01L58k04k75L16k57R6k3l0J6m1l81J82J23k45NM69k80J74l7j39j40
$$ 127 346 145 503 299 24 340 83 179 156 126 142 101 -280 -98 25 -220 -215 254 -26 148 111 -28 -168
782a68m1q1L4N5O01m7k1j52K0j57j70L9jK51l53K20r1J09r1k19k2K63j68j04L95
$$ -168 -209 -290 -256 -201 400 353 332 180 200 43 -127 -88 -89 162 -191 29 -62 47 -44 -263 -285 -22 -190 -294 101
807A01K4J1j54j20k40K91k13J25K16j6O31m08m0J64l33j18K51j65L89k81N4o7
$$ 101 125 136 -18 -138 -378 -87 -300 -175 41 25 656 248 208 372 39 -79 172 7 396 115 169 102
829A02N7j24J02l43K9J43M4J74k45j7%k33j1J82J22J28j35k4J63J30k72M0j13
$$ 102 159 35 137 -206 -177 -34 10 184 -61 -78 -78 -311 -322 -140 -18 110 -25 -49 114 244 -28 12 -101
852a01q3Q0l2J17J78J77n30J81R4L3J94k49Q0J00J3q1j79P9J0j87Q4p5J16PMj58
$$ -101 -184 -104 -136 -19 159 336 -194 -13 81 114 308 59 139 239 252 171 -8 71 81 -106 -22 -97 19 26 30 -128
878a28n5Pn4J85kj30J65R3j17J12qj58p1n9M47j97j23K55j62N0o4j59J31k4O8
$$ -128 -183 -176 -230 -45 -47 -177 -12 81 -36 76 68 -90 -161 -220 227 30 -93 162 0 50 -14 -173 -42 -66 2
903BJ82j06j51M14k65j77K23k67J70j38jM4L30j42J2j61j73M11n2n2Q0P4j20O5
$$ 2 184 78 -73 341 76 -101 122 -145 25 -113 -114 -70 260 118 130 -31 -204 207 155 103 183 257 137 202
927B02k8k87J08N2k09L8R0J70l98j4K05m6Q8J42l48L61J60k14O2j67nJ64m47J24
$$ 202 174 -113 -5 47 -162 -124 -34 136 -262 -276 -71 -117 -29 113 -235 126 286 72 134 -33 -38 126 -321 -197
951a97P2J02J49j79j36J53O8j61j49J75J51L87m19lj0j68K34j50j05J69r8q2K34
$$ -197 -125 -23 126 -53 -189 -36 32 -129 -278 -103 48 435 16 13 3 -165 69 -81 -186 -17 -115 -197 37
974C7M7j41rj00J71K60k66K55r3N1J14k95N4q7j1j43J45l20L67o1k14K82m9K92
$$ 37 84 -57 -66 -166 5 265 -1 254 161 212 326 31 85 -2 -13 -156 -11 -331 36 -25 -239 43 -6 286
998B86P7j70j01K10k93J8k6L2j69J01l17K56J95k11j12L09p3L68k23j10R0j11
$$ 286 363 193 92 302 9 27 1 33 -136 -35 -352 -96 99 -112 -224 85 12 380 157 47 137 26
1020B6J27K7j50NK05j29r8j77K75R1l14j85K39j48J73R3j82j7P9J56K06m54J37
$$ 26 153 180 30 35 240 111 13 -164 111 202 -112 -297 -58 -206 -33 60 -122 -139 -60 96 302 -152 -15
1043a5J62k56j08J30J61O4j20p5R8M1r4J28k43L04L1k2R0j37P1j58k40P6J92n2
$$ -15 147 -109 -217 -87 74 138 18 -57 41 82 -12 116 -127 177 208 186 276 139 210 52 -188 -112 80 28
1067B8K2j74J01J13K9j21L1j20J86J62l45lP3j75k2Q5O4j14lK4l1kK38p3n0K40
$$ 28 50 -124 -23 90 119 -2 29 -91 95 257 -88 -91 -18 -193 -215 -130 -66 -180 -183 -159 -190 -192 46 -27 -77 163
1093A63L5j69K23pj0p1j17j09K41J12l28J57k44Q1J99l11K44j5j41J6n1M9n3J02
$$ 163 198 29 252 245 235 164 47 -62 179 291 -37 120 -124 -43 156 -155 89 74 -67 -51 -102 -53 -106 -4
1117dj32J19j93L99j41k11J36p9m7J14J39q7M9J26k27J65k0n6r7J13n0J90Qn9
$$ -4 -136 -17 -210 189 48 -163 -27 -106 -153 -39 100 13 62 188 -39 126 106 50 -47 66 16 206 214 155
1141A55k59K7P9k1L0j11M1M3J51k60J99Ql0q2J6L2n1r3L3J24j21J43k05K14O2
$$ 155 -104 -77 2 -19 11 -100 -59 -16 135 -125 74 82 52 -30 -14 18 -33 -126 -93 31 -90 53 -152 62 124
1166A24n0K7j88J89r9Q6r5L49k28J93k67K1k09P0O4OoN0J46j90j77J04L02j98
$$ 124 74 101 -87 102 3 89 -6 343 115 308 41 62 -147 -77 -13 -7 -13 37 183 -7 -184 -80 222 24
1190B4O2J00l52K28m8j18J81J51k10J21r8K0P5j96j09J08J58j1J2m18N81m55L09
$$ 24 86 186 -166 62 14 -104 77 228 18 139 41 61 136 -60 -169 -61 97 86 98 -320 261 -194 115
1213A15k30J37m1n4O3j49P3J48N9j77J46k24K72o0K8j3N8j56p0J11j49L5K00j11
$$ 115 -115 22 -19 -73 -10 -159 -86 62 121 -56 90 -134 138 78 106 93 151 -5 -75 36 -113 -78 122 11
1237A1q6O6L1l07K47n8j50L0J14N7J17j9J14p5R6j83j26J28M5j61J71j56P7nl1
$$ 11 -75 -9 22 -285 -38 -96 -246 -216 -102 -45 72 53 167 92 188 5 -121 7 52 -109 62 -94 -17 -22 -53
1262e3K77p4j26n7K4j09K51q8R6m1j65r2J93M6r5J98k31M2R8l0qk1j42RR4P3K1
$$ -53 224 150 24 -33 -9 -118 133 45 141 100 -65 -157 36 82 -13 185 -46 -4 94 64 56 35 -107 -98 -4 69 90
1289I0k25M2J28K38l61J33J17j5j74j2K5j52J77Q2J28k04nl8J65r3m0n4m5l38
$$ 90 -135 -93 35 273 -88 45 162 147 -27 -39 -14 -166 11 93 221 17 12 -26 139 46 6 -48 -93 -431
1313d31J90J34l9m9L3K58M4j5m1J0k74J68L2K61k03K9k21n3K01J50k70L9j8J35
$$ -431 -241 -107 -146 -195 -162 96 140 125 84 94 -180 -12 20 281 78 107 -114 -167 34 184 -86 -47 -65 70
1337G0l7q8K1QJ16j39Q9l1j72J72n1m3K49k91P6J79k66J18J04mj44J32K7p4J3
$$ 70 33 -55 -34 -26 90 -49 40 9 -163 9 -42 -85 164 -127 -51 128 -138 -20 84 80 -64 68 95 21 34
1362C4n0K26l70L37j55j73L20k14R8K9k61K18k19J23J7J5q7J88p1j97M2j7J05
$$ 34 -16 210 -160 177 22 -151 169 -45 53 82 -179 39 -180 -57 -40 -25 -112 76 5 -192 -150 -167 -62
1385f2N7p0M0K4j65K25k51L70j79J40j31K08j70k5L09l92J1N8r6J67N2q2m5o2
$$ -62 -5 -75 -35 -11 -176 49 -202 168 -11 129 -2 206 36 11 320 -72 -61 -3 -99 68 120 38 -7 -69
1409f9P3j23J33k35K65j06j02M2K58l15K24J01l00N5M00l05mk69L44L0j70k4N6
$$ -69 4 -119 14 -221 44 -62 -164 -122 136 -179 45 146 -154 -99 301 -4 -8 -277 67 97 -73 -97 -41
1432d1J46j25qK16j42J61R1l65M0j2J28p8k5n3N6p6K13j93L4p9PJ84N6j47j09
$$ -41 105 -20 -28 188 46 207 298 -67 -27 -39 89 11 -14 -67 -11 -87 126 -67 -33 -112 -105 79 135 -12 -121
1457a21J1J17n3O9RJ7q1L5J15j55K41k45QJ69m5j66j09J78O5k33J08J43j84o7
$$ -121 -110 7 -46 23 32 49 -32 3 118 -37 204 -41 -33 136 91 -75 -184 -6 59 -174 -66 77 -107 -174
1481a74R3kQ3j36J13j29N8r0M1K4J57k4k64K72N4j2j00J16r0J04J53j95rK9L5
$$ -174 -81 -83 0 -136 -23 -152 -94 -184 -143 -119 38 14 -250 22 76 64 -36 80 -10 94 247 52 43 72 107
1506A07k07Q0Kj99K10L0q2q2J97J11r5pQM7k71K34k44K33Nj69r8K17K3j35J91
$$ 107 -100 -20 -18 -217 -7 23 -59 -141 56 167 72 65 73 120 -151 83 -161 72 77 -92 -190 27 50 -85 106
1531A06k67j44M63j99k67J45K13L1P1j94O9R8q5O8j45K85k95J0l0J35k0J45k20
$$ 106 -161 -305 158 -41 -308 -163 50 81 152 -42 27 125 40 108 -37 248 -47 -37 -67 68 48 193 -27
1554b7PJ3n3J37l03L69p5O9k96J53N8p9J76q0j46J53K84k94J4m5J76k58j86J77
$$ -27 -20 -7 -60 77 -226 143 68 137 -159 -6 52 -27 149 69 -77 76 360 66 80 35 211 -47 -233 -56
1578e6l5J08k16N9K3K22n6Or7J90j02J09j86J09l25L78p9j37R6K9n4O5J12j01
$$ -56 -91 17 -199 -140 -117 105 49 55 -42 148 46 155 -31 78 -247 131 52 -85 11 40 -14 51 163 62
1602F2n2L4j51L78k64k4l4K3nJ34r9j5j08r4J87J01K4j93K69k67m7K57j77L9l6
$$ 62 10 44 -107 271 7 -17 -51 -28 -33 101 2 -13 -121 -215 -28 73 97 -96 173 -94 -141 116 -61 -22 -58
1627e8j94J84K70k77M4k8J40Kk40K06J3K2j44J91n4q2L0J1l03L45P4k96J67k10
$$ -58 -252 -68 202 -75 -31 -59 81 83 -157 49 62 84 -60 131 77 -5 25 36 -267 78 152 -144 23 -187
1651a87K00J21l88M16k37K30k36K51k67J08J33k22l18M46P9j16L4j83K35K4j67
$$ -187 13 134 -254 162 -75 155 -81 170 -97 11 144 -78 -396 50 129 13 47 -136 99 123 -44
1672d4m2J37J32k92r8K21J35j31j40K7p8L26om18K85J38q0k3j45k4J40m9j72K58
$$ -44 -86 51 183 -109 -207 14 149 18 -122 -95 -173 153 147 -271 14 152 72 49 -96 -120 20 -29 -201 57
1696E7k07L07Mk35l7L15k28J61k15J20L51j55k69n8p2K27q1l83M44Q2j98j4k46
$$ 57 -150 157 161 -74 -111 204 -24 137 -78 42 393 238 -31 -89 -161 66 -15 -398 46 128 -70 -84 -330
1719c30L16r1n4r7K59J19j53m5K5Q7j6q1lk23K80Q3k38jK03J46j67k52K85Qn3
$$ -330 -14 -105 -159 -256 3 122 -31 -76 -51 36 20 -61 -64 -287 -7 76 -162 -163 40 186 19 -233 52 60 7
1744GN8lj16L03N1m63j9M33k90j57R0J52K49l48p3K57j09o7R5j81R7L30k75RO
$$ 7 65 62 -54 249 300 -163 -182 251 -39 -196 -106 46 295 -53 -126 131 22 -45 50 -131 -34 296 21 30 36
1769C6j8J35m5j68l9J63K66n63L16J43m78L16r4oL04k80Lj67K89O4j97j93J55
$$ 36 18 153 108 -60 -99 64 330 -233 83 226 -252 64 -30 -36 268 -12 -9 -176 113 177 -20 -213 -58
1792e8K09l9j38j72L49j00N7m05K47Q7R2j59l31L02K50k79Q0k01K15O4r8K3j21
$$ -58 151 112 -26 -198 151 51 108 -297 -50 37 129 -30 -361 -59 191 -88 -8 -209 6 70 -28 -5 -126
1815a26L63l13P6k10J43J05J1n2K07o6q6j82L3K55j31M2j02K11r8J32m02J36J52
$$ -126 237 -76 0 -210 -67 38 49 -3 204 138 52 -130 -97 158 27 69 -33 178 80 212 -190 -54 98
1838I8Pj49m6n6K29k2k29R5J72J24j73j87K25PJ73m18K0K46J58m51M8L0K61m2
$$ 98 105 -44 -90 -146 83 61 -168 -73 99 223 50 -137 88 95 268 -150 -130 116 274 -177 -129 -99 162 120
1862A20k45L2K81o4j1o5l05M18p5m14pM19N4p5m04J00J80N4o7j00J43J36j0j4
$$ 120 -125 -93 188 124 113 48 -257 161 86 -328 -335 84 138 63 -341 -241 -61 -7 -74 -174 -31 105 95 81
1886H1k22J44L82n26J75M8j28L60l50j74K73oN2j98j52K50k9j70J18R1P0J62n66
$$ 81 -141 3 385 -141 34 82 -46 314 -36 -210 63 57 109 -89 -241 9 -20 -190 -72 19 89 251 -315
1909c15L62N9r5n3p6K03L0j52n0J1RQM7q4J33j84J87l25L0M09l4l17K19K09J9
$$ -315 47 106 11 -42 -118 85 115 -37 -87 -76 -67 -59 -12 -96 37 -147 40 -285 -255 154 120 -197 22 231 250
1934B50J2l55j4M9M18m74j9J1K14L9l47N8J6J62o7j12J55J31N8l85j11L07k4k28
$$ 250 262 -93 -107 -58 360 -114 -133 -122 92 131 -216 -158 -142 20 -47 -159 -4 127 185 -200 -311 -4 -28 -256
1958b56L66l12L11m5k68M2J35K92k34k18O9K30kj89j35J42J61ql05K03l8L87l18
$$ -256 110 -202 109 64 -204 -162 -27 265 31 -187 -118 112 110 -79 -214 -72 89 81 -224 -21 -59 328 10
1981A0k4K73j15j86j6Mm1L55k39j46J34J10k04k9J05R9J6j92N4K9J62Nl27K48
$$ 10 -14 259 144 -42 -58 -54 -95 260 21 -125 9 119 -85 -114 -9 90 106 -86 -32 -3 159 164 -163 85
2005H5j0Q5k09J9J62J52k25k46J87k8Q6%l04K62pJ04j91j88K57O3o4k72K08J22
$$ 85 75 160 -49 -30 132 284 59 -187 0 -28 58 58 -246 16 9 113 -78 -266 -9 54 -10 -282 -74 48
2029D8K84j58l15P3K00n8j33l2K06J2k88P6J66J23j55j62K3NJ98k32L0K33j7k81
$$ 48 332 174 -141 -68 132 74 -59 -91 115 127 -161 -85 81 204 49 -113 -90 -85 113 -119 -89 144 127 -154
2053a54j53K49J6J05J3k87L8J4J60j05k65L28L68j72j69J47m5P5k97j27K65J58
$$ -154 -307 -58 -42 63 76 -211 -173 -159 1 -104 -369 -41 327 155 -14 133 88 163 -134 -261 4 162
2075A62k09q5r7K38r4Q3q9q4M31l18J66j66L48j22k36k30M48k84J66k15K1K23
$$ 162 -47 -132 -229 9 -85 -2 -91 -175 256 -62 104 -62 286 164 -72 -302 146 -138 28 -187 -166 57
2097E7j75K39k20k7K14Q8k73J32J32l7o8j9J96J04k63l76J14M76j23k52j28L11
$$ 57 -118 121 -99 -126 88 176 -97 35 167 130 62 43 239 343 80 -296 -182 294 171 -81 -209 102
2119A02j58K08m42K23M0L0k0p3J34k70K80j8j28O3L4K1j48j37M73j41j06j2J6
$$ 102 -56 152 -290 -67 -27 3 -17 -90 44 -226 54 36 -92 -29 5 26 -122 -259 214 73 -33 -45 -29
2142b9K67j24o1j94J93j1j89L6J74R6l31J40np5K07j35j72J33J8L16l83J85k43
$$ -29 238 114 53 -141 52 41 -148 -112 62 158 -173 -33 -38 -113 94 -41 -213 -80 -62 254 -129 56 -187
2165a87J17Q8r8O4q2J75j64r9K65K06j62q7O1m6J8k98J16J56q8J61j33n7%Q9j92
$$ -187 -70 18 -80 -16 -98 77 -87 -186 79 285 123 36 97 51 69 -229 -113 43 -45 116 -17 -74 -74 15 -177
2190a77P0J78j2K39k18k54M17j93j06q0J38L5Kj6j18K97rk71J76k5k26K38J7k44
$$ -177 -107 71 59 298 80 -174 243 50 -56 -136 2 37 39 23 -95 202 193 -78 98 73 -153 85 102 -142
2214a42M3l0J48n0J01O0l09J81k00L46K07k46k99Q6J94J4j70m1J85j36m2J91q7
$$ -142 -99 -129 19 -31 70 130 -179 2 -198 148 355 109 -190 -104 90 104 -66 -107 78 -58 -100 91 4
2237DK16l48q9J09q7J67M4o6k6J46l2O3m9M9pp8k30K58J30k56n3q4R5K31J59j58
$$ 4 220 -128 -217 -108 -195 -28 16 -50 -76 70 38 101 52 101 94 16 -214 44 174 -82 -135 -219 -124 107 266 108
2263A08l6j20j00K64rk39P4J75J6j01O4j5j30j57M35k3o3j65j26J24J07j19J42
$$ 108 72 -48 -148 116 107 -132 -58 117 133 32 96 81 -49 -206 229 206 143 -22 -148 -24 83 -36 106
2286A06k09K55j04j66P3J37j8j5q2J2J16j24j31oK36J58m25J50pJ05n8OJ29q4
$$ 106 -103 152 48 -118 -45 92 74 59 -23 -11 105 -19 -150 -156 80 238 -187 -37 -44 61 3 9 138 54
2310E4J5R9j04J02j35J2Q0k48K06j73J67J60k30L0n9J64j00j72M26m64j05L36
$$ 54 69 168 64 166 31 43 123 -125 81 -92 75 235 5 35 -24 140 40 -132 294 -170 -275 61
2332F1J1l5J7Lj30N2k6R1j14K00k30K94k68J23m9o7L7J37j78k7k4L12j64J64k63
$$ 61 72 37 54 57 -73 -21 -47 44 -70 130 -100 194 -74 49 0 -67 -30 107 -71 -98 -122 190 26 190 -73
2357g3n2J08J3N8J11q6k6MJ02j08K7lJ98k26k11L02j71J02o0j02L6J85j93p3J22
$$ -73 -125 -17 -4 54 165 79 53 57 159 51 78 75 273 47 -164 138 -33 69 9 -93 -57 128 -65 -138 -16
2382a6K10o3j01j31M5q2L2K68j17j24Q3p1J31j22m0J05k3k16J65K47J3k70K67
$$ -16 194 131 30 -101 -56 -138 -106 162 45 -79 4 -67 64 -58 -98 7 -16 -232 -67 180 193 -77 190
2405A90m62K27j33K70k50L40k59Q5r1L4j10K89j20j70J68j70L34k62J06j90J38
$$ 190 -272 -45 -178 92 -158 182 -77 8 -83 -49 -159 130 10 -160 8 -162 172 -90 16 -174 -36
2426c6O9k6j27J15j30K22K9k8Kl33K87K1j31PL8j37J13L7J90l10J55j63J54J41
$$ -36 33 7 -120 -5 -135 87 116 88 90 -243 44 65 -66 -59 -21 -158 -45 -8 182 -128 27 -136 18 159
2450A59p9J07l82L46j91%J43j60J31m5R4k41O5J1K82k42k44L94k40J03r5J41j24
$$ 159 80 187 -195 151 -40 -40 103 -57 74 29 123 -118 -53 -42 240 -2 -246 148 -92 11 -84 57 -67
2473f7Q8p0L32j95o1l1J27j04N5K01k25J20mo6oj65J83K1M3L9k89R7O6k21L06
$$ -67 21 -49 283 88 27 -4 123 19 74 275 50 170 166 100 94 -71 112 133 176 215 -74 23 89 -132 174
2498A74j83j7R3K0J13l39J59q1J45j59k8j05J06J82j96J72j81J44j75j0L8J38
$$ 174 -9 -26 67 87 200 -139 20 -61 84 -75 -103 -208 -102 80 -116 56 -125 19 -156 -166 -128 10
2520A0R0j22P4j39o1P3Q6J81p9j86K69Q7l10k36K64J59j09j29qk7J21J21k05M7
$$ 10 100 -22 52 -87 -148 -75 11 192 113 -73 196 283 -27 -263 1 160 51 -78 -86 -113 8 129 -76 -29
2544b9N2J15j58j52J23M7J22m11J93L7J97k84J90p7J6J17p7K6q7m0K91l22J14
$$ -29 23 138 -20 -172 -49 -2 120 -291 -98 -61 136 -148 42 -35 -19 98 21 47 -40 -80 211 -111 3
2567CP8j23R6l9J81j82k2j53J42j32L71k80J62j94P0J55kj68l3J71k39J95Q8k18
$$ 3 81 -42 54 15 196 14 -8 -161 -19 -151 220 -60 102 -92 -22 133 131 -37 -70 101 -138 57 145 -73
2591g3l9R8o5m8K68m63K56qJ56M0n0j22j65R5L7lO5QR0k13n3J8Q0J45J0l9J8q8
$$ -73 -112 -14 -79 -127 141 -322 -66 -74 82 122 72 -50 -215 -120 -83 -86 -21 -13 77 -136 -189 -171 -91 54 64 25 43 -45
2619d5o5K19j25o0j42K45q1m6j4K07O0r9m5mJ01l42J79n9j6l0K03q0J35K0M6o5
$$ -45 -110 109 -16 -76 -218 27 -54 -100 -114 93 153 54 9 5 106 -236 -57 -116 -132 -162 41 -39 96 116 162 97
2645I7n0K1J26k99m9K42k08J56j47Q2K7N8J39k62K0j0j65L15m3n4k5R2j52m9K59
$$ 97 47 68 194 -105 -154 88 -120 36 -111 -29 -2 56 195 -67 -47 -57 -222 93 50 -4 -29 63 -89 -138 121
2670A21j1j89j31J66K8k04K92j95J46q2M3K3o3j2J77k62R1qP4n6j17J06N9J00
$$ 121 110 -79 -210 -44 -16 -220 72 -123 23 -59 -16 7 -56 -68 109 -153 -62 -70 4 -52 -169 -63 -4 96
2694I6rj29J36j62K5J43k50J26l6l2K46j7r8MQ4j99O3N4O4j72Q8Q7l6r0J45R5
$$ 96 87 -42 94 -68 -43 100 -150 -24 -60 -92 154 137 39 43 127 -72 -9 45 109 -63 25 112 76 -14 131 226
2720B26k10K8N0l7M0k2k4Q1j50L2o1Q2Q2km3J80l66o7p0J80k2PJ39on7L24m85
$$ 226 16 44 94 57 97 75 51 132 -18 14 -47 35 117 115 72 252 -114 -181 -251 -71 -93 -86 53 47 -10 314 -171
2747a71P1J48q5p2M3J0J5p0q6rK49k7p2j1j5J42J30j84J5J07k54K12j33J53j73
$$ -171 -100 48 -37 -109 -66 -56 -41 -111 -197 -206 43 16 -56 -67 -82 60 190 6 21 128 -126 86 -47 106 -67
2772f7L18j67j87J91K7j70J55o3m5k56K60j99J69j1k84L25L2m0L2j2k9K0J6j01
$$ -67 251 84 -103 88 115 -55 100 37 -8 -264 -4 -203 -34 -45 -329 -4 28 -12 20 8 -21 -1 15 -86
2796h6j51K97o6j03J22J0k2N2k36J08K97n01K86m8j49L15j51Q4J19j88R0j69J84
$$ -86 -237 60 -6 -109 13 23 1 53 -183 -75 222 -279 7 -41 -190 125 -26 58 177 -11 79 -90 94
2819I4p2O9p6J69l00J82k32L40o7n9P1l23J29r3L04j63o0O5p8j0J19n4L5m5P3
$$ 94 22 91 15 184 -116 66 -166 174 107 48 119 -204 -75 -168 136 -27 -87 -22 -100 -110 9 -45 -10 -55 18
2844A8j85M2J68q7Pj64K02l4L2k0nK31l51J05q1K24k11K22j58J13m5j07PL18r4
$$ 18 -167 -125 43 -44 -37 -201 1 -33 -1 -21 -26 205 -146 -41 -122 102 -109 113 -45 68 23 -84 -77 241 147
2869A47j50Jj9j08M2M17m92J39k47K55k9J82j53N8k74J57Q8p5J08M7j88K66j57
$$ 147 -3 -2 -21 -129 -87 330 -162 -23 -270 -15 -44 138 -15 43 -231 -74 14 -61 47 94 -94 172 15
2892A5J26l35L66k9l30J3J10J4Q2l4M2r9L47k71J16J1q4m8l7k5N8K1J24j76k09
$$ 15 141 -194 172 143 -187 -174 -64 -50 32 -2 40 -59 288 17 133 144 60 12 -25 -50 8 29 153 -23 -232
2917b32J29K63j86k14J78l0K17j25J00j64j32J05K08j08O9J40j91l1l7J0Q2qn5
$$ -232 -103 160 -26 -240 -62 -92 125 0 100 -64 -196 -91 117 9 78 218 27 -4 -41 -31 51 43 -12
2940a2K5m8oJ14k8m0o3r8J07nJ32j08n1N0l4P1q9O0NQ4p0pj64J07LJ3K4k4K2L4
$$ -12 13 -35 -41 73 45 5 -58 -156 -49 -54 78 -30 -81 -31 -65 6 -83 -23 -18 66 -4 -11 -175 -68 -65 -52 -28 -52 -30 4
2970Drj02Q0j16M30k55QL7m8j2m5K01j71q2j32J88j62K55J59k04r7J42L5j44J81
$$ 4 -5 -107 -27 -143 287 32 40 77 29 17 -28 173 2 -80 -212 -24 -186 69 228 24 -73 69 104 -40 141
2995A41m6j33P3O0r1j1O9L7mj75n7K51j46M3jJ02j69R4r1J89K3k52O3P0r1K71
$$ 141 95 -38 35 95 4 -7 62 99 95 -80 -137 114 -32 11 10 112 -57 37 -54 135 158 -94 -31 39 -52 219
3021B19m19J50J38k04P1K22l6j9Mq6j08l8L78l58K46k26P6K18l25PJ39o3O3j48
$$ 219 -200 -50 88 -116 -45 177 141 122 126 40 -68 -106 272 -86 160 -66 10 228 -97 -90 49 -14 49 -99
3045i9J23k2Rp9K7J8N3K79n03R2J48L9k62L34n3l5k00P3J85n8J2j51jn8K5R9k9
$$ -99 24 2 11 -68 -41 -23 30 309 -194 -102 46 85 -177 157 104 69 -131 -58 127 69 81 -70 -71 -129 -104 -5 -34
3072c4M0kM8j57J60J77j53J24k4l45J43J03M0j46Q1j49j10L82l76K07j56m5J66
$$ -34 6 4 52 -105 55 232 79 203 179 -166 -23 80 120 -26 55 -94 -204 178 -198 9 -147 -192 -26
3095b6R9J7j24M8N0l16L34R3l23L23r7j45O5L8K79l14o2J52k09J69j35J38q3j44
$$ -26 73 90 -34 14 64 -252 82 175 -148 175 78 -67 -2 36 315 1 -61 91 -118 51 -84 54 -29 -173
3119a73K01j5L6Or2L1L2k65K65k17J07J49m9l7j16N1K90o4J3k52K4J40j75L9K4
$$ -173 28 13 49 55 -37 -6 26 -239 26 -191 -84 65 16 -21 -137 -86 204 140 153 -99 -75 65 -110 -71 -47
3144d7Q3j37J50j11O7r4J64q2j70R0K8k7J25M5j7l6j4M3j33N8j7R8m6j70J97j32
$$ -47 36 -101 49 -62 5 -89 75 -7 -177 -87 -59 -86 39 84 67 31 17 60 -73 -15 -32 66 20 -150 47 -85
3170h5J6K8J52j5l75K34j45J75q6K93p8o1j67NN7J4L5J58j74J01Q1l53L27L8q5
$$ -85 -69 -41 111 96 -279 -45 -190 -15 -101 192 114 53 -114 -109 -52 -38 -3 155 -19 82 163 -190 137 175 90
3195I0K5k11l1M3J06J01j06kL4n3k8Qj1n1J12OMj31J49j68k6J03K13l84L53k02
$$ 90 115 -96 -127 -84 22 123 17 15 49 -4 -32 -24 -35 -86 26 32 36 -95 54 -114 -140 -37 176 -208 145 -57
3221e7j0M1r9K23j22k7Q0j15K03j88K04m08J09K08n6K49j37j24M6q2L8jm8K28
$$ -57 -67 -26 -125 98 -24 -51 29 -86 117 -71 133 -275 -166 42 -14 235 98 -26 20 -62 -24 -25 -73 155
3245A55q7m1j01O1m4k7J54l5j97J97j03J41P8Q6l07R5Q9j25J52k6j20p6J13K26
$$ 155 68 27 -74 -13 -57 -84 70 35 -162 35 -68 73 151 237 -70 25 114 -11 141 115 -5 -81 32 258
3269B58k05j63J27J10j66J67j67kK40j95J23k30Nj01J57M7r4n4O4J70j3j14J94
$$ 258 53 -110 17 127 -39 128 -39 -41 199 4 127 -103 -98 -199 -42 5 -89 -143 -79 91 78 -36 158
3292A58l4j56J3j08JO9J6j54K16%j01r6K68j52K0m1o4K13j5q8Q7K9l9m6j2l5R3
$$ 158 124 -32 -19 -127 -126 -57 -41 -195 21 21 -80 -176 92 -60 -40 -81 -145 68 53 -35 52 81 42 -4 -16 -51 42
3319D2j16mJ02O5j93ML7O1Q7oj93N4J12K4Q%j52J22Kj13o4K73j77m1J13j43n8
$$ 42 -74 -78 24 89 -104 -100 -63 -2 85 79 -114 -60 52 76 84 84 -68 54 56 -57 -121 152 -25 -66 47 -96 -154
3346a54R3O3L8k0q2K97k23l1j32L76k00j05Q3lM8k52J77J5o3p5J20L07l55Q9O6
$$ -154 -61 2 40 20 -62 235 12 -19 -151 225 25 -80 3 0 48 -204 -27 -12 -75 -150 -30 277 -78 11 77
3371G7k15L35l3q9l9p6Q3j49R6J03l25M02q6j33J99j91Rj36J00K06j36j9k03L28
$$ 77 -138 197 164 75 36 -40 43 -106 -10 93 -232 170 84 -49 150 -41 -32 -168 -68 138 2 -17 -220 108
3395A08k14Q0Q7l6k3o1Q5J36n6k57P8J35p1R8j38L32k14K14k47K8r5J0L2j02k9
$$ 108 -106 -26 61 25 2 -59 26 162 106 -151 -73 62 -9 89 -49 283 69 283 36 64 -31 -21 11 -91 -120
3420a20J07L7j90L55k70L55j83k25J66l79K42K76n7j43r6K63o5L7j05M4k67L62
$$ -120 -13 24 -166 189 -81 274 91 -134 32 -347 -105 171 114 -29 -125 138 73 110 5 49 -218 144
3442A44j05J4j06K09O9k66j9P8MN9J1k51J49k21K10K6K57j18k31K39k30n6K1J69
$$ 144 39 53 -53 156 225 -41 -60 18 22 81 92 -159 -10 -231 -21 5 262 144 -87 152 -78 -134 -113 56
3466E6l8J6j15K08O9k32Jj30J13Kn2J08J20n5j30J16j94J61j22J02j61Q7k4P4
$$ 56 18 34 -81 127 196 -36 -35 -165 -52 -50 -102 6 126 71 -59 57 -137 24 -98 4 -157 -70 -94 -20
3490b0p9J44j16J60j02n1Q1j36R0Q3o0l3o3K9P6j75K42m1r0j25J76K81j30j98
$$ -20 -99 45 -71 89 -13 -64 17 -119 -29 54 -6 -39 -102 -73 3 -172 70 29 -61 -186 -10 271 141 -57
3514e7j60J64K55k39K10j95n0J22j60q7J68j9M6kQ8J8j18K08l71L43j92k07J89
$$ -57 -217 -53 202 -37 173 -22 -72 50 -110 -197 -29 -48 -2 -4 84 102 -16 192 -179 164 -28 -235 -46
3537d6M3J30l56K00R5Lk84K95L8j66J63k41J79r3m6m6R4Mj3OO5q2J3N0j93K93
$$ -46 -3 127 -229 -29 66 69 -215 80 118 -48 115 -126 53 -40 -86 -132 -38 -34 -47 -41 24 -58 -45 5 -188 105
3563A05l0j55R8r8J64j29m4j1L56k03K7l16J36K34LRj95P3L8k56K80k06J39j53
$$ 105 75 -80 18 -80 84 -45 -89 -100 256 53 80 -236 -100 134 137 146 -49 24 62 -194 86 -120 19 -134
3587a34N9j4Q5J48k32n0K61n1j77L45r6J0j24n6p8l7R7K4R0p1J21j82K71k55k32
$$ -134 -75 -89 -4 144 -88 -138 123 72 -105 240 144 154 30 -26 -104 -141 -44 -20 70 -1 120 -62 209 -46 -278
3612b78J42J46p5K60k7j43l1j45L33l23L05n5k57K9o3K48o2R0q6J53k17P5l4K38
$$ -278 -136 10 -65 195 168 25 -6 -151 182 -141 164 109 -148 -119 -182 66 4 94 8 161 -56 19 -15 223
3636B23r6pj71m3J07O7o5k0j12KJ28j75J08K3J89P2l61j1J12j00QQ0ko7J09j30
$$ 223 127 120 -51 -94 13 80 15 -5 -117 -115 13 -162 -54 -31 158 230 -131 -142 -30 -130 -122 -42 -44 -111 -2 -132
3662a32K78j68k2J07M0j08o6L20m19J06j89K4j06L37J93j16J29k73N9p2R6k09
$$ -132 146 -22 -44 63 103 -5 -71 249 -170 -64 -253 -229 -335 2 195 79 208 -65 -6 -78 18 -191
3684a91J57J21p5j3L9j39j5J26J72j35k00J52o1K21j60j3J1j18J36j71J06J72
$$ -191 -34 87 12 -1 38 -101 -116 10 182 47 -153 -1 -62 159 -1 -14 -3 -121 15 -156 -50 122
3706A22p9O2j58P4n7J72j95K0K32j53Q2j84K03j78R3J75k7j74N0j63J84j30O5
$$ 122 43 105 -53 21 -36 136 -59 -39 193 40 122 -62 141 -37 56 231 204 30 80 -83 101 -29 36
3729C6Q0j71J23NM1j91J34Q2j29oL4j0q9K40n6J17k41j25M18k45K2j4j14J44O8
$$ 36 116 -55 68 73 114 -77 57 139 10 4 38 28 -61 179 123 240 -1 -126 292 47 69 55 -59 85 153
3754A53j08K04k67r4K42k01j27J82L13l48k9M9p4L00l42J08m3K28J0m6k60J58
$$ 153 45 249 -18 -112 130 -71 -198 -16 297 -51 -80 -31 -105 195 -147 -39 -82 146 156 110 -150 8
3776HK87j28j77p6j0p2J76N5k64K58J53j04K28o21L80j94QJ95p7j54J76J0l1j29
$$ 8 295 167 -10 -86 -96 -168 8 63 -201 57 210 106 334 -287 93 -101 -93 102 25 -129 47 57 26 -103
3800a03K43l82M76k09r1K14j31k14J13P4j13K25k69L6j25K77P6l8j66J69j11l5
$$ -103 140 -242 234 25 -66 148 17 -197 -84 -10 -123 102 -167 -131 -256 21 97 59 -107 62 -49 -84
3822h4o5PK76Mk34K4kJ29n8j30J16M3N9L9p6RK10j36l78K5L83j95J1L03m48J73
$$ -84 -149 -142 134 138 -96 -72 -74 55 -3 -133 -17 26 85 124 48 57 267 131 -247 -222 161 -34 -23 280 -168 5
3848EN5n3j05R1J15Jr7j1K49k25j09q3J86J99j29j55%P3j24K15k53L12m40L19
$$ 5 60 7 -98 -7 108 109 12 1 250 25 -84 -167 19 218 89 -66 -66 7 -117 98 -155 157 -283 36
3872C6r3l7N1P4n0J48j16o2J37j92J79j06k5Q0p9j13J29j60L9K14k0J38m29L61
$$ 36 -57 -94 -43 31 -19 129 13 -49 88 -104 75 -31 -56 24 -55 -168 -39 -199 -160 54 34 172 -257 104
3896A04j29j35J84j6Pj2O2K11j60k38J93o5P4j22j83J60K84j33k39K95j81K34
$$ 104 -25 -160 24 8 15 3 65 276 116 -122 71 6 80 -42 -225 -65 219 86 -153 142 -39 195
3918A95k51J55j13j40K77r9m7j82K99l7j0M9j63j6J99Q1k57J3L25l08p0J82j8
$$ 195 -56 99 -14 -154 123 24 -23 -205 94 57 47 96 -67 -83 116 197 -60 -47 278 -30 -100 82 64
3941F4k6k4K1l0L88k15r2ok15O76m42k22R2j94K27K8k06J3K00j64K3O3k2r8RO8
$$ 64 38 14 35 5 393 178 86 80 -135 541 99 -123 -31 -225 2 30 -176 -163 37 -127 -104 -41 -63 -161 -152 -84
3967h4rJ43n6k6R6N9P1k82J92J1J00j82p2J17p0L8o6K18l37J94oj7l3j49J71j75
$$ -84 -93 50 -6 -32 64 123 194 -88 104 115 215 33 -39 78 8 46 -20 198 -139 55 49 32 -1 -150 21 -154
3993a54K74j19J19k22KJ6j7K64m7j39j54J26n1N0M7p4Pn6K37n3q3J92n7J36l84
$$ -154 120 1 120 -102 -100 -84 -101 163 116 -23 -177 -51 -102 -52 -5 -79 -72 -128 109 56 -27 165 108 244 -140
4018a40J41K36l27J15j53J96j08K40k18Q0n2N0k61O6J78m3j20QL92n58K10M6j7
$$ -140 1 237 -90 25 -128 68 -40 200 -18 62 10 60 -201 -135 43 0 -120 -112 280 -278 -68 -22 -39
4041c9qK55k69J08l9j18j56J53m2m9J10O0j50K13l2J36k75L15j26k1j43N3K43
$$ -39 -47 208 -61 47 8 -110 -266 -113 -155 -204 -94 -34 -184 29 -3 133 -142 173 47 26 -117 -64 179
4064A79l77L90j01p9po6K04k04J47J73q0k7k78J11M9K6l26J20K43j49p7J35j34
$$ 179 -198 192 91 12 5 -61 143 -61 86 259 179 152 -126 -15 34 60 -266 -146 97 -52 -129 6 -128
4087a28J1J35J12j84J48j69J53J73k02N4q1J08j34R9j08j14K2J54K5k06L4n5K65
$$ -128 -117 18 130 -54 94 -75 78 251 49 103 22 130 -4 95 -13 -127 -105 49 74 -132 -98 -153 112
4110A12j37J11l9k71J90J11n5j04J88j79P2Q5j85M18m16J17p1N8Q2j41L26k42
$$ 112 -25 86 47 -224 -34 77 22 -82 106 -73 -1 84 -101 317 -99 18 -53 5 87 -54 272 30
4132C0j1j80K80k17M4R6j52K28j14r8L43k29k9J27j18K5J23j33j41L06p8M8k35
$$ 30 19 -161 119 -98 -54 42 -110 118 4 -94 249 20 -9 118 0 25 148 15 -126 180 102 150 -85
4155h5L42k11k3P0r6j48J27O8j25J46j03mk00L17J33k47J07o6J0J0q7R2M2j80
$$ -85 257 46 23 93 -3 -151 -24 44 -81 65 -38 -42 -242 75 208 -39 68 2 12 22 -65 27 69 -111
4179a11K12j44J57p2j2J04j52o9J36j2j06O1M4j8J85j31j1J71j88j05N8L8Om9
$$ -111 101 -43 114 42 30 134 -18 -87 49 37 -69 -8 36 18 203 72 61 232 44 -61 -3 35 41 -8
4203hK7j59r6K22Mj9j3p3L0J17k44Q5L38k38P1j45J3J6KJ25Jj52J46j54J50l48
$$ -8 19 -140 -236 -14 -10 -29 -42 -115 -85 32 -212 -127 211 -27 44 -101 -88 -72 -70 55 56 -96 50 -104 46 -302
4229c02L91j09k37K53K3j08J22r0q6J03j2p6K91o2k91O7j9K67l31L65j76K8j08
$$ -302 89 -20 -257 -4 19 -89 33 -57 -143 -40 -52 -128 163 101 -190 -123 -142 125 -206 159 -17 11 -97
4252i7J83J92j21j93P0o9J0O8j70L29k82J34k8J84j26jk45K91j14kK26j15q0j58
$$ -97 86 278 157 -36 34 -35 -25 43 -127 202 -80 54 26 210 84 83 -162 129 15 13 239 124 44 -114
4276a14J84p5q0m0J79l5j73J8R6K1K34j27j15O1J00j11Q2j3j8j31Q2k0J95m33
$$ -114 70 -5 -85 -125 54 19 -154 -136 -40 -19 215 88 -27 34 134 23 105 92 74 -57 25 5 200 -233
4300b33J79J04o5m9nO2pK4M6J61j18k5j07J56J32k25n9J91N1j73j06Q0j59J71
$$ -233 -54 50 -15 -64 -69 -7 -14 10 56 217 99 74 -33 123 255 30 -29 162 213 40 -66 14 -145 26
4324B6o2Pm1j60L33Pq7N7j91N3J24j51Q1J40j09j06L7j5N6q3k2j46J02K27j56
$$ 26 -36 -29 -70 -230 103 110 23 80 -111 -58 66 -85 -4 136 27 -79 -42 -57 -1 -84 -106 -252 -150 77 -79
4349g9J26p1k0j5j96K36o7O6J09q1J36k31j5N8n3L21k24NJ07l61M05k44K16j77
$$ -79 47 -24 -44 -59 -255 -19 -86 -20 89 8 144 -87 -102 -44 -97 224 0 5 112 -249 156 -88 128 -49
4373d9J25m0j52K09j22P4k50J71J19N3j00K22k34K6k14J84J08j81J55j71n3K22
$$ -49 76 36 -116 93 -29 45 -205 -34 85 138 38 260 26 52 -162 22 130 -51 104 -67 -120 102
4395A02Lj41J41M3m8o1r8J35j16j36K64j16j13J10%j3J81j84K35k28J17Q1k94
$$ 102 105 -36 105 148 100 39 -59 76 -40 -176 88 -28 -141 -31 -31 -44 137 -47 188 -40 77 158 -136
4418a36K80J69m46M3Q6j52L17q6n4l6p7K08j31k70L56j23R3j23R6R7j74N8o6J13
$$ -136 144 313 -133 -90 -4 -156 161 75 21 -15 -92 116 -15 -285 71 -52 41 -82 14 111 -63 -5 -71 42
4442D2P1k80J86j26J33JN2k06K48j29L4rj44J49K5o6j8J33j11P3j8p4l7K1l1J39
$$ 42 113 -167 19 -107 26 27 79 -127 121 -8 26 17 -127 22 47 -19 -37 96 -15 58 40 -34 -71 -50 -81 58
4468E8P1k33K7m5j5J09J70j67J49M8k54o1K7R5O2l5%p1K29k20J05r4J76p7j86
$$ 58 129 -104 -77 -122 -137 -28 142 -25 124 172 -82 -143 -116 -21 41 6 6 -65 164 -56 49 -45 131 54 -132
4493a32k7K27L3k68K8kR6j19J07J46j83J37M7j8k47K8J14p2J64j15M0n8J41l03
$$ -132 -159 68 101 -167 -139 -141 -45 -164 -57 89 -94 43 90 72 -175 -147 -33 -105 59 -56 -16 -74 67 -236
4517b36J60L24k28j07K98Qk47j48k2J90J68m0m24J58L01k8k3K7q7k5j15K33n2
$$ -236 -76 248 20 -87 211 219 -28 -176 -198 -8 160 120 -304 -146 155 127 104 131 44 19 -96 137 85
4540H5N2j98J70k27P4K76k30J20j38Pj05J02J1P9m1q2N0j07oK02l22J83J31k22
$$ 85 137 -61 109 -118 -44 232 2 122 -16 -9 -114 -12 -1 78 37 -45 5 -102 -108 94 -228 -45 86 -136
4564a36J29j3Nk8j0J43ql2j93K62l78K79J2j36j15O2K51N6j00k59L38o5j33j6
$$ -136 -7 -20 -15 -43 -53 90 82 50 -143 119 -259 20 32 -104 -219 -157 94 150 50 -209 129 64 -69 -85
4588h5N0N9m5r0O8J66k47pp1M44j88n1k36K26j56jJ81j35q6K50L8j3r6R0KN0Q4
$$ -85 -35 24 -21 -111 -43 123 -124 -131 -202 242 54 3 -233 -7 -163 -164 17 -118 -204 46 84 71 -25 65 67 117 201
4615B01l34R7l3K24l00N0J23j13m6J65Q0l6j78J04KN1p2N7l5%q9J2j22J15M8j6
$$ 201 -133 -36 -69 155 -145 -95 28 -85 -131 34 114 78 -100 4 6 57 -15 42 7 7 -82 -70 -192 -77 -29 -45
4641d5j28J80M4Q2j90K00J96m05J80j63j6l9Q2J84k41K10o5j57K53k28J16k05
$$ -45 -173 7 51 133 -57 143 339 -66 114 -49 -65 -104 -22 162 -79 131 66 -91 162 -66 50 -155
4663a55k1K18j09J06j28K18k07nK35k99L5kK14j82P6k0J31j68M9M5ql2M2j70J88
$$ -155 -176 42 -67 39 -89 129 -78 -83 152 -147 -112 -114 100 -82 -6 -26 105 -63 -14 31 23 -9 33 -137 51
4688E1j66M4o9J53j49k7L57l45J19M3J26j12jk73P5K02K03l75J32J50k10K36k88
$$ 51 -115 -71 -140 13 -136 -163 194 -151 -32 11 137 25 24 -249 -174 28 231 -144 -12 138 -72 164 -124
4711a24J24p8l2J24rP0J49l64l4M57l41nJ44n4j29L2o5K04J16l23L35k42M4R2
$$ -124 0 -78 -110 14 5 75 224 -140 -174 283 -58 -63 81 27 -102 -70 -135 69 185 -138 197 -45 -1 91
4735I1j94K09J0j61J44j51K0K1J32L6j50no9R8Q2j07k50J68L37j45j35l4J89N
$$ 91 -103 106 116 -45 99 -52 -32 -11 121 157 7 2 -67 31 113 6 -244 -76 261 116 -19 -53 136 141
4759A41l21J44q4J54p7J68j38J01r4J2K08l24K50j40j7J64l4j33l3N0K5J26L9
$$ 141 -180 -36 -120 34 -43 125 -13 88 -6 6 214 -110 140 0 -17 147 113 -20 -53 -3 22 148 187
4782A87l62K9j2K27j48J19K52k83k26P8R1p7J40j35j09L08j90M96m62J68K5k03
$$ 187 -175 -146 -158 69 -79 40 292 9 -217 -139 -48 -125 15 -120 -229 79 -111 385 -77 91 116 -87
4804h7q2R0J56p2K72l76L3N4Q7l7j98K09r5j18k6J40J11o6q4K53j30P3k24J09
$$ -87 -169 -79 77 5 277 -99 -66 -12 75 38 -160 49 -46 -164 -190 -50 61 -5 -89 164 34 107 -117 -8
4828hj71K80p9j84N8J67K5j11m4P9N7k9Pq9j59J60j22j52J70J10j23N2r0J52L23
$$ -8 -179 101 22 -162 -104 63 88 -23 -67 12 69 40 47 -42 -201 -41 -163 -315 -145 -35 -158 -106 -196 -44 279
4853B79j57q3l7q5L24j80r2o5K16r7r7M5l7L6jj13J51n1O3J57l48J30L1J66j64
$$ 279 122 39 2 -83 241 61 -31 -96 120 23 -74 -29 -66 -30 -31 -144 7 -44 19 176 -172 -42 -11 155 -9
4878iP1j28J45j0k77J59j96K86J00k3l3J8k16P5P6n2J23j8j92l4J35j48K16j59
$$ -9 62 -66 79 69 -208 -49 -245 41 141 118 85 103 -113 -38 38 -14 109 91 -101 -135 0 -148 68 -91
4902i1J48j63K5M0J75j14P4j86K1J85q1j7J76k94n0J14L2j5PK5L6j6Nr3MJ92K3
$$ -91 57 -106 -81 -41 134 20 94 -92 -71 114 33 16 192 -102 -152 -38 -6 -21 -14 11 47 31 36 -57 -53 139 162
4929A62q5L8n8j0J2j7N2Lk10j38L19p6J73k45M8J0J73o3L6j45L5n6J97n1j17J54
$$ 162 77 115 57 47 59 42 94 97 -113 -251 68 -8 165 -80 -32 -22 151 88 124 -21 14 -42 155 104 -13 141
4955A41k38j2J47j22J0j4K05j59K06l36K9K65l0l44L31lj22j10L00r7k04K30q2
$$ 141 -97 -109 38 -84 -74 -88 117 -42 164 -172 -143 122 92 -252 79 76 -46 -156 144 47 -157 73 -9
4978ij19J17n1k06K00J43O8j21n8M3P5j13K4j81K82j60J00J18o5l4J13j24J04
$$ -9 -128 -11 -62 -268 -68 75 143 22 -36 7 82 -31 -7 -188 94 -66 34 152 87 53 166 42 146
5001A46k11j87K62Q1j01R6k10K32r3K32k17j55J33l2J8j02j7P5J48j42j0J1L9
$$ 146 -65 -252 10 91 -10 86 -124 108 15 247 30 -125 8 -24 -6 -108 -125 -50 98 -44 -54 -43 -4
5024dj80J69J1P3l78M24j33R1q5P8nK4n6j73L50m04L16P1m31K09R6j14K33k52
$$ -4 -184 -15 -4 69 -309 115 -18 73 -12 66 61 85 29 -144 206 -198 118 189 -242 -33 63 -51 182 -70
5048g0O0J23p2j94J56n8J02j04lJ31j27J49k63R8J68j0nk24K02L1N5j36j16R6
$$ -70 -10 113 41 -153 3 -55 47 -57 -60 71 -56 93 -170 -72 96 86 81 -143 59 90 145 9 -107 -11
5072a1Q2qk8Mr9K5k9pJ76m0r1J8j16R0O2N6p0Qr9j10K41l7j13M8J06jP3k95L10
$$ -11 71 63 35 39 -60 -35 -64 -71 105 65 -26 -8 -124 -34 28 84 14 22 -77 -187 54 17 -96 -48 58 57 130 -165 145
5101A45k78n4L10l07K0J96q2J40j37n2J24J1N8k17o5L62l07l0J61N2o1J66k63
$$ 145 -133 -187 123 -184 -164 32 -50 90 -47 -99 25 36 94 -123 -188 174 -133 -163 -2 50 -11 155 -108
5124a08O3j85K85J06k39K49k9J15l22J66J5j72j08Q3L67j20k46J85k95K6J32J5
$$ -108 -45 -230 55 161 -78 171 142 257 -65 101 116 -56 -164 -81 286 166 -80 105 -190 -164 -32 -17
5146a7K9n9nL1J73k21Q8Q1l03M22L8k23Jj15M14m69K96k72o3J84N8k88m1L72K4
$$ -17 12 -47 -52 -21 152 -69 19 100 -203 219 257 34 35 -80 334 -135 161 -111 -174 10 68 -220 -261 111 135
5171A35m56J56P8j46J32q5P5RJ3J92O8j52q9J23J22j77J3L21o9l23M8MK32j73
$$ 135 -321 -165 -87 -233 -101 -186 -111 -102 -89 103 171 19 -70 53 175 -2 11 332 263 -60 -12 -8 224 51
5195E1l3PJ05l8o5n9p9K95j48l1J56j59o4j74J10j4J97j43K7L3m1J74P4j18j18
$$ 51 18 25 130 92 27 -32 -111 184 36 5 161 2 -62 -236 -126 -140 57 -86 -59 -26 -67 107 181 63 -55
5220e5n0J50NR6m13J58N7Q8p5m6j32KK62q1j05J60PK14k52o5K13l51L20j36n1
$$ -55 -105 45 50 146 -267 -109 -52 36 -39 -85 -217 -215 47 -34 -139 21 28 242 -10 -75 138 -213 107 -29 -80
5245h0k3J57q9Q8%l0m9J36j1k67mO1j52K59j93L01j46k45K09j97K60nJ05N1j91
$$ -80 -103 54 -35 53 53 23 -26 110 99 -168 -172 -111 -263 -4 -197 104 -42 -287 -78 -275 -15 -20 85 136 -55
5270e5P5j02K3m4J81j16J24j96P8j28N7j9J25j27O0m8K7J85k15N1J31O1j29K0
$$ -55 20 -82 -59 -103 78 -38 86 -110 -32 -160 -103 -122 3 -124 -64 -112 -85 100 -115 -64 67 128 -1 19
5294A9J23j29k5Q2j52J29r7J89r8o9n8O9m4K17j21m2m3j43J55K0O2L3l18M36j32
$$ 19 142 13 -12 70 -82 47 -50 139 41 -28 -86 -17 -61 156 35 -7 -50 -193 -38 -18 44 77 -241 195 63
5319F3o3j53J50Q1j98M5O8K5K9L5J99l68L08m04K02Ok06L45k33K7NK35o6k90L1
$$ 63 0 -153 -3 78 -120 -75 -7 18 47 82 281 -87 221 -183 19 25 -181 164 -69 -42 -37 198 132 -158 -127
5344a27K77k32r2K49r1k44L13J49q4k41J58j18J91k49K50j13l6o1j02K23Lj00
$$ -127 150 -82 -174 75 -16 -260 53 202 118 -123 35 -83 108 -141 109 -4 -40 -101 -203 20 23 -77
5366g7M1M3l5J61j4p9j44l3J4K39n6M8j66J57r2K23m76J86N3j01P8O1k2q4N0L8
$$ -77 -36 7 -28 133 119 40 -104 -137 -123 116 60 108 -58 99 7 230 -246 -60 -7 -108 -30 31 9 -75 -25 13
5392A3J4K1l7k07K02j23J40R9p5R0p1n2j3Jj04J50j53K12j95l0K31P0m14K56j4
$$ 13 27 48 11 -196 6 -117 23 122 47 137 66 14 1 2 -102 48 -105 107 -88 -118 113 183 -231 25 11
5417A1J70l21L37k52O8m6j84K47J24j51k75M58k94J68Q6k19j00J74J11q7M2P5
$$ 11 181 -140 197 -55 13 -33 -217 30 154 3 -272 186 -108 60 146 -73 -173 1 112 25 67 142
5439A42j34L7r3L60k54r0j53J27K6O9j25K75K4j65q9m4O5k87N69k64O2k0l1R8
$$ 142 8 45 -48 312 58 -32 -185 -58 -32 37 -88 187 211 46 -43 -87 -22 -309 260 -4 58 38 7 105
5463A05p3j78Q7O0k0O1o8N6j47m7J93P3j96J09O0N2P1l43N5q5K58M7J29m02RJ67
$$ 105 32 -146 -59 1 -19 42 -26 30 -117 -164 29 102 -94 15 75 127 198 -145 -90 -175 83 130 259 -143 -134 33
5489C3J6k5k3l0J78k59K02l9k35L28j84J67k95L86l07K1O2J44l07K80k88J37j53
$$ 33 49 24 1 -29 149 -110 92 53 -182 146 -38 129 -166 220 -87 -66 -4 140 -167 113 -175 -38 -191
5512a91j61L04r4J58j03l0J66m1j20J15P5r4p4J83n0p3L0j01L4j5Q4l5J37m5j40
$$ -191 -352 -48 -142 16 -87 -117 49 8 -112 3 78 -16 -90 93 43 -30 0 -101 -67 -82 2 -33 104 59 -81
5537h1L31k75K06l58L56n7k24K69l43L70j08j9j55J47OJ12j14j30Jj22K15kJ29
$$ -81 250 -25 181 -177 179 122 -102 167 -176 194 86 67 -88 59 65 177 63 -67 -66 -188 27 25 154
5560A54k07J70j41j14l1K39j17K4O9k25J08L3J22k24k9J41J9q0P2J24j82J07j3
$$ 154 -53 117 -24 -138 -169 70 -47 -23 46 -179 -71 -38 84 -140 -169 -28 -9 -89 -17 107 -75 32 19
5583A9j3n8l7q2J12j49J90j2k11L78o0l1j31K26l26J58N3l4k2O0j42o2K62P0j56
$$ 19 6 -52 -89 -171 -59 -208 -18 -30 -241 137 77 46 -85 141 -185 -27 26 -8 -30 30 -112 -174 88 158 2
5608BJ6RJ4Q2j57r2L54k89m7P1K40l80R2J7K62k37J63p9O9pq2j3P0p3k4J38j7
$$ 2 18 27 41 123 -34 -126 228 -61 -108 -37 203 -177 -85 -68 194 -43 120 41 110 103 21 8 78 5 -19 119 102
5635A02O0l09L31j24J9k40J72q2K16j96O2J49j40j18K71l8m7O2l8j3q0p1l7J69
$$ 102 162 -147 184 60 79 -161 11 -71 145 -51 11 160 20 -98 173 135 88 150 112 99 19 -52 -89 80
5659H0J2J36k29j23p9L5Q5l8R6J29Q6p9j39k11K66j65r5O1K96k9N5j52j47K63
$$ 80 92 228 -1 -124 -203 -168 -83 -121 -25 104 190 111 -28 -239 27 -138 -233 -172 124 95 150 -2 -149 114
5683A14jQ1j77j44J12n3K16l23K63k00P0J15l11L51j65M6n8j54K92k81K52Q4j38
$$ 114 113 194 17 -127 -15 -68 148 -175 88 -112 -42 73 -238 113 -52 -6 -64 -218 74 -207 45 129 -9
5706ij21J14J03n2M3n6j11pK54l00J63j05J48L6k50J71k17L84j92R3j62J28P5
$$ -9 -130 -16 87 35 78 22 -89 -96 158 -142 21 -84 64 100 -150 21 -196 188 -4 89 -73 55 130
5729A30k58Q1r6K03q7j45K77j03Q3j04j9O1k78K16j26R6r8K88k49J31p7K52j37
$$ 130 -128 -47 -143 60 -27 -172 105 2 85 -19 -38 23 -255 -39 -165 -69 -167 121 -128 3 -74 178 41
5752D1k4K2j51p7J60J5j74N1J42O8n5J68K3n19R7L28pj22p6m6J49j3m1L3q5oK24
$$ 41 17 39 -112 -189 -29 -14 -188 -137 5 73 18 186 209 -310 -213 115 108 -14 -90 -136 13 0 -41 -8 -93 -99 125
5779A25k85L8k3Q6m4J86l06K04M4j10P7N9l01NL73n9R8l6k58l4K44l49K69KK9
$$ 125 -160 -122 -145 -59 -103 83 -223 -19 25 -85 -8 51 -250 -245 128 69 167 131 -127 -161 83 -266 3 5 34
5804C4oJ02j32L8j73jJ82O6k74J53j61J06K8R3K60l44J1j43L08k13K00k55J77
$$ 34 28 130 -2 36 -137 -138 44 110 -164 -11 -172 -66 -38 55 315 -29 -18 -161 147 -66 134 -121 56
5827E6L1m5L5j54K42j94J37j32R3J61j77n3l2J89j04j25J0K6l3N6P5j06K28k19
$$ 56 87 42 77 -77 165 -29 108 -24 69 230 53 0 -32 157 53 -72 -62 -36 -69 -13 62 -44 184 -35
5851c5L5K0N4l16J08k1K26k55J28L2p2J81j62J40L8j18k83L70j95J3n0R2K08j86
$$ -35 0 20 74 -242 -134 -155 71 -184 -56 -24 -96 85 -77 63 101 -17 -300 70 -125 -112 -162 -70 138 -48
5875d8QJ50j53K1J78j78J54k39K03j80L26k48k1k7N5pk7q3J99k95J94J2N9On5
$$ -48 -40 110 -43 -22 156 -22 132 -107 96 -84 242 -6 -27 -54 1 -6 -33 -116 83 -212 -18 -6 53 59 4
5900Dj09P2R5k6o1K6q1J16o1K16q5j07K81k22r6q4J98kj79K44j24J7j40MJ89r0
$$ 4 -105 -33 62 36 -25 1 -80 36 -25 191 106 -1 280 58 -38 -122 76 74 -105 139 15 32 -108 -104 85 -5
5926ej01L3J56M2l32J98j20J61L2J43l84J7J21J3J07j57O1n5K31l46K91j33K20
$$ -5 -106 -73 83 125 -207 -9 -129 32 64 207 -177 -160 -39 -26 81 -76 -15 -70 161 -185 106 -27 193
5949A93k97Q4Q6J21k54L0KM9m8R6j85P3n6J51j79p0K49K5n5j46J74oJ04n1r8R2
$$ 193 -104 -20 66 187 -67 -37 -35 14 -34 62 -123 -50 -106 45 -134 -204 45 70 15 -131 43 37 141 90 -8 84
5975H4j01j04K73j74L7j95J05o2J62j05N2J09J16pJ03l51J48j2N1p6j33J91k09
$$ 84 -17 -121 152 -22 15 -180 -75 -137 25 -80 -28 81 197 190 293 -58 90 78 129 53 -80 111 -98
5998i8M39k62L2j5k22J81Q5j08J71q2k56L0J26r2K02j1p7j7j53L30k42J13O3j36
$$ -98 341 79 111 96 -126 55 140 32 203 121 -135 -105 21 -71 131 120 43 26 -127 203 -39 74 137 1
6022AJ73k72L3M7J10m1r4J04N8k27K76k01P8j08j26K41j52k34J12K43M2j66J17
$$ 1 174 -98 -65 -18 92 51 -43 61 119 -108 168 -33 45 -63 -189 52 -100 -334 -222 21 63 -103 14
6045A4j36K4J28q9OR7j9j9j7K06j99J88j46M0j2p7k01NJ37K14j51j13J46j7j73
$$ 14 -122 -98 30 -59 -53 44 25 6 -11 195 -4 184 38 78 66 -11 -212 -207 -70 144 -7 -120 26 9 -164
6070a64k7K67j49L86l93J31N8j25m1L08j84j43O4nP2j33K81m31K54j45J02J50
$$ -164 -191 76 -73 313 -80 51 109 -16 -57 251 67 -76 -12 -17 55 -78 203 -228 26 -119 -17 133
6092A33p1m2R6j90n7j11M50k55K08q7q4K07j60Pn5l1j60L68m78J24K26k74J39
$$ 133 62 20 116 -74 -131 -242 208 -47 161 74 -10 197 37 44 -11 -42 -202 166 -312 -188 38 -236 -97
6115i7m3L36k78m7J10M4J89l29%J28R6k4j32k4J14J6j94K21q1M6k3M0Ll7K44m59
$$ -97 -140 196 -82 -129 -19 25 214 -115 -115 13 109 85 -47 -71 43 59 -135 86 5 51 28 68 71 34 278 -181
6141a81j49L49l47N5L53LO6n4j29j05K37j6M9l70K57j21N1K02k20Q8r8P0n8n6
$$ -181 -330 19 -328 -273 80 83 149 95 -34 -139 98 82 131 -239 18 -103 -52 150 -70 18 -80 -10 -68 -124
6165a24r0J34Q5j7j68J99j17O2R2j08R0J6q7J13rr4K35j60n0r5J1k68L11k20K93
$$ -124 -214 -80 5 -12 -180 19 -98 -36 56 -52 38 54 -33 80 71 -23 212 52 2 -93 -82 -350 -39 -259 34
6190C4P3l29K50N3j07N8k14J85P3n4J35j22j27O1n0J68j21J68m3k02Q9N0N9j56
$$ 34 107 -222 28 81 -26 32 -182 3 76 22 157 35 -92 -31 -81 87 -34 134 91 -111 -22 28 87 -69
6214f9r6J50R3k7J2l03L27j1l7Nj20l7K02j10k0K15Qk83J90Nj6m9J5l13M95j77
$$ -69 -165 -15 78 51 63 -240 87 76 39 44 -76 -113 89 -21 -41 174 182 -101 89 94 78 29 44 -269 226 49
6240D9j57K30k2j36j7J44j50J64j32P6p6L0nj83J43j25M15j89r6K0J53j99J08
$$ 49 -108 122 100 -36 -53 91 -59 105 -27 49 -27 3 -2 -185 -42 -167 248 59 -37 -17 136 -63 45
6263D5j60J16k21K14m8J57Q3k26J61q8k22Q3nJ87j40p9N7Q4K4J5L8k54J76m7J96
$$ 45 -115 1 -220 -6 -54 103 186 -40 121 33 -189 -106 -111 76 -64 -143 -86 -2 22 37 75 -179 -3 -50 146
6288A46o6j81N8P9J35k7l09n0J78lP0J38J79m70o1J25LJ64p4j93K77j34j7J70
$$ 146 80 -101 -43 36 171 144 -165 -215 -37 -40 30 168 347 -123 -184 -59 -56 108 34 -159 118 -16 -33 137
6312A37r5L5J01l57L50m5j23J22j81N0j76J40M2K24k25j3L5j29J57K50l18J84
$$ 137 42 77 178 -179 171 126 3 125 -56 -6 -182 -42 0 224 -1 -14 21 -108 49 299 -19 165
6334A65j87L7J45j17j13M0M9j03J01j02N6L9j04q4J23L35l14j08L28l1r2j96r3
$$ 165 -22 15 160 43 -70 -30 19 -84 17 -85 -29 10 -94 -178 -55 280 -34 -142 186 155 63 -133 -226
6357b26K79J2k57K95l76J43J19j64L34k20n3O2K67j47o1j1l7p2K48j11M7j21j51
$$ -226 53 65 -192 103 -273 -130 -11 -175 159 -61 -114 -52 215 68 7 -4 -41 -113 135 24 71 -50 -201
6380b01J52N6J00j5j53L6j8N9j19O3%pp0J89o5N6j76J01j91L47M7k13r6K66j76
$$ -201 -49 7 107 92 -61 -25 -43 16 -103 -40 -40 -47 -117 72 7 63 -113 -12 -203 144 191 -22 -118 148 -28
6405b8j46L79r8j60J91j9j72Mj3M5N6N3p3p5J50j16OR8k08M9j45P5K14j55pLM4
$$ -28 -174 205 107 -53 138 119 -53 -49 -62 -17 39 92 19 -56 94 -22 -16 82 -126 -77 -222 -147 67 -88 -95 -92 -48
6432d8Q1j61l6J69R5k68J99o2j40R0l6LJ03J1K9Qo5O0j04N8m3J37J8k09K62j13
$$ -48 33 -128 -164 5 100 -168 31 -31 -171 -81 -117 -114 -11 0 29 37 -28 32 -72 -14 -57 80 98 -111 151 38
6458C8N1r0k8J81l84K59k22J19J78j14r4J17j4p8N5k2j24K57R8k05q4J32J55j12
$$ 38 89 -1 -29 152 -232 27 -195 -76 102 -12 -106 11 -3 -81 -26 -48 -172 85 183 -22 -106 26 181 69
6482F9o7n6j1j63K20L7k88L35P7j48P3j25q7Q5Q8q5J08J91k50o7O5J43j91J03
$$ 69 2 -54 -65 -228 -8 29 -259 76 153 5 78 -47 -134 -49 39 -46 62 253 3 -64 1 144 -47 56
6506E6J57m61L87j66J23L9k00R4j30J90J41l78J29q8R4Q8k98M14l54L40j75k4
$$ 56 213 -248 139 -27 96 135 -65 29 -101 89 230 -148 -19 -107 -13 75 -223 191 -163 177 2 -22
6528b2r5L50k11k22K41j24J36M7J36l39M5j74J56J62j24n6L23l32M3J67lk09J86
$$ -22 -117 233 22 -200 41 -83 53 100 236 -103 -58 -232 -76 86 -38 -94 229 -103 -60 107 104 -105 81
6551H1j68K9J62j29j19J79Q2k15K75K5k25K3j13j38J99R4n5O5k6k2r7L1J23j09
$$ 81 -87 -58 104 -25 -144 35 117 -98 177 202 -23 0 -113 -251 -52 42 -13 52 26 4 -93 -62 61 -48
$$ [...]
8191E9
##END NTUPLES=NMR FID
##END=
