##TITLE=1H_16-2022
 CDCl3
 8 sc, 
 9.03.2022
##JCAMPDX= 6.0         $$ Bruker NMR JCAMP-DX V2.0
##DATA TYPE= NMR FID
##DATA CLASS= NTUPLES
##ORIGIN= UXNMR, Bruker Analytische Messtechnik GmbH
##OWNER= root
$$ XWIN-NMR		Version 3.5
$$ Wed Mar  9 11:57:21 2022 Russian Standard Time (UT+4h)  she@DPX200
##.OBSERVE FREQUENCY= 200.131346
##.OBSERVE NUCLEUS= ^1H
##.DELAY= (6, 6)
##.ACQUISITION MODE= SIMULTANEOUS
##.ACQUISITION SCHEME= undefined
##.AVERAGES= 8
##.DIGITISER RES= 18
##SPECTROMETER/DATA SYSTEM= spect
##.PULSE SEQUENCE= zg30
##.SOLVENT NAME= CDCl3
##.SHIFT REFERENCE= (INTERNAL, CDCl3, 0, 15.7039)
##AUDIT TRAIL= $$ (NUMBER, WHEN, WHO, WHERE, WHAT)
$$ ##TITLE= Audit trail, XWIN-NMR		Version 3.5
$$ ##JCAMPDX= 5.01
$$ ##ORIGIN= Bruker BioSpin GmbH
$$ ##OWNER= she
$$ F:/spectra/data/she/nmr/H-F/1/audita.txt
$$ ##AUDIT TRAIL=  $$ (NUMBER, WHEN, WHO, WHERE, WHAT)
(   1,<2022-03-09 11:55:59.46 +0400>,<she>,<DPX200>,
      <created by zg, POWCHK disabled, PULCHK disabled
       configuration hash MD5:
       00 E9 B6 7A A2 85 ED C7 34 08 36 98 17 FE 4E 26
       data hash MD5: 16K
       3F E6 8A F5 2C 80 6F 68 F3 B3 D5 33 8B 52 45 29>)
$$ ##END=
$$ 
$$ hash MD5
$$ F2 4C 89 7E 03 93 F7 FD 85 07 FF 09 A1 77 D7 01
##$RELAX= 
##$RELAX= 
##$RELAX= 
##$RELAX= 
##$RELAX= 
##$RELAX= 
$$ Bruker specific parameters
$$ --------------------------
##$DU= <F:/spectra>
##$EXPNO= 1
##$NAME= <H-F>
##$PROCNO= 1
##$TYPE= <nmr>
##$USER= <she>
##$AMP= (0..31)
100 100 100 100 100 100 100 100 100 100 100 100 100 100 100 100 100 100 
100 100 100 100 100 100 100 100 100 100 100 100 100 100 
##$AQSEQ= 0
##$AQ_mod= 1
##$AUNM= <au_zg>
##$AUTOPOS= <>
##$BF1= 200.13
##$BF2= 200.13
##$BF3= 200.13
##$BF4= 200.13
##$BF5= 200.13
##$BF6= 200.13
##$BF7= 200.13
##$BF8= 200.13
##$BYTORDA= 1
##$CFDGTYP= 0
##$CFRGTYP= 5
##$CHEMSTR= <none>
##$CNST= (0..31)
1 1 145 1 1 1 1 1 1 1 1 1 1 1 1 1 1 1 1 1 1 1 1 1 1 1 1 1 1 1 1 1 
##$CPDPRG= <>
##$CPDPRG1= <>
##$CPDPRG2= <>
##$CPDPRG3= <>
##$CPDPRG4= <mlev>
##$CPDPRG5= <mlev>
##$CPDPRG6= <mlev>
##$CPDPRG7= <mlev>
##$CPDPRG8= <mlev>
##$CPDPRGB= <>
##$CPDPRGT= <>
##$D= (0..31)
0 1.2 0 0 0 0 0 0 0 0.06 0 0.03 0 0 0 0 0.0002 0 0 0 0 0 0 0 0 0 0 0 0 
0 0 0 
##$DATE= 1646812558
##$DBL= (0..7)
120 120 120 120 120 120 120 120 
##$DBP= (0..7)
150 150 150 150 150 150 150 150 
##$DBP07= 0
##$DBPNAM0= <>
##$DBPNAM1= <>
##$DBPNAM2= <>
##$DBPNAM3= <>
##$DBPNAM4= <>
##$DBPNAM5= <>
##$DBPNAM6= <>
##$DBPNAM7= <>
##$DBPOAL= (0..7)
0.5 0.5 0.5 0.5 0.5 0.5 0.5 0.5 
##$DBPOFFS= (0..7)
0 0 0 0 0 0 0 0 
##$DE= 6
##$DECBNUC= <off>
##$DECIM= 32
##$DECNUC= <off>
##$DECSTAT= 4
##$DIGMOD= 1
##$DIGTYP= 9
##$DL= (0..7)
0 120 120 120 120 120 120 120 
##$DP= (0..7)
150 150 150 150 150 150 150 150 
##$DP07= 0
##$DPNAME0= <>
##$DPNAME1= <>
##$DPNAME2= <>
##$DPNAME3= <>
##$DPNAME4= <>
##$DPNAME5= <>
##$DPNAME6= <>
##$DPNAME7= <>
##$DPOAL= (0..7)
0.5 0.5 0.5 0.5 0.5 0.5 0.5 0.5 
##$DPOFFS= (0..7)
0 0 0 0 0 0 0 0 
##$DQDMODE= 0
##$DR= 18
##$DS= 0
##$DSLIST= <SSSSSSSSSSSSSSS>
$$ [...]
##$SUBNAM2= <"">
##$SUBNAM3= <"">
##$SUBNAM4= <"">
##$SUBNAM5= <"">
##$SUBNAM6= <"">
##$SUBNAM7= <"">
##$SUBNAM8= <"">
##$SUBNAM9= <"">
##$SW= 18.0517287032376
##$SWIBOX= (0..15)
0 0 2 0 0 0 0 0 0 0 0 0 0 0 0 0 
##$SW_h= 3612.71676300578
##$TD= 16384
##$TD0= 1
##$TE= 0
##$TE2= 300
##$TE3= 300
##$TEG= 300
##$TL= (0..7)
0 120 120 120 120 120 120 120 
##$TP= (0..7)
150 150 150 150 150 150 150 150 
##$TP07= 0
##$TPNAME0= <>
##$TPNAME1= <>
##$TPNAME2= <>
##$TPNAME3= <>
##$TPNAME4= <>
##$TPNAME5= <>
##$TPNAME6= <>
##$TPNAME7= <>
##$TPOAL= (0..7)
0.5 0.5 0.5 0.5 0.5 0.5 0.5 0.5 
##$TPOFFS= (0..7)
0 0 0 0 0 0 0 0 
##$TUNHIN= 0
##$TUNHOUT= 0
##$TUNXOUT= 0
##$USERA1= <user>
##$USERA2= <user>
##$USERA3= <user>
##$USERA4= <user>
##$USERA5= <user>
##$V9= 5
##$VALIST= <valist>
##$VCLIST= <CCCCCCCCCCCCCCC>
##$VD= 0
##$VDLIST= <DDDDDDDDDDDDDDD>
##$VPLIST= <PPPPPPPPPPPPPPP>
##$VTLIST= <TTTTTTTTTTTTTTT>
##$WBST= 1024
##$WBSW= 4
##$XGAIN= (0..3)
0 0 0 0 
##$XL= 0
##$YL= 0
##$YMAX_a= 619151
##$YMIN_a= -818387
##$ZGOPTNS= <>
##$ZL1= 120
##$ZL2= 120
##$ZL3= 120
##$ZL4= 120
##$ABSF1= 10
##$ABSF2= 0
##$ABSG= 5
##$ABSL= 3
##$ALPHA= 0
##$AQORDER= 0
##$ASSFAC= 0
##$ASSFACI= 0
##$ASSFACX= 0
##$ASSWID= 0
##$AUNMP= <proc_1d>
##$AZFE= 0.1
##$AZFW= 0.1
##$BCFW= 1
##$BC_mod= 2
##$BYTORDP= 1
##$COROFFS= 0
##$CY= 11.3945322036743
##$DATMOD= 1
##$DC= 2
##$DFILT= <>
##$DTYPP= 0
##$F1P= 2.36226072786647
##$F2P= -0.459571619588291
##$FCOR= 0.5
##$FTSIZE= 0
##$FT_mod= 4
##$GAMMA= 1
##$GB= 0.15
##$INTBC= 1
##$INTSCL= 1
##$ISEN= 128
##$LB= 0.24
##$LEV0= 0
##$LPBIN= 0
##$MAXI= 10000
##$MC2= 0
##$MEAN= 0
##$ME_mod= 0
##$MI= 1.114404
##$NCOEF= 0
##$NC_proc= 0
##$NLEV= 6
##$NOISF1= 3.799351
##$NOISF2= 2.8
##$NSP= 1
##$NTH_PI= 0
##$NZP= 0
##$OFFSET= 15.70392
##$PC= 1
##$PHC0= -16592.25
##$PHC1= 15.60078
##$PH_mod= 1
##$PKNL= yes
##$PPARMOD= 0
##$PSCAL= 0
##$PSIGN= 0
##$REVERSE= no
##$SF= 200.130013532006
##$SI= 16384
##$SIGF1= 3
##$SIGF2= 2
##$SINO= 400
##$SIOLD= 16384
##$SREGLST= <1H.CDCl3>
##$SSB= 0
##$STSI= 0
##$STSR= 0
##$SW_p= 3612.71676300578
##$SYMM= 0
##$S_DEV= 0
##$TDeff= 0
##$TDoff= 0
##$TI= <>
##$TILT= no
##$TM1= 0
##$TM2= 0
##$TOPLEV= 0
##$USERP1= <user>
##$USERP2= <user>
##$USERP3= <user>
##$USERP4= <user>
##$USERP5= <user>
##$WDW= 1
##$XDIM= 8192
##$YMAX_p= 0
##$YMIN_p= 0
$$ End of Bruker specific parameters
$$ ---------------------------------
##NTUPLES= NMR FID
##VAR_NAME=  TIME,          FID/REAL,        FID/IMAG
##SYMBOL=    X,             R,               I
##VAR_TYPE=  INDEPENDENT,   DEPENDENT,       DEPENDENT
##VAR_FORM=  AFFN,          ASDF,            ASDF
##VAR_DIM=   8192,          8192,            8192
##UNITS=     SECONDS,       ARBITRARY UNITS, ARBITRARY UNITS
##FACTOR=    0.0002768,     1,               1
##FIRST=     0,             0,               0
##LAST=      2.2672688,     0,               0
##MIN=       0,             -818387,         0
##MAX=       2.2672688,     619151,          0
$$ Real data points
##PAGE= N=1
##DATA TABLE= (X++(R..R)), XYDATA
0 0 0 0 0 0 0 0 0 8 -8 8 -8 16 -24 32 -32 40 -56 72 -88 104 -120 144 -176 208 -240 280 -328 381 -438 502
30 502 -574 656 -746 846 -953 1073 -1209 1356 -1516 1690 -1881 2090 -2322 2571 -2844 3140
46 3140 -3466 3826 -4217 4641 -5112 5632 -6209 6849 -7565 8371 -9286 10335 -11553
59 -11553 12982 -14689 16774 -19385 22754 -27300 33791 -43859 61671 -102397 386958 -274005
71 -274005 -683922 619151 -93812 -573159 491847 399723 -633674 82292 541039 -402918
81 -402918 -393069 436519 22985 -238763 332606 126226 -469083 -63210 309694 -55818
91 -55818 -153509 236335 61692 -291543 56901 203905 -263071 -55162 367712 -77993
101 -77993 -257007 240677 20918 -347319 198206 274018 -341806 12706 362805 -320236
111 -320236 -196301 450676 -108277 -342137 353806 64380 -410912 237998 282384 -424563
121 -424563 -54614 399433 -202817 -205372 364523 -44964 -333331 248773 168722 -338672
131 -338672 -19177 289346 -68106 -128641 178121 -23809 -287067 103909 278179 -150250
141 -150250 -125478 215789 -38451 -236686 139034 120026 -240069 73137 319103 -204967
151 -204967 -236311 218462 -44371 -181036 295242 100793 -317645 61720 175242 -240019
161 -240019 -32224 272892 -84219 -111564 218545 -75483 -269053 150141 134260 -138696
171 -138696 86837 125910 -184912 -85380 133088 -28654 -78060 138636 66152 -149509 -19195
182 -19195 82015 -88537 -39351 149316 20741 -117446 42170 61594 -142078 -24043
192 -24043 182935 -36491 -111034 136497 -8717 -183518 108881 121877 -162637 2391
202 2391 165052 -105309 -96662 157350 -28092 -152388 137700 74950 -173384 35912 120876
213 120876 -112693 -24716 119186 -67596 -91417 109990 46989 -95787 24661 58581 -91213
224 -91213 -21521 99110 -18561 -50340 70460 19762 -92800 -12355 64104 -28776 -14812
235 -14812 102153 -13471 -116358 35066 35274 -81311 46087 106949 -65247 -56354 63121
246 63121 -46777 -85946 103036 68941 -82884 31871 46822 -124069 -24630 107676 -16278
257 -16278 -22046 86586 -17825 -108626 16741 47586 -44846 30765 88919 -49956 -65506
268 -65506 33037 -18883 -42012 61879 54941 -39970 -23075 21339 -40431 -41350 64640 36227
280 36227 -41847 21562 20964 -69604 -16420 60475 -2735 -22743 48762 3830 -71530 15441
292 15441 45705 -47811 4351 65709 -37464 -38915 46767 -8916 -45238 38600 29993 -50164
304 -50164 -1486 45366 -32935 -21872 50474 -15940 -44240 36941 17241 -32943 15104 27675
316 27675 -30946 -23163 29547 1063 -22158 36257 21094 -43419 -7263 16990 -23727 -339
328 -339 44307 7800 -31345 145 2319 -39272 6723 52766 -7047 -14029 23069 -28338 -43432
341 -43432 24860 27323 -8552 18549 23462 -40938 -35242 25306 574 -5968 49277 10159 -44135
354 -44135 -5728 1589 -22899 13724 42543 3057 -21552 819 -14168 -32711 19033 34614
366 34614 -5665 1990 7375 -27337 -22822 12773 16539 -12 12112 14925 -27191 -22577 17608
379 17608 -644 -3932 28585 4093 -25135 -99 8328 -14986 -997 26327 -2753 -18049
391 -18049 15181 -3294 -24565 16998 13495 -18971 3057 11818 -12231 -4542 14670 -2380 -16212
404 -16212 7265 7904 -12437 8486 15938 -12301 -8133 4258 -5408 -2084 12324 12674 -6232 -9154
418 -9154 3796 -11822 -11755 20093 12701 -4646 6061 -6345 -26693 -6061 20540 9522 -53
431 -53 12018 -8769 -27536 4447 6843 -9815 20169 22493 -12767 -13359 -7846 -14560 3894 28906
445 28906 15236 -11524 -7965 -7059 -16210 4378 15720 2954 7409 5695 -12669 -18482 -9225 9045
459 9045 15785 8899 6422 -11637 -22503 51 8491 319 9580 11562 -6101 -11818 362 -4326
473 -4326 -7872 18251 14840 -13065 -298 1850 -18324 3410 16634 -3948 -1332 7159 -8277
486 -8277 -10650 7030 5932 -6508 2971 3813 -9286 2830 6905 -7457 -1116 4060 -1118 1444
500 1444 -1501 -865 4406 1301 1557 -3424 -10534 1476 12381 5743 -2254 -4024 -7343 -7469 8402
515 8402 9433 -7751 3958 9830 -13361 -6975 2909 -9819 7379 23463 -1701 -15755 -4947
528 -4947 -5180 -3401 15152 12596 -8081 -879 3339 -14326 -5251 8503 2712 10158 9335 -9952
542 -9952 -12949 -7010 1019 10662 8898 2645 -2625 -8983 -8388 -1633 4518 4727 7384 6009 -9789
557 -9789 -9306 2034 -5524 2922 16737 -1044 -5639 2963 -10117 -8350 11284 7789 -2131 2981
571 2981 -495 -11656 150 9064 -5916 -553 10368 -5066 -4272 4179 -7369 -2231 9608 847
585 847 -3521 -1221 -1734 981 4181 678 -4423 -2113 1839 2166 4297 -1297 -4909 3308 -1205 -4413
601 -4413 5680 -413 -1781 9384 -1981 -11512 114 1333 -381 8763 5751 -8641 -6353 2014
615 2014 -5400 -749 12760 899 -3625 4351 -8909 -9634 6864 5011 3462 7520 -2054 -9661
629 -9661 -4757 -29 1836 7067 7942 -1546 -5406 -4490 -7050 1575 7961 2729 4414 -419 -10371 -3392
645 -3392 -430 -1229 8821 7074 -3510 -3621 -3502 -6143 345 9043 3482 -1524 2989 -4844 -8505
660 -8505 4720 2913 -1342 8076 712 -7832 -443 -473 -2745 4144 4423 -1718 -2239 203 -3277 -1684
676 -1684 4654 332 -1625 2588 -2830 -2104 3967 -998 -502 2442 -2770 -313 2640 -782 999 1940
692 1940 -1680 -2645 357 386 -544 4274 2208 -5212 -885 -662 -4496 4632 5434 -2252 813 -1192 -6860
709 -6860 -779 3798 1940 2864 2630 -3041 -5837 -555 338 540 7247 3238 -3672 -1669 -4511 -4106
725 -4106 5160 4962 2128 1341 -3705 -5183 -1754 611 2253 3514 3285 -1529 -4310 -3214 -3622 1878
741 1878 7325 1602 -355 -1191 -6121 -1127 3360 618 2687 2680 -1651 -2665 -1601 -1773 6 4416
757 4416 3602 -2325 -1573 -1595 -3783 2400 3409 -1724 964 352 -3131 102 443 -879 1208 1343 -271
774 -271 -1246 -133 343 -516 1750 257 -2100 1158 57 -543 2674 -523 -1806 208 -1714 82
790 82 2762 692 -188 -984 -2128 -1513 284 2091 788 873 1148 -3043 -2737 274 -709 3195 4732 -1268
808 -1268 -2205 -2135 -2754 1402 3426 2459 561 -624 -1759 -3559 -1288 2092 1792 3605 1752 -4253 -3291
825 -3291 -1631 -579 3956 3271 -77 -1038 -2724 -2427 -289 1256 2835 2133 620 -1570 -3661 -983
841 -983 677 1803 3841 415 -1969 -954 -2713 -686 2566 1189 1084 582 -1844 -1939 -647 788
857 788 1129 929 1257 -1613 -1726 572 -955 679 2359 -826 -643 264 -1138 764 984 223 44 -497
875 -497 4 -11 142 1243 -290 -280 -166 -1728 252 1307 70 1232 -647 -2357 -330 -431 665
892 665 2115 687 -455 -1137 -1691 -921 230 2375 1599 -214 -68 -2469 -2369 1512 1117 1249 2375
909 2375 -1193 -2336 -1322 -1177 852 2274 1979 122 -1888 -1949 -1694 -329 2689 1528 543 179 -2662
926 -2662 -1815 161 334 2365 1921 -509 -916 -1782 -1220 582 1419 1663 705 -317 -1192 -1865 220 1346
944 1346 475 1757 -47 -2150 -206 -560 -687 1396 735 -196 -4 -735 -783 -376 1103 942 -283 378
962 378 -479 -907 1281 232 -639 492 -527 -191 898 -176 143 377 -412 -187 -513 -254 497 809
980 809 672 -691 -1205 -357 -528 1178 1506 -655 95 -217 -1802 74 592 531 1252 644 -1209 -1429 -698
999 -698 283 823 1764 1010 -1477 -895 -994 -1208 1498 1597 437 469 -1154 -1862 -494 -4 1271 1496 529
1018 529 -261 -1309 -1205 -348 567 2133 877 -438 -396 -1747 -813 1237 502 778 832 -1056 -657 -549
1036 -549 -597 437 1049 837 -492 -831 -789 -747 576 1299 -290 157 18 -1165 90 448 -348 642 360
1055 360 -386 -57 -360 73 404 438 252 -790 70 230 -50 943 -75 -706 225 -596 -373 1132 140
1074 140 27 299 -834 -611 -75 362 664 438 327 -963 -1072 271 -51 725 1436 -247 -387 -373 -1095
1093 -1095 112 1040 530 615 -226 -864 -973 -449 650 772 805 473 -1209 -924 -438 -538 1146 1215 -292
1112 -292 75 -946 -1280 159 592 666 917 76 -786 -992 -361 309 507 1132 231 -832 -322 -803 -538
1131 -538 1036 342 201 362 -791 -494 -6 36 387 381 274 -373 -584 -51 -81 221 709 -146 -239 295 -564
1152 -564 284 470 -297 146 14 -516 262 115 -105 38 -246 -262 -348 74 351 -101 323 -79 -709 111 -46
1173 -46 -59 763 343 -260 -244 -568 -211 471 742 507 -179 -273 -516 -548 350 482 123 515 -388 -771 -338 -608
1195 -608 507 895 262 -80 -578 -700 -184 290 669 490 -98 -112 -817 -436 101 105 807 621 -449 -298
1215 -298 -406 -546 622 525 315 92 -421 -567 -259 141 602 277 176 -115 -727 -181 -82 -73 722 214 -189
1236 -189 132 -562 -63 196 87 247 -146 -192 58 -319 437 171 -118 305 -417 -429 184 -168 208 276 -293
1257 -293 -226 -240 -171 393 366 16 22 -318 -45 32 190 458 59 -71 -45 -363 100 264 239 619 164 -332 -231
1280 -231 -314 172 499 343 155 -424 -563 -53 -127 195 339 -26 70 -491 -559 94 87 365 530 -161 -244 -291 -374
1303 -374 166 244 433 314 -226 -201 -256 -173 477 285 340 168 -416 -254 -75 -9 147 358 50 24 -404 -221
1325 -221 -32 20 487 164 -24 -41 -267 -13 251 -66 375 -72 -322 6 -86 42 324 13 61 -185 -305
1346 -305 -11 -106 88 -3 -155 122 -247 -199 278 19 -10 -7 -304 -99 137 -137 286 113 -70 -69 -203 100 208
1369 208 213 180 -79 -244 -12 -279 82 306 -21 41 -196 -479 0 -16 318 296 20 -42 -361 -375 53 127 266
1392 266 168 -171 -67 -249 -158 165 209 165 140 -267 -335 -8 -196 393 68 289 -6 -390 -187 -83 -34 187
1414 187 119 119 113 -402 119 48 -17 282 86 -235 -97 -248 -73 41 -18 -117 -53 -129 40 184 28 60 27 9 -30
1439 -30 -58 159 -82 -86 78 -215 -37 -147 -17 237 -4 -101 -82 -128 -106 14 109 189 -9 -76 76 -149 32 44
1463 44 44 246 -54 -112 -29 89 85 105 99 89 -31 -217 -64 -55 156 255 -143 -121 -219 -92 72 144 259 47 -58 -267
1489 -267 -163 -41 178 158 10 188 -299 35 -9 121 315 189 -123 -2 -198 -59 -45 193 135 -11 -90 -15
1511 -15 -158 10 25 -9 218 -34 -68 8 -177 282 228 38 187 55 -141 64 44 106 80 -77 -153 -69 -47 -10
1535 -10 39 -3 -8 -143 -24 16 -9 -38 100 -114 63 -151 110 142 95 161 -100 -119 -2 35 54 123 21 101 -127
1560 -127 -279 68 145 163 128 7 -113 -75 -37 73 142 -48 39 -129 -60 -141 -180 142 5 89 -29 -35 124 -261
1584 -261 130 124 44 44 32 -176 98 -206 2 294 18 46 32 -147 -104 -143 182 174 -45 -82 -163 -167 114 109 152 -14
1610 -14 51 -20 -68 77 210 211 -25 78 -187 -7 19 -37 71 82 -217 -28 -194 10 41 -18 -123 187 -151 93
1634 93 -50 26 243 -51 46 22 137 111 24 88 170 62 -22 154 64 281 234 -80 19 -145 -181 72 -23 196 133
1659 133 -12 -166 -127 -49 64 -54 122 65 -38 44 -214 -139 183 14 125 -144 -161 -243 -69 173 110 167 -15
1682 -15 -108 8 -38 95 222 169 -124 -135 -7 -64 -46 35 206 11 57 -235 -8 56 13 164 188 -84 -108 17
1706 17 -47 -102 278 -69 -72 -66 -228 4 133 127 96 97 -111 -74 -86 40 154 -144 -34 11 -74 -114 16 113 -32 -46
1732 -46 73 -15 -42 -94 78 -125 -31 -41 -141 -23 44 129 225 143 10 -68 -12 -5 23 -30 28 -222 -79 -10 -29 97
1758 97 187 -30 0 -189 -19 38 216 182 -12 70 29 -193 -17 20 234 312 -192 77 -169 -126 100 46 80 149
1782 149 6 -104 63 -153 35 181 248 -9 -202 55 -123 -27 107 -118 51 -42 -59 -75 60 -10 132 -75
1804 -75 73 -83 -128 -66 -33 19 71 -59 10 -103 -91 -94 112 30 -21 76 -149 217 15 -55 35 -39 35 -153 -123 216
1830 216 15 -27 -34 -193 38 -29 -85 217 155 -196 27 -103 -97 53 131 202 -124 57 72 -25 -7 101 -107 -31 -54
1855 -54 -144 38 61 79 111 -16 67 -124 -167 30 276 173 71 55 -102 -55 -88 180 25 56 95 -211 -170 -121 -170
1880 -170 -59 122 -83 41 -270 -111 -156 -43 140 121 18 -17 -296 8 32 25 -27 -20 -89 78 46 18 280 204
1904 204 31 170 -4 -13 -118 -133 162 -125 47 -139 -66 43 -54 153 140 -126 -102 42 -165 126 -16 -130
1926 -130 39 -230 -131 58 42 65 101 -60 -28 -71 83 248 -153 231 57 -202 -2 115 7 -52 32 -117 -116
1949 -116 -90 62 -21 -16 44 -131 -172 21 -172 36 87 22 168 -79 -144 -119 -200 77 150 26 126 -204 9 -93
1973 -93 17 136 60 -215 57 -151 -139 70 -107 338 161 77 -68 -53 170 -66 80 152 29 -107 15 47
1995 47 -32 211 -35 -148 53 -140 62 -16 -34 21 -82 -22 -1 63 60 -125 -17 -51 -142 -64 -39 -78 95 -26 -149
2020 -149 60 -123 -35 67 79 45 74 16 -59 -16 35 -45 -68 -5 -66 -229 17 -14 -72 52 67 -51 -13 -200 -87
2045 -87 -18 141 18 50 -50 -142 -193 -20 74 148 185 -59 -70 -119 -184 204 218 98 215 -133 3 -144 -22 133
2069 133 88 120 -36 -313 -73 -71 100 244 151 -247 105 -169 -180 67 29 -20 58 -103 44 -15 47 57 38 115 86
2094 86 -177 19 -32 -57 242 -78 -37 19 -194 -35 -166 -45 168 -113 -33 -12 62 193 -31 -58 91 -150 -48
2117 -48 -106 -71 158 44 -224 -83 148 -1 165 60 19 -70 -113 -47 -16 -49 78 0 148 -50 -306 173 -105
2140 -105 212 145 -161 15 -29 -62 127 134 46 29 -121 25 -55 -30 235 267 133 157 -68 -37 39 -113 136 49 -22
2165 -22 -83 -97 -69 96 28 78 -4 -7 156 -117 0 198 -130 170 112 -168 -24 -73 -255 203 -41 -60 26 -58 -60
2190 -60 55 -39 13 96 -46 23 -284 167 -5 88 36 67 -187 54 -21 101 254 -135 -13 -88 -13 16 172 138
2214 138 -170 -158 -24 -164 93 197 -42 76 -43 -65 12 71 -2 181 101 -74 53 -195 -107 45 146 178 -141
2237 -141 17 -68 -206 216 186 159 -18 -35 -123 61 82 3 134 35 -11 -145 -101 -36 -71 190 -10 -90 91 -79
2261 -79 -60 67 -97 164 77 -184 26 -119 -139 2 124 151 -87 39 0 -95 174 140 -70 -40 -98 -216 13
2284 13 84 -41 105 73 -30 170 -64 -102 197 -164 63 -185 75 76 22 94 20 -149 127 -188 -123 74 73 41
2308 41 -36 -177 36 84 104 184 108 49 -68 -139 130 -89 63 176 -13 -44 -168 -251 -111 40 -155 51 31 -126
2332 -126 -32 -173 -58 157 -48 188 -10 -48 -64 -48 138 232 79 107 -102 -233 4 -6 42 99 27 -121 -58 -49
2356 -49 28 -84 132 113 -25 113 -120 11 190 -68 45 128 -275 75 110 15 136 150 -40 117 -113 2
2378 2 34 71 138 23 -159 95 -48 148 68 -326 24 76 -156 -25 12 -26 120 -169 -43 157 101 90 89 65 194
2403 194 -365 82 48 -17 150 -96 -83 115 -154 -126 96 73 63 120 -42 -62 -106 -89 151 -52 38 -215 -195 121
2427 121 -142 17 295 -80 -77 -34 -160 -3 -4 145 84 46 35 -147 -170 208 53 40 108 -159 5 -36 -214 24
2451 24 214 82 72 -165 -117 93 -62 220 137 98 -19 -143 192 -4 -107 105 -2 -11 197 -161 43 209
2473 209 -36 -23 25 -51 65 60 128 2 -51 -117 -151 -92 172 2 110 -41 -119 5 71 -107 180 -32 -17 128
2497 128 -148 72 5 -108 78 -101 26 -7 -253 73 159 -44 182 130 -40 4 36 -44 108 -100 132 55 -114
2520 -114 -200 -127 148 182 -60 140 -23 -180 151 12 -25 156 93 10 -64 -115 20 64 130 -17 -16 -97 -31 -161 20
2545 20 11 92 -4 -124 61 -3 26 101 22 -191 193 -7 -143 -68 -60 -30 -56 -1 -120 -129 39 -26 48 122 239 -90 242
2572 242 -128 -30 125 93 -71 -55 -275 13 127 23 63 -13 -137 -14 43 296 24 36 -34 -164 41 88 -61
2595 -61 60 71 -34 24 26 -103 -137 15 -12 -59 65 43 -152 -37 40 -18 32 -66 -198 105 33 55 1 253 34
2620 34 -222 -132 -44 -96 -118 141 -87 24 -219 -79 10 -139 -141 137 -196 -28 185 -70 108 -18 136 20 -76
2643 -76 218 61 -93 137 -51 -130 194 -145 -48 43 -174 156 51 -32 25 -80 118 144 -47 -38 86 -35 5
2666 5 -5 31 82 -25 106 -20 -85 61 20 -90 213 -18 -160 56 128 58 37 -66 -56 -57 -62 26 -132 78 24 -14
2692 -14 59 -126 23 145 -85 97 104 -287 51 92 19 165 110 68 6 83 80 -119 -104 83 -223 128 -10 -279
2716 -279 102 -59 -48 20 -210 -73 33 -72 0 -10 69 146 -136 -50 -119 -90 95 40 19 169 -25 -2 89 10 -25
2741 -25 10 119 -156 -87 -36 -94 -87 149 -48 23 134 -114 64 160 -222 93 -98 -113 -25 -7 91 6 -40 27 -1 -111
2767 -111 81 -85 18 -47 -78 -135 -48 -54 159 102 -68 43 60 -58 -90 -66 182 140 -86 21 -201 -13 104 -82
2791 -82 122 17 -37 162 80 -38 371 148 -64 -101 19 -3 -32 158 45 152 -47 -245 -112 -20 2 -59 126
2814 126 -76 15 6 -134 -34 -23 128 68 -104 -94 -166 121 9 -17 -13 11 -61 34 118 -212 157 3 -89 148 -216
2839 -216 -175 85 -49 61 78 66 -19 -83 -1 43 -3 166 28 -118 121 -73 -19 127 -6 -39 222 -207 -31
2862 -31 48 14 -53 -122 -100 -18 -68 51 -31 54 79 -68 -19 -53 -8 112 -5 -13 18 -32 -79 -40 -14 26 0 51 -76 12
2890 12 56 148 1 189 48 -137 89 103 -52 -7 44 24 19 17 -188 172 30 -18 -110 -105 -43 -99 153 10 -14 109
2916 109 -21 -157 99 189 -6 210 -73 -113 98 -119 -43 39 137 -179 -42 206 -47 -66 102 -180 161 121
2938 121 -123 10 44 -123 101 54 87 78 136 112 -76 20 35 16 172 20 -30 14 136 -149 159 10 -4 210
2962 210 -61 -16 -23 97 1 -173 -38 23 20 57 37 48 -43 -28 16 252 -88 -4 200 -2 58 115 121 96 168 -50 -6
2989 -6 -81 74 -102 212 326 5 119 -34 -68 58 106 55 58 -21 -80 -65 -35 150 139 60 81 -203 44 -110 -51
3014 -51 176 180 43 0 -104 -49 -43 -60 -31 77 54 -44 -86 122 173 69 66 143 -236 47 -86 10 169 -12 8 118
3040 118 -25 -76 117 8 109 61 -44 -41 -108 -26 40 69 -45 108 -130 -89 53 6 49 -7 91 -41 -182 -95 -63
3065 -63 -225 114 -28 23 42 -67 69 31 3 86 -112 -107 -143 -125 3 104 16 -98 -60 -64 115 27 26 -4 -34 -14 -48
3092 -48 111 24 -54 40 35 -212 -46 -115 -122 132 -92 52 88 67 -111 -77 80 -116 44 -64 -66 -34 75 -35 243
3117 243 109 -21 36 64 -65 170 140 -39 83 23 -119 -58 180 4 -39 58 82 -218 94 15 -9 95 2 21
3141 21 9 -82 -67 174 -105 11 65 -16 81 100 25 -107 -76 55 -115 -26 54 78 46 182 61 5 63 1 38 112
3167 112 -29 61 -41 25 52 -63 54 -86 17 -54 -47 -40 -16 -27 4 58 -171 95 -26 -29 26 -27 -137 -173 -40 -73
3193 -73 -179 86 -25 226 98 -120 -74 -35 -117 7 11 -178 -123 102 -88 -14 97 -71 -152 -92 -73 43 32 32 123
3218 123 -64 132 -142 -28 37 -81 17 81 52 84 -138 -21 -234 -66 -62 56 69 62 86 -115 107 -120 1 -34
3242 -34 -155 35 52 24 121 -90 119 -74 -55 -46 -142 -8 -133 107 56 -85 -108 134 -70 -59 49 -10 -85 -12 13
3267 13 -18 -199 14 168 -109 -64 55 -51 63 2 -123 103 -95 -68 55 -38 31 38 -8 0 159 -33 86 -20
3291 -20 68 174 92 -28 -211 18 44 -23 -20 150 9 -108 110 -143 34 -2 -178 -1 -75 -36 -50 164 110 -41
3315 -41 11 -213 -49 -180 -194 63 169 -225 128 26 -128 91 -9 -123 31 7 39 -44 -61 128 34 -139 188
3338 188 -85 52 51 -100 -65 -172 17 69 -49 -176 46 -48 -24 83 57 -74 27 -119 24 -37 -30 95 -91
3361 -91 78 85 38 5 -53 -17 116 -40 94 17 -84 -63 67 128 29 -12 -24 27 -126 -85 -9 -57 48 -48 26 -172
3387 -172 -163 -65 87 -121 214 -81 -21 -83 -89 54 -38 -30 19 -85 -174 -17 -10 -7 133 -166 -52 38 -78 -33 -142 70
3413 70 104 -105 101 -12 -169 96 3 140 40 72 231 5 -105 287 -8 -40 160 -20 3 7 4 40 86 36
3437 36 95 39 114 -64 53 47 -114 17 -29 -73 98 -62 -3 49 -88 -46 -122 -19 -39 67 -109 87 -9 -18 61 -67
3463 -67 42 10 -52 -71 71 -23 67 -81 47 -16 -1 -40 10 -67 -20 -21 -22 -74 -88 118 -9 58 107 -61 60 86 -200
3490 -200 -71 -20 -45 39 -54 -59 15 -87 96 28 7 -76 38 55 25 97 -85 -17 -38 8 36 79 95 55 19 47 -199
3517 -199 -45 -8 107 8 -130 -45 159 57 -85 -3 7 36 40 148 13 -44 25 -22 -38 -159 79 -143 -146 111 19
3542 19 51 31 -95 -73 10 -25 -118 125 249 -81 -13 34 -95 82 178 -213 -19 -35 44 -41 70 -11 -100 -39 -46 16
3568 16 -95 11 -19 -46 2 -136 -46 58 45 30 -19 3 11 75 -185 57 -22 59 57 53 45 -33 121 30 -133 34 -98
3595 -98 -79 -54 -19 132 -27 87 -109 163 -90 70 -36 100 125 71 64 87 43 -121 -72 -80 -113 -179 -75 37 -92
3620 -92 31 -71 126 30 78 -91 120 88 -73 -100 -91 122 57 -226 24 37 -32 -37 70 -25 24 -47 -147 12 60
3645 60 120 -8 88 -43 107 -2 -106 67 48 -13 -166 104 57 19 133 -35 90 107 -38 -14 96 -55 -40
3668 -40 -15 -46 -68 1 -8 -32 15 -45 -57 19 52 148 -18 -69 -4 186 44 -103 -56 -12 90 132 26 40 146 109 0
3695 0 -19 -71 -196 51 -196 -40 50 216 69 -53 20 119 302 180 -80 -28 41 -29 -79 22 -45 -126 135 14
3719 14 -58 -129 -5 -24 97 87 -69 -34 89 -73 -58 179 -68 9 -9 64 21 158 24 5 70 -229 14 37 8
3744 8 -58 77 6 148 14 -12 38 12 57 -68 50 -45 27 81 84 139 -106 -158 -5 -10 184 -29 -50 -20 -146 -147 47
3771 47 22 55 -3 -81 147 -117 -39 40 6 32 75 -101 64 -57 90 -8 -44 145 -53 113 92 -82 31 -58 149
3796 149 132 20 -10 92 -46 -15 89 13 10 -100 -66 -96 -33 12 97 -149 -72 67 -9 -97 -6 -65 -54 -96 32 77
3822 77 -55 136 52 -135 217 2 -165 30 196 16 45 60 15 48 22 40 -31 82 -37 192 -26 38 -119
3845 -119 -153 -97 139 34 84 -110 -54 117 -65 -105 -42 -28 -174 35 16 -71 61 18 35 -131 21 34 -154 -74
3869 -74 -71 97 100 16 105 174 3 67 80 -180 84 -174 4 122 180 -30 30 3 -129 117 -19 56 127 -140 48
3894 48 -88 1 -51 -44 -92 -59 113 69 -23 69 -121 -13 84 -38 -68 -128 -109 -174 34 -70 -2 214 151 -36 -32 -29 131
3921 131 -84 -10 22 -17 -96 73 -18 85 -40 58 54 -71 -21 -20 94 -97 -45 85 -72 64 39 -9 -204 -93 -93
3946 -93 70 54 -137 65 135 -41 -147 -82 -103 131 120 -18 -32 -6 -7 -98 -72 109 -4 64 112 44 -119 -98 -11 -27
3972 -27 17 -147 26 9 61 52 -171 24 57 28 -144 2 -44 -89 124 36 -56 -40 70 -43 -92 7 84 115 -12 -231
3998 -231 -58 7 49 35 -175 -53 -67 -19 -61 -43 -90 -118 23 -43 -37 40 138 61 -213 39 -9 -41 72 -14 -56 -3 -93
4025 -93 78 -51 -39 -71 -99 0 107 88 -42 -3 -60 103 182 260 88 -115 -30 24 -7 -6 52 6 37 -109 -59 71
4051 71 51 40 194 124 -58 24 -12 -76 40 55 -59 -33 -45 153 -13 -210 -211 38 -15 76 -122 -48 -10 58 -47 -103
4077 -103 16 -37 -11 -10 55 -65 82 -151 -33 -145 -52 -127 -50 48 119 91 12 23 -16 -35 -83 29 -48 -7 -36 -60 -20
4104 -20 -59 38 153 118 -25 -49 -79 113 -41 10 34 -24 166 53 94 -122 -12 -91 -68 12 27 45 -12 -114 -46 -100
4130 -100 -114 104 -110 87 -21 56 -97 46 1 -173 30 168 -141 -45 153 65 -98 -157 -111 -118 120 -20 30
4153 30 3 91 35 130 -138 -22 -79 -21 -38 -118 -59 142 -12 -83 45 65 173 -24 -64 13 -16 47 45 0 61 -27 -42
4180 -42 -117 7 113 -82 -134 44 -33 -99 13 149 -80 -8 28 -86 -152 75 -10 -16 -89 -39 -65 -84 -39 147 17
4205 17 -111 171 -103 46 89 71 109 9 55 -33 92 -88 -40 -145 167 -83 158 217 -29 -68 4 -68 44 -49
4229 -49 -36 97 -108 -72 -246 39 -51 -174 -37 -94 -75 138 -55 83 50 -84 18 119 0 -46 40 -37 176
4252 176 175 90 14 -88 5 48 -5 -8 -166 41 34 20 87 38 71 -3 -54 -14 -10 182 -63 18 12 85 71 68 97 43 -136 31
4282 31 -40 50 -201 165 75 99 -11 -49 -3 -131 -206 60 -28 -25 32 -47 -14 140 -126 -45 170 -53 -75 88 -45
4307 -45 -46 129 60 67 -107 56 0 -114 2 -53 10 -68 24 147 45 34 28 -198 -20 -27 80 -109 20 -203 100
4332 100 -44 75 -30 104 96 -18 10 -38 15 -47 -69 57 83 -85 53 -36 -12 -81 70 -68 -22 28 50 15 -11
4357 -11 -22 30 -84 19 -63 -14 45 -16 18 -27 -17 -36 -172 -8 206 -55 -112 -51 -74 8 33 98 176 -17 170 -120
4383 -120 16 -83 15 32 -29 97 60 118 -61 -116 -156 5 -2 -2 -148 -17 31 -160 74 -88 -136 18 0 -13 157
4408 157 -168 80 13 55 -100 -14 -6 -97 147 28 -113 -2 26 -143 26 31 22 -69 -15 12 -26 -21 72 -9 -33 20 -16
4435 -16 -38 -32 -94 -4 27 80 -73 -109 13 -10 87 63 -18 1 64 -68 22 -62 -67 -52 -34 -33 61 -15 69 12 -87 -56 120 -118
4465 -118 21 -73 42 -1 9 -29 13 146 -23 -215 -17 -41 52 30 14 -45 1 -53 118 -100 150 162 -61 75
4489 75 -104 63 -109 23 -103 -55 -8 -92 12 123 26 -61 19 -26 75 65 -127 208 89 36 24 -102 28 -132
4513 -132 -58 -43 79 31 38 -91 127 -190 106 100 132 -37 -17 25 -44 -19 -157 153 67 -25 4 -174 -68 -75 179 121
4539 121 -94 -32 82 40 87 142 62 62 23 -154 77 62 -43 -59 -36 37 0 250 -23 -151 137 -79 10 -82 12
4564 12 -178 -18 -87 -174 -193 -44 -28 0 59 41 19 65 -111 -151 -77 -141 136 -115 -98 159 128 -14 -134 55 17
4589 17 -35 -147 -97 35 -74 104 84 65 201 -16 34 -16 69 99 29 10 45 13 -65 95 -29 -40 -176 -107 157
4614 157 49 -28 11 -36 157 -33 -231 -87 -66 -68 14 207 39 -121 3 8 14 3 49 84 135 74 8 76 91 38 -56
4641 -56 -1 -103 22 -95 -16 -174 -45 11 91 17 -268 -78 16 -42 87 44 -135 -43 -87 -89 27 -37 -43 74 -175
4666 -175 -94 62 -81 15 10 -77 48 49 6 55 36 40 164 20 71 199 -37 -22 -29 25 -13 -6 24 105 -17 -157 -42
4693 -42 -8 -123 -6 17 -143 56 21 -34 -113 -14 80 -24 101 39 -28 -156 -26 12 -58 3 -36 -5 37 24 -11 -36
4719 -36 -132 47 -77 40 -46 156 11 -84 128 -85 -71 -50 10 -74 -6 -25 -49 123 -104 58 -32 73 -11 112
4743 112 98 -75 -56 104 -93 31 -37 253 -73 -18 115 85 -59 -107 -40 69 9 56 122 238 -8 -122 -139 6
4767 6 3 -164 -66 -62 42 158 -23 16 20 -115 -68 -98 45 -63 -168 -136 179 24 -46 -72 31 0 -224 -3 -18 -185
4793 -185 68 41 22 59 -60 -74 28 100 -187 178 -18 1 -46 11 80 -8 -94 47 88 76 -12 18 -31 137 -1
4818 -1 36 -1 -52 -126 -10 63 -15 0 -2 -13 -49 142 118 18 150 -151 -4 96 -149 78 -130 -289 -1 47 -1
4843 -1 -110 -4 91 81 58 103 16 -132 -11 46 90 -78 42 -145 -3 52 -44 -93 122 0 -80 38 -156 -75 -1
4868 -1 -158 -150 -2 -44 -3 -87 34 -43 141 15 87 92 -86 37 117 -30 -16 134 23 -69 -38 -104 -10 -55 136 81
4894 81 91 -144 -195 35 94 75 -148 -40 162 49 50 -49 -98 95 -99 -7 -175 -100 4 132 -40 -84 -167 -114 17
4919 17 32 -42 -129 -31 57 132 -45 181 93 -247 -59 -134 -148 22 3 -116 -139 -15 -38 25 0 -3 59 8 120 55 -12
4946 -12 -132 -13 24 75 -2 73 34 12 11 128 -112 78 145 78 131 16 -53 117 -46 143 -36 41 41 157 -120
4971 -120 46 29 93 -1 -81 -104 76 121 -82 -53 -93 81 -71 -9 10 15 13 -103 -3 -24 -42 54 -152 59 -37 -13
4997 -13 102 28 -142 -7 -63 -16 26 26 -66 -115 -172 -13 -79 69 41 -27 -36 54 19 -77 3 122 -124 -67 57 -25 26
5024 26 132 -91 -39 0 44 49 -34 5 103 165 -86 -85 63 146 -63 -168 -97 88 -41 26 160 24 -168 -64 -6
5049 -6 -11 -126 -75 35 -96 73 59 105 -28 41 102 -66 -80 86 65 -49 -136 -74 144 -41 -63 -69 178 -5 -167
5074 -167 -68 -64 -37 89 -91 -47 -88 -32 -68 74 -7 -72 109 29 36 -18 -27 49 25 -30 11 -133 -97 15 37 -2 -97 -153
5102 -153 -40 -44 16 -103 31 10 -81 -62 62 -29 38 74 -42 -29 46 10 32 6 123 -25 -36 29 -42 -121 -112 -212 15
5129 15 10 41 83 -4 210 -3 49 56 102 37 51 52 45 48 8 -7 -113 43 74 -66 -4 -30 17 -19 157 -62 -26 102 79
5158 79 -18 -60 -11 -71 120 -32 -44 89 -29 2 -127 -103 61 51 65 -74 75 8 32 -11 -87 82 78 114 228 159
5184 159 -21 46 -55 -28 42 -71 -36 -63 -131 144 -4 -9 15 149 69 -203 -19 -12 -102 -8 67 -81 -158 -31 -46 72
5210 72 -133 53 32 7 -16 -70 37 -36 -21 68 54 25 18 41 111 -40 -4 -13 87 14 -92 49 89 -34 145 117 -140
5237 -140 -9 61 118 -78 -141 164 63 -69 84 68 -14 74 -47 34 25 -49 -50 -78 32 -52 11 -57 110 76 140 -28
5263 -28 40 91 50 -99 79 30 99 122 2 -60 -61 48 73 -60 -101 125 -71 -100 86 -42 109 146 -56 -157 119
5288 119 -76 -124 125 -124 -58 -193 -11 -67 -73 -54 -26 9 50 79 4 39 -88 44 16 -38 118 -5 4 -143 126
5313 126 41 238 -138 104 73 42 12 88 49 -110 16 -38 18 33 -230 -61 -67 -32 85 135 -137 32 -79 -44 -49
5338 -49 -158 -128 -5 -76 -62 -140 -45 -40 -24 21 -13 -39 -85 125 -63 103 -25 83 -31 -70 -64 -8 -42 37 43 66 25 120
5366 120 103 159 -138 117 77 -44 -34 -60 69 -133 -263 25 -48 6 6 -9 -92 98 305 -18 -16 -101 136 16 54
5391 54 -41 118 108 74 118 -69 -45 162 94 108 62 141 3 125 -71 -18 24 -173 -24 31 39 -67 -29 -9 35 -140
5417 -140 -24 -47 -31 135 95 0 -77 -5 48 -142 -124 -21 -96 3 -17 14 -72 14 -11 48 102 -16 43 -12 146 106 -61
5444 -61 24 55 19 121 -30 -47 -32 -27 -95 -16 -77 29 34 -46 -7 34 1 -63 81 -41 -13 -111 -3 18 -35 61 39 7
5472 7 -41 49 28 136 11 165 73 74 -38 -50 -147 22 -118 34 49 10 -55 -93 13 -30 43 -2 -69 53 84 95 56
5499 56 -142 103 38 22 -74 47 94 61 -66 61 82 2 -54 70 133 -39 -64 24 -37 -85 67 73 118 15 70 10
5525 10 74 102 34 -33 91 -6 95 31 -14 -61 136 -122 240 7 -68 2 -98 -180 -58 134 45 -54 -3 76 105 74
5551 74 -31 7 -59 85 -110 74 -7 -17 -36 -40 35 89 48 158 187 30 -5 -14 2 -18 105 -18 -26 -11 194 -26 -19
5578 -19 -80 -31 9 136 -58 61 47 84 -212 -97 -77 -13 -153 111 84 145 165 -187 -25 -105 24 -43 75 -13 -74
5603 -74 35 -72 110 58 11 3 -17 -57 -15 -34 86 -127 -30 17 80 -16 -11 62 -108 -70 -92 10 -77 63 -2 -65 124
5630 124 -73 -47 -53 142 44 -86 -46 127 66 -49 -13 -35 -65 -55 167 -40 -70 6 64 -37 112 18 155 46 -133
5655 -133 -3 55 145 114 38 118 -13 -15 38 29 -11 -2 -54 -142 -77 34 126 80 -171 59 123 -73 62 18 27 20 105 -74
5683 -74 -71 12 -67 -30 24 129 52 -73 5 65 -90 101 -114 9 -36 -39 -235 57 -19 -45 -8 0 13 -38 -4 -113 -173
5710 -173 -72 7 39 -24 79 -8 -202 118 -76 -51 -80 -97 60 -38 125 1 -106 55 53 -102 -65 45 130 79
5734 79 -46 5 -104 -79 -283 72 -3 35 -109 -63 14 -103 68 129 146 -115 13 49 -16 -10 -42 15 -83 28 -120
5759 -120 38 -27 -14 233 -108 25 -8 -82 191 -21 5 -155 10 126 -91 -92 114 115 -90 -4 298 41 48 -50
5783 -50 -149 12 -1 -34 -53 -122 -111 21 -87 45 54 -53 16 94 -86 13 -47 132 1 202 70 25 116 -56 -3
5808 -3 34 84 -24 -113 127 -49 -75 115 47 -44 -77 68 58 97 -83 32 114 -32 -32 -31 -16 -21 19 -74 -176 27 7
5835 7 33 -12 6 -39 254 -54 67 -101 109 -20 -53 147 -139 63 -61 -33 -76 152 3 -119 -171 -321 -58
5858 -58 -44 -190 59 -35 87 70 24 -65 -105 -75 -175 151 -38 -31 -89 -156 -145 -125 96 -20 87 -74 -61 -9 5 -147
5884 -147 -34 -19 -248 103 -15 65 39 -72 72 -105 -21 63 35 -12 -37 -20 -94 -45 -19 7 30 0 110 30 48 -68
5910 -68 3 -82 -98 -152 6 -8 -21 98 -68 -28 34 -122 94 5 -7 171 63 67 -125 134 -63 120 -8 83 126
5935 126 -122 -34 51 10 32 25 125 4 -23 -41 76 -150 8 56 50 20 -66 -45 7 -27 98 176 29 72 -48 1
5961 1 29 -118 31 99 23 -47 -31 -21 -76 10 -46 81 141 105 -51 -76 -68 136 137 -51 27 33 26 131 146 -70 82 31
5989 31 -5 -37 55 -181 -135 -51 -6 -56 47 -76 -26 103 -123 -174 54 28 -12 -42 -97 134 81 -42 -16 -73 97 -85
6015 -85 -108 189 27 41 94 156 -120 -4 -16 -53 46 -1 9 81 -18 56 -58 8 72 -78 -82 -62 -22 128 34 10 37
6042 37 -8 -115 -4 -37 -31 -76 56 -32 12 57 -26 -115 -23 -170 174 27 76 -39 87 -49 -20 -106 -54 95 152 130
6068 130 62 93 -41 74 -44 -96 39 16 2 26 -8 -49 -96 69 137 -32 -38 -94 -70 55 21 -89 215 28 52
6093 52 -11 -5 98 -83 125 22 61 -13 58 -167 86 -16 185 36 -10 65 96 -8 -98 -51 -89 -77 32 83 -11
6118 -11 104 -110 22 80 -94 49 -16 6 88 -62 11 -7 31 24 -124 -13 47 41 39 178 1 -145 -84 -67 53 -46
6144 -46 116 81 57 133 -76 62 149 27 112 -15 -167 13 25 24 21 41 -22 88 -75 97 -4 -49 29 -116 15
6169 15 45 108 -2 94 32 28 35 64 86 18 56 -67 71 32 -22 143 -39 40 16 -78 260 13 -73 -4 104 -34 12
6196 12 -55 -23 -16 108 101 -52 -25 -82 -60 230 64 -98 40 -86 -106 123 -103 19 72 -121 46 -4 57 -91 64
6221 64 9 -107 120 64 -71 -32 -17 -91 147 47 -144 -17 148 -170 -97 0 -18 73 -126 9 -69 0 52 35 -59
6246 -59 75 51 2 104 65 7 18 51 -138 117 -46 -70 -93 -3 -70 -2 18 -31 24 84 -18 74 56 -39 -61 81 33
6273 33 -90 86 39 -19 -17 177 107 -42 -55 -1 1 121 66 23 9 10 71 -8 9 -200 -54 -6 -23 -33 4 60 -28 67
6301 67 -76 -105 -94 -21 85 -31 -3 -39 120 226 -128 -85 86 45 98 -66 66 178 -183 -4 114 -98 122
6324 122 71 -74 -192 48 -149 23 43 -106 0 -54 -58 -109 35 33 170 62 -16 8 42 -91 -33 180 106 16 -43
6349 -43 62 128 -45 26 -203 46 -19 122 -54 69 -123 80 -7 60 -15 42 -12 0 -88 90 -13 -15 134 -4
6373 -4 -89 73 72 18 58 -72 4 -18 64 -26 28 -50 -36 106 -105 -101 32 67 -42 -8 156 -55 -10 39 5 17 13 -49
6401 -49 68 189 4 28 -90 86 -44 -235 -69 -2 120 -140 -31 39 83 1 -44 22 35 -18 34 30 -30 -111 -94
6426 -94 -123 143 -45 -9 17 47 180 -18 77 -61 86 -51 -132 100 -63 -46 -170 -136 -38 24 -35 78 -175 31
6450 31 -3 -6 54 -9 -37 35 -23 -75 -137 23 34 20 -28 55 138 -56 -20 -17 -85 -117 -19 26 -128 -31 -66 135 21 -61 -98
6479 -98 28 90 32 0 130 103 -25 191 61 -103 -55 60 150 14 -46 -69 9 -42 19 30 -26 3 -91 9 -43 -46
6505 -46 32 219 11 74 -102 126 14 21 -77 -6 -28 19 33 4 55 62 16 10 10 140 117 -27 67 -77 32 119 81 47
6533 47 131 117 67 -34 7 -24 8 119 -117 55 -217 22 -99 -59 -162 -51 -11 23 -70 -31 69 -39 19 85 -109
6558 -109 62 91 -64 -18 51 128 57 36 -105 -104 -17 -47 -84 -110 25 91 -17 -82 -133 -63 144 69 -154 54 -88 152
6584 152 -25 -83 80 -10 -60 -94 29 -112 94 -57 -48 -63 -37 -11 -133 -162 111 -36 -68 20 -4 32 -78 -45 -43 58
6610 58 125 -46 65 -93 -60 123 -56 -145 -164 80 83 82 104 136 72 -46 -15 169 -115 16 -162 -57 -25 83 121
6635 121 -141 131 -62 -63 -28 -52 -28 6 33 136 -122 -84 111 94 -99 -31 43 -38 152 116 46 2 -21 54 -60 120
6661 120 56 56 -138 -81 -44 49 -77 23 24 56 67 34 62 24 87 -125 -57 -27 203 -66 -5 -113 -26 18 15 11 13 36 117
6690 117 -10 -64 -143 63 -46 -141 -109 30 91 -108 -209 -18 65 82 -39 48 60 127 121 86 -166 36 43 44 -72 -4
6716 -4 35 -31 124 125 86 61 -121 82 85 43 -234 60 34 101 -78 -75 -5 70 0 -21 137 35 -29 -26 -16 -38 -116 89
6744 89 -51 -58 75 -24 -21 35 105 -12 79 -90 -242 105 48 -84 232 194 -97 66 77 18 -4 -179 1 -26 -48
6769 -48 -26 -241 -35 -78 110 21 -19 97 -19 -56 20 -4 63 -5 91 110 22 263 84 117 23 -82 76 -75 16
6794 16 -121 -4 76 -207 -2 63 -26 -15 21 -52 -75 161 -104 -27 -59 -22 135 80 -79 -83 -15 24 68 -13 -15 41 4
6821 4 -9 -91 -11 -48 79 46 -44 59 0 -114 -6 5 -34 -68 -98 -33 -49 82 -43 -73 -117 -23 -52 -74 97 0 -153
6848 -153 94 -97 3 -52 32 84 106 119 86 131 120 -42 -23 36 -70 72 145 -168 -42 -27 -79 48 -29 -105 7
6873 7 74 -100 118 -72 52 32 -140 -53 64 -92 -37 35 -14 -1 16 -15 165 -23 33 9 72 88 -143 -150 -58 -11
6899 -11 40 35 -30 50 70 -15 -72 -40 0 110 -46 -57 64 92 -81 -38 108 108 30 -35 -24 -122 -10 92 -92 -5 -46
6926 -46 61 -101 -131 -156 110 -1 -87 296 -48 39 45 -185 -105 133 -33 110 64 -100 -103 -14 -42 -79 -34 -30 -75 -58
6952 -58 146 82 2 -75 59 121 -113 -48 85 -75 -1 75 -24 -37 60 -34 25 -75 9 38 -29 7 -82 54 -34 -39 -58
6979 -58 26 -103 49 62 -37 85 48 -14 57 -160 0 150 26 16 -70 -49 -88 -40 52 12 -80 -30 62 -69 104 20
7005 20 128 58 -1 -5 -37 -52 -36 -56 -71 -14 -79 -91 -44 -12 5 -79 -67 -121 100 86 -55 45 128 70 30 22 -3 7 -5
7034 -5 -15 117 10 88 -17 -17 108 -83 -82 -63 189 -105 -82 57 -42 1 -55 -45 -2 0 -24 78 -56 -122 17 -23 22
7061 22 17 -85 -73 0 -24 -75 -101 -28 47 14 89 -18 118 -207 -62 184 40 1 -98 80 -107 -24 53 -64 -63 -71 -66
7088 -66 -17 144 33 148 45 12 153 70 -66 -52 86 42 -70 -62 -43 75 67 109 15 3 -134 -63 -20 -115 74 -60
7114 -60 -71 32 -160 25 91 31 149 21 49 -41 -93 31 -19 -1 -31 -188 159 13 -46 57 -3 -35 59 -139 -2
7139 -2 133 130 -61 -41 111 89 -38 3 48 -4 136 22 -25 26 12 -104 -52 78 169 -77 70 172 -28 -18 -16 -120
7165 -120 -18 -75 -111 -32 62 105 -94 -20 -133 169 73 58 -99 -64 -68 -25 -32 58 118 48 66 44 -193 -135 58 -78 138
7192 138 7 -133 -156 100 1 57 3 -91 4 -119 20 78 44 -238 -242 -65 125 -138 10 -66 -37 -45 -71 134 -82
7217 -82 109 3 -69 44 -31 12 -140 38 96 100 -27 53 45 76 12 -99 35 148 -57 33 -1 -94 44 -81 -69
7242 -69 54 81 76 1 -96 21 -61 31 -134 108 -6 82 -107 78 -8 -221 -8 -115 109 3 41 -36 40 18 59
7267 59 62 69 17 -13 -36 3 7 88 60 79 15 95 -52 -31 -118 -65 -54 -7 -158 -27 71 -91 -124 73 95 -26 79 -105
7295 -105 -106 2 43 -52 15 -59 41 9 109 28 -52 -67 9 160 -34 -89 1 125 2 47 -51 77 178 -95 10
7320 10 87 52 104 -72 24 -28 -80 128 -122 -19 122 83 -55 0 -44 -38 0 -54 35 75 84 -48 -149 4 -142 105
7346 105 48 23 -64 -9 8 -170 90 42 -107 -24 56 -13 22 -66 -52 -14 11 -144 62 69 -171 107 86 -3 53 -86
7372 -86 85 24 104 113 26 -172 -65 36 103 -114 63 11 74 2 65 -35 121 -21 -99 105 1 51 -41 144 -96
7397 -96 71 12 -32 96 52 169 -107 -142 38 105 -3 -58 -67 51 85 108 -36 -196 47 -6 -38 46 -134 63 -100
7422 -100 94 -51 79 -22 -164 29 -53 -205 -88 90 -177 -35 -71 -20 116 -127 50 -31 -60 54 -16 9
7444 9 -26 43 -4 -82 -26 -43 26 -46 47 43 51 -25 127 38 -82 -22 -61 38 -21 217 75 -78 33 53 40 100 -127 -137
7472 -137 25 -66 -51 -227 6 -44 -158 15 -95 174 -67 80 -49 -150 51 -57 158 108 42 -126 122 48
7494 48 -75 152 31 135 42 -4 71 -121 85 12 -7 -189 88 -53 88 -65 -86 -20 -46 -65 -70 -81 -30 5 -39
7519 -39 -72 1 5 -44 216 79 9 -119 256 12 -130 2 84 -7 -121 26 51 -88 4 80 173 -106 109 106 195
7544 195 33 -294 171 39 -41 -199 24 -12 45 -28 -66 37 114 49 1 59 84 99 24 34 110 28 80 -32 -79 21
7570 21 -47 28 -93 -130 -95 103 32 26 -42 -109 -141 138 -50 21 -24 -41 -3 -38 -164 -113 79 27 190 89 109 20 -128
7597 -128 -19 76 -141 41 -112 74 -25 -29 -43 58 -20 -7 109 -131 124 13 71 -137 171 -2 -92 -75 -9 71
7621 71 4 68 -38 99 118 -15 85 -70 -149 117 212 -16 -20 -11 42 11 79 -121 -127 46 21 -76 -125 28 -116 -81
7647 -81 143 37 -21 246 79 59 -106 65 116 -22 -132 -12 -188 66 -22 28 -7 -78 96 -19 -187 45 129
7670 129 190 -13 43 -118 50 47 94 65 12 9 -87 -141 -3 0 -19 94 58 23 -134 62 -56 184 -9 18 27 -173
7696 -173 1 -12 97 -114 -128 111 -174 -163 82 97 -93 61 -73 100 22 -70 -86 -81 -16 -87 -59 -73 -129 20 -50
7721 -50 -58 4 -84 -100 75 -64 -7 -19 165 104 -121 58 96 33 -24 48 95 -7 -144 -135 -67 11 218 -4 48 -52
7747 -52 -101 14 92 1 45 21 79 111 44 -59 124 -20 -58 52 -54 128 -160 77 -65 -12 77 202 21 -33
7771 -33 5 -31 -55 36 -143 -76 102 -65 11 -3 34 7 72 -56 64 -94 47 25 -124 -110 -159 -91 -117 -15 224
7796 224 12 -58 74 -85 10 64 -10 -10 43 155 66 65 -25 -42 -78 -156 -2 120 -75 94 83 30 92 -139 101 -214
7822 -214 67 -16 -78 23 -29 29 33 79 15 -161 -60 -82 112 -81 -6 34 193 8 86 17 -103 -47 11 7 -181 112
7848 112 -75 -40 -109 -195 64 -39 22 -108 -55 -206 -9 14 36 37 10 -6 7 100 96 -46 -27 -6 25 -10 -196 -34
7874 -34 -39 142 63 65 -16 46 -1 -123 -104 -84 -64 19 -69 34 -127 77 13 54 117 -90 -116 74 -112 -128 -85 28 -39
7901 -39 0 -113 -15 -90 128 14 56 -45 55 24 -104 -17 -1 -5 -70 -80 43 -26 154 118 26 -45 121 1 29 89
7927 89 82 -46 66 115 -25 -11 -21 -57 77 -108 -210 99 -70 -10 -146 12 28 22 -62 -99 -129 0 68 -181 118
7952 118 190 85 -135 -25 75 266 -79 -69 6 18 174 54 7 64 114 8 -90 -14 -50 -28 -126 127 33 -121
7976 -121 91 -27 -70 25 66 -92 -24 -65 -197 39 -65 -139 33 73 -38 37 -22 70 120 -25 166 15 125 -55
8000 -55 22 56 -104 28 -125 123 -81 72 42 0 -67 34 -36 -32 -41 -82 -2 45 81 200 -3 -7 -104 14 -4 99
8026 99 18 1 -13 75 101 6 -19 28 -33 148 -71 -100 41 -142 -6 21 -38 163 -42 51 -45 -77 137 47 -77 -229
8052 -229 -35 44 3 -53 -66 -162 101 8 4 16 -6 -152 -88 -23 -25 69 -50 106 -5 34 -26 11 -124 -11 -95 -14 -179
8079 -179 -1 91 -26 30 -9 -66 -150 53 -119 69 29 145 -40 18 114 10 -136 -4 6 -10 -89 -91 180 -30
8103 -30 16 -61 90 66 33 100 30 -128 78 35 -7 139 -88 -152 19 55 -14 2 -125 81 74 -140 111 -1 -42
8128 -42 -13 -133 6 140 -63 38 -180 153 101 -157 -33 -131 -104 160 -87 39 -48 243 -57 96 21 85 -113
8151 -113 -73 -8 -71 19 130 3 39 128 -150 62 -68 11 46 62 107 -22 113 -16 19 37 -63 10 81 -11 -2 71
8177 71 -80 -19 13 65 -18 -154 -25 -90 87 21 65 -33 -42 34
8191C4
$$ Imaginary data points
##PAGE= N=2
##DATA TABLE= (X++(I..I)), XYDATA
0 0 0 0 0 0 0 0 8 0 0 0 8 -8 8 -8 16 -16 24 -32 32 -40 48 -58 69 -80 92 -108 125 -142 164 -186 212 -242
32 -242 273 -308 345 -387 433 -483 539 -599 664 -738 817 -899 994 -1097 1211 -1332 1466
49 1466 -1613 1778 -1961 2166 -2390 2647 -2939 3280 -3673 4135 -4693 5382 -6248 7375 -8901
64 -8901 11085 -14449 20185 -31732 63341 -313239 -818387 497029 227413 -569286 355957
75 355957 485979 -603975 -120533 574324 -293521 -451874 471351 189563 -327671 191546
85 191546 144926 -449845 -63741 399656 -4283 -206773 156802 76945 -281131 1960
95 1960 248877 -169945 -114240 334853 -27830 -329655 168186 132135 -307805 108853 334015
106 334015 -290362 -137020 376777 -185452 -297153 425671 43223 -426997 258398 214570
116 214570 -414113 100595 368066 -361729 -178019 442165 -83354 -321507 309047 79025
126 79025 -379741 158457 258591 -316865 -85990 335988 -28522 -217936 121472 45701
136 45701 -243112 74482 307742 -126380 -211472 186570 36899 -241179 96163 197599
146 197599 -187959 -22850 292757 -155472 -308612 223421 108920 -206086 191088 149520
156 149520 -339598 -31276 254660 -161249 -100048 283734 -24415 -209933 152774 9888
166 9888 -264615 129312 226110 -146934 -19043 133732 -157484 -113720 170311 36890 -98064
177 -98064 92393 71506 -158414 -53295 117846 -33176 -55862 130180 30961 -143270 980
188 980 86428 -94213 -43420 175549 260 -159426 85837 52441 -172325 64253 166472
199 166472 -140385 -60434 172717 -58307 -139254 138408 38518 -162377 89955 122497 -166635
210 -166635 -19747 155624 -83304 -76186 122297 -25845 -108229 95434 70939 -109176 -15097
221 -15097 77164 -63039 -40005 104657 3358 -77086 45287 30366 -87254 -15531 85380
232 85380 -83 -37641 67270 -1578 -121503 22786 84379 -55483 12221 101121 -63174
243 -63174 -93064 61113 4571 -74438 84610 86983 -100831 -27102 62275 -88269 -35681
254 -35681 130453 8717 -65350 51703 -6714 -107839 18387 87158 -23900 -3183 71404
265 71404 -47868 -88029 41640 25661 -32941 50637 51955 -55824 -46434 25026 -9818 -30039
277 -30039 59238 45226 -57266 -12448 27951 -52242 -18872 71512 10549 -41011 24881 11086
289 11086 -65437 4380 64843 -30100 -19840 62312 -23562 -56838 44766 15136 -46857 27082
301 27082 39754 -46065 -17217 49480 -16690 -37001 43882 2298 -51284 29372 32055 -37415
313 -37415 -908 28777 -26113 -26671 31750 15376 -25210 18653 22275 -44937 -16343 32752 -6276
326 -6276 -4274 38233 3436 -41692 -8213 16399 -18361 5135 52870 -6304 -38895 11992
338 11992 -11964 -36237 31469 40676 -14836 -5431 11906 -35913 -34214 36451 23763 -13139 27779
351 27779 6649 -54742 -10800 23902 -6015 12591 37583 -5702 -36274 -5654 2156 -16266
363 -16266 21407 40175 -12466 -18914 2976 -20006 -16319 22736 23263 -3820 -3347 4628 -23554
376 -23554 -22861 24299 14200 -9448 17042 3154 -30536 -3362 16939 -6115 -2600 23366 479
389 479 -24113 8435 7978 -21824 11674 21388 -19495 -4709 15713 -9393 -8266 13142 117
402 117 -16568 4387 13129 -10175 96 14506 -12989 -13519 8724 1412 -1007 10951 7681 -9802
416 -9802 -13449 3862 114 -6521 19835 14996 -13683 -5372 -3587 -18139 1793 26988 10837
429 10837 -10495 -1117 -7170 -24092 6353 20862 -5398 8935 16625 -21240 -21875 957 -47
442 -47 9948 25787 6898 -22474 -15582 260 -4325 8591 20907 1147 -4221 -337 -14277 -13747
456 -13747 2722 16696 16490 284 -7040 -13466 -18135 5595 17919 2118 2188 5078 -10617 -14441
470 -14441 1748 4774 -2528 13252 13585 -17588 -9505 7523 -10265 2285 20944 -3344 -8863
483 -8863 5263 -4850 -9259 8234 9317 -6699 -1511 5471 -7302 -1088 8778 -6273 -4410 6356
497 6356 -1251 -982 166 -1753 3617 530 -2549 -2332 -6354 3680 13451 2611 -7928 -6692 -3191
512 -3191 -976 9214 11087 -7564 -3738 8770 -10551 -10177 9688 -452 3568 18276 -6603
525 -6603 -22833 -3531 4854 2299 12548 9596 -12805 -9190 4532 -8329 -3918 14888 5549
538 5549 1794 3278 -13245 -12947 2209 8611 12006 5806 -4479 -7442 -8123 -3900 4515 8202 5067
553 5067 1420 -554 -10733 -10468 6006 3002 1218 13143 -2463 -13715 1075 -3341 -5821 13108
567 13108 9700 -6614 -2736 -107 -8224 301 12004 -2007 -4685 9325 -2726 -8589 5034
580 5034 -2006 -3291 9946 1240 -7471 -1327 83 1062 3024 -708 -4601 -1620 3585 2411 1263
595 1263 -1642 -5572 1908 2508 -4161 4583 3078 -4268 5154 -622 -11765 1820 7638 642 4739
610 4739 2731 -10165 -7781 5321 1214 -805 10462 862 -10294 514 -3778 -8093 9563 8999
624 8999 -1312 1435 -4351 -10590 -1743 5688 5345 4950 3651 -5333 -8589 -1877 -603 4221 10003
639 10003 1250 -2388 -2465 -9787 -2163 6195 1752 6075 4592 -7692 -6968 -1256 -1682 2886 9164 2276
655 2276 -6005 -1263 -2416 -6955 5633 7421 -2552 3346 1057 -9417 -654 4042 -677 3590 4085
670 4085 -3179 -4000 504 -610 -855 4459 1473 -3814 1017 -872 -3046 3801 234 -2687 2028 -1751
686 -1751 -1458 3123 -238 -680 1401 -1774 -2318 1190 2187 415 2180 1500 -5411 -2012 2857 -1666
702 -1666 3310 6013 -4210 -3097 -23 -4841 670 6296 1822 -436 -410 -4098 -5381 1036 4085
717 4085 1222 4116 1460 -6954 -3286 -656 -961 6591 5903 -1534 -2148 -4065 -4188 1352 3621 3219
733 3219 2340 301 -3537 -5153 -1289 813 3288 6641 44 -4874 -2268 -4142 -101 5927 1486
748 1486 7 1199 -2993 -3344 -188 700 1754 3826 2482 -3630 -3431 290 -1110 2549 4394 -2147
764 -2147 -1288 937 -2656 -156 1790 -497 497 998 -1071 -1528 -382 746 -277 599 520 -2072 538
781 538 1432 -1044 1526 -20 -2688 511 343 131 2766 358 -1671 -1098 -1214 -55 1507 2226 728
798 728 -918 -144 -2651 -2700 2067 1338 1710 3169 -3116 -4562 -890 -241 2495 3835 918 -1418 -2141
815 -2141 -1929 -1654 534 3894 2268 890 -136 -4990 -3237 1822 1881 3503 2261 -2599 -2525 -2369 -1139
832 -1139 1728 2430 2223 577 -1817 -2569 -2818 224 2895 1762 2050 -842 -3703 -1048 -390 270 3374
849 3374 1391 -813 -436 -1902 -1237 675 1549 1240 26 21 -1542 -2077 1118 493 157 1826 -1067 -1922
867 -1922 644 -390 278 1464 -359 -482 -395 -116 352 97 757 -236 -1007 269 -645 314 1885 -89
885 -89 19 -551 -2227 227 1185 445 1714 -39 -1740 -1173 -1075 121 1343 1905 854 -1700 -1430 -1238
903 -1238 -1394 2481 2452 0 619 -1618 -2916 -57 751 1828 2315 806 -1217 -2597 -1450 359 984
920 984 2809 1296 -1446 -1046 -2142 -1511 1803 1344 1457 966 -1882 -1788 -1054 -466 1708 1742 695 -378
938 -378 -1645 -1194 -865 812 2201 461 375 -265 -2331 -211 890 -66 1329 616 -1059 -595 -644 -435
956 -435 186 1120 641 -900 -439 -11 -730 905 630 -1012 153 14 -201 795 57 -420 498 -246 -59
975 -59 0 -6 733 523 118 -722 -1246 313 507 742 1232 -1002 -1060 88 -1310 456 1586 325 521 -228
995 -228 -1450 -1107 163 1174 1131 892 174 -2062 -1284 293 -37 1639 1806 -702 -802 -1116 -1581 383
1013 383 1160 1188 1038 -527 -1217 -1270 -584 713 1156 1558 364 -1549 -833 -981 -121 1974 836 -194
1031 -194 244 -1275 -1170 284 139 951 1135 220 -790 -1103 -85 51 696 1309 -335 -851 67 -922
1049 -922 -57 1138 -315 163 365 -894 -322 11 78 491 243 -107 -598 -298 472 -2 482 171 -1069
1068 -1069 249 256 -412 837 154 -653 32 -656 -473 590 519 240 -131 -513 -948 -914 483 742 230 911
1088 911 -581 -1319 -102 -188 496 1458 316 -214 -311 -1063 -414 473 994 821 194 -97 -1301 -885 372
1107 372 333 1106 899 -805 -1033 -449 -865 693 985 174 353 -545 -1077 -552 65 751 731 500 -55 -1142
1127 -1142 -462 127 -157 1170 786 -431 90 -590 -604 593 335 298 189 -212 -464 -365 224 322 8 451
1147 451 -229 -701 241 -292 -128 676 -313 -86 218 -497 135 422 -14 -45 -108 -221 -216 291 579 -86 -280
1168 -280 214 -717 89 585 -252 419 218 -659 -299 -180 32 562 411 177 -420 -576 -154 -109 716 674 9
1189 9 48 -425 -844 -3 177 571 929 -155 -533 -543 -517 277 539 658 137 -451 -532 -634 -228 693 344 286
1211 286 442 -756 -524 -80 -65 695 918 -70 -129 -524 -459 -4 320 654 131 -152 -179 -654 -202 391 10
1232 10 430 70 -529 -54 -178 1 649 94 -167 -67 -280 -153 53 173 189 -247 162 -160 -122 395 83
1253 83 9 393 -132 -162 218 -151 265 262 -247 -237 -341 -29 425 99 337 -161 -319 -202 -296 44 581 98
1275 98 332 -4 -765 -251 106 340 507 117 -228 -426 -271 70 193 345 511 -211 -59 -345 -565 351
1295 351 396 269 279 -225 -440 -227 -231 329 277 90 45 -382 -156 -21 -63 648 316 8 63 -445 -294 259 102
1318 102 385 381 -153 -169 -279 -188 151 146 130 -78 -307 -83 -239 -36 226 -1 79 -115 -450 29 129 72 311
1341 311 -94 -163 34 -159 251 -40 -2 113 -276 -106 168 -158 233 153 -239 -27 -252 18 214 20 152
1362 152 138 -370 -127 60 -31 269 -100 -175 -22 -236 69 -102 73 283 -112 -208 -63 -246 235 208 203 223 -315
1385 -315 -180 -44 -139 192 267 356 109 -195 -211 -26 -76 297 309 -58 25 -200 -247 109 -51 254 112 11 46
1408 46 -229 -46 72 206 134 -30 -226 -73 -205 14 276 188 -8 78 -77 -31 -131 -5 141 -195 -40 -69
1430 -69 -134 15 -37 41 188 -173 -133 -82 97 192 126 -52 -92 -148 54 30 86 198 56 118 61 -150 53 236 -19
1455 -19 149 -172 -270 -127 33 85 238 -84 26 -94 -271 66 29 159 88 -149 -202 -186 -185 167 98 76 139 -96
1479 -96 -159 91 -168 43 289 -87 -48 -144 -43 -35 -94 246 164 -57 1 -256 -132 268 204 322 189 -208 -78
1502 -78 -45 89 195 90 149 22 -40 2 -165 117 44 94 -2 28 -169 -55 53 -196 -31 -9 -240 -120 -132 -83
1526 -83 -25 -25 90 -59 97 8 -6 95 60 122 87 -65 -203 -72 -64 113 60 -205 -174 -62 -59 71 78 -47 14 -59
1552 -59 -80 -165 30 144 -49 -24 -34 -75 222 -9 76 -90 -131 -237 -72 7 152 186 -98 55 -16 -31 4 140
1576 140 50 146 44 -22 -228 -27 138 188 90 44 -166 -49 -195 24 140 43 76 17 -209 -47 -107 81 233
1599 233 9 105 -90 -119 160 3 -46 254 -249 42 20 -61 -88 82 161 -58 20 -115 -89 11 244 -98 -113
1622 -113 184 -25 10 64 -32 158 41 -58 73 -33 20 18 80 -110 -16 -218 -133 -26 72 133 -15 -99 -103 -60 3 90
1648 90 87 -96 -46 -108 -116 91 61 83 -1 -25 -83 -103 27 34 186 15 -24 44 -189 -23 72 136 116 77 -92 -131 -146 -156
1676 -156 88 30 -83 13 -272 -123 -160 106 83 149 243 -130 -142 -109 -47 42 113 -128 205 -140 -43 104 32 158
1700 158 59 3 3 -115 43 29 57 150 110 -270 -107 -20 22 224 -80 -157 12 -11 89 -33 113 -96 9 39
1724 39 -167 -149 109 70 -8 53 -110 167 -27 -170 -9 -7 -70 -38 -41 -31 -35 80 42 95 3 -161 -111 -8 61 -165
1750 -165 -83 -154 -174 46 -49 60 98 -23 27 0 -120 -58 117 89 177 -105 -62 -71 -179 -87 169 68 51 -136 -123
1775 -123 -17 -153 102 37 34 77 -147 -137 -83 -88 121 116 112 27 -85 -66 -19 -10 119 -40 -123 -5 -24 -74 98 -94 123
1802 123 -32 -80 -60 -78 -7 143 -113 -87 114 -69 -60 125 -74 18 -1 -202 -67 -63 -18 -5 -56 5 92 3 3 -107
1828 -107 210 63 -55 -119 22 -84 78 190 59 -125 -194 -63 -70 41 47 -135 112 -207 -259 7 -160 -34
1850 -34 155 -159 -94 -58 -140 75 248 91 133 -78 -44 -73 -55 83 135 5 -40 -149 -206 -51 -109 142 64 111 59
1875 59 -98 -27 107 -50 85 202 -60 -46 -175 -133 -11 4 65 18 -121 -74 -103 -15 127 -88 -185 -33 -114 -160
1899 -160 -115 -49 -39 -102 -20 145 -88 92 -20 -135 -165 29 37 -12 -42 99 119 -218 64 -1 -50 76 -38 -27 -10
1924 -10 33 -8 27 -64 -34 -27 81 -64 -145 25 -115 -11 169 -35 38 68 -205 47 148 50 51 54 -198 -188 -171 47
1950 47 157 -55 89 5 -90 -49 -68 16 163 95 73 -13 -70 -126 91 203 110 -21 -33 -177 -129 -96 133 59 33 -98
1976 -98 -51 -71 22 241 177 66 -67 -40 -122 -24 -65 39 78 36 162 -154 -120 58 -6 173 -49 -3 64 -78 136
2001 136 -22 58 6 3 10 -149 93 67 91 11 22 -144 -60 34 -140 149 47 -304 12 -17 -107 -104 -27 11 -88 -132 -50
2028 -50 -62 163 78 -48 -21 -90 -51 -72 172 -68 182 -200 -89 58 -91 82 92 60 -9 -54 -210 -57 45 64
2052 64 -74 84 -39 -145 -165 118 -137 231 102 -164 -36 -38 -109 36 42 40 27 69 -33 -63 19 75 -1 84 -35
2077 -35 -235 -57 -118 -240 142 89 -196 -21 -93 5 7 104 97 82 -34 21 11 140 44 75 198 -14 -53 147 -16
2102 -16 77 53 -88 12 -144 -134 -40 -19 -226 64 -45 -21 -75 30 48 -105 -123 43 -106 -16 209 -19 69 -16
2126 -16 96 -16 -34 -24 7 56 127 -64 6 18 -131 24 104 -70 134 -109 -326 82 162 213 106 -122 1 -94
2150 -94 -57 117 -100 296 -80 -101 12 -170 -91 216 81 41 247 -144 -129 19 -165 -23 71 1 61 25 -137
2173 -137 -169 13 56 -65 -36 -38 -219 25 -56 -20 217 44 -98 41 -117 160 181 19 -71 -120 37 -15 -17 67 29
2198 29 -218 -77 -67 -71 184 -31 -47 -95 -50 -66 0 26 116 4 7 -46 -49 5 42 59 353 -54 -79 51 -98 -69 229
2225 229 24 134 165 -80 -180 84 28 -14 2 54 -163 -179 42 -82 134 153 -62 -34 -45 -201 38 -54 34 57
2249 57 -16 -295 -97 -229 88 116 173 9 -149 -70 -90 -233 113 89 29 29 -151 -45 137 -158 36 146 -76
2272 -76 79 -34 58 14 82 144 -55 -58 80 -287 124 123 -74 -10 -65 -300 154 -66 -137 208 -26 -78 26 22 199
2297 199 41 21 91 -161 -19 -189 -101 64 -33 -74 114 -81 -37 132 -133 184 80 -75 150 16 -22 -35 121
2320 121 224 -54 -306 36 38 -32 73 48 -10 -132 -229 -109 52 88 125 77 262 -193 -73 204 -10 157 115
2343 115 -184 142 94 -23 306 42 -49 181 -78 52 -92 -176 235 27 12 -105 -168 -69 83 -126 265 -51
2365 -51 -84 146 -216 -72 51 147 66 104 -124 -28 -59 -30 0 -60 63 25 -9 147 -96 -91 192 -164 9 72 -258
2390 -258 101 19 -73 134 -206 -241 -80 39 34 -156 -3 58 -134 80 5 42 266 -25 -304 22 -236 -12 40
2413 40 51 -22 38 -185 -28 -20 34 1 87 136 20 -188 86 55 -64 0 -94 -148 38 -179 11 87 -32 74 -65
2438 -65 -38 -154 -123 86 113 -48 103 -295 -219 148 -83 47 60 -27 -116 -218 -169 -116 52 110 190 56 -4 -230
2462 -230 172 100 -157 -14 35 16 5 -23 -17 283 97 -42 154 -97 2 107 -6 83 -149 24 -159 4 73
2485 73 -15 7 129 -96 34 -4 85 54 57 -67 -121 14 -57 12 -49 -49 9 -165 82 -195 25 273 -43 158 25
2510 25 -132 11 -123 -49 40 -10 -73 -159 -171 40 -31 77 220 -93 -16 87 -69 326 75 -36 128 -56 -71
2533 -71 81 11 227 220 -3 -18 1 -32 91 -100 139 86 94 75 -115 81 208 -136 64 217 -50 51 20 -20
2557 -20 98 93 98 6 -1 131 41 -40 88 -181 72 39 -227 212 -7 -62 140 -105 -73 39 -37 -88 8 172 -37
2582 -37 -99 16 79 -111 166 -45 -118 224 -100 20 81 -92 112 173 -151 -28 -103 12 70 39 6 -50 -281 -143
2606 -143 -10 -30 214 -44 58 183 -192 -30 95 -189 40 23 -55 9 14 20 80 37 188 -14 -171 61 -141
2629 -141 123 58 -132 44 -114 -196 -85 -17 97 94 80 -77 -16 58 -43 40 111 -17 -47 72 -158 -34 53 -30
2653 -30 78 257 -211 27 -81 -7 -70 160 7 -16 -51 25 -53 -189 203 37 -116 -115 -181 112 105 -121 132 -32
2677 -32 -56 -5 -9 72 123 -26 106 -74 195 51 -17 175 -6 -30 40 -62 -64 150 20 -78 234 -162 -58 -99 -26
2702 -26 98 -12 86 164 1 151 21 20 194 -57 54 169 -262 -116 83 -38 54 37 -213 -110 -50 166 -8
2725 -8 -50 121 -229 -7 118 -162 173 78 -23 10 -73 -72 96 -83 -13 56 -165 -79 -67 55 94 -28 -177 4
2749 4 5 170 -59 -49 142 -45 -51 36 -134 -58 88 -64 -169 98 133 62 -159 172 51 63 46 -24 2 148 -112
2774 -112 -31 87 -117 -44 52 -66 51 95 -112 -18 -96 75 -49 1 91 31 130 -105 -320 45 84 82 122 152 -227
2799 -227 -176 -15 5 24 -22 -22 34 -265 -134 6 90 22 134 156 128 -117 48 34 -60 273 -154 -137 31 22 -29 -9
2825 -9 70 27 76 50 -153 -22 199 40 22 90 -164 8 98 37 92 -17 17 24 -85 -166 37 93 48 52 -152 60
2851 60 -84 -19 -63 86 175 30 31 59 29 4 138 20 28 -22 -76 -61 47 55 -71 -77 -1 -92 -64 171 -74 -53 210
2878 210 -137 54 -7 -96 90 174 32 -37 -62 -9 -19 -22 191 4 -28 121 -181 23 13 -100 215 3 9 58 -7
2903 -7 72 93 -48 134 -97 -114 36 -74 -35 -138 -84 -65 63 -198 -36 147 16 105 166 90 -34 73 -33 -67
2927 -67 73 -51 -17 1 -131 -80 208 40 -44 100 5 -64 69 -30 77 57 -94 5 34 126 40 -9 -45 -30 -66 8
2953 8 27 -56 26 8 -98 165 -24 61 61 -50 163 50 54 -133 79 99 71 78 -42 -224 -170 -171 57 34 -102 -105 159
2980 159 -49 -245 13 -81 54 33 -152 67 -127 216 -14 -69 60 15 -70 182 21 -97 278 -47 41 28
3002 28 -22 -18 149 48 -65 -38 26 -24 11 84 -52 71 278 -77 -7 -20 90 8 138 -117 36 -2 12 19 -40 -6
3028 -6 -117 64 7 -11 -21 72 -69 -83 -234 -125 110 96 -159 37 -52 104 197 34 -60 -95 149 65 55 38 1
3053 1 66 -108 43 -170 153 -149 -53 6 -165 171 89 -161 -21 10 -27 106 6 119 83 74 -54 89 120 -50
3077 -50 -39 150 138 -122 -84 -30 -69 184 -15 -12 -38 -41 -2 38 -17 64 22 139 -43 -164 62 119 121 257 -131 -133 27
3104 27 -96 -1 -42 88 50 17 -135 38 128 94 36 -98 39 -241 -48 95 -193 58 8 -113 36 73 -77
3127 -77 15 -75 26 111 65 -26 -51 180 42 -47 7 -15 -75 16 33 -31 -29 -212 -124 68 24 -25 -69 148 38 110 -187
3154 -187 147 -61 170 95 -24 88 -33 -19 -26 -134 105 140 -5 -55 90 -55 -21 92 -174 6 67 38 -65
3177 -65 -63 91 -39 -58 -2 -87 4 59 -114 -91 68 -13 -114 -118 -77 70 42 54 81 -74 4 -123 160 14 158 16
3203 16 62 -46 -48 21 98 178 45 -60 38 -126 58 -35 -10 -93 -168 -15 -110 -49 47 -56 8 51 -145 -29 57 -143
3229 -143 -1 -112 13 143 22 12 87 19 24 -3 187 49 -256 110 55 -148 86 37 -168 6 -97 35 -39
3252 -39 54 -99 -10 44 -11 -95 182 -28 -81 -8 -107 -69 -14 -74 157 11 -80 41 125 33 -34 -33 -9 194 -5 172
3278 172 108 -4 69 -14 -183 61 -5 44 40 -13 -29 1 35 -65 -6 -20 60 -9 19 -169 4 61 121 -125 -41 -122 -69
3305 -69 -114 -46 -114 -269 -54 -36 -102 20 116 -71 -44 -35 -61 -6 47 175 -67 4 50 -109 -156 166 -57 71 -33
3330 -33 -72 26 -8 154 8 -18 191 -92 -97 41 -4 44 160 -22 -3 86 -132 245 2 38 25 86 -85 153 46
3355 46 -235 5 55 -16 71 26 98 -69 13 34 -59 80 -8 27 -4 -81 -108 64 -61 -8 -117 -128 42 -28 -156 52
3381 52 -24 166 24 6 7 -92 -61 61 12 85 -12 -2 63 53 1 40 -82 -80 -179 -105 167 36 -102 -105 53 -49 -80
3408 -80 9 -135 90 -81 131 -35 -44 -71 -53 124 27 204 -9 10 190 12 -139 47 -18 12 99 -159 78 -71
3432 -71 -138 3 87 132 128 -91 -45 51 -39 20 -7 -57 28 -55 106 173 50 -103 105 -9 -99 224 -32 -18 29 35 16
3459 16 -54 105 47 73 215 -3 5 97 -12 -95 45 -139 13 -15 -153 154 144 54 -26 52 -8 5 -71 -62 33 -99
3485 -99 7 -74 50 -91 41 56 -78 40 -53 -50 240 110 16 46 -44 -77 -39 -36 55 -69 -130 -16 -69 -43 194 -137
3511 -137 124 133 -133 -5 -114 -50 180 19 72 -33 30 59 -100 -33 53 -48 -73 -29 -38 77 -13 -2 17 59 44 36
3537 36 -43 -3 82 86 97 -18 89 196 -88 24 -116 -87 31 57 12 -42 97 121 27 16 114 -13 109 -24 45
3562 45 68 -70 24 -64 -30 -33 -83 -3 -50 -16 -18 -13 -58 -25 35 -72 173 143 -80 43 -49 -46 55 -36 140 30 -155 -10
3590 -10 -79 -54 29 64 -128 160 -76 -102 100 -64 -77 -11 -58 -99 139 52 94 -87 -38 4 -116 113 -62 168 -45
3615 -45 -13 -117 -60 -16 160 -148 34 -99 -94 154 -38 -57 86 -50 -35 -48 5 -7 27 -198 30 104 124 -19 42
3640 42 52 66 -120 49 -21 136 75 104 136 72 -24 -44 76 30 181 -81 -56 -115 8 13 -8 -62 -77 78 113 -17
3666 -17 -26 38 20 65 165 116 -42 146 7 -169 -27 103 -16 -103 -22 46 98 42 -54 104 81 -21 -20 38 -39 36
3692 36 -18 -25 246 -128 -123 86 -47 122 -8 -25 -16 -8 22 103 -91 -11 119 61 2 31 32 -51 58 -46 183 -17 128
3719 128 -57 45 65 66 17 -180 7 -6 -55 -8 131 44 -89 -73 46 -120 231 -137 -1 7 34 53 -16 10 130
3744 130 -48 22 -31 -132 -15 -71 72 76 -19 21 -108 -87 10 101 39 45 -51 82 22 39 51 -70 63 -44 30 -34
3770 -34 -55 -115 96 -91 10 155 15 150 137 2 93 -47 -24 29 62 0 21 92 215 41 -89 -19 -17 26 -53
3795 -53 3 -118 132 65 -30 194 -171 -127 142 -81 49 -131 109 -91 23 -1 -72 -71 21 -86 3 -27 -61 113
3819 113 -128 -85 -21 -79 92 -94 128 -9 28 65 -1 -53 21 -27 49 89 -45 -56 45 -80 113 -49 -55 3 -191
3844 -191 -64 118 -61 -85 -67 -158 132 -18 -2 -121 -42 -20 -13 -127 -167 13 186 71 202 71 -106 45 77
3867 77 -142 -150 74 118 38 3 94 17 -17 -60 121 -80 35 -22 -85 27 60 126 -15 51 1 70 74 15 58 -165 -26
3894 -26 86 21 30 -91 -157 33 -71 -14 -152 -36 -52 39 3 93 -24 80 -140 27 20 -25 -40 21 101 -16 41 -92
3920 -92 91 5 -67 -73 -23 21 -61 106 108 82 -15 53 36 50 31 -126 -12 -5 9 224 -6 -64 89 -56 -150 43 41 -234
3948 -234 57 62 14 -13 -18 15 19 74 52 -111 -14 -42 93 -104 -146 -60 -88 7 137 93 -17 84 89 8 23 136 -132
3975 -132 64 10 119 -155 -13 -156 52 -36 44 7 -61 -108 -7 -64 -28 48 50 159 -2 -20 -23 -7 -20 24 12 36
4001 36 -74 57 18 2 -137 203 93 46 89 29 -68 -52 20 -14 -55 -37 79 -90 98 -183 -66 -44 -137 70 56
4026 56 -20 10 24 -104 186 6 83 95 -81 50 68 -155 -21 34 66 -61 -178 -10 79 -37 -126 28 152 -20
4050 -20 -143 -64 -1 25 -125 -64 -20 -10 -92 131 -47 62 42 6 35 63 -14 68 90 -37 -77 -52 -60 -133 28 -188 14
4077 14 50 -9 24 42 39 78 136 -77 -97 16 -81 26 -45 14 31 -56 3 -52 160 4 -13 -81 28 -62 35 37 -53 -113
4105 -113 -64 -52 1 49 -11 13 2 -122 -41 66 -11 -19 -47 62 -45 -78 43 247 74 -105 -44 167 -8 -83 -102
4130 -102 -160 -126 51 -6 -16 87 -20 0 -40 32 -24 -135 -64 155 8 46 -59 26 68 8 -8 42 24 -35 -52 -180
4156 -180 74 -13 -33 -98 14 33 -50 -43 78 155 51 -69 -38 -48 -153 77 101 26 -38 -201 -71 -2 -96 75 108
4181 108 -107 29 33 -109 72 126 -79 74 43 192 25 -13 116 32 41 64 42 66 -34 11 179 88 140 -56 127
4206 127 51 195 -36 4 76 75 63 48 -139 144 41 -75 -108 102 56 -122 89 40 71 61 -63 -12 124 -88
4230 -88 -138 -3 5 -131 -19 -22 76 -3 -98 4 222 12 -22 -49 49 -19 -55 72 -1 -15 186 84 -2 2 6 -45 -57 102
4258 102 -259 24 -170 56 -101 -61 -106 53 30 53 -92 127 -25 -102 -65 41 101 -40 -49 103 104 -113 -51 15
4282 15 -69 28 27 51 89 -102 2 -32 16 -50 22 -165 15 -46 19 -70 22 -8 -12 48 -16 -115 -24 28 160 -136 139 24
4310 24 20 -21 104 -62 16 -72 73 154 58 149 -75 48 -42 32 28 124 178 -47 65 -39 10 27 -16 26 -11 16 80
4337 80 -57 64 36 -13 100 -35 -83 57 -27 95 -11 -93 -31 -184 87 165 100 -76 145 4 -69 -6 67 62 190
4362 190 -40 -14 33 72 -32 30 -13 41 93 111 -85 -40 15 68 -31 42 -45 -44 -17 25 75 34 4 80 -57 34 76 -20
4390 -20 -40 7 -12 -51 125 -39 -139 -42 90 -43 38 -13 -70 -51 53 157 -67 163 63 30 119 -109 34 -59
4414 -59 28 7 121 -32 32 65 29 -91 -27 -43 -116 132 27 -95 12 19 -16 -9 18 -69 123 -118 141 -106 91
4439 91 174 -29 -23 -11 -4 34 49 75 96 52 -23 -147 -104 -108 -60 25 71 -55 52 -155 -27 5 -36 -66 34 -126 -76 -124
4467 -124 -34 -69 -33 100 28 -35 -176 92 -68 25 51 -27 -136 136 -82 -7 38 106 -5 -22 -58 -50 -85 37 -24 -111
4493 -111 58 28 -146 -29 -72 -89 51 -129 28 121 -97 -168 209 -90 -11 23 -97 41 1 57 57 12 -40 7 15
4518 15 -38 21 85 36 -100 106 -32 -30 233 146 -101 99 -84 26 -70 87 20 19 96 -133 200 -12 -88 -122 -58
4543 -58 -2 -20 22 39 -75 -51 51 192 -163 -13 -157 243 41 -194 -19 -69 -65 -109 83 -37 -29 22 42 -38 -3
4568 -3 82 13 116 -11 33 -18 -66 -46 102 -75 101 20 171 -8 90 -2 -24 -54 -18 -8 -35 77 23 138 -90 74
4594 74 -66 49 -102 -4 23 109 -145 -54 78 214 -56 118 -106 117 75 68 86 -17 67 -92 -62 -146 14 -71
4618 -71 2 57 91 -21 -31 -172 -84 127 11 -150 -35 32 29 65 77 -47 -98 -133 104 72 66 22 -15 -64 -79 29 157
4645 157 -38 21 -43 91 -8 135 -39 -64 -30 0 -62 100 -88 9 47 -26 0 42 56 -35 -17 -204 -92 -85 -144 -71
4671 -71 27 -67 27 158 8 -151 -142 -83 113 155 104 -81 27 138 -45 -51 -66 -102 4 78 69 20 64 -1 88 -2 13
4698 13 233 -31 -18 71 -68 -35 -59 90 -8 -100 91 -95 164 -47 -115 132 81 -81 -3 124 -6 23 -74 -52
4722 -52 5 -15 81 -194 -8 112 38 -98 -93 -36 -91 -33 58 46 15 -37 -73 185 50 -107 61 -134 44 -40 -11 -66
4748 -66 -27 -221 -75 -63 113 107 -80 4 135 -4 69 -48 -7 -10 -34 -25 -169 -140 64 121 31 8 -54 -73 46 -64
4774 -64 58 -33 -162 -166 85 32 -14 -143 165 99 -25 25 -50 119 -165 -155 -14 -204 -65 16 209 34 31 -7 116
4799 116 65 120 -48 -27 -52 102 -20 55 16 79 46 -175 58 67 -99 68 1 -34 -41 25 150 -144 -10 165 14
4824 14 42 47 -79 -88 -202 -136 -113 -110 62 19 45 12 42 85 -49 35 -4 -69 48 -18 51 -13 -130 67 -90 -17 210
4851 210 42 -63 30 99 11 36 -39 -96 68 122 -16 -73 29 -55 82 -90 0 -103 -136 -77 45 59 23 -87 -13
4876 -13 106 -59 -25 -34 108 69 -34 -60 29 111 45 -74 -99 128 56 -28 -28 -102 21 166 96 58 203 -67 138 37
4902 37 77 49 60 14 104 -1 108 30 23 23 -51 202 134 49 -27 12 5 67 -21 -30 -54 -67 -101 131 -51 8 -56 33 88 -75
4932 -75 52 -69 47 -102 7 12 -106 14 40 -80 69 -63 -67 55 -43 -79 -14 -180 -110 96 3 128 -82 40
4956 40 125 117 42 -50 -102 16 1 10 95 0 -64 -21 75 52 54 3 -41 -113 -12 104 -11 13 3 128 96 -37 -13 96
4984 96 62 -141 148 -2 34 77 72 -31 -13 76 29 12 -70 -86 -115 -30 -125 112 -43 -48 31 -50 101 -106 71 -52
5010 -52 -84 -119 -216 -7 12 18 100 8 186 -22 -2 -17 110 60 90 86 33 -184 0 6 110 29 -9 37 -112 -51 120
5037 120 -22 -24 -8 11 107 -132 -165 -48 -197 -27 -99 52 4 184 -97 -133 58 -180 100 98 32 -117 -70 -108 5
5062 5 -51 -23 28 -90 98 -96 -52 -92 76 60 86 9 126 13 -52 72 19 26 86 53 0 -36 124 146 56 -33 -19
5089 -19 97 40 22 86 124 85 -48 50 -64 -54 49 38 -42 13 -16 -40 139 55 51 100 84 3 -44 32 -84 53 64
5116 64 99 -28 44 56 95 -27 -7 85 1 3 -24 -24 -86 -57 -82 -81 -9 48 110 -35 -57 75 -101 42 98 -20 -74 -60
5144 -60 61 100 143 -69 -209 -35 -10 -54 -82 -184 -128 -29 -187 54 -17 24 42 15 57 -58 -21 72 -24 49 -84 -182
5170 -182 -43 -4 89 -69 7 87 32 -21 2 47 142 -59 -108 85 -102 -1 -49 93 -13 -98 123 61 -3 72 -95
5195 -95 65 45 -132 -35 -99 -111 -80 92 -29 63 91 90 34 69 -65 -73 103 -129 117 38 -212 6 32 157 -198
5220 -198 -69 76 -56 -46 -64 -119 -22 -54 -28 8 116 146 101 -39 130 49 -141 2 61 8 -39 121 100 -124 -27
5245 -27 101 0 34 59 11 78 -142 -28 11 -104 29 6 106 -177 64 -74 126 71 25 4 16 4 32 -63 -89
5270 -89 -60 -58 56 86 -10 -5 9 101 130 -102 -79 42 66 42 116 24 -77 67 58 -48 -133 -150 -70 -59 46 113 -21 97
5298 97 15 68 -167 117 -4 -136 55 -32 23 -17 -118 97 -12 100 128 77 -17 58 -97 -13 -53 43 -12 52 12
5323 12 60 135 56 226 -98 -18 -1 -49 -91 -55 -48 -32 -65 133 62 15 -110 86 83 20 138 70 10 -69 -42 -28 77 -42
5351 -42 85 -88 -71 39 68 38 38 20 91 111 -42 -114 104 17 77 -5 52 -31 2 -129 94 -43 -45 -52 -71 40 -72
5378 -72 -85 134 24 -31 74 90 -203 -87 43 25 -47 -55 -12 -118 36 236 79 -42 10 -183 -185 -70 -141 -43 -46
5403 -46 89 -102 -122 -62 66 70 149 103 -61 -185 87 133 59 35 -39 -9 -63 -14 -15 199 104 152 113 77 -66 65 -68
5430 -68 91 44 45 -4 -61 53 -45 25 -74 -114 82 -131 10 -7 24 186 -46 21 -254 45 228 19 101 163 -6
5455 -6 -131 2 -103 77 17 106 74 -204 45 142 -6 77 123 0 48 -45 98 41 -82 24 -12 145 92 -133
5479 -133 -2 -59 -110 -21 22 -32 -50 71 40 127 65 -125 16 108 -7 57 -2 -27 51 172 -80 -217 138 23 30
5504 30 94 58 -104 -76 38 -1 87 -23 -74 -45 -50 -39 -25 9 33 -91 63 115 -21 4 -65 21 4 17 -90 0 -98
5531 -98 22 22 -73 36 -21 132 12 -7 64 44 -119 61 -89 -50 -95 -13 111 -42 0 13 -82 -26 -52 81 -16 -28
5557 -28 -95 72 -120 -25 -110 -62 14 -58 13 120 106 66 92 -38 -35 20 25 11 52 -34 22 50 -177 84 29 -30 32 -12
5585 -12 139 -84 56 66 -143 56 35 87 -2 -153 63 10 -51 -27 172 59 -209 28 6 -47 54 68 -84 -58
5609 -58 -78 -26 -127 36 -82 180 115 -129 -115 47 83 -35 -46 39 34 140 257 8 28 -131 83 -55 95 -36
5633 -36 -81 -71 38 60 -2 -13 64 -21 -169 62 21 19 14 14 -22 -249 10 117 156 134 10 66 30 128 102 89 95 -5
5661 -5 89 -64 25 42 138 -46 -134 -81 -61 109 1 0 47 -50 47 -158 84 115 170 102 9 91 18 112 81 -47 26 150
5689 150 70 -113 -20 57 -121 286 71 24 -99 17 3 32 -127 123 100 -76 72 -75 104 156 48 -105 17
5712 17 -56 -45 -165 53 -52 18 -69 28 25 -52 -18 -58 -32 130 -198 0 -3 -21 -61 45 -56 70 125 -133 -10 160
5738 160 103 -36 88 -66 -98 56 -64 -99 -31 116 -15 -92 54 -183 -79 -44 -78 114 -40 -190 183 -115
5760 -115 -89 -112 59 75 11 83 -72 -137 54 148 2 50 -1 -88 33 119 128 59 -51 39 -19 50 93 -85 -37 7 90
5787 90 158 0 -69 55 42 -116 13 -1 3 71 98 190 -33 91 -46 216 13 22 88 159 -41 72 -113 71 14
5812 14 -50 47 47 7 15 7 128 -74 145 -56 -40 54 12 -133 123 59 -22 -37 138 97 -5 127 -85 -132 -48 149
5838 149 -1 -132 105 129 1 95 -58 115 63 -102 19 52 5 21 60 -57 -7 113 -93 30 138 59 -78
5861 -78 -52 130 -124 -116 37 68 56 -43 15 -165 31 7 21 36 5 110 -23 -93 69 63 -78 84 -42 -22 66 44
5887 44 26 22 26 31 -20 -13 -121 -74 -46 -112 27 -8 77 -4 -48 67 -16 40 51 -9 68 142 12 33 27 -86 -111 91 -114
5916 -114 23 11 70 -131 -18 -39 -57 64 -92 148 36 -62 2 74 -195 49 102 -19 75 21 -26 -31 154 -115
5940 -115 -77 -31 19 53 123 89 -40 -47 -41 32 20 -95 74 44 -53 -161 17 -14 -21 15 -94 -169 35 -63 -94 -200 -121
5967 -121 81 -89 -111 63 -116 26 -36 236 81 -47 45 97 -71 -193 141 26 44 50 -51 -98 -84 174 205
5990 205 -98 19 8 54 31 45 56 -25 48 122 8 -118 3 40 -49 -203 -6 -35 36 35 96 -101 1 -41 -39 -47 60
6017 60 25 -5 -94 45 -98 61 -88 42 -83 -45 80 91 137 -95 88 -53 -96 88 113 -10 29 39 -60 -146
6041 -146 31 -101 70 133 101 17 -49 -3 51 19 148 84 -182 155 100 -13 -73 -123 34 -49 -72 -55 71 -60 -107
6066 -107 -162 -120 -69 110 -59 -71 -103 -53 6 31 -30 -203 36 52 -6 19 -72 -48 17 -90 -60 54 -42 115 -103 12
6092 12 -72 -91 56 -17 53 34 -38 33 -32 -5 -130 57 58 6 -9 51 -5 25 -26 238 48 2 -170 -1 -108 5
6118 5 -84 -57 99 -156 -34 -70 -144 -92 -79 -48 37 52 46 90 -84 -51 -119 0 117 -96 2 -102 -69 4 149 24
6144 24 63 -30 -3 -194 33 -58 21 -84 -103 91 13 117 6 -166 57 -80 60 -167 -58 58 38 110 -6
6167 -6 -43 -246 -20 -57 -107 63 46 69 -126 39 71 77 -61 -161 4 5 103 -25 -65 -55 -35 51 93 93 29 11 -51 70
6195 70 -51 96 0 28 -28 -53 -16 39 157 -25 -44 -93 -9 -21 88 -25 106 -70 -15 80 -35 137 44 75 118
6220 118 -71 68 -47 12 -112 80 -90 -70 163 -40 104 12 63 -145 59 -3 -11 150 -66 -91 -159 -114 62
6243 62 -32 17 -31 -24 -4 -71 50 96 37 -136 -66 -96 -6 34 23 -129 -8 27 -197 24 -90 150 -53 -35 -67 -7
6269 -7 -131 -2 -182 1 -81 56 7 -102 -26 -63 -43 23 124 -97 76 121 -33 -36 -37 -93 36 -43 19 -72 113 -52
6295 -52 -62 202 -29 62 30 142 17 -58 -81 -29 -1 44 206 2 72 4 148 38 96 19 -55 73 121 -2 161
6320 161 -52 4 -130 71 84 -1 -20 126 -43 16 -91 -122 8 79 50 38 -45 104 -129 -55 -27 66 -16 -165 197
6345 197 28 12 99 50 102 36 -142 -16 -9 134 98 69 82 134 -24 -169 38 -55 156 31 56 -25 32 -74 16
6370 16 123 -45 -57 -21 60 -46 20 14 -31 -41 -69 -39 128 74 -54 26 81 116 -84 -48 23 -24 -36 -65 160 -93 -5
6397 -5 -45 17 54 -15 -152 -35 -44 49 -154 33 -16 83 26 41 113 55 36 140 -72 96 15 -78 115 39 -1 -72 -13
6424 -13 -3 -80 -238 30 21 7 -119 -17 75 -19 -42 92 -13 34 -61 -94 -3 73 109 112 -74 65 -52 -61 -138 -130 8
6451 8 -58 -68 -4 -21 120 -49 -177 -68 12 194 -64 -162 -86 141 27 73 -9 -65 55 115 -64 96 73 54 -8
6476 -8 58 -9 -97 79 83 -113 -54 105 44 174 -100 -8 290 20 133 145 -85 -3 112 -155 -33 135 26 -15
6500 -15 -18 113 192 47 -29 114 36 -35 -96 -108 -58 119 218 -76 196 -1 8 -34 23 -100 -3 134 28 68 21 28 124
6527 124 -98 53 -24 130 -70 -112 14 -50 -17 70 110 -75 8 189 -9 0 119 93 -28 67 -41 1 15 -15 -44
6552 -44 146 -26 97 -170 -159 75 24 87 -83 22 51 75 53 90 -101 182 6 -30 36 140 -128 16 -133
6575 -133 40 55 7 70 138 92 70 -41 26 26 -110 -23 4 -7 -62 -44 56 102 9 145 60 101 -37 144 -13 49
6601 49 -148 63 -45 -21 -133 28 115 -23 26 45 31 -40 -9 -25 102 -112 -10 47 40 70 130 14 42 -3 -12 80
6627 80 163 79 -2 75 -28 -104 -3 47 149 -35 156 -152 105 -37 -110 -60 -104 -58 -43 176 118 165 -5 17 33
6652 33 181 93 143 -14 5 -86 29 -103 -35 -77 -57 36 -10 -16 19 87 -12 -67 1 -77 -108 25 -23 -17 -134 -122 -19 124
6680 124 120 -14 66 -22 -5 124 -67 52 14 179 153 3 50 2 -1 -19 -113 219 65 188 32 -100 79 81 7
6705 7 194 42 54 64 -110 -192 -132 -140 3 5 -118 118 1 62 82 -10 -60 21 83 -75 189 -11 101 -83 -65 33
6731 33 -16 81 -20 50 35 64 70 -48 24 -37 -34 -71 5 188 -89 -157 44 36 -70 35 -2 83 -78 21 216 6 -55
6758 -55 28 9 -42 -19 -57 -33 -14 -148 64 34 -172 -48 104 -9 -79 32 -1 -54 47 82 128 -38 13 106 -1
6783 -1 -50 -55 26 -165 120 43 -116 174 31 31 -48 -78 -36 -113 -113 9 -14 65 35 -137 -93 -151 -30 -107 -95 -110 -48 9
6811 9 80 68 -126 73 12 -57 71 20 -14 -32 -31 -19 -117 -69 61 72 -4 108 80 19 -9 226 -110 -145 27 181 209
6838 209 -96 83 -68 -6 -25 15 -99 44 46 -53 -177 80 -43 115 137 76 3 -70 -22 -84 91 19 66 -80 -5
6863 -5 183 2 -181 44 4 -39 130 60 -57 -108 21 -32 -98 30 49 40 60 141 -41 -86 -73 -28 -52 53 50 -85
6889 -85 74 77 24 12 32 -4 38 50 -30 4 -22 56 -120 -71 50 178 145 -122 -14 24 -33 -19 -29 -49 55 22 190
6916 190 53 -63 -123 27 -50 -8 -69 138 -81 17 62 -16 153 -183 121 9 49 54 -23 -38 -142 -51 73 88 78
6941 78 -157 77 73 159 17 -197 18 30 -17 -16 -57 -59 -12 -3 -4 -78 122 -139 -160 -42 -17 84 -16 41 3 -18 -54 -30
6969 -30 16 -11 66 -10 -33 129 112 122 -44 -13 -116 -3 -76 -9 -27 -75 30 10 152 88 69 6 -88 1 12 -16 -119
6996 -119 15 119 -70 0 20 -5 -180 56 120 -64 -82 -79 -5 -42 11 -52 -23 40 -22 20 30 113 152 63 -157 -6
7022 -6 11 -12 168 159 4 22 -77 -131 -86 85 -1 138 -52 203 47 -139 117 33 -2 -77 5 46 -19 181 -44 142
7048 142 -81 37 -57 -18 -46 64 157 97 -19 -89 -82 -19 -49 -130 130 -154 75 -39 -85 31 36 118 25 -15 128 -5
7074 -5 -50 29 -35 42 193 52 34 -26 60 87 -44 90 21 -16 -28 17 -63 -77 -13 -129 32 220 -73 17 1 15 15
7101 15 121 -8 107 101 45 5 135 35 208 -67 19 -19 48 -44 83 -16 124 -24 -32 -58 -74 93 -1 132 61
7126 61 66 65 -51 -50 83 -34 -7 -154 54 -42 -92 -121 -20 90 -72 -191 90 43 -61 7 112 -179 102 58 -71
7151 -71 -11 -27 69 -83 26 43 32 10 9 13 25 10 -161 -40 -21 -73 -123 137 19 -83 62 -66 -12 71 5 39 116
7178 116 16 -140 -95 191 62 -47 167 183 -73 -45 -57 -19 -1 -13 -7 -101 -1 -37 126 63 67 100 -49 -61 67
7203 67 -46 -56 -115 -45 11 -15 -30 -12 50 -183 94 -8 44 -58 -9 -132 37 -158 -59 -163 82 -144 -59 123
7227 123 -69 86 195 30 8 174 -2 138 120 -1 -32 96 11 107 -60 -60 41 -92 112 78 -3 -80 25
7250 25 55 25 -13 -13 58 172 -9 -54 62 140 39 -73 5 111 36 10 86 67 -59 -37 -176 40 -100 -111 -76 -42
7276 -42 89 -211 102 84 55 -12 35 -48 4 -74 23 22 -90 -162 -208 -81 129 82 -15 -137 52 -199 -54 -2 8 14
7302 14 -55 38 -11 -65 46 158 -130 64 54 -34 -156 133 47 38 -39 -126 23 19 12 121 -219 182 -126 -195 214 -230
7328 -230 -87 89 39 88 37 172 54 17 87 -187 -68 100 49 28 74 114 -82 -13 30 -10 -53 -24 72 -45 119
7353 119 32 81 -142 104 93 75 -67 -40 143 -18 -14 145 -123 -40 10 12 40 44 99 -76 -35 112 -45 55 177
7378 177 -47 -168 34 72 -102 21 -75 -38 111 -103 -42 67 65 88 4 -6 47 -159 -164 70 88 -12 27 55 104
7403 104 -22 45 49 15 -70 -14 -96 -73 -122 118 59 54 5 47 -42 45 -118 -151 105 -29 141 120 -51 -4 66 -48 149
7430 149 86 -70 -97 14 -162 115 53 -102 -5 -43 -27 50 -82 19 -90 52 127 236 -85 164 9 -62 11
7453 11 54 71 43 53 35 -29 16 9 31 -27 -46 190 -109 -2 19 57 -28 -20 95 -129 30 -37 68 -63 48 70 -67
7480 -67 -106 201 -38 -19 20 -29 -18 -36 120 219 84 44 273 55 -18 -89 -42 -30 -85 -107 -173 -22 -100 -51 28 1 126
7507 126 25 176 -6 -135 -187 2 29 124 -12 43 41 -196 -47 -100 -37 92 -41 99 15 162 89 -15 121
7530 121 -147 25 -161 95 -53 -37 -2 -69 -73 72 6 -43 -26 -14 96 99 -71 -59 18 124 159 69 22 71 15 74
7556 74 133 -4 26 54 110 -19 -207 57 89 14 112 -44 -4 -69 -132 -45 193 -47 -140 115 70 -112 -15 11 141
7581 141 0 58 -70 0 213 -64 -15 -109 36 -72 104 39 187 28 -63 59 3 -40 103 37 20 -4 -40 -37 -1
7606 -1 38 43 121 93 -75 -42 -29 162 40 127 -47 43 66 -167 65 -145 34 -187 1 -37 127 90 -7 -7 74 99
7632 99 91 62 37 38 6 36 -25 50 62 62 -47 82 15 122 61 -24 74 -17 131 -148 16 -20 -13 -60 54 23 25 -32 27
7661 27 -84 -58 22 87 52 -56 -13 -59 64 16 25 44 -44 14 -24 53 -106 34 38 86 -109 -170 -147 -26 19 10 -56 128
7689 128 30 191 68 -35 2 -37 87 70 48 -23 -18 -123 -122 -136 47 -123 -20 -147 87 -17 74 169 50 -12 -36
7714 -36 -45 -24 -21 -78 22 -105 -9 -96 23 -43 26 -37 99 21 -137 -41 -30 157 154 17 -40 37 12 -84 -2 -21 -110 -7
7742 -7 -26 -117 -6 -188 -143 -18 -145 193 1 119 89 70 -23 -47 14 148 -78 117 -28 -73 73 107 142 106 64
7767 64 20 2 10 73 38 58 -28 -58 174 30 -1 22 25 76 2 137 -45 20 50 -138 -63 -60 3 38 136 -55 82 81 -19
7796 -19 1 -5 -10 100 -42 31 -56 119 24 -86 -122 -68 18 -146 -57 13 114 48 0 -74 4 -45 -68 31 54 130 156 -90
7824 -90 64 -14 -89 23 171 -85 150 25 -51 -126 42 -34 20 -6 54 63 -9 6 41 -37 -100 -124 -74 23 66 -21 -46
7851 -46 39 -41 -96 -20 99 99 -65 -24 -105 53 16 141 2 -65 40 -136 -160 52 -10 -73 146 -163 -44 73 113
7876 113 -11 51 56 41 -12 143 100 51 -64 -10 -17 81 -12 -158 -45 -5 -79 -128 52 -60 -41 180 -63 -79 110 45
7902 45 -30 54 34 -193 -75 -88 -103 -12 -82 67 -77 133 -29 93 -173 0 41 31 -48 -65 31 -26 -50 66 -41
7927 -41 29 56 85 -99 108 37 -124 15 -3 56 -148 88 -15 149 -178 -48 95 192 103 -174 46 -25 -40 -56
7951 -56 127 107 -1 -53 -34 81 53 91 -127 93 -117 -15 -103 -37 -63 152 -70 -54 19 160 -123 81 137 -10
7975 -10 -46 -105 55 56 75 -85 -20 -89 29 -57 58 48 38 -13 -107 -140 -30 83 5 -18 -52 143 -38 63 27 -130
8001 -130 -127 -77 -42 82 -47 -165 -122 -33 96 44 -25 116 8 -137 -24 -130 81 131 -7 -79 138 18 21 148
8025 148 105 45 -102 -58 6 19 49 86 -54 138 -3 -12 148 -104 -175 -42 18 129 102 17 20 -37 127 21 -20 -23
8051 -23 -98 -102 -25 103 108 -136 21 -144 5 22 -128 -46 -21 -38 -51 -50 5 27 89 103 -145 43 131 -85 -52 -113 -122 -19
8079 -19 109 -89 -59 45 -40 7 -133 77 -79 -131 -5 87 -2 158 67 -17 -40 -46 27 -92 -141 109 166 107 36 32
8105 32 103 -144 -192 3 -13 -42 50 99 -68 -87 40 -22 46 164 163 113 -81 -178 19 99 34 -13 -135 73 25 -68
8131 -68 36 38 18 85 -36 67 -81 -25 -27 -44 -115 129 62 39 -85 -106 -17 -129 -10 -19 149 -130 121 30 37 -117
8157 -117 55 -43 114 -45 -83 -59 -43 -18 72 165 -10 178 46 96 -47 35 -111 -37 19 14 -191 -4 -20 -77 51
8182 51 -18 207 -65 -21 160 135 21 -41 -137
8191a37
##END NTUPLES=NMR FID
##END=
