##TITLE=1H_15-2025
 200.13MHz, CDCl3,
 8 sc
 
 22.1.2025
##JCAMPDX= 6.0         $$ Bruker NMR JCAMP-DX V2.0
##DATA TYPE= NMR FID
##DATA CLASS= NTUPLES
##ORIGIN= UXNMR, Bruker Analytische Messtechnik GmbH
##OWNER= pz
$$ XWIN-NMR		Version 3.5
$$ Wed Jan 22 13:47:12 2025 Russian Standard Time (UT+4h)  she@DPX200
##.OBSERVE FREQUENCY= 200.1313
##.OBSERVE NUCLEUS= ^1H
##.DELAY= (6, 6)
##.ACQUISITION MODE= SIMULTANEOUS
##.ACQUISITION SCHEME= undefined
##.AVERAGES= 8
##.DIGITISER RES= 18
##SPECTROMETER/DATA SYSTEM= spect
##.PULSE SEQUENCE= zg30
##.SOLVENT NAME= D2O
##.SHIFT REFERENCE= (INTERNAL, D2O, 0, 14.3821)
##AUDIT TRAIL= $$ (NUMBER, WHEN, WHO, WHERE, WHAT)
$$ ##TITLE= Audit trail, XWIN-NMR		Version 3.5
$$ ##JCAMPDX= 5.01
$$ ##ORIGIN= Bruker BioSpin GmbH
$$ ##OWNER= she
$$ F:/spectra/data/she/nmr/H-C/1/audita.txt
$$ ##AUDIT TRAIL=  $$ (NUMBER, WHEN, WHO, WHERE, WHAT)
(   1,<2025-01-22 13:46:04.34 +0400>,<she>,<DPX200>,
      <created by zg, POWCHK disabled, PULCHK disabled
       configuration hash MD5:
       00 E9 B6 7A A2 85 ED C7 34 08 36 98 17 FE 4E 26
       data hash MD5: 16K
       93 C5 6D BA 37 43 00 21 91 89 4C 2D 73 CC 09 49>)
$$ ##END=
$$ 
$$ hash MD5
$$ 50 B6 AA E2 C9 A4 C3 36 A6 79 47 E4 6D C5 C3 8A
##$RELAX= 
##$RELAX= 
##$RELAX= 
##$RELAX= 
##$RELAX= 
##$RELAX= 
$$ Bruker specific parameters
$$ --------------------------
##$DU= <F:/spectra>
##$EXPNO= 1
##$NAME= <H-C>
##$PROCNO= 1
##$TYPE= <nmr>
##$USER= <she>
##$AMP= (0..31)
100 100 100 100 100 100 100 100 100 100 100 100 100 100 100 100 100 100 
100 100 100 100 100 100 100 100 100 100 100 100 100 100 
##$AQSEQ= 0
##$AQ_mod= 1
##$AUNM= <au_zg>
##$AUTOPOS= <>
##$BF1= 200.13
##$BF2= 200.13
##$BF3= 200.13
##$BF4= 200.13
##$BF5= 200.13
##$BF6= 200.13
##$BF7= 200.13
##$BF8= 200.13
##$BYTORDA= 1
##$CFDGTYP= 0
##$CFRGTYP= 5
##$CHEMSTR= <none>
##$CNST= (0..31)
1 1 145 1 1 1 1 1 1 1 1 1 1 1 1 1 1 1 1 1 1 1 1 1 1 1 1 1 1 1 1 1 
##$CPDPRG= <>
##$CPDPRG1= <>
##$CPDPRG2= <>
##$CPDPRG3= <>
##$CPDPRG4= <mlev>
##$CPDPRG5= <mlev>
##$CPDPRG6= <mlev>
##$CPDPRG7= <mlev>
##$CPDPRG8= <mlev>
##$CPDPRGB= <>
##$CPDPRGT= <>
##$D= (0..31)
0 0.7 0 0 0 0 0 0 0 0 0 0.03 0 0 0 0 0 0 0 0 0 0 0 0 0 0 0 0 0 0 0 0 
##$DATE= 1737539163
##$DBL= (0..7)
120 120 120 120 120 120 120 120 
##$DBP= (0..7)
150 150 150 150 150 150 150 150 
##$DBP07= 0
##$DBPNAM0= <>
##$DBPNAM1= <>
##$DBPNAM2= <>
##$DBPNAM3= <>
##$DBPNAM4= <>
##$DBPNAM5= <>
##$DBPNAM6= <>
##$DBPNAM7= <>
##$DBPOAL= (0..7)
0.5 0.5 0.5 0.5 0.5 0.5 0.5 0.5 
##$DBPOFFS= (0..7)
0 0 0 0 0 0 0 0 
##$DE= 6
##$DECBNUC= <off>
##$DECIM= 32
##$DECNUC= <off>
##$DECSTAT= 4
##$DIGMOD= 1
##$DIGTYP= 9
##$DL= (0..7)
0 120 120 120 120 120 120 120 
##$DP= (0..7)
150 150 150 150 150 150 150 150 
##$DP07= 0
##$DPNAME0= <>
##$DPNAME1= <>
##$DPNAME2= <>
##$DPNAME3= <>
##$DPNAME4= <>
##$DPNAME5= <>
##$DPNAME6= <>
##$DPNAME7= <>
##$DPOAL= (0..7)
0.5 0.5 0.5 0.5 0.5 0.5 0.5 0.5 
##$DPOFFS= (0..7)
0 0 0 0 0 0 0 0 
##$DQDMODE= 0
##$DR= 18
##$DS= 0
##$DSLIST= <SSSSSSSSSSSSSSS>
##$DSPFIRM= 0
$$ [...]
##$SUBNAM0= <"">
##$SUBNAM1= <"">
##$SUBNAM2= <"">
##$SUBNAM3= <"">
##$SUBNAM4= <"">
##$SUBNAM5= <"">
##$SUBNAM6= <"">
##$SUBNAM7= <"">
##$SUBNAM8= <"">
##$SUBNAM9= <"">
##$SW= 18.0517328524113
##$SWIBOX= (0..15)
0 0 2 0 0 0 0 0 0 0 0 0 0 0 0 0 
##$SW_h= 3612.71676300578
##$TD= 16384
##$TD0= 1
##$TE= 0
##$TE2= 300
##$TE3= 300
##$TEG= 300
##$TL= (0..7)
0 120 120 120 120 120 120 120 
##$TP= (0..7)
150 150 150 150 150 150 150 150 
##$TP07= 0
##$TPNAME0= <>
##$TPNAME1= <>
##$TPNAME2= <>
##$TPNAME3= <>
##$TPNAME4= <>
##$TPNAME5= <>
##$TPNAME6= <>
##$TPNAME7= <>
##$TPOAL= (0..7)
0.5 0.5 0.5 0.5 0.5 0.5 0.5 0.5 
##$TPOFFS= (0..7)
0 0 0 0 0 0 0 0 
##$TUNHIN= 0
##$TUNHOUT= 0
##$TUNXOUT= 0
##$USERA1= <user>
##$USERA2= <user>
##$USERA3= <user>
##$USERA4= <user>
##$USERA5= <user>
##$V9= 5
##$VALIST= <valist>
##$VCLIST= <CCCCCCCCCCCCCCC>
##$VD= 0
##$VDLIST= <DDDDDDDDDDDDDDD>
##$VPLIST= <PPPPPPPPPPPPPPP>
##$VTLIST= <TTTTTTTTTTTTTTT>
##$WBST= 1024
##$WBSW= 4
##$XGAIN= (0..3)
0 0 0 0 
##$XL= 0
##$YL= 0
##$YMAX_a= 665439
##$YMIN_a= -670718
##$ZGOPTNS= <>
##$ZL1= 120
##$ZL2= 120
##$ZL3= 120
##$ZL4= 120
##$ABSF1= 10
##$ABSF2= 0
##$ABSG= 5
##$ABSL= 3
##$ALPHA= 0
##$AQORDER= 0
##$ASSFAC= 0
##$ASSFACI= 0
##$ASSFACX= 0
##$ASSWID= 0
##$AUNMP= <proc_1d>
##$AZFE= 0.1
##$AZFW= 0.1
##$BCFW= 1
##$BC_mod= 2
##$BYTORDP= 1
##$COROFFS= 0
##$CY= -3
##$DATMOD= 1
##$DC= 2
##$DFILT= <>
##$DTYPP= 0
##$F1P= 0
##$F2P= 0
##$FCOR= 0.5
##$FTSIZE= 0
##$FT_mod= 4
##$GAMMA= 1
##$GB= 0.15
##$INTBC= 1
##$INTSCL= 1
##$ISEN= 128
##$LB= 0.25
##$LEV0= 0
##$LPBIN= 0
##$MAXI= 10000
##$MC2= 0
##$MEAN= 0
##$ME_mod= 0
##$MI= 1.114404
##$NCOEF= 0
##$NC_proc= 0
##$NLEV= 6
##$NOISF1= 3.799351
##$NOISF2= 2.8
##$NSP= 1
##$NTH_PI= 0
##$NZP= 0
##$OFFSET= 14.38212
##$PC= 1
##$PHC0= 248.3263
##$PHC1= 12.5922
##$PH_mod= 1
##$PKNL= yes
##$PPARMOD= 0
##$PSCAL= 0
##$PSIGN= 0
##$REVERSE= no
##$SF= 200.129724274929
##$SI= 16384
##$SIGF1= 3
##$SIGF2= 2
##$SINO= 400
##$SIOLD= 16384
##$SREGLST= <1H.CDCl3>
##$SSB= 0
##$STSI= 0
##$STSR= 0
##$SW_p= 3205.1282051282
##$SYMM= 0
##$S_DEV= 0
##$TDeff= 0
##$TDoff= 0
##$TI= <>
##$TILT= no
##$TM1= 0
##$TM2= 0
##$TOPLEV= 0
##$USERP1= <user>
##$USERP2= <user>
##$USERP3= <user>
##$USERP4= <user>
##$USERP5= <user>
##$WDW= 1
##$XDIM= 8192
##$YMAX_p= 0
##$YMIN_p= 0
$$ End of Bruker specific parameters
$$ ---------------------------------
##NTUPLES= NMR FID
##VAR_NAME=  TIME,          FID/REAL,        FID/IMAG
##SYMBOL=    X,             R,               I
##VAR_TYPE=  INDEPENDENT,   DEPENDENT,       DEPENDENT
##VAR_FORM=  AFFN,          ASDF,            ASDF
##VAR_DIM=   8192,          8192,            8192
##UNITS=     SECONDS,       ARBITRARY UNITS, ARBITRARY UNITS
##FACTOR=    0.0002768,     1,               1
##FIRST=     0,             0,               0
##LAST=      2.2672688,     0,               0
##MIN=       0,             -670718,         0
##MAX=       2.2672688,     665439,          0
$$ Real data points
##PAGE= N=1
##DATA TABLE= (X++(R..R)), XYDATA
0 0 0 0 0 0 0 0 0 0 0 0 0 -8 8 -8 8 -8 16 -16 16 -24 27 -32 37 -40 48 -57 67 -77 85 -99 110 -125 140 -160
34 -160 178 -200 221 -247 276 -306 337 -374 414 -458 506 -553 609 -673 743 -815 896 -989
52 -989 1092 -1210 1341 -1491 1668 -1876 2126 -2425 2801 -3282 3923 -4810 6105 -8156 11771
67 11771 -19334 40902 -216924 -654549 532716 480162 -549060 96045 665439 -309617
77 -309617 -391386 482344 87560 -518336 135475 330602 -346416 -177909 288319 -92806
87 -92806 -255061 118375 118378 -53408 -2759 78734 120694 -27115 -142006 107122 103567 -242670
99 -242670 -28054 294545 -127375 -278505 288122 147711 -423617 57702 414769 -324572
109 -324572 -251332 518067 -13270 -491395 321029 306312 -492886 -30671 478807 -235182
119 -235182 -326829 401516 97888 -437015 131803 323562 -312691 -133220 349547 -66027
129 -66027 -243523 195768 98393 -201999 -700 122683 -41816 -62611 47464 72325 -12737
140 -12737 -68560 26634 75307 -80098 -103047 114060 52628 -183201 48851 223305 -164238
151 -164238 -136171 279956 -24969 -295298 191107 178873 -302297 -5487 306883 -160698
161 -160698 -217646 269275 53456 -320228 103476 250436 -231189 -81576 298701 -65812
171 -65812 -212284 193033 89671 -211598 22298 150686 -98300 -94533 100280 20770 -106115
182 -106115 6334 66559 -40292 -44629 38919 44273 -8975 -36903 46051 77743 -73541 -41710
194 -41710 124418 -41413 -141549 113228 71344 -171791 16841 166027 -105751 -117953
204 -117953 164019 24700 -197337 71345 153953 -169607 -54292 216739 -49667 -153346
214 -153346 154411 71009 -165529 29628 131944 -97136 -85453 112361 10542 -125281
224 -125281 33914 83451 -81625 -34785 89004 -2105 -49506 32942 36053 -20796 -31741
235 -31741 22428 41096 -43959 -33021 69286 298 -76564 37444 57634 -73648 -37385
246 -37385 84763 -10522 -101313 57943 81010 -108265 -18809 136082 -47339 -90650 115299
257 115299 32045 -121971 33936 95812 -81482 -62890 94319 3971 -105576 45735 80073
268 80073 -86325 -25279 97020 -29159 -73101 54732 34608 -56059 -8267 53860 -661
279 -661 -45057 27436 46296 -46414 -28160 54678 -1732 -55526 13106 38272 -31129 -36894 47133
292 47133 26155 -66277 8998 74687 -50413 -48661 80306 6258 -78093 34807 58788 -57303
304 -57303 -29860 74514 -354 -80689 37084 58890 -78088 -22028 82687 -31876 -63764
315 -63764 58848 28627 -58699 5833 58860 -17375 -42919 42779 29919 -59401 -5927 50408
327 50408 -31685 -36671 40509 13725 -35139 1588 35813 -5876 -38265 21352 33473 -45186
339 -45186 -15695 52070 -15512 -42240 36387 23858 -43859 -6517 49796 -7612 -47852 35152
351 35152 34836 -60900 -4080 61894 -36667 -41917 56485 9951 -52856 17196 42562 -33623 -31358
364 -31358 42817 7524 -52943 21833 46216 -41439 -14394 48643 -10589 -35205 19222 18154
376 18154 -24196 -14785 29059 9898 -34887 8432 34653 -28502 -21050 35824 1883 -33944
388 -33944 9271 31018 -18167 -28182 34909 16845 -50016 11863 49649 -40454 -24229 54287
400 54287 -8275 -50662 24349 27908 -41249 -14653 46946 -4977 -42328 36553 33380 -46893
412 -46893 1217 44882 -25154 -24592 31306 5648 -25889 1705 22732 -6443 -26490 12176
424 12176 16966 -29896 -10969 24694 -6643 -21024 14679 23592 -11700 -13745 34694 14425 -40530
437 -40530 13976 38235 -42232 -18755 47003 -17706 -43754 30084 18925 -42916 -2043 45400
449 45400 -15716 -33335 42430 15446 -50429 15328 35183 -40069 -10618 39229 -8656 -19184
461 -19184 21406 13116 -15495 -7488 12715 -3669 -21673 2976 9749 -10959 -4817 9674 8844
474 8844 -3919 -9761 19603 11879 -28510 11573 30699 -35279 -13025 40811 -18732 -36738 33233
487 33233 16631 -40914 3715 40886 -26205 -32444 45157 4817 -52167 29548 37924 -45073
499 -45073 1002 45445 -23358 -22039 32546 2616 -28220 7555 19493 -16746 -14309 15277
511 15277 -4572 -18122 8104 2200 -5766 7434 -1466 6546 12685 -18811 734 25009 -22373
524 -22373 -12516 36432 -4221 -27535 27565 17433 -39587 -5287 35790 -25671 -35818 44081
536 44081 8790 -51489 28815 37083 -51021 -2734 47184 -28111 -25138 40565 5448 -30131
548 -30131 18296 24738 -24278 -9210 24989 -13738 -22132 20181 -1357 -17995 14735 -788
560 -788 -11706 13876 -5461 -9597 19160 -4245 -13794 20207 3153 -21973 11277 18641 -22876
573 -22876 -8580 33129 -9274 -31169 33613 11095 -48004 18747 33003 -47294 -6452 44255
585 44255 -26009 -26007 40779 4773 -33831 22241 29045 -30073 -5237 36762 -17770 -27569 29268
598 29268 -3892 -33098 20761 9350 -24572 11891 11293 -15991 4799 6871 -12475 2985 8783
611 8783 -7555 1958 16594 -6200 -10117 21785 -1502 -27293 21295 12303 -39307 11279 29036
624 29036 -38874 -7421 40193 -21265 -26681 35367 5538 -35682 17497 30916 -30935 -10014
636 -10014 41153 -14500 -30766 35266 5112 -36374 21965 18999 -29757 3368 18547 -18689
648 -18689 -8456 11526 -6589 -9256 8081 2000 -7022 9751 6297 -8447 12360 7363 -19523
661 -19523 11342 13766 -27390 4733 23286 -27243 -8170 30094 -15559 -23283 25148 5729
673 5729 -30326 9889 27141 -24501 -11149 37840 -8182 -28904 33162 9505 -36792 15864
685 15864 20781 -29544 -1426 23543 -13656 -14177 14285 889 -16626 5602 11280 -12416 -947
698 -947 12775 -8463 -235 11643 -10070 1555 13254 -12440 1359 16095 -15590 -5461 18852
711 18852 -9878 -16559 15299 3303 -22540 4712 19516 -19178 -10141 32283 -6151 -27077
723 -27077 27985 11007 -32294 14118 22509 -26060 -4524 24806 -8724 -17861 14196 7667 -20041
736 -20041 589 16505 -13923 -9713 17150 -4790 -10357 12460 -150 -4022 7978 -3326 -73
749 -73 7855 -7516 -981 9154 -7839 -7654 10158 2359 -13112 2299 14051 -13558 -11699 22647
763 22647 -3954 -24127 21323 11158 -27040 10591 22865 -19118 -6109 22268 -3751 -17136
775 -17136 11334 11062 -19054 -3534 18791 -11380 -13595 17771 -1784 -15662 9977 3859 -8039
788 -8039 4905 3119 -1075 1634 -1288 2992 2907 -3582 -49 3783 669 -4048 -1253 6201 -6705
803 -6705 -9623 12753 -1955 -17113 14020 8471 -19573 7127 16430 -13376 -3581 16290 -2708
816 -2708 -14115 8602 11394 -14955 -2939 18695 -9113 -13199 18090 -1271 -18289 9558 5174
829 5174 -13406 817 7878 -2286 -2816 4444 5524 -3690 -392 7593 -2408 -4041 3086 -1235
843 -1235 249 -586 -4896 4816 -1840 -9994 8689 3502 -13238 6226 9486 -10831 -1409 11891
857 11891 -2116 -9596 7371 10451 -12250 -2168 18545 -7938 -13801 17386 -12 -18780 8619
870 8619 6720 -14654 -1512 10002 -2966 -6918 6391 7481 -8204 -579 11922 -4681 -4878
883 -4878 8847 -1705 -4027 3612 -1516 891 -680 -5881 4388 -312 -9741 3816 4667 -7634
897 -7634 -157 7597 -214 -5920 4517 8560 -9172 -3728 16281 -5085 -11929 15161 780 -16224
911 -16224 8125 7334 -14039 -2281 9630 -3691 -8736 7091 7053 -10621 197 12290 -8476
924 -8476 -4995 12667 -3026 -5599 8288 -261 -3147 2768 -1535 -915 -870 -3457 1692 535 -3124
939 -3124 450 1154 455 -3217 -234 6421 -5296 -4266 12856 -2541 -9543 14177 2350 -13986
953 -13986 8209 7120 -13257 -1814 9920 -4995 -10504 7634 5715 -13527 1682 14054 -11001
966 -11001 -5688 16509 -4517 -8832 11520 631 -7435 4985 3602 -3301 -1855 1513 494 -4062
980 -4062 274 1421 -3395 683 -507 -3456 5148 -1895 -5778 10030 -463 -9473 12182 4293
994 4293 -11487 6727 8402 -10777 -2351 10278 -3327 -11315 6944 7202 -14393 682 15189
1007 15189 -12367 -7780 16611 -5389 -10955 12710 2243 -9269 6014 6382 -4717 -1371 5652
1020 5652 -741 -6323 3038 1712 -6974 3047 1827 -7937 3965 1618 -7987 6333 2804 -8836
1034 -8836 6794 5999 -8294 3153 7982 -5984 -3447 8223 483 -10207 4967 8108 -13481
1047 -13481 -1405 14143 -11694 -8028 15901 -5822 -12159 13151 2605 -11209 6181 7954
1059 7954 -7219 -1640 9489 -1682 -8266 7553 3462 -11162 4252 6032 -10964 1619 5838
1072 5838 -9303 997 5587 -6884 1275 5643 -4755 186 6329 -1455 -3814 5610 3160 -8174
1086 -8174 3108 9101 -10798 -3260 13592 -9631 -9352 14657 -3853 -13353 10852 3919 -12395
1099 -12395 3678 9591 -7193 -4677 11470 453 -10519 8694 6944 -12424 3842 9200 -11442
1112 -11442 -17 8818 -8840 -2525 6433 -5560 -2227 5012 -2302 -3225 4219 1677 -3839 2780
1126 2780 5818 -6476 52 10448 -7426 -5110 13057 -5306 -10005 11939 -1068 -12901 7402
1139 7402 4450 -11447 941 9011 -5201 -6200 9906 1882 -10755 7851 8055 -12496 3041
1152 3041 10937 -10629 -1431 10713 -7251 -4858 7379 -3092 -5730 4356 776 -5609 817
1165 817 4743 -4529 -1782 7885 -3764 -4162 10432 -2746 -6854 10610 -1090 -8955 8794 1218
1179 1218 -9903 4524 4324 -8406 -1435 6837 -4089 -6910 8131 2459 -11051 5995 9128
1192 9128 -12030 1965 12722 -9266 -3169 11990 -4666 -6872 7999 305 -7521 1916 4358
1205 4358 -5962 -2727 6803 -3019 -5916 7702 -343 -6812 7629 695 -6659 7557 1573 -6847
1219 -6847 5824 2725 -6788 2301 4163 -5062 -2311 5166 -1547 -7652 5094 3909 -10249 3384
1233 3384 9150 -10379 -515 11695 -6876 -4115 10697 -1884 -6225 6179 2495 -6365 47
1246 47 4888 -4426 -4969 6609 -1635 -7846 6365 1343 -7922 5518 3114 -6772 4347 3510 -5318
1261 -5318 2358 3923 -3119 70 3625 -977 -3543 2484 1353 -6419 1444 4754 -7946 -131 7487
1276 7487 -7235 -1761 8998 -4748 -4147 8158 -577 -4759 5007 3189 -4626 72 5857 -2936
1290 -2936 -5615 6577 -203 -8716 5719 2723 -9182 3328 4781 -7068 881 5212 -2880 -736
1304 -736 3494 279 -1225 1662 2560 -2372 55 3714 -3922 -1611 4275 -4585 -2008 5609 -4404
1319 -4404 -2638 6214 -3287 -3533 5812 -111 -3963 3374 3572 -3250 -1137 6002 -922 -5865 6272
1334 6272 1816 -9122 3658 4432 -8537 1075 5500 -5607 -1670 4299 -1656 -2303 2405 2041 -2223
1349 -2223 151 4683 -1676 -1907 4883 -2314 -2743 4625 -2418 -3157 4553 -2711 -3325 4133 -1594 -3379
1365 -3379 2372 138 -2428 338 3076 -637 -1986 4688 1604 -5166 4364 3236 -6992 2363 4395
1380 4395 -6661 202 4840 -4258 -2308 3369 -794 -3217 1312 2754 -2962 -1116 5455 -1307 -3054
1395 -3054 6200 -506 -3986 4931 -172 -4250 3417 202 -3392 1440 -213 -2336 8 184 -599
1410 -599 -1700 1446 957 -2414 2791 2403 -4299 3079 3484 -5235 2152 4435 -5538 -349 4200 -3280
1426 -3280 -2257 2797 -276 -3841 63 3158 -3597 -2556 5702 -1380 -4542 6146 1134 -4720 4529
1441 4529 1833 -3760 2238 1784 -2177 -213 394 -640 -1652 -25 481 -2699 135 1065 -3472 1468
1457 1468 3110 -4091 2069 4159 -4353 1186 4591 -3588 -747 3864 -1750 -2428 2110 1407 -3306
1472 -3306 -1063 3320 -2652 -3854 5190 -847 -4971 5112 899 -4830 3891 2295 -3613 1716 2742
1487 2742 -1733 12 2151 117 -2462 503 1703 -3601 -225 2690 -4498 -540 4018 -3851 -327
1502 -327 4324 -2817 -491 4104 -1610 -1327 3092 52 -1624 999 2121 -2002 -1687 3737 -1680 -3878
1518 -3878 4720 -945 -5316 4370 534 -5569 3552 2688 -3939 1038 3527 -1409 -1050 3299 1246
1533 1246 -3205 1312 3147 -4310 -783 4710 -4233 -2020 4239 -3090 -1896 3809 -2057 -1565 2838
1548 2838 -515 -1276 2246 1611 -1208 308 2518 -1583 -1853 4219 -989 -4222 4037 -222 -6039 3710
1564 3710 1619 -5981 1900 3400 -3830 -228 3817 -1156 -2471 3303 2209 -3725 1424 4284 -3896
1579 -3896 -739 5159 -3484 -2203 4827 -3036 -3359 3525 -1127 -2741 2240 489 -2267 656 2301
1594 2301 -1228 -1055 3472 -285 -2681 4149 593 -5037 3355 1364 -5568 2274 2194 -4892 646 2472
1610 2472 -3045 -1285 2791 -483 -2559 2192 2484 -3648 1094 4804 -3802 -738 5914 -3276 -2700
1625 -2700 5707 -1776 -3916 3545 -419 -3780 1207 1909 -2546 -1206 3046 -513 -2696 3602 813
1640 813 -3430 3642 2224 -4133 2794 2420 -4429 1607 2682 -3993 -70 2364 -2603 -1958 1988 -192
1656 -192 -3229 1585 2841 -3822 135 5391 -3382 -1884 6386 -2182 -3317 5358 -401 -4269 3134
1671 3134 1185 -3677 79 2315 -1847 -2592 2998 -55 -3852 2765 1616 -4169 2721 2788 -4205 2076
1687 2076 3241 -3834 690 3251 -2684 -839 2687 -907 -2515 1464 981 -3546 -215 3470 -3682
1702 -3682 -1541 5240 -2441 -2799 5795 -520 -3553 4252 833 -3417 2128 2052 -2593 -773 2323 -985
1718 -985 -2966 2627 757 -4377 2036 2522 -4602 1400 3400 -4298 308 3916 -2437 -402 3322
1733 3322 -823 -1622 1857 741 -2277 101 2172 -2611 -1680 3041 -2315 -2607 4216 -1514 -3442 4105
1749 4105 -23 -3536 3443 1407 -2814 1337 2302 -1627 -1062 2687 47 -3411 2199 1836 -4951 1172
1765 1172 3262 -4762 -622 3876 -3252 -1054 3724 -1201 -952 2650 630 -1221 641 1814 -1451
1780 -1451 -852 2464 -1503 -2171 3044 -1301 -3134 3147 -380 -3294 2753 214 -3032 2061 1413 -1931
1796 -1931 462 2442 -204 -1822 2385 1399 -3198 1055 2581 -4290 -104 3145 -3740 -1197 3208
1811 3208 -2370 -1391 2662 -654 -1790 1210 1227 -937 71 2342 -675 -1532 3141 -266 -2753 3026
1827 3026 -325 -3504 2553 378 -3049 1537 895 -2681 263 1473 -808 -789 1355 690 -1917 1177
1843 1177 2099 -2383 613 2840 -2687 -378 3147 -2963 -869 2907 -1893 -1834 1800 -180 -1711 597
1859 597 1243 -1142 -917 2401 -278 -2076 2877 491 -2956 2622 1353 -3117 1621 1176 -2842 228
1875 228 894 -1382 -504 661 -116 -1433 448 1420 -1820 209 2489 -1908 -57 3288 -2033 -784
1891 -784 3422 -1413 -1430 2129 -1254 -1817 829 323 -1644 -824 1712 -774 -2177 2148 479 -2768
1907 -2768 2432 1489 -2990 1810 1893 -2421 1080 1476 -1604 -284 978 -918 -1006 193 540 -1715 -199
1924 -199 1654 -2021 -816 2721 -1342 -942 3025 -1170 -1266 2678 -297 -1613 1617 202 -829 329
1940 329 414 -620 -1102 1012 54 -2225 1162 1130 -2694 1623 1602 -2684 1414 2505 -1686 794 1848
1957 1848 -1014 -284 1115 -68 -1249 -25 1387 -1506 -1397 2318 -1329 -1937 2798 -719 -1864 2597
1973 2597 -59 -1425 1809 447 -566 1085 429 -231 -570 492 80 -1490 837 343 -2242 1200
1989 1200 884 -2513 1202 1647 -2611 869 2171 -1706 -25 1690 -550 -620 1004 1140 -1195 -671
2005 -671 2002 -1187 -1947 2012 -1052 -2293 1730 -414 -2074 1528 -80 -1142 1010 413 -257 437
2021 437 868 551 -425 634 680 -1485 699 1235 -2477 694 1378 -2598 290 1906 -2066 11 1544
2038 1544 -1195 -374 1107 557 -629 365 1403 -622 -709 1968 -482 -1896 2230 -422 -2355 1810
2054 1810 -126 -2033 1076 127 -1579 695 675 -328 -328 692 725 -1009 894 1391 -1642 526 1774
2071 1774 -1651 -88 1744 -2094 -188 1423 -1502 -520 887 -951 -724 577 159 -321 -57 1575
2087 1575 -355 -905 2314 37 -1935 2371 51 -2547 1853 368 -2212 860 696 -1514 -298
2102 -298 816 -244 -681 215 1126 -1204 27 1959 -1225 76 1903 -1513 -282 1904 -1337 -565
2118 -565 1544 -1049 -502 804 -569 -797 67 612 -458 -675 1453 -117 -1756 2022 233 -1915
2134 -1915 2328 703 -2237 1568 787 -1580 498 763 -1098 -605 222 -62 -959 -59 1150 -1468 22
2151 22 1833 -1554 -153 2143 -1322 -346 2306 -1027 -978 1664 -602 -711 549 141 -637 -605 694
2168 694 -381 -1543 1218 244 -1863 1450 635 -1794 1888 1340 -1918 1448 1013 -1156 744 611
2184 611 -699 -536 240 248 -1604 -341 1466 -1838 -346 1843 -1400 -875 2501 -1075 -650 2235 -342
2201 -342 -492 1110 132 -571 -24 669 -446 -1124 856 10 -1858 1222 785 -1994 1214 655 -2114
2218 -2114 1106 1018 -1375 1146 1091 -958 8 985 -102 -765 691 1137 -1566 -26 1353 -1577 -522
2235 -522 2231 -1261 -1400 2319 -679 -1172 1566 -132 -779 1110 722 -303 -229 978 240 -1029 1139
2252 1139 474 -1513 866 640 -2453 758 696 -2191 377 929 -1286 210 1403 -699 -107 777 548
2269 548 -569 329 1573 -1294 -513 1959 -1176 -987 2214 -942 -1219 1719 -588 -1250 1297 98
2285 98 -765 656 679 -401 -316 1097 378 -1325 1081 1180 -1834 588 1152 -1878 366 1261 -2119 46
2303 46 854 -1298 -66 835 -58 -697 369 796 -667 -223 1821 -792 -772 2074 -954 -1072 1914 -519
2321 -519 -1497 1417 -206 -1460 497 -30 -1175 -413 567 -141 -1049 1035 791 -1190 789 1175 -1563
2338 -1563 246 1691 -1794 134 1255 -1340 -353 495 -1024 -483 3 271 -444 -11 700 -704 -589
2355 -589 1828 -337 -1132 2145 -67 -1328 1726 78 -1274 1294 269 -888 46 17 -507 -703 513
2372 513 69 -1139 580 931 -1560 612 1261 -1260 485 1828 -991 131 1471 -746 -262 843
2388 843 -436 -704 -197 234 -503 -522 995 -453 -1232 1530 -214 -1067 1551 249 -1259 1346 431
2405 431 -1075 1012 193 -709 -174 -112 -85 -1018 188 258 -1202 -148 1041 -1379 -20 1366 -1242 283
2423 283 1487 -759 -219 1012 -301 -66 713 -22 -233 -388 661 -355 -908 992 -74 -1663 930
2440 930 150 -1404 1162 471 -1154 976 548 -848 234 630 -16 -61 332 487 -923 64 1017 -1409
2458 -1409 -128 1063 -1356 -640 1483 -968 -452 998 -406 -499 1002 300 -54 223 665 28 -730
2475 -730 785 0 -1129 524 174 -1614 725 269 -1210 679 668 -968 516 613 -472 -118 571
2492 571 478 -509 153 958 -763 -238 1296 -954 -786 1572 -763 -825 1167 -814 -997 684 -313 -417
2510 -417 432 268 113 -95 768 344 -566 886 222 -1304 1022 291 -1490 734 629 -1611 280 345
2528 345 -1002 382 574 -198 -500 490 649 -515 32 1179 -471 -347 1317 -528 -914 959 -545
2545 -545 -957 1049 -654 -839 651 139 -568 18 205 -61 -626 611 306 -982 1053 560 -1099 525
2563 525 939 -1237 651 520 -996 -112 666 -377 -412 5 -230 -632 142 659 -295 -179 1275 -515
2581 -515 -683 1491 -803 -407 1718 -569 -811 797 -23 -745 262 100 -352 -431 503 -272 -945 442
2599 442 483 -1101 749 1025 -1377 404 1036 -1065 250 755 -701 -268 542 -428 -380 112 193 -484 -377
2618 -377 638 -667 -159 1060 -715 -528 1194 -328 -601 1333 -12 -729 963 83 -551 235 295
2635 295 -499 -839 258 131 -1294 444 576 -1377 504 796 -995 107 1076 -984 -30 1021 -395
2652 -395 -157 222 57 -169 4 449 -502 -810 739 -535 -545 1202 -351 -1076 1291 98 -789 1216
2670 1216 4 -437 732 148 -192 -109 424 160 -709 237 154 -1069 407 641 -1450 420 735 -1219
2688 -1219 409 1057 -780 -59 1234 -367 -340 435 260 -281 -111 666 -272 -771 769 -655 -1201 1097
2706 1097 -290 -989 1143 -66 -608 732 304 -512 381 399 83 -164 303 272 -585 284 488 -1385 241
2725 241 726 -1161 -83 1038 -1363 48 1181 -877 -329 649 32 -251 472 525 -441 109 1207 -295
2743 -295 -943 906 -165 -960 815 -102 -1161 742 -1 -850 694 264 -221 305 296 90 -409 470 382
2762 382 -740 363 934 -670 56 968 -1157 -67 885 -1024 -200 839 -422 -422 517 63 -189 6
2780 6 491 -129 -324 1138 -49 -643 1186 80 -1333 872 -25 -1103 588 177 -993 169 464
2797 464 -390 -548 283 130 -504 87 682 -723 334 983 -813 -165 1020 -702 -242 760 -458 -103
2815 -103 687 -616 -564 317 -28 -329 116 743 -101 -700 804 235 -934 893 401 -1312 647 469
2833 469 -1141 378 451 -470 46 70 -63 -418 97 367 -413 -36 951 -600 -62 987 -723 6 1160
2852 1160 -490 -345 961 -493 17 143 22 -519 134 314 -592 -356 613 -2 -962 752 393 -1208
2870 -1208 937 462 -908 627 335 -736 160 244 -346 -59 222 160 -607 -65 457 -575 -280 996
2888 996 -703 -634 1221 -591 -451 987 -214 -551 954 -156 -494 441 393 -8 -160 451 -173 -948
2906 -948 392 309 -1305 535 509 -1136 612 387 -746 288 615 -265 208 333 -274 -189 290 455 -653
2925 -653 -261 477 -725 -513 1110 -525 -785 1007 -389 -576 901 -224 -613 272 171 -71 -157 113
2943 113 153 -506 495 235 -972 243 129 -796 526 424 -1011 -7 816 -711 -7 719 -185 -147
2961 -147 552 243 -207 124 734 -286 -347 898 -583 -715 1282 -284 -920 714 173 -837 707 247
2979 247 -322 -77 284 44 -224 514 393 -793 295 636 -740 226 548 -1074 98 557 -1068 -224
2997 -224 708 -906 -275 404 -150 -357 193 376 -252 -161 827 122 -758 1097 -339 -772 840 -135 -714
3016 -714 643 175 -880 132 169 -425 -174 388 161 -487 431 546 -429 237 728 -852 -290 924 -874
3035 -874 -163 825 -980 -362 295 -285 -15 11 -355 -202 -221 682 -67 -35 730 -102 -758 900 -3 -833
3055 -833 900 -110 -995 657 218 -979 171 365 -514 -356 93 116 -644 111 740 -762 115 1004
3073 1004 -648 -339 1039 -622 85 571 -314 -290 278 -134 -4 196 108 15 -467 482 -50 -823 450
3092 450 60 -798 796 138 -716 823 337 -679 336 258 -585 -62 65 108 -621 -28 303 -634 -198
3111 -198 611 -977 -195 817 -470 -140 686 -394 20 843 86 -50 198 52 -203 -76 257 -115 -852
3130 -852 388 10 -905 502 227 -1002 639 208 -666 672 168 -188 394 53 -177 194 110 119 -192
3149 -192 -48 383 -417 -451 783 -873 -153 733 -644 -293 960 -230 -254 764 -153 -175 219 398 87
3168 87 -287 186 432 -716 486 294 -847 -6 161 -848 135 383 -846 141 209 -368 226 317 -132
3187 -132 -76 72 179 -286 -223 596 -786 -463 997 -463 -655 822 -385 -551 446 -56 -126 364 194
3206 194 -68 60 489 332 -471 239 442 -454 406 256 -975 192 461 -936 190 14 -332 208 244
3225 244 -358 176 259 303 -505 260 740 -278 -447 1017 -259 -301 901 -321 -776 605 -272 -558 554
3244 554 -235 -285 -34 94 -123 -10 499 408 -455 466 505 -936 213 712 -732 95 773 -762 229 399
3264 399 -820 229 63 -27 -387 -114 208 -38 -350 666 -49 -202 907 -200 -471 724 -325 -170
3282 -170 820 -270 -314 236 -74 -405 -252 65 -101 -672 371 338 -612 166 578 -665 344 366 -650
3301 -650 40 571 -601 117 374 -384 -137 -256 144 -208 -167 326 -173 -282 479 -238 -320 665 137 -405
3321 -405 955 -114 -167 799 -131 -325 355 -175 -273 -149 96 101 -705 434 232 -643 112 529 -847 -4
3341 -4 949 -628 -85 748 -181 68 341 135 -316 52 61 -480 -295 359 -323 -644 696 -38 -563 737
3361 737 -65 -336 550 -22 -574 370 92 -155 347 -111 -118 -286 47 437 -961 225 479 -906 10 589
3381 589 -862 109 562 -341 135 688 -527 227 383 84 -55 -206 522 -130 -624 573 -66 -730 385
3400 385 -29 -759 11 119 -492 414 95 -387 288 21 -59 -6 59 256 -178 23 362 -485 -23 434 -848
3421 -848 -396 628 -746 -147 641 -590 -316 588 -137 -183 241 252 0 -192 567 92 -479 276 27 -785
3441 -785 322 256 -648 168 -5 -618 142 117 -415 161 -34 216 40 33 389 -285 -44 780 -261 -49 609
3462 609 -678 -346 722 -684 -352 247 -272 -219 127 -115 -129 133 163 104 -456 394 281 -407 429 196
3482 196 -560 750 424 -854 386 310 -436 238 159 -309 -235 -64 332 -384 108 637 -493 -196 728 -209
3502 -209 -124 667 -343 -304 723 -297 -303 373 -430 -344 -39 -212 8 -88 376 36 -290 841 179 -496 701
3523 701 387 -841 454 523 -626 495 202 -388 -199 70 88 -293 -64 293 -134 -148 538 -178 -362 710
3543 710 -170 -264 707 -5 -84 488 37 -115 176 -2 -110 -36 -33 133 -23 291 133 -505 228 34 -832 497
3565 497 439 -494 205 165 -362 164 337 -340 -22 81 99 -284 -235 326 -184 -292 541 -349 -568 794 -181
3586 -181 -493 743 163 -260 402 -32 -130 203 -228 -157 -335 207 80 -609 75 181 -307 116 -45 -622
3606 -622 339 168 -733 499 666 -384 135 502 -43 -299 272 18 -60 -533 259 -297 -568 615 -239
3625 -239 -846 672 -133 -484 470 62 -204 330 -111 -144 36 126 214 -385 95 287 -548 -218 243 -507 -142
3646 -142 136 -393 -27 363 -407 -65 273 -153 64 137 -1 65 23 475 -52 -251 426 -170 -199 431 223
3667 223 -322 94 -72 -555 266 -24 7 119 68 -10 -56 157 74 -147 194 290 -522 87 395 -428 -115 534
3689 534 -404 -158 121 -497 122 251 70 157 -106 -84 103 79 493 83 -242 362 165 -327 289 -3 -460
3710 -460 242 229 -533 578 152 -244 -3 238 112 -243 215 320 -353 -337 372 -494 -64 459 -255 -208 395
3731 395 -466 -439 164 -130 -154 -66 115 34 -57 181 138 -148 284 -77 -401 218 153 -662 178 -62 -474 614
3753 614 63 -298 297 -187 -256 -294 96 -35 -218 -66 413 -373 -69 605 -338 -133 603 -207 -135 38 -207
3774 -207 14 -1 -116 92 28 232 -85 -282 74 221 -240 178 154 -424 363 343 -289 341 375 -263 194 134
3796 134 -254 251 529 -186 -384 42 199 -268 -257 299 -500 -566 285 -153 -408 295 -311 -164 481 -48 -241
3817 -241 93 -155 16 -117 -57 -357 -536 47 125 -437 300 235 -464 219 189 -255 271 285 -67 117 -45 -146
3839 -146 -51 -198 66 8 -116 213 87 -165 21 -30 -471 339 -344 -225 457 -76 -56 692 134 -162 56
3860 56 397 -143 -401 489 342 -268 71 273 -790 -151 104 -295 196 78 -327 6 209 -190 -188 25 170
3881 170 -62 281 120 -2 203 432 -536 -352 679 -221 -718 397 -173 -680 172 133 -381 413 -62 -257
3901 -257 176 263 357 -203 -1 261 -145 227 277 -569 -98 54 -483 76 179 -498 139 344 59 -90 -91 250
3923 250 -115 86 168 61 82 448 -185 -278 309 -47 -537 408 -306 -415 315 122 -90 -173 47 -27 214 196
3945 196 124 -106 -37 543 -299 -27 175 -354 47 270 -284 -139 -93 -343 -81 0 -177 103 101 101 -136 8 296
3968 296 7 -248 547 85 -484 443 -52 -138 330 -252 -336 249 -82 -121 -8 -99 -18 -263 -131 282 -378 377
3990 377 320 -163 127 563 -155 93 428 -317 -194 359 91 -311 349 56 -165 -271 247 80 -68 108
4010 108 322 -520 466 213 -340 53 35 -342 96 63 -429 54 -66 -86 -132 19 -93 151 117 312 -147 -362
4032 -362 507 -4 -148 292 -23 -129 463 -342 -178 230 72 -26 -53 -51 292 -380 -19 -153 -395 114 -144
4053 -144 -586 209 189 -285 169 134 12 175 275 -43 -26 -32 -105 -107 -88 166 89 -182 100 -101 -252 428 -556
4076 -556 -207 701 10 -319 340 -26 157 371 -123 -340 54 -99 257 -397 330 185 -561 438 193 -354
4096 -354 8 189 -277 18 28 -256 53 365 163 -196 33 -40 -94 31 276 118 -209 274 143 -382 231
4117 231 -179 -184 -74 -200 -271 323 246 -194 163 -57 -102 -87 215 169 -260 297 135 -723 188 88 -268 334
4139 334 -15 -219 238 -9 -114 -53 228 46 182 126 -127 212 -68 223 -322 -47 416 -151 -100 99 -139
4160 -139 -388 41 -86 17 128 -146 -422 228 -79 51 -153 170 98 -183 13 -53 -483 172 175 -385 -13
4181 -13 -10 -494 47 206 -146 -123 118 69 261 -163 228 -121 -79 254 63 -355 51 -56 -341 312 -242 -400
4203 -400 103 -407 -216 64 51 -21 -48 33 -105 -316 -93 67 -193 158 -45 -243 -177 304 -175 45 167 -457
4225 -457 -286 90 -334 25 -271 291 -41 -8 -184 136 -177 324 -20 -414 242 -130 -212 10 93 396 134
4246 134 161 -246 -44 184 35 -59 -180 279 -386 70 209 -331 129 281 -115 215 383 -26 -102 125 -88
4267 -88 -109 -16 -208 -360 -326 87 144 7 241 -389 -302 274 -56 -250 404 -57 -48 195 95 230 52 93 310
4290 310 -35 -26 89 39 -260 272 -278 185 286 -354 90 369 -233 -247 670 -311 -251 130 227 140 12 67 -296
4313 -296 -105 -37 -28 24 137 285 -292 72 -96 -377 109 247 -42 180 172 -223 160 33 88 192 -186 291
4335 291 5 -21 238 -119 -200 -48 -324 -100 176 -69 -98 10 -52 -111 -229 118 -101 141 165 -150 -399 50
4357 50 -21 -194 286 37 -298 86 128 -308 370 46 -102 92 -110 -261 141 11 65 110 -431 176 -423 32
4379 32 83 -352 25 136 -182 -344 -97 -131 182 150 91 -29 11 -21 219 35 63 283 -165 134 -22 -472 238
4402 238 111 -364 -73 -5 -463 -131 -12 -100 235 290 -85 -131 196 94 -51 11 440 -293 -23 151 -133 -141
4424 -141 492 72 -232 168 69 -109 91 126 -170 216 -186 112 304 21 -97 -247 -46 242 -200 350 -28
4445 -28 -56 96 246 -355 -5 30 -328 -20 248 16 42 80 103 -218 117 334 -244 -98 239 47 -136 85
4467 85 -189 -106 -64 -300 -6 -80 10 -194 84 31 300 -154 115 97 -92 88 105 -179 42 -27 -311 51 -159
4490 -159 -80 -5 -53 23 -102 88 -8 -251 14 186 30 49 496 -109 -87 117 -74 -216 89 27 -99 83 -189
4513 -189 90 57 -85 140 -201 -21 64 -216 105 176 -86 -128 338 -87 69 159 -212 122 76 -150 327 114
4535 114 225 134 -141 52 -46 -260 152 -150 -216 146 -68 -212 279 -21 -231 -42 184 -2 -369 14 44
4556 44 -8 302 -29 -150 234 1 -257 -166 64 -100 -125 438 -126 68 123 -109 120 12 -3 -55 -20 -130 168
4579 168 -212 -36 -318 -346 275 -206 -372 16 -108 -507 -65 262 53 -28 68 15 73 -250 -42 22 -54 63
4601 63 153 -150 81 -93 -376 236 -41 -61 234 -244 -208 116 -340 143 304 -67 125 -104 -212 87 -161
4622 -161 226 101 -108 372 -79 -519 33 -129 -423 406 -54 -77 -86 8 -233 115 230 11 -21 -153 101 173
4644 173 -342 -190 -106 -234 -61 -251 -135 353 -272 -322 -129 -178 -82 99 -23 -223 66 260 -302 -206 2 190
4666 190 -117 -5 241 82 98 -73 -426 -40 -8 -111 25 123 -79 -92 61 88 17 -240 235 -223 -198 457
4688 457 101 -67 69 -77 -180 175 -206 -161 102 -305 219 55 49 -57 -175 87 -381 134 -201 -48 -31
4709 -31 -41 195 -172 -42 298 -161 267 103 -184 -112 -168 -352 -12 -115 -345 -57 -22 69 -148 -245 66 103 -79
4732 -79 233 82 161 90 -173 -21 -142 41 -72 -166 -158 235 77 -155 308 43 50 -141 -252 136 250 -26 178
4755 178 362 33 181 102 126 176 -179 -53 124 -77 30 23 -157 189 165 -221 45 -230 51 233 294 -8
4777 -8 8 177 -40 -90 -104 23 -103 -155 -162 -138 -172 30 -223 -54 154 -311 -83 -179 47 164 400 -46 130 -79
4801 -79 27 -338 -73 190 133 -46 18 214 -230 -37 158 -114 74 319 -231 322 -44 70 69 267 136 -150
4823 -150 -67 -53 91 -83 3 -111 24 353 -336 -42 181 -101 -35 325 136 -70 165 302 320 19 -42 157
4845 157 -190 -168 78 44 135 -115 -239 -84 -43 -59 225 -241 67 151 18 149 169 280 104 -71 79 108 121
4868 121 -137 141 -224 32 290 -287 -327 -16 -86 -3 -24 148 -206 222 -88 258 426 80 -13 -19 85 -31
4890 -31 117 -95 297 41 14 -78 -440 -195 9 -103 -61 -22 9 -9 186 202 -126 -31 2 -132 -248 -124 41
4913 41 -209 204 -88 -293 -51 -75 -114 -22 -28 29 -181 -249 -90 -42 -131 -150 -179 28 6 74 95 226 -36 321 299
4938 299 182 -192 -240 -132 -318 68 126 54 111 208 3 -176 121 185 20 -115 -162 51 235 -19 -167 -16
4960 -16 92 25 232 80 139 128 -27 -208 -12 161 125 -1 31 -8 -278 194 -81 -214 196 210 -115 49 66
4983 66 106 68 -321 60 -202 -81 135 -3 -94 95 28 48 -49 -106 -335 273 119 88 -196 132 41 7 -93 208
5007 208 -103 -252 -10 -222 163 -111 207 33 91 -239 315 204 -93 285 -82 30 2 72 -55 82 -293
5028 -293 -178 -53 -32 -35 -27 -58 -57 72 -41 -218 17 -295 -13 12 102 29 170 -146 -6 13 391 10 123 113
5052 113 -88 -226 30 -203 81 132 -286 -9 -54 -421 -69 194 -97 38 -45 104 9 -363 128 366 -63
5073 -63 -65 -339 -57 -115 86 -47 -34 -52 -106 37 102 -20 -84 -133 -286 190 -9 44 -7 26 42 38 34 -87 141 38
5099 38 -94 -328 -6 5 192 -134 169 -37 35 80 175 84 34 22 90 -197 78 52 -561 46 -31 -50 155 -35
5123 -35 -103 26 -96 92 95 112 122 25 16 11 -328 3 190 92 198 10 -106 -79 36 121 33 16 -5 176 -362 148
5149 148 -196 -280 97 133 -61 149 -112 88 33 -9 156 180 -165 -212 11 -217 109 -180 -142 130 83 210 -224
5172 -224 -42 -269 155 29 -117 -3 -98 65 165 -102 -240 -147 -105 7 10 155 86 100 -79 99 -180 -38
5194 -38 284 -4 71 -243 -107 -101 131 -62 -37 -167 25 -64 -40 -43 -80 -144 229 113 -57 -7 -109 -321 218 -204
5218 -204 -29 63 -206 6 122 -206 126 -50 -24 -42 50 -69 -112 102 -145 -59 -66 109 -191 -178 -201 291 -102
5241 -102 -25 -13 7 89 -95 -292 -39 254 -73 60 -167 64 -154 -72 -136 -89 86 -232 50 -71 421 -36
5263 -36 156 -37 -16 86 -246 91 -114 0 -135 262 -58 -157 71 -68 17 115 7 223 173 -221 -58 121
5285 121 17 -77 -221 267 59 33 193 -31 -5 53 75 87 299 -274 38 41 -165 -50 -318 116 -31 -81 -174
5308 -174 101 -159 -61 223 46 50 53 171 -92 262 40 117 338 108 11 347 -236 -108 -29 -287 -116 53 -31
5331 -31 88 247 85 160 11 -281 20 280 108 -225 -306 -24 -265 -418 25 -9 105 -150 81 27 49 4
5353 4 -85 173 109 -223 -202 256 82 -128 -63 323 70 87 -16 -67 -46 -45 98 -151 -296 -166 14 -69 -192 80
5377 80 131 4 -36 102 -49 -56 271 118 -115 87 342 114 106 -20 88 -96 107 -95 -277 116 99 149 -63
5400 -63 -52 -276 -91 20 328 -259 -34 22 186 159 27 -16 -171 -305 318 121 78 100 -46 -80 87 64 -32
5423 -32 139 65 -83 265 -150 106 85 -18 289 -273 -22 -64 68 -19 -265 59 117 142 -172 3 -158 -111 16
5446 16 148 121 170 132 -129 26 -277 109 228 164 -95 -180 -33 -131 197 -109 32 220 -162 -107 44 107 -408
5469 -408 53 178 -109 -33 -265 -88 77 84 -87 221 -248 -40 -27 300 -51 -60 -131 38 32 -53 108 -88 162
5492 162 -85 -20 75 97 -120 -87 95 -9 -74 -137 -88 -88 -127 205 -10 255 51 -7 119 132 -73 369 -95 124
5516 124 231 17 177 -149 -250 -70 -85 -195 368 -109 -75 -143 79 273 -140 64 126 26 -268 -13 -83 -194
5538 -194 -7 -276 3 -39 69 207 165 107 20 60 62 72 -82 -63 -158 5 -75 -144 53 47 -231 36 -192 -116 5
5563 5 86 -57 -90 66 26 -41 273 100 -239 28 -191 -39 -45 -154 128 9 -72 111 105 -35 -20 89 -150 39
5587 39 -216 -320 -17 -192 -100 -46 99 -8 -146 340 74 -193 143 154 125 190 87 13 30 32 127 6 -369 33
5611 33 301 -110 -169 8 125 -85 201 -105 -112 -84 55 174 -110 -76 -24 -105 -183 73 21 57 -23 -164 -194 195
5635 195 251 34 -48 -99 85 -201 64 -133 -185 75 -122 44 -24 -140 -22 -4 -146 -229 -60 16 14 -171 -123 111
5659 111 28 45 24 -57 225 -50 -238 -378 18 -367 -125 -213 225 -219 76 -22 -41 109 -7 60 65 30 -63 -235
5683 -235 137 -178 -36 232 117 -247 297 -145 -173 12 -35 268 -175 115 -239 -117 210 -66 156 298 -85
5704 -85 -133 168 190 -120 -250 37 -225 -8 -11 -201 283 213 -164 -67 18 -18 49 -196 -217 -135 -82 -299 128 -48
5728 -48 38 292 -144 -106 -133 -268 201 30 141 -212 -95 128 101 -270 -81 43 23 17 195 214 86 -327 -54
5751 -54 -144 -165 -60 190 -80 -6 258 107 28 -90 -75 33 88 -82 -209 -28 61 -136 59 54 61 190 -98 238
5775 238 56 -158 -11 43 33 -44 59 96 -86 81 -67 53 7 -41 101 -331 52 -189 -68 209 -82 -27
5797 -27 40 -60 98 52 97 143 16 -101 -137 146 169 -212 -63 104 -246 118 -48 -304 -112 118 -287 -137
5819 -137 125 -46 65 -39 -182 41 -311 54 -96 138 290 255 118 159 -123 39 23 -109 -204 -128 -6 76
5841 76 54 76 -188 58 -13 106 46 -53 206 121 268 115 -74 140 95 -120 -212 -156 12 256 108 -135 -8
5864 -8 4 -112 239 19 195 -5 87 -166 167 7 350 -11 -140 -49 -5 -194 55 -10 -32 -116 252 -112 177
5887 177 45 -253 -42 -56 95 -248 164 20 -265 56 -13 12 -52 118 92 89 286 -299 169 66 59 305 225
5910 225 -179 -68 201 -9 247 62 -38 -66 -128 114 83 87 -199 112 210 -117 -13 -84 -68 374 -96 -45 142
5933 142 -203 -216 -166 -188 102 -2 151 -31 -174 30 -146 -63 171 -162 113 -100 82 -53 46 -172 -98 -105 69
5956 69 -10 -232 -54 -35 8 -163 83 141 122 -101 6 31 112 162 -143 214 -3 -75 111 82 40 -38 -148 -226 36
5981 36 230 49 76 182 -490 -19 -122 -106 44 85 -28 -151 45 308 130 -276 -23 -1 -206 -18 -176 195
6003 195 23 -83 -11 -57 57 22 -40 -46 -82 -59 49 215 -28 -73 87 139 18 -6 -85 142 120 -109 21 -298
6027 -298 64 109 266 -234 -18 -123 -220 21 -15 57 -138 -51 167 42 141 154 36 -151 -129 -35 10 -38 -319 8
6051 8 -41 128 153 -47 -30 94 -304 234 -167 -119 93 -462 -60 -26 273 213 -220 -173 389 8 135 249 210
6074 210 -116 179 242 -65 90 -6 -70 35 275 -42 -116 123 30 19 -178 20 -129 -282 117 -81 -165 -19
6096 -19 -282 65 315 -34 0 87 367 -160 222 -148 -71 98 -136 134 -434 21 -172 400 54 226 -142
6117 -142 79 103 14 69 -113 -315 137 -46 -176 172 -242 33 -77 7 135 -329 -69 -41 -418 44 -37 -95
6139 -95 -124 -299 155 -67 300 146 94 63 38 -18 174 -25 -3 20 -56 12 -110 45 70 -5 212 215 -39 232 153
6164 153 130 29 187 14 29 -74 52 -153 -70 -23 236 -198 78 -272 -50 -119 16 74 -50 -33 74 15 67
6187 67 308 112 148 13 284 -46 -85 0 29 89 -175 278 222 12 175 -42 -12 20 -109 -63 -22 195 -138 118
6211 118 95 88 52 114 172 114 158 93 30 -256 274 -276 -226 -266 -125 -153 84 116 -91 297 -55 137 174 109 -201
6236 -201 -35 -83 255 77 -81 -208 -96 -79 -101 -38 64 -40 155 32 -216 -23 -126 45 -210 -108 -11 173
6258 173 64 -168 289 23 -127 -5 -121 42 19 -258 121 -19 -172 59 213 289 -21 -100 -31 -170 -108 144
6280 144 379 71 -24 -3 -20 274 20 -120 -191 57 75 218 -76 51 41 -32 89 -20 -126 166 130 80 226
6303 226 -82 -231 -57 -150 -131 -25 133 -156 73 -16 -71 -161 118 38 109 117 148 81 59 366 -50 -110 -241 5
6327 5 -168 -71 -45 82 31 248 10 -203 -106 20 -315 -79 -73 163 -155 63 40 -94 29 126 -8 -92 -316 175
6351 175 38 159 86 -49 -87 -203 -60 106 -16 40 -25 -285 -58 291 120 -129 84 -175 -36 -1 69 -108
6373 -108 205 29 -99 10 210 -115 -11 111 31 -29 -121 -183 -38 -105 -58 -110 112 -58 -56 55 -75 -271 -166
6396 -166 383 30 255 143 26 11 120 -76 -248 188 -138 59 -8 8 279 -180 -113 182 -101 173 95 83
6418 83 -43 -6 68 256 -14 -130 -114 -142 78 -318 172 -208 87 -134 -140 43 -152 -10 73 117 -29 0 85 -45
6442 -45 75 284 65 238 -45 129 -24 170 -65 66 202 20 -62 -155 25 -265 -55 109 -109 5 1 -36
6464 -36 -120 42 70 -246 17 39 -17 35 384 -244 -33 129 -70 -60 -271 -64 -83 -297 -38 -125 -39 -16 220 89
6488 89 -142 72 107 -215 214 -12 59 -49 -24 -62 25 57 99 -89 185 -14 -107 -84 -214 -95 12 24 -70 142
6512 142 -132 15 14 -201 162 -88 -80 -18 131 -115 48 -43 -181 102 -191 -219 -237 -40 89 -105 -90 -63 83
6535 83 207 37 -314 -56 -66 -142 -156 -181 151 -241 -22 87 206 21 -125 -19 -39 -140 87 -113 -65 102
6557 102 -8 198 -248 -39 53 133 -36 -23 -3 10 -16 62 89 108 -242 -61 17 -235 19 108 87 -201 -267 -25
6581 -25 -165 13 125 97 154 -263 -52 212 201 -210 254 76 208 256 -294 127 -70 -46 -18 61 -197 -140 -281
6604 -281 -190 -79 140 4 -74 -154 122 298 122 -1 -61 116 62 21 -125 207 4 -125 -8 212 -72 -36
6626 -36 82 66 -67 -35 106 -40 166 -224 -189 301 156 -138 26 -41 -48 380 138 81 -256 155 -59 206 122
6649 122 -89 225 -451 -76 -40 129 -196 -25 134 -11 3 97 -44 24 10 -74 57 330 -60 -123 -152 436 -11
6672 -11 -95 67 -100 -370 156 119 119 -200 -61 -12 12 -119 -41 149 8 -11 124 137 225 -278 141 -18 -49 -160
6696 -160 -16 86 136 80 -54 83 -206 163 -190 -47 -40 -4 -183 64 -237 -117 37 -84 31 -53 -187 194
6718 194 -1 -26 27 -226 67 130 191 10 114 -16 -186 79 99 -67 -54 7 62 307 65 117 -6 142 -68
6741 -68 24 -209 71 8 -80 -175 -68 232 66 336 -354 -51 2 -301 -269 109 -132 -64 -59 44 8 -83 162 444
6765 444 64 -33 24 9 -93 -187 138 0 4 61 -104 50 33 1 47 -127 52 -82 -223 217 -16 227 31
6788 31 8 -257 6 60 -369 -92 -127 61 -170 -74 38 -114 90 102 -106 114 -13 -175 40 -53 -8 -255 -181
6811 -181 -195 104 206 95 -217 149 122 -218 93 -25 -4 -9 -37 -90 -126 -195 -33 -114 335 -126 198 -72 166
6834 166 -154 70 -166 176 271 -24 208 -180 -274 -128 203 91 151 21 -15 -48 107 -116 -157 247 -8 125
6856 125 -28 2 -143 140 199 -155 107 23 -406 -102 130 58 125 -154 -168 -131 138 -221 -30 339 248 -268 116
6879 116 80 102 77 62 210 7 -2 -106 -186 -107 -54 -323 -106 -122 139 -137 183 33 55 245 5 47 -2 -20 -15
6904 -15 89 -41 90 98 63 -31 -380 -2 133 184 -200 44 -349 143 159 173 79 -11 103 -33 -295 39 -181
6927 -181 105 -94 230 -11 21 -55 198 182 -117 -227 -117 191 15 76 84 -228 98 -290 -136 70 -137 151
6949 151 328 120 14 102 -220 -246 25 66 -239 -121 116 -71 -225 57 -109 189 154 183 121 -51 -195 -94
6971 -94 -195 -18 29 208 -184 -36 123 9 -213 -81 3 104 -103 -154 -185 106 287 -302 366 -59 8 -33
6993 -33 -143 -34 -24 -90 68 165 64 -25 -33 -17 -106 -10 -141 -32 21 -191 -38 -3 -112 -57 -110 -254 -57 -205 112
7018 112 7 12 -119 151 127 20 133 109 97 -68 -176 -135 94 70 -113 134 -31 147 -132 -90 176 -1 -93
7041 -93 -251 -162 21 265 -203 -118 -231 26 -220 149 -72 119 -77 -154 9 -112 53 -27 -153 83 -76 -134
7063 -134 -88 74 204 231 -88 -209 180 -50 -126 -35 33 -229 13 -11 -37 -39 3 157 2 95 -97 29 99 -225
7087 -225 41 -224 157 25 190 35 -114 227 -129 109 40 -133 173 147 -11 -53 -5 168 134 -6 -86 119
7109 119 -47 6 158 -128 -282 56 223 272 -29 -103 57 165 14 213 -79 132 -122 230 1 77 27 58
7131 58 102 151 -82 -226 196 15 -50 -65 -48 -144 4 -141 -35 159 15 143 -57 -266 -24 90 -60 -20 260
7154 260 -86 -257 -105 -212 -32 -89 7 168 106 209 -35 -68 -16 -177 12 236 92 -82 27 16 -1 -41 -100
7177 -100 21 72 -48 34 -259 201 -19 4 33 234 109 242 23 -186 -80 -163 101 -47 -160 -226 -20 56
7199 56 72 -178 150 8 215 222 139 169 -9 143 98 -137 54 -57 -371 180 38 -70 90 -137 -120 -119 217
7222 217 210 23 89 -91 -298 -10 -218 -149 267 -6 111 128 -61 21 -79 -66 108 113 -130 -15 -34 24 141 9
7246 9 52 -233 209 235 -109 -90 198 13 -37 -23 -120 -79 66 -312 -165 80 140 -152 -239 100 130 -130 3 38
7270 38 322 -20 101 -114 -155 109 -224 34 -120 -19 25 212 -170 -19 -121 160 43 5 35 -146 -92 -121
7292 -121 -43 -146 -1 61 97 -96 116 -98 -102 46 -64 -38 41 -40 6 22 85 49 -12 -17 131 -49 -67 -11 -18 165
7318 165 -34 6 33 -144 -290 -42 -171 170 134 -111 -216 -34 -4 -108 -152 292 -159 38 -62 131 -43 132
7340 132 -48 256 144 48 -175 263 47 -17 70 -24 61 -7 364 113 348 191 -123 -1 9 -139 107 85 -114
7363 -114 -166 62 -168 -309 32 203 -107 -3 262 3 158 -75 148 39 -32 45 181 2 -210 -178 -26
7384 -26 -98 -68 -104 -48 -190 207 126 102 153 7 -178 -196 -168 119 35 51 -94 -56 4 97 -95 21 -212 86 28
7409 28 83 -188 73 -177 242 -24 287 17 -246 -41 32 -81 35 -57 -30 -133 172 214 158 245 227 202 229 -56
7433 -56 -44 61 2 -132 -161 0 -108 -253 -53 58 -50 -122 50 213 17 -131 -77 72 -114 80 -10 84 -21
7456 -21 -74 -297 104 31 -183 52 -171 112 -370 -91 -66 36 158 47 19 38 -81 -219 -126 -51 -89 -51 -201
7479 -201 -53 -106 -73 -38 -90 204 61 -13 37 -15 69 115 39 -131 225 -57 -27 -70 -19 66 -110 26 -38 21 -222
7504 -222 -179 -160 207 -41 166 46 165 -25 -74 18 185 137 -81 -59 100 -235 43 82 155 2 171 120 -109
7527 -109 -74 -24 -266 -256 -139 -117 -228 59 8 88 -87 -17 -159 352 63 135 157 -59 -4 3 -40 127 257 68
7551 68 -142 -380 263 -53 -23 131 -111 -125 31 -39 10 -76 -23 -44 -98 252 13 -96 -155 3 -80 90 -197 481
7575 481 67 47 15 36 121 37 -286 -212 135 -175 -37 70 -224 -4 166 31 -77 -215 -110 -100 204 46
7597 46 -147 232 -42 -165 -146 -35 9 -264 -349 -100 -218 -43 -80 -272 32 147 -70 71 350 -153 -116 -98
7619 -98 -162 -76 116 -64 -127 57 173 19 168 -67 92 64 190 -168 119 118 -216 76 -191 66 97 6 46
7642 46 109 121 -28 -72 -89 262 -167 -86 96 -122 -38 78 -133 -168 111 166 143 -333 85 243 -28 -200 -41
7665 -41 -319 166 -198 248 70 178 39 -7 161 175 -288 164 252 -38 128 237 -222 77 -32 -28 101 -79
7687 -79 -18 161 -171 -51 25 -96 163 60 73 -94 66 -41 -67 -258 -137 116 51 33 -39 -354 -15 -231 -24
7710 -24 -35 -213 92 76 168 -69 -40 -358 252 -198 -16 181 -51 -9 -119 3 0 -4 86 2 98 -175 -100 -198 -185
7735 -185 -96 286 108 127 248 -7 -332 -2 30 -151 55 420 210 -79 -58 -115 -164 -60 -253 243 108 -123
7757 -123 -224 82 45 184 167 59 36 29 -174 -69 66 -254 43 41 53 145 -64 -30 -43 -100 -11 -232 -130 -32 98
7782 98 140 -86 243 95 -154 63 -259 191 262 224 -89 -8 280 -74 -80 -94 -69 10 -375 -138 -340 96 -2 -261
7806 -261 5 142 16 -6 152 82 -127 -60 3 210 211 118 161 101 -62 -64 49 133 -17 -123 166 -6 48 50 157
7831 157 -120 30 -172 100 -134 -235 -7 64 220 -85 -104 -87 -79 40 -230 -64 -129 54 183 190 249 -50 254
7854 254 86 6 132 195 221 -139 -115 4 223 120 -154 77 36 -8 -85 177 159 272 -26 -2 -152 -127 209
7877 209 95 -257 -47 -151 230 -216 190 91 93 -129 -55 126 -59 13 -113 143 59 -179 -25 -167 -16 243
7899 243 41 -46 -12 -31 -59 15 -67 177 50 -14 -44 -48 -89 161 75 1 121 118 -64 -8 -181 -57 -131 31 -322 -17
7925 -17 -79 14 51 55 242 -375 37 -15 -41 -182 -116 125 -169 -19 85 22 -10 143 -82 41 -7 -1 212 -72 -116
7950 -116 -140 207 -114 28 -12 73 -84 43 93 194 -9 -18 36 -22 -80 -110 13 152 -89 -89 -32 -68 -108 -11 -55 -1
7976 -1 -173 -45 -14 27 -227 60 123 -44 45 -52 -53 -180 97 -47 102 271 83 -238 -109 -260 -307 -9 -88 61
8000 61 -228 279 136 -35 314 10 -153 -70 -248 36 135 -35 -11 10 14 8 25 115 75 -128 -63 -218 -117 107
8024 107 326 -19 212 236 88 -230 -451 211 -29 -96 -5 191 -14 239 -44 -11 274 349 -71 78 -88 112
8046 112 147 59 -315 -33 -44 -139 161 -16 -32 -149 153 118 -13 -94 94 70 94 -180 -152 89 -107 192 166 225
8070 225 184 8 209 -144 -187 -368 -162 -40 -57 -254 197 -314 -100 135 -266 -134 97 -168 242 -71 116
8091 116 -127 -229 20 111 -242 -70 1 115 9 57 54 -262 39 -192 -51 47 78 -47 74 -56 152 -30
8113 -30 78 120 124 -94 130 106 -36 -14 63 -6 349 -39 -139 -41 18 70 188 244 -156 0 157 85 -197 -22
8137 -22 147 157 -175 35 -142 158 28 46 18 -84 123 214 -21 344 94 -142 -84 -161 -47 -204 -10 -66 -50
8160 -50 342 -239 87 109 -382 -32 119 117 208 198 188 -169 -5 -50 -26 101 134 -203 -46 107 -273 -125 -167 15
8184 15 -93 -93 232 -65 -62 -2 180
8191A80
$$ Imaginary data points
##PAGE= N=2
##DATA TABLE= (X++(I..I)), XYDATA
0 0 0 0 0 0 0 0 0 -8 8 -8 8 -16 24 -24 32 -40 49 -64 74 -89 106 -130 155 -181 212 -249 291 -336 387 -443
30 -443 509 -581 659 -747 844 -950 1065 -1194 1335 -1490 1660 -1844 2045 -2266 2510 -2770
46 -2770 3056 -3368 3713 -4091 4506 -4964 5472 -6037 6671 -7382 8191 -9118 10198 -11466
60 -11466 12984 -14839 17169 -20192 24285 -30166 39369 -55873 94509 -373707 75605 533703
72 533703 -670718 -160177 659117 -112302 -462835 514998 281116 -479698 44716 475368
82 475368 -237044 -228730 337467 29993 -317652 68664 98707 -167349 -99920 53814 68123
93 68123 -4018 -91018 111211 165611 -166217 -88473 262312 -54971 -295970 214550 235643
104 235643 -359059 -52172 428867 -214053 -381057 422425 127123 -520606 187255 429514
114 429514 -416204 -163166 506652 -119540 -424470 335480 227751 -426500 25787 395538
124 395538 -239658 -243552 337876 15774 -314092 153052 185485 -201651 -39415 159704
134 159704 -38796 -102239 30063 51075 -24625 -49812 42601 95446 -36310 -87933 87425
145 87425 66902 -174235 -30723 203278 -99547 -180147 243563 73864 -295163 114867
155 114867 244992 -268881 -102548 320078 -72912 -263129 228600 141518 -309860 15438
165 15438 280756 -195626 -189054 273750 8495 -259329 152368 169228 -196628 -14105 193335
176 193335 -65746 -119308 108265 58268 -107325 -9908 82367 -34811 -69285 23562 22078
187 22078 -36717 -43982 22633 65523 -44602 -48580 121192 18886 -134120 80727 112154
198 112154 -151855 -34487 169584 -63847 -141371 144858 77757 -188496 17532 176031
208 176031 -136810 -124641 190114 -5533 -194206 114154 121887 -159697 -6177 166209
218 166209 -57502 -104047 112299 52345 -120189 8990 99222 -72147 -70706 81342 5235
229 5235 -77320 20711 44914 -21208 -25238 22714 39693 -28342 -39006 57264 17918 -74036
241 -74036 25093 75376 -53710 -47610 80476 14579 -99534 24725 87543 -91912 -59767
252 -59767 123469 -18566 -121213 88911 69865 -116711 10687 119588 -53114 -74901
262 -74901 91377 30377 -108242 17045 93550 -72337 -57412 97496 -883 -86561 45385
273 45385 50358 -61823 -22712 51171 -322 -50766 14858 52314 -30861 -33797 57435 17512
285 17512 -52385 9818 43635 -26205 -40289 35207 29570 -61308 -13109 74523 -28264 -64786
297 -64786 68477 27668 -82776 16254 69432 -48721 -43456 70536 19750 -76793 19807
308 19807 76029 -56683 -42522 82490 -9414 -79513 45460 41246 -66953 -15096 56893
319 56893 -10988 -48254 34373 44078 -44846 -12466 60483 -15552 -48846 34881 20117 -43185
331 -43185 -7552 34727 -271 -33156 14636 38500 -33226 -26647 49860 -1910 -51553 26570
343 26570 33261 -41634 -16311 44672 -229 -47742 22806 45857 -46928 -18311 67014 -17974
355 -17974 -57863 46380 24354 -57164 5874 49861 -23497 -34677 39733 19317 -53817 2147
367 2147 49506 -34456 -31780 49395 4564 -38158 19874 25365 -24368 -18254 23685 11845 -33577
380 -33577 -1725 38776 -16561 -27598 33928 9727 -36928 4111 31357 -14004 -30366 26362
392 26362 25828 -43942 -5877 52373 -25991 -36921 52680 10297 -51496 20359 40426 -36140
404 -36140 -26743 38260 572 -50390 17712 39174 -41777 -13051 52827 -12709 -34103 32499
416 32499 15394 -28648 -1016 24459 -772 -21092 11393 24585 -20903 -15178 25881 -4013
428 -4013 -30783 3615 15348 -16447 -21036 22211 18955 -32748 4724 47684 -24487 -25699 51829
441 51829 2333 -47306 24153 29094 -41138 -15316 39485 -11018 -43219 29865 28587 -45893
453 -45893 2813 48294 -29275 -26048 37625 -5977 -32118 16862 17108 -14035 -2928 20883 7423
466 7423 -15991 1200 12736 -12728 -12158 6053 1865 -7996 -10088 10686 12930 -23625 1352
479 1352 37009 -19565 -20416 43008 -1569 -40551 25335 23889 -40493 -7546 42024 -13782 -38447
492 -38447 35979 18883 -54336 8720 43888 -42516 -18850 50861 -11383 -31844 33465 14070
504 14070 -29224 4232 25150 -9429 -13776 19429 6249 -19617 4038 5573 -14943 -1922
516 -1922 -2001 -3216 11359 -9944 -5660 24976 -11745 -22405 28717 2225 -33415 20473 29062
529 29062 -27800 -6481 42683 -8656 -40487 30343 18540 -55116 8022 47984 -41186 -19705
541 -19705 53411 -15260 -40635 32096 10593 -37990 8753 31325 -17042 -11693 31279 1242
553 1242 -24562 17084 8771 -23513 8036 8210 -16996 7940 3216 -14982 12378 1032 -19291
566 -19291 13901 9882 -21598 5201 22245 -16306 -14556 27997 714 -32986 23326 25630 -41338
579 -41338 4859 45141 -34820 -22202 46332 -14585 -40465 32418 11359 -42630 7267 32417
591 32417 -24701 -14509 40074 -79 -28694 29110 13525 -35566 11325 19317 -28319 329
603 329 17862 -16202 -1076 12874 -11076 -3572 8642 -8294 -6427 10588 -3622 -12208 17604
616 17604 9998 -22585 14245 25044 -31402 -1399 36604 -27421 -19999 41409 -9428 -37571
628 -37571 27621 14149 -39093 4080 33283 -24375 -20203 39538 -858 -37517 27191 19684
640 19684 -38393 10222 30438 -26677 -4435 28582 -10618 -11821 16671 -786 -13718 3224
652 3224 780 -12478 661 5165 -10740 3839 12140 -13973 4393 22295 -18161 -3568 29189
665 29189 -16586 -17201 31121 -3891 -28186 20512 13489 -30664 201 27546 -20594 -23307 31779
678 31779 2322 -35170 23514 22708 -35388 6056 32534 -23735 -9659 29491 -6290 -18586
690 -18586 14683 6772 -16638 1536 12626 -11888 -8311 12738 -5665 -8594 11342 -5777 -5764
703 -5764 14269 -7725 -5984 17748 -7404 -9587 21262 -405 -16590 14637 9557 -21000 -2088
716 -2088 19648 -13687 -18605 24368 1566 -32565 17606 20850 -31943 3107 30525 -20438 -12209
729 -12209 27709 -2230 -20679 13217 13477 -17103 -3547 19372 -8110 -15394 15075 540 -16871
742 -16871 8186 3080 -10530 4998 340 -3825 8350 -2468 -3523 10930 -2429 -8299 9729
755 9729 5272 -11328 -500 13809 -7486 -13846 18256 3735 -26785 11076 17166 -27999 -1292
768 -1292 25467 -15815 -13711 23412 2197 -18233 9355 16166 -14343 -7442 20360 -3388 -17448
781 -17448 15304 4914 -19365 5749 8262 -11969 51 4701 -4349 -2 -196 863 3391 -2816
795 -2816 -667 5089 752 -1899 522 6719 -1009 -8273 9838 4524 -18060 5902 12056 -20053
809 -20053 -1874 18166 -11006 -9518 16226 1088 -14390 6565 13364 -11390 -7719 17828 -2287
822 -2287 -16584 16019 8017 -18768 6784 12284 -13473 -3071 7828 -5045 -6931 1959 3615
835 3615 -3969 -2632 7324 883 -4601 4821 2248 -706 2319 -2506 2811 2333 -8321 4300 6221
850 6221 -13880 69 11173 -9984 -5763 11511 -695 -10892 4122 9763 -9686 -6824 17177
863 17177 -1115 -15453 15782 9403 -17756 6286 13512 -13496 -4950 10780 -3325 -10682 2369
876 2369 6149 -8071 -4398 11240 -1213 -8137 8342 2298 -6221 4530 1929 -304 2750 -2926
890 -2926 2863 4423 -7654 1087 5900 -8183 -3761 6165 -1543 -7136 1768 7465 -6196 -6485 13545
905 13545 384 -14918 12223 8289 -15697 6209 13914 -11256 -4722 10847 -2083 -10203 3624
918 3624 7002 -9702 -4066 12381 -4812 -10176 11204 443 -10122 6771 3060 -4905 4384
931 4384 2274 -848 1699 -1353 981 1549 -4023 -643 1651 -271 -1806 -1220 4017 -2954 -7180 8669
947 8669 552 -12891 9635 7836 -13886 5303 12868 -9561 -3009 12077 -2086 -10302 5560
960 5560 7637 -11723 -4240 13608 -7678 -11671 14081 -137 -13883 9324 4903 -9977 3561
973 3561 6058 -3240 -894 3076 2143 -1774 290 3468 -2560 -732 1644 -3672 1924 300 -7757
988 -7757 5021 2138 -11834 5994 7326 -12215 2738 11951 -8212 -3395 12109 414 -10733
1001 -10733 4462 9560 -11380 -4639 15461 -6907 -13126 15073 419 -16009 8620 5581 -12895
1014 -12895 2318 7957 -5380 -2108 6757 1827 -4792 3129 5347 -5351 730 5386 -6497 415
1028 415 4789 -8042 983 5048 -9966 921 7414 -8832 -1119 9446 -4321 -5083 8042 3029
1042 3029 -8035 2554 10317 -8458 -4891 15477 -5000 -12461 14539 160 -16218 9192 5931
1055 5931 -14579 1306 9303 -7122 -4351 9281 1124 -8294 5441 7471 -9016 1484 10419
1068 10419 -7876 -1707 9795 -6690 -3415 7229 -6069 -3285 6000 -4702 -3699 5359 -1004
1081 -1004 -4841 3742 4008 -6032 401 10170 -5870 -6087 14314 -2411 -12190 13209 2738 -15982
1095 -15982 7421 7860 -13758 -534 10414 -6338 -7607 9086 2446 -10895 4523 10004 -10528
1108 -10528 -917 13064 -7317 -4148 12133 -4616 -5125 9012 -2388 -5121 4606 -1777 -5082
1121 -5082 2628 1232 -4823 87 5208 -4868 -3682 9815 -2365 -7991 12276 1096 -11685
1134 -11685 10572 5465 -12908 5123 8850 -10537 -2310 9334 -4455 -8646 6690 3911 -11728
1147 -11728 2306 10376 -10761 -2403 13364 -6859 -5598 12967 -2741 -7361 9081 518 -7182
1160 -7182 3547 2790 -5480 -993 4326 -3724 -4392 5987 -1254 -7317 7185 862 -9389 8201
1174 8201 3764 -10044 6812 6588 -9476 3200 7954 -6944 -2814 7543 -1670 -8119 4999
1187 4999 4251 -10851 759 10302 -10209 -4384 13676 -5801 -8084 12648 -234 -8846 7896
1200 7896 4182 -6961 1823 6006 -3749 -4245 5547 -335 -7710 4656 2104 -8812 3723 3625 -8667
1215 -8667 3894 5047 -7708 3231 6092 -6046 976 6746 -3288 -2585 5875 767 -6827 2620
1229 2620 5758 -8927 -1767 9724 -7941 -6334 11519 -3998 -8704 9953 1058 -8542 5326
1242 5326 5167 -5556 200 6704 -1211 -4799 5813 1844 -8156 3533 4195 -8884 1711 5613
1256 5613 -7668 297 4979 -5986 -236 4913 -3096 -1300 4392 514 -2480 2669 3541 -3956 -154
1271 -154 6036 -5124 -3727 7416 -4661 -6122 8331 -2226 -7456 6784 916 -7025 3381
1284 3381 4050 -4266 -1033 6111 -192 -5435 5794 3657 -8020 2907 6492 -8526 -357 6793
1298 6793 -6809 -2226 5507 -3550 -3348 2985 39 -2629 797 2865 -1191 -898 3988 -867 -2376
1313 -2376 5405 -1650 -3711 5650 -1702 -5114 5409 -1298 -6152 4543 1054 -5425 1416 3359
1327 3359 -3265 -2447 4585 979 -5586 4461 5363 -7324 1432 7792 -6691 -1731 7519 -4329
1341 -4329 -4119 4770 -801 -4014 1415 1750 -2703 -1552 3304 -562 -3136 4297 635 -3557 4844
1356 4844 827 -4083 4515 355 -4412 3963 831 -4414 1826 1037 -3261 -780 1653 -1179 -3479
1371 -3479 2317 2268 -4938 1579 6015 -5248 62 7154 -4778 -1865 6756 -2348 -3344 3969 178
1386 178 -3585 498 2189 -3031 -2938 3947 -611 -5002 4412 1546 -5373 3923 2816 -4751 2798 2989
1402 2989 -2934 1538 1635 -1574 507 790 -703 -1534 -185 504 -2692 -141 2370 -4016 384 4592
1418 4592 -4132 -281 5805 -3743 -1408 5899 -1550 -2780 3461 961 -3102 -44 3275 -2143 -4055
1433 -4055 3878 148 -6309 3446 2468 -6079 2049 3970 -4378 726 3605 -1883 164 1822 393
1448 393 -264 645 1322 -1314 -894 1967 -2551 -1050 2687 -3625 -1494 4110 -3514 -1454 5280 -2582
1464 -2582 -2055 4817 -240 -2694 2819 2201 -2126 -866 3467 -439 -4291 3473 986 -6301 2593
1479 2593 3203 -6254 1288 3457 -4781 -158 3550 -1754 -612 2391 893 -1163 1044 2656 -1819
1494 -1819 -709 3394 -2454 -2576 4166 -2605 -3167 3951 -1812 -3145 3724 -638 -2640 2271 866
1509 866 -1895 527 2341 -867 -1285 3297 479 -3818 3578 2033 -5866 2554 2953 -6469 608 3735
1525 3735 -4874 -898 3816 -1714 -2294 2496 1743 -2785 513 4207 -1983 -1660 5324 -1852 -3559 5088
1541 5088 -867 -3988 3403 -591 -3650 2126 -6 -2790 894 1271 -1373 -412 2140 -190 -2011
1556 -2011 3266 1501 -4125 3327 3028 -5412 2269 4142 -5951 -167 4145 -3933 -2212 3295 -1150
1571 -1150 -3314 1643 2229 -3158 -515 4713 -2364 -2411 5953 -1013 -3679 5587 -296 -4255 3570 544
1587 544 -3787 1567 847 -2844 -501 1333 -1040 -2206 2016 792 -3420 2752 2648 -4216 2044 3917
1603 3917 -4824 1294 4388 -4026 -596 3894 -2591 -2337 2542 -431 -3719 834 2318 -3582 -1158
1618 -1158 4699 -2310 -3160 5613 -728 -4312 5605 887 -4640 3616 2350 -3749 1060 2552 -2164
1633 -2164 -1927 2226 -257 -3363 1843 1738 -4512 1242 3047 -4175 383 4146 -3677 87 4608
1648 4608 -2693 -379 3725 -1399 -2027 1990 609 -2939 420 2735 -3498 -1995 4848 -2315 -4003
1663 -4003 5398 -283 -5107 4907 2042 -4327 2495 3308 -3080 -201 3082 -968 -2483 1988 940
1678 940 -3947 834 2642 -4369 122 3651 -3914 -430 4200 -3045 -954 4272 -1632 -1566 3346 208
1694 208 -2388 1427 1903 -2500 -773 3623 -2259 -3319 4016 -895 -4970 4176 887 -5370 2939
1709 2939 2327 -3873 1416 3178 -1798 -656 2889 280 -2708 1908 1843 -4068 641 3489 -4382 -909
1725 -909 4181 -3495 -2230 3946 -2115 -2058 3385 -367 -2347 1634 1584 -1256 -95 2695 -807 -2031
1741 -2031 3321 -267 -3681 3227 190 -4386 2773 1239 -4421 1815 2164 -3137 391 2796 -1504
1756 -1504 -1468 2613 823 -2631 1381 3244 -3499 -168 4311 -3392 -1816 4242 -2350 -3206 2808 -1135
1772 -1135 -3244 1854 730 -2045 326 1745 -439 -1048 2746 469 -2471 2885 1162 -3317 2240
1787 2240 1370 -3865 1803 1841 -3737 613 1885 -2227 -974 2088 -427 -1922 1411 2147 -2598 -265
1803 -265 3776 -2232 -1031 4328 -2072 -2217 3635 -1207 -2902 2332 -162 -2708 499 699 -1642 -632
1819 -632 1568 -540 -1923 2524 1356 -2238 2233 1880 -3013 1880 2472 -3140 1032 2610 -2381 -456
1835 -456 1240 -1459 -1240 685 417 -1711 -160 2042 -1889 -842 3480 -1556 -1490 3810 -1096 -1761
1851 -1761 3454 -97 -1990 2032 170 -2077 -4 1051 -1397 -1673 1518 244 -2987 1485 1930
1866 1930 -3082 1559 2756 -2922 525 2613 -2080 3 2150 -912 -583 829 -79 -1301 -314 1245
1882 1245 -1504 -1289 1817 -1235 -1565 2772 -1096 -1804 3280 -435 -2094 2804 489 -1819 1424 898
1898 898 -1144 -321 1064 -177 -2485 1046 1165 -3420 809 2169 -3171 224 2694 -2456 -210 2599
1914 2599 -1092 -421 1876 92 -521 619 983 -1046 -770 1822 -1167 -1890 2178 -839 -2397 2469
1930 2469 -199 -2805 2433 496 -1925 1444 972 -969 466 1207 109 -980 730 787 -2004 520
1946 520 1703 -2650 -64 2102 -2708 -564 2399 -2170 -703 2176 -935 -803 1504 552 -606 -5
1962 -5 1454 -460 -1307 2274 -338 -2436 2059 180 -2757 1562 284 -2417 905 656 -1438 507
1978 507 634 -366 250 754 589 -553 479 1426 -1406 204 1794 -2391 -457 2109 -2516 -732
1994 -732 2251 -1916 -1473 1671 -294 -1294 699 885 -563 -721 2254 255 -1599 1958 979 -2562
2010 -2562 1262 942 -2583 849 767 -2023 365 526 -1000 109 445 -181 -425 331 975 -920 69
2027 69 2077 -1365 -313 2425 -1443 -760 2329 -1216 -1092 1895 -1097 -1429 949 -171 -1314 -151
2043 -151 959 -381 -977 1726 409 -1742 1777 1146 -2356 1553 1508 -1846 808 1242 -1842 3
2059 3 981 -827 -699 158 289 -1100 -403 1463 -1104 -853 2465 -870 -785 2404 -625 -672 2330 -739
2077 -739 -815 1544 -361 -773 497 174 -699 -502 504 -213 -1382 1325 601 -2490 1336 1437 -2567
2094 -2567 1488 1843 -2027 550 1700 -1062 -392 675 -113 -1171 -165 889 -1089 -904 1690 -1060
2110 -1060 -1302 1891 -1002 -1195 2294 -439 -1014 2045 -297 -724 1224 -75 -618 446 462 -267 -892
2127 -892 955 -116 -2145 694 641 -2183 926 1429 -2090 729 2026 -1527 257 1522 -699 -348
2143 -348 1111 392 -969 -539 869 -1221 -1218 1562 -1033 -1604 1967 -792 -1613 2146 -281 -1373 1737
2160 1737 554 -692 885 566 -529 205 954 127 -1513 550 717 -2453 658 1099 -2600 264
2176 264 1519 -2134 254 1531 -1313 182 1374 14 -380 875 668 -777 -265 1233 -943 -1092
2192 -1092 2067 -843 -2073 1962 -367 -1817 1964 -11 -1726 771 790 -856 173 875 156 -521
2208 -521 775 712 -1230 513 1188 -2169 359 1677 -2350 0 1647 -2011 -43 1370 -1352 -451
2224 -451 1216 -148 -304 437 1124 -718 -530 1936 -559 -1231 2131 -243 -2000 1992 65 -2178
2240 -2178 1265 284 -1608 468 453 -540 -279 849 259 -721 830 1266 -1165 483 1512 -1999 253
2257 253 1763 -1765 -374 1615 -1733 -573 1053 -872 -617 678 259 -798 -207 1094 -480 -847
2273 -847 1989 69 -1336 1930 147 -1683 1727 333 -1780 1170 577 -1681 -92 246 -461 -815
2289 -815 417 492 -1206 593 1496 -1619 130 1949 -1274 14 1895 -1179 -525 1232 -854 -876 876
2306 876 -248 -953 -126 344 -534 -511 1087 -175 -1256 1574 335 -1399 1857 561 -1395 1592 818
2323 818 -1720 731 683 -943 -262 711 -183 -1144 165 840 -1592 192 1580 -1481 -493 1790 -1081
2340 -1081 -612 2055 -574 -381 965 -302 -557 490 247 -213 -16 309 -490 -1436 871 168 -1200
2357 -1200 1389 398 -1604 1249 901 -1519 979 1189 -1073 76 739 -265 -361 283 446 -1121 -154
2374 -154 1118 -1344 -891 1305 -1214 -795 1462 -493 -511 1743 -545 -473 1085 27 -294 340 311 -424
2392 -424 -802 879 52 -1662 826 323 -2005 1020 741 -1770 881 868 -1231 525 1119 -289 -168
2409 -168 416 449 -274 -81 735 -819 -646 1270 -710 -962 1385 -977 -1035 1219 -499 -802 1081 18
2427 18 -707 433 416 -126 0 844 -173 -906 805 509 -1483 706 768 -1654 538 850 -1605 335
2445 335 846 -705 21 720 -27 -249 322 649 -495 -52 1103 -249 -789 1475 -814 -1075 1697 -351
2463 -351 -1491 1033 -344 -1119 488 142 -465 -54 212 398 -691 793 741 -864 438 823 -1328
2480 -1328 499 825 -1545 49 785 -1183 -148 1121 -585 -250 326 -271 -459 84 749 -413 -660
2497 -660 1593 -120 -1047 1747 -146 -970 1156 -8 -1039 394 150 -753 -301 117 53 -567 171 567
2515 567 -429 243 759 -1160 421 1081 -948 -23 1180 -1388 162 1065 -1133 -601 690 -484 -613
2532 -613 73 441 -512 -563 1016 -290 -903 1222 -117 -1031 1411 316 -903 1211 332 -890 561
2549 561 226 -563 -149 92 190 -785 24 457 -845 199 920 -1043 285 1217 -896 14 1478 -880
2567 -880 20 1125 -571 -244 463 -270 -494 -366 557 -387 -894 573 -59 -1207 980 64 -1144 1184
2585 1184 178 -1106 934 440 -647 450 428 -233 -426 270 -5 -993 184 638 -1099 262 950
2602 950 -906 -543 1467 -843 -338 1428 -529 -264 813 90 193 318 171 -213 -501 642 -277 -854
2620 -854 718 -168 -1167 1018 63 -1102 723 354 -968 917 480 -831 311 649 52 -434 274
2637 274 401 -558 103 925 -1074 -197 1025 -1027 -561 1216 -728 -251 783 -490 -449 560 -233 -316
2655 -316 -4 309 60 -233 854 -80 -1270 763 -31 -1347 825 531 -1251 551 345 -772 548
2672 548 408 -191 202 700 415 -217 75 603 -451 -312 736 -1305 -262 1287 -1084 -523 989 -571
2690 -571 -570 844 -236 -322 641 163 -277 -140 553 261 -524 702 233 -831 616 473 -1183 541 537
2709 537 -1091 75 144 -1014 52 316 -370 38 137 410 -261 298 637 -605 2 1151 -825 -361
2727 -361 1468 -816 -488 750 -367 -788 828 -274 -389 147 563 -265 -647 766 403 -684 938
2744 938 533 -843 506 471 -926 477 919 -868 495 311 -629 -184 404 -108 -445 341 202 -731
2762 -731 -310 989 -638 -187 1370 -466 -626 1027 -282 -750 805 -126 -601 158 -65 -411 -279 474
2780 474 -56 -855 598 437 -1093 719 504 -1231 790 1036 -1220 595 982 -791 -150 756 -196
2797 -196 -443 189 127 -499 -337 609 -441 -636 989 -357 -554 965 -89 -588 1304 133 -475 823
2815 823 123 -338 622 412 -333 -274 401 -225 -1074 478 392 -914 743 776 -1250 278 1275 -808 80
2834 80 848 -583 -220 660 184 -249 -169 392 -463 -539 561 -547 -645 955 -336 -645 983 -99 -737
2853 -737 854 -127 -656 663 471 -365 125 459 22 -450 268 212 -895 483 740 -1225 287 829
2871 829 -1048 -65 887 -614 -305 694 -168 -260 513 388 -249 -189 857 -374 -490 1033 -131 -948 934
2890 934 110 -875 819 -150 -781 593 278 -500 358 299 -142 -121 202 183 -746 276 581 -926 105
2909 105 779 -906 -221 899 -937 -347 868 -873 108 547 173 -114 82 645 -156 -66 741 -103 -595
2928 -595 940 -79 -1168 743 45 -1157 567 227 -784 518 350 -265 99 255 381 -230 440
2945 440 509 -480 -24 1212 -661 -133 969 -875 45 1005 -529 -318 433 -398 -319 449 117 -312 -59
2964 -59 712 -251 -796 875 210 -798 923 29 -919 639 368 -918 410 274 -482 -10 -74 -280 -411
2983 -411 237 421 -609 14 791 -504 -83 962 -572 -108 990 -584 -142 531 -399 -74 331 -178
3001 -178 -264 -121 -4 -64 -522 503 284 -745 765 400 -777 791 617 -766 465 483 -604 71
3019 71 417 -340 -220 116 104 -488 -369 380 -523 5 931 -460 -445 1067 -382 -561 954 -319 -459
3038 -459 695 -39 -424 377 -92 -155 -324 88 118 -612 -127 236 -889 785 364 -870 591 730 -867
3057 -867 326 681 -362 106 483 -211 -40 148 359 -387 -222 645 -893 -779 787 -202 -656 908
3075 908 -129 -286 661 50 -326 505 46 102 -37 179 21 -375 306 197 -573 8 228 -793 345
3094 345 317 -896 218 444 -514 374 406 -217 158 436 382 -452 -230 334 -253 -407 390 -637 -780 716
3114 716 -231 -709 838 -100 -476 794 -184 -272 421 62 87 373 125 261 -377 141 397 -845 253
3133 253 567 -866 27 374 -748 -45 626 -704 62 431 -184 -25 54 33 -131 70 421 -1 -328 647
3153 647 -163 -612 876 -250 -736 931 208 -969 408 66 -154 69 146 104 -153 224 687 -247 232
3172 232 185 -492 190 653 -692 41 380 -743 -134 686 -548 -250 285 -257 109 131 224 43 -159 539
3192 539 -262 -525 1111 -108 -631 767 113 -843 513 -95 -535 162 108 -221 7 207 599 -400 135
3211 135 513 -423 -130 888 -527 294 1050 -765 -92 615 -369 -242 360 -510 -248 -93 47 -271 -314
3230 -314 183 -143 -694 641 -29 -452 697 365 -495 718 337 -719 375 -19 -773 -86 205 -278
3248 -278 -83 78 67 -408 14 674 -738 -92 947 -320 -49 550 -463 -2 473 -465 -196 305 -268
3267 -268 -155 -142 -196 -6 -305 305 13 -706 136 170 -487 674 99 -674 728 256 -547 367 293 -260 32
3288 32 388 -144 -397 -1 281 -766 -129 613 -689 -150 478 -344 -334 645 -460 -73 464 -238 -267 198
3308 198 12 0 -160 65 189 -282 108 315 -541 390 90 -634 499 289 -755 569 74 -327 257
3327 257 465 -125 23 357 110 -277 -27 358 -303 -185 859 -733 -323 737 -635 -177 764 48 -267
3346 -267 500 157 -62 125 207 134 -172 439 185 -380 266 353 -687 311 129 -725 143 253 -696 308
3366 308 644 -278 23 106 5 155 -119 366 -376 -319 733 -258 -21 843 -360 -496 518 -726 -502
3385 -502 548 -280 -383 278 74 -123 115 148 201 -237 378 600 -375 354 654 -906 292 285 -697 -40
3405 -40 216 -129 108 -1 -238 55 35 198 163 239 482 -296 -358 635 -367 -31 701 18 -543 567 -319
3426 -319 -886 124 -280 -274 201 -3 103 -96 411 131 -468 378 618 -638 370 561 -511 40 368
3445 368 -552 166 580 -488 -56 -105 -68 -32 2 147 -5 -288 439 -100 -437 541 211 -406 737 -308
3465 -308 -502 514 -170 -440 158 -218 -384 -284 -336 -152 -417 326 126 -480 361 494 -743 220 709 -478
3485 -478 253 620 -549 -164 453 -496 -263 170 -1 -375 -170 352 -56 -557 775 -197 -278 644 -140 -451
3505 -451 543 132 -280 492 -10 -82 296 -86 -90 -137 99 38 -188 -27 239 -597 219 719 -934 -23 1064
3526 1064 -97 35 322 -293 -78 446 126 -73 -124 243 -124 -650 382 -132 -248 118 -88 -440 505
3545 505 -98 -517 229 -11 -176 535 271 58 7 97 0 -297 -98 290 -411 -53 125 -476 -257 588 -463
3566 -463 -171 544 -664 -183 561 -276 -47 296 159 -156 -258 371 216 -415 144 -202 -394 526 -25 -650
3586 -650 369 63 -657 272 369 -470 176 -69 186 16 94 274 39 -81 551 -355 -390 691 -584 -454
3606 -454 426 -180 -160 292 -281 -133 184 41 58 65 -64 86 -157 280 43 -461 309 248 -859 536 -109
3627 -109 -920 259 317 -670 79 109 -396 26 -101 145 0 -61 398 -199 -353 445 -242 -422 512 -315 -454
3648 -454 439 -218 -326 502 -554 -222 -46 50 35 37 -22 -50 -257 285 167 -492 300 143 -570 181 369 -341
3670 -341 348 246 -234 -107 270 -177 -183 85 348 -79 -97 502 33 -3 721 -262 -161 427 -218 -249 504 -89
3692 -89 -351 59 -163 -204 94 -87 -134 -277 574 -11 -243 450 127 -503 5 557 -353 198 346 -392 71
3713 71 341 -649 -180 87 -106 -155 169 209 -225 -316 462 -259 -419 625 -82 -218 512 -39 -251 338 66
3734 66 -133 36 250 -56 -163 -50 -102 -133 -56 158 -129 148 190 -270 111 332 -456 375 348 -247 108 351
3756 351 -83 -153 207 190 -284 -278 147 -85 -303 435 53 -509 727 121 -490 452 336 -301 411 46 87
3777 87 112 31 -40 68 178 177 -116 20 92 -638 -213 538 -648 -85 403 -449 -65 430 -42 71 338 -47
3799 -47 119 370 262 -180 -301 328 -314 -329 149 156 -243 292 50 -438 408 1 -94 -277 112 188 128 -95
3821 -95 70 50 265 322 -460 92 391 -645 -84 614 -361 -200 177 -364 -221 288 -300 192 159 288 356
3842 356 -4 118 119 -215 286 -15 -383 291 21 -710 494 201 -897 156 35 -234 46 228 92 -218
3862 -218 -39 205 -163 -90 597 -177 -258 348 76 -120 392 -191 -350 276 -431 140 209 -183 -11 -35 -68 32
3884 32 -172 146 30 -277 409 324 -640 422 88 -594 274 1 -525 414 155 -247 -207 193 27 -176 -144
3905 -144 323 -130 -111 420 -280 -12 421 -512 -212 286 -573 -207 110 150 -109 -367 -10 184 -268 271 133
3926 133 -123 125 -225 -245 285 128 -229 225 469 -475 -21 102 -324 54 140 -52 -19 140 53 -161 -190 345
3948 345 -218 -52 363 -377 -119 289 -133 -2 504 -47 -364 319 -451 -28 4 -81 -276 -191 -34 89 -105
3969 -105 -42 74 -351 292 248 -374 397 157 -452 159 331 -226 -66 -28 -87 17 -41 194 -36 -205 487 -198
3991 -198 -201 539 157 -55 405 63 -130 437 40 -265 76 226 -184 -119 82 -13 -375 -4 -4 -274 82 41
4013 41 -380 362 162 -448 210 -55 -259 309 202 -112 72 -205 121 -43 286 15 -272 -319 337 -482 -280
4034 -280 580 -51 -111 347 -7 -110 175 -237 -14 115 116 -40 77 2 -52 -387 59 74 -480 -240 68 -663
4056 -663 191 199 -388 161 148 -512 143 325 -64 178 77 191 51 -134 558 53 -85 405 -117 -370 378
4077 378 -102 -191 352 79 -135 -156 171 -253 28 56 184 -235 6 441 -121 215 441 -435 -50 -35 -261
4098 -261 -174 486 -127 -270 306 60 148 -30 142 69 -213 -112 80 56 291 79 -281 356 -173 -420 146
4119 146 -75 -161 37 -55 -439 -1 2 -58 -292 -90 59 -144 152 256 -195 227 380 40 -7 238 109 -37
4141 -37 183 39 82 73 -72 76 30 74 45 -370 177 297 -220 329 -48 -171 394 142 -381 294 80 119 132
4164 132 -191 -62 70 62 254 -166 -7 -69 29 267 322 -139 -142 351 -130 -46 66 182 -129 205 -119 34 -42
4187 -42 117 48 92 20 179 -445 131 275 -297 482 311 -211 70 310 -12 309 -5 -261 -114 107 -440
4208 -440 -102 -257 -21 -108 -389 388 -119 52 7 -281 -191 184 -51 -54 361 -165 149 306 104 -108 72 467
4230 467 73 -454 37 12 -507 255 30 -254 258 195 -213 45 205 174 97 -50 139 129 -44 -11 -110 -125 319
4253 319 -153 -119 -105 -69 32 180 -235 -374 127 -312 -170 45 -116 -22 381 29 -144 -23 250 207 -408 -73
4275 -73 87 -441 60 90 -448 229 151 -437 -166 246 -140 161 211 -71 -67 -155 -100 -148 45 482 -97 -356 71
4298 71 31 -170 402 -40 -275 458 -62 40 156 9 111 -20 -14 58 -155 8 48 -272 166 52 -527 115
4320 115 7 -282 -118 331 -247 117 155 -159 -11 117 210 30 -40 146 -171 -187 303 -165 -117 301 150 39
4342 39 505 65 -323 66 -52 -90 -71 -182 46 -130 106 95 -163 118 133 -377 118 117 -284 -215 293 -322 54
4365 54 -64 -266 178 92 -79 19 -44 14 127 -137 288 -81 -86 186 -80 -50 410 107 -134 140 110 110 300 88
4389 88 -149 -258 -118 -41 -195 -198 11 -219 171 34 -161 340 435 -5 -25 185 -231 87 324 -119 -52 150
4411 150 -75 -95 59 239 204 -157 87 218 -183 39 -69 -125 199 98 -411 170 84 26 166 40 -74 192
4433 192 -96 2 151 -73 144 -200 96 242 -357 252 192 131 59 139 -310 121 128 -170 9 183 -10 -146
4455 -146 77 153 -179 -242 22 -97 -138 447 147 -257 414 100 -155 255 222 -164 -23 197 -18 192 2
4476 2 169 -128 17 94 -275 2 252 -255 38 261 -267 75 313 -135 -44 223 -33 -67 79 79 2 -249 43
4499 43 -273 -499 203 163 -236 226 3 -98 21 75 -211 346 183 -45 165 12 191 -87 114 -42 79
4520 79 -5 -29 -157 -418 226 -22 -357 316 111 61 178 262 -194 54 -138 128 141 5 243 -86 12 -195
4542 -195 -205 7 115 -403 -177 -288 -227 166 387 20 -96 28 23 77 -141 -33 40 109 150 -140 -175 346 -219
4565 -219 -122 99 3 -174 -160 -266 81 39 -210 -128 -190 116 180 209 10 333 -148 156 152 -340 39 128 -136 56
4589 56 370 -275 153 54 64 65 146 80 -76 121 112 -58 -84 244 -219 -165 381 -68 -177 49 164 -111 423 14
4613 14 -29 169 -23 105 90 31 -249 92 193 86 -1 77 168 -115 -65 54 176 144 118 336 14 119 -208
4636 -208 105 -71 85 -65 22 37 -27 156 -84 -271 -129 349 -131 -174 101 122 -19 61 -20 -2 258 -125 -49
4659 -49 -227 -305 123 -106 185 245 -82 -139 266 -113 3 76 -347 23 -96 -18 -81 -97 -314 1 -75 145 -154
4682 -154 -59 128 -21 168 121 190 0 398 45 -196 262 -60 -175 80 72 -239 -114 97 -5 135 -29 28
4704 28 -314 -186 96 132 14 22 -60 -10 67 -141 -158 230 -184 -246 293 146 -22 -320 93 141 31 267 277 -292
4728 -292 -104 183 -306 352 280 -96 74 85 85 123 -189 33 120 -424 25 -130 -179 247 -27 -405 313 -109
4750 -109 11 413 -241 -230 212 -139 294 -72 109 55 -58 -204 11 -238 173 -12 -332 -49 92 -49 52
4771 52 -13 -37 109 45 -186 -106 218 -51 36 129 225 -125 -145 -227 -117 -49 195 1 -65 246 -180 -204 278 -25
4795 -25 -167 -21 204 233 -82 72 -303 -146 -35 142 -210 69 25 -238 260 198 -260 -1 0 -66 -101 242 -200
4818 -200 -83 -20 196 86 -226 -100 -66 -134 359 -299 -200 165 -174 -293 61 29 -109 104 -55 -198 161 -126
4840 -126 54 -88 -78 24 -171 3 274 -21 122 165 -321 305 37 -133 3 121 40 -46 3 -219 -327 2
4862 2 106 -7 -77 232 105 51 77 -101 -112 12 195 3 207 -41 -86 310 -67 -55 -63 -110 -62 -22 -127 -70 138
4887 138 180 51 -186 191 144 -502 -126 104 -172 -103 270 -64 -95 -145 -335 67 59 398 213 -123 -60 -32 -34 142
4911 142 -480 -147 -235 200 -192 367 66 -120 38 130 52 -292 174 98 38 240 156 -152 -230 485 -85 -97 302
4934 302 13 -362 161 -143 -60 228 20 -22 -144 -22 51 8 136 0 -181 70 -42 110 -33 80 -141
4955 -141 -67 -39 -146 203 -250 -48 293 225 39 79 36 -52 -190 -88 162 -105 -167 196 -52 155 -186 87
4977 87 66 -31 -46 -58 -13 27 -141 -31 -57 177 68 196 159 -306 -78 -165 -227 212 -47 -147 211 -79 -76 -140 41
5002 41 85 52 161 20 -65 -214 323 42 -285 141 -128 -110 106 -155 -143 39 -102 -210 246 -34 -80 252
5024 252 -186 145 -245 148 197 159 -115 3 -13 251 68 -255 -7 40 41 -104 42 -42 151 -196 -66 104
5046 104 35 -40 -130 -204 110 59 25 -55 -67 -37 351 105 141 100 -67 -79 31 -115 -136 -66 43 -201 -171 -51 319
5071 319 -18 186 -10 -294 26 62 70 181 47 -152 212 -81 -234 38 -45 115 -157 51 321 -230 -196 216
5093 216 144 -8 229 -41 -158 5 10 -271 145 44 -250 46 -181 -93 -103 -57 -7 -205 -31 -21 238 -88 -20
5116 -20 -80 -217 174 -206 17 37 155 -19 -205 -166 226 62 -84 -47 6 96 -199 -133 63 187 -267 -55 -200
5139 -200 175 317 54 23 192 21 44 139 -211 -38 78 313 -87 -141 30 -147 -225 28 355 1 22 -213
5161 -213 305 149 69 -6 109 132 112 -117 -45 141 136 -460 -12 -78 -75 122 224 34 -38 -23 -144 89 140 -141
5185 -141 125 78 -2 -13 4 52 3 197 153 89 -84 74 -215 -50 -3 -44 207 262 -220 -105 232 -91 -252 -24
5209 -24 175 53 30 162 30 -147 -57 27 -1 97 33 -236 -51 -75 -109 350 -127 67 267 -67 134 -104 65
5232 65 182 127 -116 5 -250 -87 206 97 132 137 -100 44 99 -149 -177 166 -41 197 -118 142 -57 103
5254 103 -49 246 -176 -124 -58 -272 7 -8 -126 80 -7 37 -76 168 -144 -154 212 -37 -239 27 -20 -117 187
5277 187 233 55 -233 -242 49 -70 -90 51 -98 7 135 -87 -91 -105 192 -193 -64 94 50 66 104 -118 210
5300 210 220 14 191 -16 -189 -117 240 8 -44 -82 52 -67 -4 73 75 99 51 -146 13 79 148 282 16 -145
5324 -145 -189 -86 -336 -12 -187 -6 39 -8 74 52 -382 -89 -56 -27 -86 183 -59 81 87 -95 -1 46 118 -85
5348 -85 -54 -107 -8 16 202 -111 192 -96 -90 -148 -4 -29 -237 -166 -1 -153 222 -72 263 -51 -145 151 72 -179
5372 -179 294 -3 -53 -102 -18 86 -142 17 131 84 -106 14 130 101 189 -27 -30 33 101 -21 44 159 136 -144
5396 -144 -71 -58 -85 39 -41 -43 -169 -128 4 22 248 -18 86 167 -77 168 6 -8 -242 -10 105 -145 -7
5419 -7 -130 -64 -176 10 102 28 6 19 73 -171 165 -202 107 -91 -168 95 -37 57 -101 157 -187 238 58
5442 58 -193 169 116 -282 282 98 -65 66 -119 -225 32 25 107 10 -32 184 34 -15 -215 29 -185 -11 -83
5465 -83 -14 114 158 -91 15 -146 42 -81 54 84 17 -72 -304 150 -78 132 -36 -82 264 137 189 25 21
5488 21 183 122 203 80 -34 33 -230 -23 289 -246 -37 45 226 -140 76 213 -2 3 165 17 155 -12
5510 -12 -145 183 126 37 201 109 6 -191 -88 -222 -72 -210 -244 319 -3 -192 34 184 -19 4 45 -125
5532 -125 -270 -79 -83 129 20 -107 -291 -168 -72 -224 39 9 -27 -152 181 -93 271 -108 -177 118 160 -16
5554 -16 -38 -42 -112 217 74 -188 -241 -131 -55 141 -55 9 258 39 63 -40 -191 -301 6 53 -278 276 -109
5577 -109 -195 -42 229 182 7 113 32 225 -27 -178 135 -182 -164 43 -12 -16 18 -40 -79 52 34 105 55 -163
5601 -163 -48 -214 53 10 41 139 -111 -54 -151 32 -100 -117 192 -55 -391 -71 76 -7 -16 81 -67 -344 1
5624 1 61 -59 -50 113 -84 203 297 -157 -201 -187 245 -99 223 -138 -142 12 6 29 20 141 -15 -106 -107 -219 341 43
5650 43 169 -129 84 56 67 -134 -41 -163 23 64 -63 -67 -173 149 7 -168 66 -188 -211 111 -207 147 -153
5673 -153 284 -83 18 -51 -131 -79 240 -52 15 -175 -53 -74 -117 133 -64 -28 213 14 49 112 13 98 -13 -104
5697 -104 -36 38 16 65 -14 -112 85 -132 15 -252 -97 353 -88 -461 9 -14 -59 -7 38 134 -67 39 -33 -108
5721 -108 93 21 120 114 -203 -14 192 116 -248 234 164 -177 -103 141 -241 -112 177 -129 -47 -41 120 -75 186
5744 186 30 269 30 135 42 -104 2 246 47 -81 127 -46 215 33 -51 -114 190 -269 -15 -236 14
5765 14 -130 -303 -143 -83 7 -163 45 19 -173 -125 -27 -305 -30 -43 -152 56 -244 70 -40 -3 -253 -106 217
5788 217 -180 176 -178 60 176 6 5 7 43 -53 410 -235 -122 21 239 -74 165 276 -2 -16 -162 71
5810 71 3 31 68 95 -51 -149 -190 -45 80 -57 -43 28 -38 -85 -66 -86 -9 -36 197 185 -10 452 41 -141 23
5835 23 220 -39 58 53 -80 -110 79 319 203 -88 28 -16 -39 -89 63 -12 -57 -97 201 230 -45 6 -53 -32 177
5860 177 27 -429 -100 -155 247 -79 -47 19 79 -124 -46 -29 93 0 -106 -326 -47 -76 -138 -115 -51 -25 -30 -118 -347
5885 -347 -47 -30 -44 -70 -92 461 -91 39 95 -96 23 37 -6 -3 42 89 16 14 47 3 96 90 78 -5 210 310 -167
5912 -167 -131 -82 88 137 4 171 8 -212 -306 -55 -383 -124 -58 -224 144 -26 -71 -135 167 54 124 -121 7
5935 7 75 -62 157 -18 -118 44 -167 -33 -303 32 -8 308 262 62 -33 -229 237 289 -43 198 97 193 -328
5958 -328 -153 -176 55 -157 -285 178 137 52 100 -317 15 235 -98 134 32 -206 30 -92 7 28 -170 33
5980 33 284 89 -65 12 164 234 -32 -186 -60 -169 -54 29 -79 278 196 297 -29 217 130 87 -145 -32
6002 -32 -62 -244 -195 -68 24 -55 12 3 195 60 59 -16 176 -143 -189 -23 -172 -146 139 -34 118 -165 10 -101
6026 -101 115 -63 -35 196 155 193 295 69 229 -133 -207 -200 10 -146 112 171 -75 14 56 -97 -24 278 97
6049 97 -57 131 171 -49 27 273 87 27 59 148 61 -37 1 -209 -128 115 -303 -28 -240 125 -108 -137 26 58
6073 58 -42 -166 -86 94 4 -202 36 126 -35 133 109 -130 320 119 -16 59 102 13 -4 139 -1 28 159
6096 159 -80 -33 34 -17 -70 77 16 -26 235 21 239 -116 -170 -80 -302 145 -82 129 46 -146 -8 140 -137
6119 -137 -9 -128 78 -59 -10 202 -50 6 65 45 66 326 212 17 -117 -50 128 278 -96 -50 -45 14 75 63
6143 63 128 226 190 -77 -260 -54 142 -50 17 183 13 -47 109 181 25 -62 -158 -120 -176 33 -273 -46 -10 -73
6167 -73 127 71 -52 82 -223 76 -18 -19 213 -24 -101 11 -12 -301 -155 -76 0 186 -11 -33 -21 -245 21 136
6191 136 -280 17 -56 110 -10 161 25 -36 155 -230 -142 -252 -143 -110 -32 -46 -86 -324 62 -135 21 -127
6213 -127 9 94 -36 -8 281 181 -11 -96 -27 89 -90 309 -13 -184 -270 52 3 7 -140 -87 -43 127 7
6236 7 -204 73 193 -14 -133 119 -197 66 -322 37 82 65 -151 -33 -68 167 23 -77 104 189 238 116
6258 116 -18 -15 -36 -121 -54 333 -75 -92 56 -138 -53 -179 -73 -45 78 -170 35 56 -89 -211 -130 60 -75
6281 -75 -217 -10 -338 195 -60 65 -83 90 144 137 -43 292 -207 -106 -140 -33 -255 8 -120 198 76 -100
6303 -100 -111 192 36 125 108 60 132 153 -66 -192 -92 19 9 -156 176 -33 -42 -121 17 -87 -81 -9 -199 144
6327 144 -114 -29 -5 58 -41 -94 -9 61 60 12 159 -138 -22 -117 286 -10 49 -142 56 -146 -416 27 -125 39
6351 39 83 45 193 -273 -164 73 1 304 10 83 87 -48 126 55 -35 107 -47 88 -254 288 148 -84 168
6374 168 -43 209 -173 33 -120 -83 -235 -408 -49 58 160 -191 42 34 99 -114 -136 -39 -17 179 -135 -87 247
6397 247 -171 -126 -83 -45 91 -140 -111 77 -167 80 254 3 -35 1 -75 -328 19 -201 -17 205 -42 -41 -143
6420 -143 -18 318 -77 -88 128 49 -102 -158 -170 -113 -26 52 268 50 -207 7 -7 189 63 214 163 120 175 -120
6444 -120 -94 2 -277 272 18 -141 223 12 120 -89 -17 47 -9 -67 -5 -252 113 129 17 273 62 -72 90
6467 90 -164 23 61 -92 106 49 -218 127 273 99 -184 -137 41 -121 81 5 -110 99 -34 44 -126 -229
6489 -229 -166 142 -16 -33 -192 199 -118 -40 133 -44 30 9 -36 -141 153 148 155 174 -74 16 -45 57 -163 45
6513 45 -33 -155 141 -123 -196 -138 34 71 -95 65 -82 27 -44 267 -117 -111 -168 130 -164 -91 368 43 127 -170
6537 -170 143 -64 43 138 -6 3 25 -125 114 101 -61 -228 187 115 -219 148 78 0 143 38 -194 -135 383
6560 383 146 92 58 -57 146 -9 -41 217 126 116 86 -68 -198 88 32 -45 64 70 -253 85 -260 -44 48 18
6584 18 13 270 148 -64 -151 -88 -127 -168 -71 8 -21 78 174 -121 -50 -95 61 -246 121 28 -144 -82 -156 -152 -167 68 -181
6611 -181 110 -137 -100 191 9 -88 56 -103 -191 92 95 21 24 111 -25 273 50 76 24 -19 168 -28 -90 215
6635 215 75 26 164 132 -290 5 283 147 231 135 -74 -108 -4 65 -315 -131 -22 -50 26 -46 -70 38 -192
6658 -192 -203 -38 -114 -148 127 -67 -116 94 81 -165 -40 -72 -33 79 73 -253 -107 -55 222 59 -96 -77 174 210
6682 210 41 -50 -104 -210 196 170 -74 13 57 16 5 8 -45 204 -65 291 22 -239 -224 -314 192 -184 79 -135
6706 -135 -49 -22 -98 -75 56 80 59 67 -21 122 -20 -212 231 -354 -145 -62 -127 -116 111 -188 163 248 105 -24
6730 -24 -119 -199 -18 99 -181 163 74 -70 48 273 43 34 66 72 9 -343 80 135 -86 -15 -219 -28 -185 -73
6754 -73 -154 -24 -59 -190 118 8 -207 77 -149 61 24 -15 -88 -36 184 14 3 254 -123 -141 209 53 8
6777 8 -17 -158 61 -1 -145 65 130 88 -61 -221 -148 -79 57 204 7 78 -179 135 63 -31 127 44 -86 -138
6801 -138 25 54 113 -2 -154 -125 51 43 -43 -19 -313 202 -98 -155 316 51 119 186 -18 -5 50 -176 215 95
6825 95 -53 -9 292 100 83 -55 270 -298 -124 -100 50 -29 73 11 -95 -20 -23 53 -95 -75 -110 -68 -19 5 84
6850 84 -15 -56 0 39 -59 243 -75 59 -31 -299 79 -37 63 -236 42 -162 47 -114 251 46 -88 -139 -188
6873 -188 104 145 -21 -105 46 -106 70 145 -193 321 -69 -106 37 -13 -75 182 -203 -202 12 136 28 51 35
6896 35 9 118 106 -85 -3 51 17 -8 187 87 58 -65 -149 134 32 21 -296 -158 172 140 -154 -10 -87 -204
6920 -204 17 29 -107 -257 46 196 20 -558 156 12 -36 71 130 154 121 -21 -5 -150 33 23 -62 319 105
6943 105 12 22 -153 -64 132 -247 -145 -134 57 -84 -119 80 -146 -95 -37 236 44 -269 123 -55 173 -4
6965 -4 47 -77 206 -118 -280 -239 56 -3 -159 29 -79 -63 4 -20 -63 142 -64 -41 -33 55 7 159 -10 85 49
6990 49 157 -60 -14 155 -201 164 -144 -71 77 115 77 151 -93 211 -8 0 -95 50 32 12 -77 -154 0 169
7014 169 77 134 -32 -171 81 62 -153 24 -33 88 152 -128 76 -289 -14 76 15 -100 -103 60 -300 -84 -74
7037 -74 235 115 -26 11 176 -31 -149 19 106 -54 59 155 -80 -68 2 70 -190 69 -27 64 29 -59 -55 -14 114
7062 114 220 -97 -50 -218 -284 -211 -95 92 307 -45 -87 187 57 37 279 -111 -194 -124 -59 -158 -24 -139 103
7085 103 -18 45 137 -308 -214 49 -98 -57 -229 -33 -62 -33 149 -180 111 4 -65 435 -20 104 -113 36
7107 36 144 -38 -278 -42 120 28 -66 -100 21 -213 -76 181 -367 -42 116 -167 -215 23 94 -4 378 -66
7129 -66 -201 17 47 -157 -234 134 261 -311 -63 -90 -176 -112 -9 31 219 -201 -133 -31 14 -62 -14 60 252 216
7153 216 41 -36 -226 -95 108 34 -296 247 -8 32 -32 -177 -288 -297 -339 94 -27 15 -10 89 -96 0 -151 53
7177 53 -14 -235 0 -399 111 41 -261 402 -77 -316 372 -182 135 -149 129 -103 81 162 4 -299 180
7198 180 209 -124 -101 -277 -72 -69 -32 -27 181 -19 199 -169 127 118 110 -29 -250 -70 110 103 -55 -3 29 -63 69
7223 69 -337 -120 284 312 20 45 244 -15 122 333 -150 -54 122 -197 121 141 176 -80 -162 122 194 -128 -133
7246 -133 183 149 -56 45 105 24 -29 15 -130 -152 40 -2 199 4 -242 -42 22 -231 35 -45 -36 149 165 62
7270 62 278 93 -126 -312 160 -91 -66 71 -122 17 -35 69 -210 -122 -12 -30 38 118 -40 241 144 -10 -182
7293 -182 -146 21 123 59 -92 79 -188 292 123 -223 -29 -113 -21 175 -130 48 -238 -228 14 -114 158 -32
7315 -32 -100 98 332 -84 35 128 104 -246 172 -201 134 -176 52 92 30 256 -108 -322 -121 -154 130 29
7337 29 -140 263 92 -59 175 -105 -34 254 -130 123 324 192 51 141 -31 -44 -123 -207 39 -341 -25 -124
7359 -124 113 -9 -111 -139 -122 -138 78 -123 -58 49 50 -305 -59 -11 -163 58 181 35 -616 3 -202 202
7381 202 -182 140 -24 228 -39 -43 -34 92 196 -177 -82 -116 85 222 -254 150 -195 -47 181 62 -37 52 -335
7404 -335 -78 186 -275 -97 238 -133 -174 105 22 -55 93 90 110 80 -24 204 177 -36 -50 44 -236 42 -134
7427 -134 -123 37 -162 -67 -104 100 -176 408 203 136 -112 -246 2 -71 -219 47 112 -244 84 35 213 85
7449 85 246 -152 -289 -138 -303 256 -16 -139 -333 -334 -217 -126 -131 -4 72 -106 -209 -4 -87 -21 -7 -61 26 74
7473 74 187 91 58 170 213 45 41 113 -77 -83 12 -238 -15 -171 -160 -109 -44 65 95 -122 84 -154 19 -126 -153
7498 -153 46 -199 62 -265 122 -75 79 -38 102 -221 -164 -8 -181 -160 10 30 -12 5 208 190 90 -46
7520 -46 1 60 305 -183 -11 129 0 -160 44 114 -18 185 -8 246 168 41 482 -394 45 -159 242 93
7542 93 -55 227 -59 124 14 -120 200 298 -93 135 -43 121 21 -95 -114 266 -106 -156 35 -131 -332
7563 -332 33 -20 -220 -12 -25 114 261 -94 63 -150 359 17 131 182 -127 -21 -161 60 321 -81 -185
7584 -185 -319 176 85 35 67 167 -130 120 31 -1 168 138 58 -116 184 -142 157 -36 178 268 -65 30 210
7607 210 50 69 -138 -281 -242 -130 -159 45 37 -124 -225 -121 38 -164 -291 50 -85 34 137 -65 114 -252
7629 -252 -282 -190 -148 -156 -7 341 1 8 162 -31 -87 78 16 67 -115 127 -40 -30 -68 -145 -75 131 -215 -29 -100
7654 -100 69 -19 80 -109 -138 -126 -31 -292 26 -26 92 -95 158 161 160 -56 -277 125 129 236 -213 -27 -162 -112
7678 -112 -16 63 -132 274 66 67 -180 -1 94 -217 246 96 -195 210 -112 -236 -122 10 -321 197 209 112
7700 112 -232 -136 227 35 -83 -30 12 -140 7 -119 -36 -81 -216 -6 -232 -30 -44 -85 5 62 -90 -290 -41
7723 -41 48 103 -166 -67 -117 -215 45 97 -132 -207 206 -234 -108 125 60 51 94 48 176 47 19 -100 -48 58 -144
7748 -144 27 -117 36 -87 225 -30 -7 -166 -145 73 -71 218 204 184 264 -235 -199 125 -110 1 176 -63
7770 -63 -3 75 181 -186 10 -42 -163 -16 -105 -239 55 -154 2 91 256 124 -57 -164 20 46 97 -109 75
7793 75 103 10 46 -200 -40 174 8 242 -205 65 -73 127 58 126 46 -260 115 45 -184 120 -77 -128 -200
7816 -200 99 -19 -234 62 -44 110 261 -96 310 -150 45 219 -166 -65 -3 146 53 13 86 -235 -150 168
7838 168 62 203 -136 -23 176 -101 -34 -98 -102 -336 159 12 -83 -176 -33 78 229 77 -93 63 65 -174 -252
7861 -252 -24 181 44 68 -21 -18 279 112 -217 122 -156 21 58 -44 -198 -161 -34 -122 -47 -71 7 53 -59 33
7885 33 140 233 -35 -77 55 4 -173 -56 136 375 185 62 111 34 110 149 119 -55 102 91 204 81 -95
7908 -95 -242 5 21 -128 168 -170 -65 -73 -41 -118 -139 -77 78 345 7 168 -69 -77 225 -51 9 -163 88 214
7932 214 70 -13 157 136 -195 -45 -224 237 -234 -40 294 -176 53 -157 -58 -68 -235 -127 -51 -57 30 -185 -90
7955 -90 -8 -6 -13 -20 154 -1 -32 92 -382 -147 -154 38 118 147 187 94 -63 -291 62 -23 198 58 41 198 -33 92
7981 92 -209 73 -157 79 214 -10 133 63 -4 66 169 129 52 -172 -35 159 -12 82 -10 -231 208 -77 -260
8004 -260 -87 -189 -30 165 -225 -69 58 -262 -96 35 194 37 -157 -165 67 -127 -108 210 -6 -113 -188
8025 -188 -20 267 -150 31 70 -155 99 2 -18 120 72 13 166 20 0 282 -44 -161 -49 -19 350 -103
8047 -103 86 -77 -6 -252 163 220 -125 -20 44 -198 190 -156 -235 205 137 -192 -88 150 -8 178 64 53
8069 53 -89 37 -95 -198 -37 217 -41 -56 -243 -98 289 194 -494 82 -2 -146 78 -81 175 -177 23
8090 23 -86 41 133 141 19 -18 -24 -45 -150 -30 -83 26 -130 -45 -80 154 -93 -13 35 -100 -198 71 -103 -16 21
8115 21 -102 211 53 12 -132 -300 133 -71 44 -59 -19 70 -26 -403 70 121 -138 141 -51 36 -209 -389
8137 -389 -80 127 13 -123 -165 -128 6 213 -230 55 -79 -31 92 132 -133 -83 34 67 217 -51 -219 -121
8159 -121 -114 122 189 -18 220 -169 -169 -85 -44 295 -263 -56 46 -54 -9 -320 39 215 23 111 41 184 -181
8182 -181 -36 168 -33 -105 -24 -250 52 -134 9
8191I
##END NTUPLES=NMR FID
##END=
